<?xml version="1.0" encoding="UTF-8" standalone="no"?>
<!-- Created with Inkscape (http://www.inkscape.org/) -->

<svg
   xmlns:dc="http://purl.org/dc/elements/1.1/"
   xmlns:cc="http://creativecommons.org/ns#"
   xmlns:rdf="http://www.w3.org/1999/02/22-rdf-syntax-ns#"
   xmlns:svg="http://www.w3.org/2000/svg"
   xmlns="http://www.w3.org/2000/svg"
   xmlns:sodipodi="http://sodipodi.sourceforge.net/DTD/sodipodi-0.dtd"
   xmlns:inkscape="http://www.inkscape.org/namespaces/inkscape"
   version="1.1"
   id="svg2"
   xml:space="preserve"
   width="507.69543"
   height="326.64264"
   viewBox="0 0 507.69543 326.64264"
   sodipodi:docname="2018_Thu_Junior.svg"
   inkscape:version="0.92.3 (unknown)"><metadata
     id="metadata8"><rdf:RDF><cc:Work
         rdf:about=""><dc:format>image/svg+xml</dc:format><dc:type
           rdf:resource="http://purl.org/dc/dcmitype/StillImage" /><dc:title></dc:title></cc:Work></rdf:RDF></metadata><defs
     id="defs6"><clipPath
       clipPathUnits="userSpaceOnUse"
       id="clipPath18"><path
         d="m 81.5,688.53 h 450 v -585 h -450 z"
         id="path16"
         inkscape:connector-curvature="0" /></clipPath><clipPath
       clipPathUnits="userSpaceOnUse"
       id="clipPath24"><path
         d="m 108.5,661.5 h 396 v -531 h -396 z"
         id="path22"
         inkscape:connector-curvature="0" /></clipPath><clipPath
       clipPathUnits="userSpaceOnUse"
       id="clipPath30"><path
         d="m 117.5,139.5 h 377 v 513 h -377 z"
         id="path28"
         inkscape:connector-curvature="0" /></clipPath><clipPath
       clipPathUnits="userSpaceOnUse"
       id="clipPath68"><path
         d="m 81.5,688.53 h 450 v -585 h -450 z"
         id="path66"
         inkscape:connector-curvature="0" /></clipPath><clipPath
       clipPathUnits="userSpaceOnUse"
       id="clipPath74"><path
         d="m 108.5,661.5 h 396 v -531 h -396 z"
         id="path72"
         inkscape:connector-curvature="0" /></clipPath><clipPath
       clipPathUnits="userSpaceOnUse"
       id="clipPath80"><path
         d="M 174.98,540.14 H 488.04 V 359.3 H 174.98 Z"
         id="path78"
         inkscape:connector-curvature="0"
         style="clip-rule:evenodd" /></clipPath><clipPath
       clipPathUnits="userSpaceOnUse"
       id="clipPath86"><path
         d="M 187.52,524.677 V 167.76 h 275.14 v 356.917"
         id="path84"
         inkscape:connector-curvature="0" /></clipPath><clipPath
       clipPathUnits="userSpaceOnUse"
       id="clipPath140"><path
         d="m 81.5,688.53 h 450 v -585 h -450 z"
         id="path138"
         inkscape:connector-curvature="0" /></clipPath><clipPath
       clipPathUnits="userSpaceOnUse"
       id="clipPath146"><path
         d="m 108.5,661.5 h 396 v -531 h -396 z"
         id="path144"
         inkscape:connector-curvature="0" /></clipPath><clipPath
       clipPathUnits="userSpaceOnUse"
       id="clipPath152"><path
         d="M 229.61,312.73 H 472.19 V 212.5 H 229.61 Z"
         id="path150"
         inkscape:connector-curvature="0"
         style="clip-rule:evenodd" /></clipPath><clipPath
       clipPathUnits="userSpaceOnUse"
       id="clipPath158"><path
         d="M 204.72,561.937 V 230.54 h 255.468 v 331.397"
         id="path156"
         inkscape:connector-curvature="0" /></clipPath><clipPath
       clipPathUnits="userSpaceOnUse"
       id="clipPath232"><path
         d="m 81.5,688.53 h 450 v -585 h -450 z"
         id="path230"
         inkscape:connector-curvature="0" /></clipPath><clipPath
       clipPathUnits="userSpaceOnUse"
       id="clipPath238"><path
         d="m 108.5,661.5 h 396 v -531 h -396 z"
         id="path236"
         inkscape:connector-curvature="0" /></clipPath><clipPath
       clipPathUnits="userSpaceOnUse"
       id="clipPath244"><path
         d="M 223.02,402.2 H 465.6 V 301.97 H 223.02 Z"
         id="path242"
         inkscape:connector-curvature="0"
         style="clip-rule:evenodd" /></clipPath><clipPath
       clipPathUnits="userSpaceOnUse"
       id="clipPath250"><path
         d="M 243.53,558.207 H 494.5 V 226.81 H 243.53 Z"
         id="path248"
         inkscape:connector-curvature="0" /></clipPath><clipPath
       clipPathUnits="userSpaceOnUse"
       id="clipPath296"><path
         d="m 81.5,688.53 h 450 v -585 h -450 z"
         id="path294"
         inkscape:connector-curvature="0" /></clipPath><clipPath
       clipPathUnits="userSpaceOnUse"
       id="clipPath302"><path
         d="m 108.5,661.5 h 396 v -531 h -396 z"
         id="path300"
         inkscape:connector-curvature="0" /></clipPath><clipPath
       clipPathUnits="userSpaceOnUse"
       id="clipPath308"><path
         d="m 117.5,139.5 h 377 v 513 h -377 z"
         id="path306"
         inkscape:connector-curvature="0" /></clipPath><clipPath
       clipPathUnits="userSpaceOnUse"
       id="clipPath336"><path
         d="m 117.5,139.5 h 377 v 513 h -377 z"
         id="path334"
         inkscape:connector-curvature="0" /></clipPath></defs><sodipodi:namedview
     pagecolor="#ffffff"
     bordercolor="#666666"
     borderopacity="1"
     objecttolerance="10"
     gridtolerance="10"
     guidetolerance="10"
     inkscape:pageopacity="0"
     inkscape:pageshadow="2"
     inkscape:window-width="1855"
     inkscape:window-height="1056"
     id="namedview4"
     showgrid="false"
     fit-margin-top="0"
     fit-margin-left="0"
     fit-margin-right="0"
     fit-margin-bottom="0"
     inkscape:zoom="0.97399147"
     inkscape:cx="303.44544"
     inkscape:cy="225.07334"
     inkscape:window-x="65"
     inkscape:window-y="24"
     inkscape:window-maximized="1"
     inkscape:current-layer="g10" /><g
     id="g10"
     inkscape:groupmode="layer"
     inkscape:label="brainteasers"
     transform="matrix(1.3333333,0,0,-1.3333333,-105.88789,629.56932)"><path
       inkscape:connector-curvature="0"
       id="path38"
       style="fill:#9dc8e1;fill-opacity:1;fill-rule:nonzero;stroke:none"
       d="m 117.48,406.45 h 0.02 v 246.08 h -0.02 z" /><g
       id="g62"
       transform="translate(-21,-52.5)"><g
         id="g64"
         clip-path="url(#clipPath68)"><g
           id="g70"
           clip-path="url(#clipPath74)"><g
             id="g76"
             clip-path="url(#clipPath80)"><g
               id="g82"
               clip-path="url(#clipPath86)"><g
                 id="g88"><path
                   d="m 188.424,472.511 h 51.262 v 51.262 h -51.262 z"
                   style="fill:#ffffff;fill-opacity:1;fill-rule:nonzero;stroke:none"
                   id="path90"
                   inkscape:connector-curvature="0" /><path
                   d="m 239.686,472.511 h -51.262 v 51.262 h 51.262 z"
                   style="fill:none;stroke:#231f20;stroke-width:1.80799997;stroke-linecap:butt;stroke-linejoin:miter;stroke-miterlimit:4;stroke-dasharray:none;stroke-opacity:1"
                   id="path92"
                   inkscape:connector-curvature="0" /><path
                   d="m 188.424,421.249 h 51.262 v 51.262 h -51.262 z"
                   style="fill:#f26649;fill-opacity:1;fill-rule:nonzero;stroke:none"
                   id="path94"
                   inkscape:connector-curvature="0" /><path
                   d="m 239.686,421.249 h -51.262 v 51.262 h 51.262 z"
                   style="fill:none;stroke:#231f20;stroke-width:1.80799997;stroke-linecap:butt;stroke-linejoin:miter;stroke-miterlimit:4;stroke-dasharray:none;stroke-opacity:1"
                   id="path96"
                   inkscape:connector-curvature="0" /><path
                   d="m 290.948,421.249 h -51.262 v 51.262 l 27.108,-27.18 24.154,-24.082"
                   style="fill:#3a89c9;fill-opacity:1;fill-rule:nonzero;stroke:none"
                   id="path98"
                   inkscape:connector-curvature="0" /><path
                   d="m 290.948,421.249 h -51.262 v 51.262 l 27.108,-27.18 z"
                   style="fill:none;stroke:#231f20;stroke-width:1.80799997;stroke-linecap:butt;stroke-linejoin:miter;stroke-miterlimit:4;stroke-dasharray:none;stroke-opacity:1"
                   id="path100"
                   inkscape:connector-curvature="0" /><path
                   d="m 239.686,472.511 h 51.262 V 421.25 l -27.107,27.18 -24.155,24.081"
                   style="fill:#ffffff;fill-opacity:1;fill-rule:nonzero;stroke:none"
                   id="path102"
                   inkscape:connector-curvature="0" /><path
                   d="m 239.686,472.511 h 51.262 V 421.25 l -27.107,27.18 z"
                   style="fill:none;stroke:#231f20;stroke-width:1.80799997;stroke-linecap:butt;stroke-linejoin:bevel;stroke-miterlimit:4;stroke-dasharray:none;stroke-opacity:1"
                   id="path104"
                   inkscape:connector-curvature="0" /><path
                   d="m 342.21,472.511 h 51.261 V 421.25 l -27.107,27.18 -24.154,24.081"
                   style="fill:#3a89c9;fill-opacity:1;fill-rule:nonzero;stroke:none"
                   id="path106"
                   inkscape:connector-curvature="0" /><path
                   d="m 342.21,472.511 h 51.261 V 421.25 l -27.107,27.18 z"
                   style="fill:none;stroke:#231f20;stroke-width:1.80799997;stroke-linecap:butt;stroke-linejoin:round;stroke-miterlimit:4;stroke-dasharray:none;stroke-opacity:1"
                   id="path108"
                   inkscape:connector-curvature="0" /><path
                   d="M 393.471,421.25 H 342.21 v 51.261 l 27.107,-27.18 24.154,-24.081"
                   style="fill:#ffffff;fill-opacity:1;fill-rule:nonzero;stroke:none"
                   id="path110"
                   inkscape:connector-curvature="0" /><path
                   d="M 393.471,421.25 H 342.21 v 51.261 l 27.107,-27.18 z"
                   style="fill:none;stroke:#231f20;stroke-width:1.80799997;stroke-linecap:butt;stroke-linejoin:bevel;stroke-miterlimit:4;stroke-dasharray:none;stroke-opacity:1"
                   id="path112"
                   inkscape:connector-curvature="0" /><path
                   d="m 290.948,421.249 h 51.262 v 51.262 h -51.262 z"
                   style="fill:#6bc071;fill-opacity:1;fill-rule:nonzero;stroke:none"
                   id="path114"
                   inkscape:connector-curvature="0" /><path
                   d="m 342.209,421.249 h -51.262 v 51.262 h 51.262 z"
                   style="fill:none;stroke:#231f20;stroke-width:1.80799997;stroke-linecap:butt;stroke-linejoin:miter;stroke-miterlimit:4;stroke-dasharray:none;stroke-opacity:1"
                   id="path116"
                   inkscape:connector-curvature="0" /><path
                   d="m 188.424,369.987 h 51.262 v 51.262 h -51.262 z"
                   style="fill:#3a89c9;fill-opacity:1;fill-rule:nonzero;stroke:none"
                   id="path118"
                   inkscape:connector-curvature="0" /><path
                   d="m 239.686,369.987 h -51.262 v 51.262 h 51.262 z"
                   style="fill:none;stroke:#231f20;stroke-width:1.80799997;stroke-linecap:butt;stroke-linejoin:miter;stroke-miterlimit:4;stroke-dasharray:none;stroke-opacity:1"
                   id="path120"
                   inkscape:connector-curvature="0" /><path
                   d="m 222.598,498.141 c 0,-4.718 -3.825,-8.543 -8.543,-8.543 -4.719,0 -8.544,3.825 -8.544,8.543 0,4.719 3.825,8.544 8.544,8.544 4.718,0 8.543,-3.825 8.543,-8.544"
                   style="fill:#ffffff;fill-opacity:1;fill-rule:nonzero;stroke:none"
                   id="path122"
                   inkscape:connector-curvature="0" /><path
                   d="m 222.598,498.141 c 0,-4.718 -3.825,-8.543 -8.543,-8.543 -4.719,0 -8.544,3.825 -8.544,8.543 0,4.719 3.825,8.544 8.544,8.544 4.718,0 8.543,-3.825 8.543,-8.544 z"
                   style="fill:none;stroke:#231f20;stroke-width:1.80799997;stroke-linecap:butt;stroke-linejoin:miter;stroke-miterlimit:4;stroke-dasharray:none;stroke-opacity:1"
                   id="path124"
                   inkscape:connector-curvature="0" /><path
                   d="m 222.599,498.141 c 0,-4.718 -3.826,-8.543 -8.544,-8.543 -4.718,0 -8.543,3.825 -8.543,8.543 0,4.719 3.825,8.544 8.543,8.544 4.718,0 8.544,-3.825 8.544,-8.544"
                   style="fill:#3a89c9;fill-opacity:1;fill-rule:nonzero;stroke:none"
                   id="path126"
                   inkscape:connector-curvature="0" /><path
                   d="m 222.599,498.141 c 0,-4.718 -3.826,-8.543 -8.544,-8.543 -4.718,0 -8.543,3.825 -8.543,8.543 0,4.719 3.825,8.544 8.543,8.544 4.718,0 8.544,-3.825 8.544,-8.544 z"
                   style="fill:none;stroke:#231f20;stroke-width:1.80799997;stroke-linecap:butt;stroke-linejoin:miter;stroke-miterlimit:4;stroke-dasharray:none;stroke-opacity:1"
                   id="path128"
                   inkscape:connector-curvature="0" /><path
                   d="m 325.122,446.879 c 0,-4.718 -3.826,-8.543 -8.544,-8.543 -4.718,0 -8.543,3.825 -8.543,8.543 0,4.719 3.825,8.544 8.543,8.544 4.718,0 8.544,-3.825 8.544,-8.544"
                   style="fill:#f26649;fill-opacity:1;fill-rule:nonzero;stroke:none"
                   id="path130"
                   inkscape:connector-curvature="0" /><path
                   d="m 325.122,446.879 c 0,-4.718 -3.826,-8.543 -8.544,-8.543 -4.718,0 -8.543,3.825 -8.543,8.543 0,4.719 3.825,8.544 8.543,8.544 4.718,0 8.544,-3.825 8.544,-8.544 z"
                   style="fill:none;stroke:#231f20;stroke-width:1.80799997;stroke-linecap:butt;stroke-linejoin:miter;stroke-miterlimit:4;stroke-dasharray:none;stroke-opacity:1"
                   id="path132"
                   inkscape:connector-curvature="0" /></g></g></g></g></g></g><g
       id="g134"><g
         id="g136"
         clip-path="url(#clipPath140)"><g
           id="g142"
           clip-path="url(#clipPath146)"><g
             id="g148"
             clip-path="url(#clipPath152)"><g
               id="g154"
               clip-path="url(#clipPath158)"><g
                 id="g160"><path
                   d="m 270.625,268.844 32.481,-18.613 -31.745,-17.359 -0.736,35.972"
                   style="fill:#ffffff;fill-opacity:1;fill-rule:nonzero;stroke:none"
                   id="path162"
                   inkscape:connector-curvature="0" /><path
                   d="m 270.625,268.844 32.481,-18.613 v 34.978 l -32.481,-16.365"
                   style="fill:#3a89c9;fill-opacity:1;fill-rule:nonzero;stroke:none"
                   id="path164"
                   inkscape:connector-curvature="0" /><path
                   d="m 270.625,268.844 32.481,-18.613 v 34.978 z"
                   style="fill:none;stroke:#231f20;stroke-width:1.67900002;stroke-linecap:round;stroke-linejoin:bevel;stroke-miterlimit:4;stroke-dasharray:none;stroke-opacity:1"
                   id="path166"
                   inkscape:connector-curvature="0" /><path
                   d="m 270.625,301.948 -32.729,-16.739 32.729,-16.365 32.481,16.365 -32.481,16.739"
                   style="fill:#f26649;fill-opacity:1;fill-rule:nonzero;stroke:none"
                   id="path168"
                   inkscape:connector-curvature="0" /><path
                   d="m 270.625,301.948 -32.729,-16.739 32.729,-16.365 32.481,16.365 z"
                   style="fill:none;stroke:#231f20;stroke-width:1.67900002;stroke-linecap:round;stroke-linejoin:bevel;stroke-miterlimit:4;stroke-dasharray:none;stroke-opacity:1"
                   id="path170"
                   inkscape:connector-curvature="0" /><path
                   d="m 237.896,250.362 v 35.222 l 32.729,-16.48 v -37.611 l -32.729,18.869"
                   style="fill:#6bc071;fill-opacity:1;fill-rule:nonzero;stroke:none"
                   id="path172"
                   inkscape:connector-curvature="0" /><path
                   d="m 237.896,250.362 v 35.222 l 32.729,-16.48 v -37.611 z"
                   style="fill:none;stroke:#231f20;stroke-width:1.67900002;stroke-linecap:butt;stroke-linejoin:bevel;stroke-miterlimit:4;stroke-dasharray:none;stroke-opacity:1"
                   id="path174"
                   inkscape:connector-curvature="0" /><path
                   d="m 303.106,285.209 v -34.978 l -32.481,-18.738 v 37.351 z"
                   style="fill:none;stroke:#231f20;stroke-width:1.67900002;stroke-linecap:butt;stroke-linejoin:round;stroke-miterlimit:4;stroke-dasharray:none;stroke-opacity:1"
                   id="path176"
                   inkscape:connector-curvature="0" /><path
                   d="m 261.79,259.243 c 0,-4.264 -3.458,-7.722 -7.722,-7.722 -4.265,0 -7.722,3.458 -7.722,7.722 0,4.265 3.457,7.723 7.722,7.723 4.264,0 7.722,-3.458 7.722,-7.723"
                   style="fill:#f26649;fill-opacity:1;fill-rule:nonzero;stroke:none"
                   id="path178"
                   inkscape:connector-curvature="0" /><path
                   d="m 261.79,259.243 c 0,-4.264 -3.458,-7.722 -7.722,-7.722 -4.265,0 -7.722,3.458 -7.722,7.722 0,4.265 3.457,7.723 7.722,7.723 4.264,0 7.722,-3.458 7.722,-7.723 z"
                   style="fill:none;stroke:#231f20;stroke-width:1.67900002;stroke-linecap:butt;stroke-linejoin:miter;stroke-miterlimit:4;stroke-dasharray:none;stroke-opacity:1"
                   id="path180"
                   inkscape:connector-curvature="0" /><path
                   d="m 426.85,301.948 -32.73,-16.739 32.73,-16.365 32.48,16.365 -32.48,16.739"
                   style="fill:#0cb14b;fill-opacity:1;fill-rule:nonzero;stroke:none"
                   id="path182"
                   inkscape:connector-curvature="0" /><path
                   d="m 426.85,301.948 -32.73,-16.739 32.73,-16.365 32.48,16.365 z"
                   style="fill:none;stroke:#231f20;stroke-width:1.67900002;stroke-linecap:round;stroke-linejoin:bevel;stroke-miterlimit:4;stroke-dasharray:none;stroke-opacity:1"
                   id="path184"
                   inkscape:connector-curvature="0" /><path
                   d="m 394.12,250.362 v 35.222 l 32.73,-16.48 v -37.611 l -32.73,18.869"
                   style="fill:#ffffff;fill-opacity:1;fill-rule:nonzero;stroke:none"
                   id="path186"
                   inkscape:connector-curvature="0" /><path
                   d="m 394.12,250.362 v 35.222 l 32.73,-16.48 v -37.611 z"
                   style="fill:none;stroke:#231f20;stroke-width:1.67900002;stroke-linecap:butt;stroke-linejoin:bevel;stroke-miterlimit:4;stroke-dasharray:none;stroke-opacity:1"
                   id="path188"
                   inkscape:connector-curvature="0" /><path
                   d="m 459.33,285.209 v -34.978 l -32.48,-18.738 v 37.351 l 32.48,16.365"
                   style="fill:#ffffff;fill-opacity:1;fill-rule:nonzero;stroke:none"
                   id="path190"
                   inkscape:connector-curvature="0" /><path
                   d="m 459.33,285.209 v -34.978 l -32.48,-18.738 v 37.351 z"
                   style="fill:none;stroke:#231f20;stroke-width:1.67900002;stroke-linecap:butt;stroke-linejoin:round;stroke-miterlimit:4;stroke-dasharray:none;stroke-opacity:1"
                   id="path192"
                   inkscape:connector-curvature="0" /><path
                   d="m 435.076,285.296 c 0,-4.264 -3.458,-7.722 -7.722,-7.722 -4.266,0 -7.723,3.458 -7.723,7.722 0,4.264 3.457,7.723 7.723,7.723 4.264,0 7.722,-3.459 7.722,-7.723"
                   style="fill:#f26649;fill-opacity:1;fill-rule:nonzero;stroke:none"
                   id="path194"
                   inkscape:connector-curvature="0" /><path
                   d="m 435.076,285.296 c 0,-4.264 -3.458,-7.722 -7.722,-7.722 -4.266,0 -7.723,3.458 -7.723,7.722 0,4.264 3.457,7.723 7.723,7.723 4.264,0 7.722,-3.459 7.722,-7.723 z"
                   style="fill:none;stroke:#231f20;stroke-width:1.67900002;stroke-linecap:butt;stroke-linejoin:miter;stroke-miterlimit:4;stroke-dasharray:none;stroke-opacity:1"
                   id="path196"
                   inkscape:connector-curvature="0" /><path
                   d="m 418.565,259.41 c 0,-4.264 -3.458,-7.722 -7.723,-7.722 -4.265,0 -7.722,3.458 -7.722,7.722 0,4.264 3.457,7.723 7.722,7.723 4.265,0 7.723,-3.459 7.723,-7.723"
                   style="fill:#3a89c9;fill-opacity:1;fill-rule:nonzero;stroke:none"
                   id="path198"
                   inkscape:connector-curvature="0" /><path
                   d="m 418.565,259.41 c 0,-4.264 -3.458,-7.722 -7.723,-7.722 -4.265,0 -7.722,3.458 -7.722,7.722 0,4.264 3.457,7.723 7.722,7.723 4.265,0 7.723,-3.459 7.723,-7.723 z"
                   style="fill:none;stroke:#231f20;stroke-width:1.67900002;stroke-linecap:butt;stroke-linejoin:miter;stroke-miterlimit:4;stroke-dasharray:none;stroke-opacity:1"
                   id="path200"
                   inkscape:connector-curvature="0" /><path
                   d="m 459.348,250.418 v 35.495 l -15.174,-24.994 -17.415,-29.516 32.589,19.015"
                   style="fill:#3a89c9;fill-opacity:1;fill-rule:nonzero;stroke:none"
                   id="path202"
                   inkscape:connector-curvature="0" /><path
                   d="m 459.348,250.418 v 35.495 l -15.174,-24.994 -17.415,-29.516 z"
                   style="fill:none;stroke:#231f20;stroke-width:1.67900002;stroke-linecap:butt;stroke-linejoin:bevel;stroke-miterlimit:4;stroke-dasharray:none;stroke-opacity:1"
                   id="path204"
                   inkscape:connector-curvature="0" /><path
                   d="m 316.943,284.542 31.795,-15.698 31.483,15.411 -31.71,-51.655 -31.568,51.942"
                   style="fill:#ffffff;fill-opacity:1;fill-rule:nonzero;stroke:none"
                   id="path206"
                   inkscape:connector-curvature="0" /><path
                   d="m 316.943,284.542 31.795,-15.698 31.483,15.411 -31.71,-51.655 z"
                   style="fill:none;stroke:#231f20;stroke-width:1.67900002;stroke-linecap:round;stroke-linejoin:bevel;stroke-miterlimit:4;stroke-dasharray:none;stroke-opacity:1"
                   id="path208"
                   inkscape:connector-curvature="0" /><path
                   d="m 316.358,250.278 v 35.495 l 14.979,-24.994 17.191,-29.516 -32.17,19.015"
                   style="fill:#3a89c9;fill-opacity:1;fill-rule:nonzero;stroke:none"
                   id="path210"
                   inkscape:connector-curvature="0" /><path
                   d="m 316.358,250.278 v 35.495 l 14.979,-24.994 17.191,-29.516 z"
                   style="fill:none;stroke:#231f20;stroke-width:1.67900002;stroke-linecap:butt;stroke-linejoin:bevel;stroke-miterlimit:4;stroke-dasharray:none;stroke-opacity:1"
                   id="path212"
                   inkscape:connector-curvature="0" /><path
                   d="m 380.99,250.278 v 35.495 l -14.979,-24.994 -17.191,-29.516 32.17,19.015"
                   style="fill:#3a89c9;fill-opacity:1;fill-rule:nonzero;stroke:none"
                   id="path214"
                   inkscape:connector-curvature="0" /><path
                   d="m 380.99,250.278 v 35.495 L 366.011,260.779 348.82,231.263 Z"
                   style="fill:none;stroke:#231f20;stroke-width:1.67900002;stroke-linecap:butt;stroke-linejoin:bevel;stroke-miterlimit:4;stroke-dasharray:none;stroke-opacity:1"
                   id="path216"
                   inkscape:connector-curvature="0" /><path
                   d="m 348.738,301.948 -32.73,-16.739 32.73,-16.365 32.479,16.365 -32.479,16.739"
                   style="fill:#3a89c9;fill-opacity:1;fill-rule:nonzero;stroke:none"
                   id="path218"
                   inkscape:connector-curvature="0" /><path
                   d="m 348.738,301.948 -32.73,-16.739 32.73,-16.365 32.479,16.365 z"
                   style="fill:none;stroke:#231f20;stroke-width:1.67900002;stroke-linecap:round;stroke-linejoin:bevel;stroke-miterlimit:4;stroke-dasharray:none;stroke-opacity:1"
                   id="path220"
                   inkscape:connector-curvature="0" /><path
                   d="m 348.68,269.318 v -38.62"
                   style="fill:#ffffff;fill-opacity:1;fill-rule:nonzero;stroke:none"
                   id="path222"
                   inkscape:connector-curvature="0" /><path
                   d="m 348.68,269.318 v -38.62"
                   style="fill:none;stroke:#231f20;stroke-width:1.67900002;stroke-linecap:butt;stroke-linejoin:bevel;stroke-miterlimit:4;stroke-dasharray:none;stroke-opacity:1"
                   id="path224"
                   inkscape:connector-curvature="0" /></g></g></g></g></g></g><g
       id="g226"
       transform="translate(-235.0586,-88.553139)"><g
         id="g228"
         clip-path="url(#clipPath232)"><g
           id="g234"
           clip-path="url(#clipPath238)"><g
             id="g240"
             clip-path="url(#clipPath244)"><g
               id="g246"
               clip-path="url(#clipPath250)"><g
                 id="g252"><path
                   d="m 348.184,389.861 -32.73,-16.739 32.73,-16.365 32.48,16.365 -32.48,16.739"
                   style="fill:#3a89c9;fill-opacity:1;fill-rule:nonzero;stroke:none"
                   id="path254"
                   inkscape:connector-curvature="0" /><path
                   d="m 348.184,389.861 -32.73,-16.739 32.73,-16.365 32.48,16.365 z"
                   style="fill:none;stroke:#231f20;stroke-width:1.67900002;stroke-linecap:round;stroke-linejoin:bevel;stroke-miterlimit:4;stroke-dasharray:none;stroke-opacity:1"
                   id="path256"
                   inkscape:connector-curvature="0" /><path
                   d="m 315.454,338.274 v 35.223 l 32.73,-16.48 v -37.612 l -32.73,18.869"
                   style="fill:#f26649;fill-opacity:1;fill-rule:nonzero;stroke:none"
                   id="path258"
                   inkscape:connector-curvature="0" /><path
                   d="m 315.454,338.274 v 35.223 l 32.73,-16.48 v -37.612 z"
                   style="fill:none;stroke:#231f20;stroke-width:1.67900002;stroke-linecap:butt;stroke-linejoin:bevel;stroke-miterlimit:4;stroke-dasharray:none;stroke-opacity:1"
                   id="path260"
                   inkscape:connector-curvature="0" /><path
                   d="m 380.664,373.122 v -34.979 l -32.48,-18.738 v 37.352 l 32.48,16.365"
                   style="fill:#0cb14b;fill-opacity:1;fill-rule:nonzero;stroke:none"
                   id="path262"
                   inkscape:connector-curvature="0" /><path
                   d="m 380.664,373.122 v -34.979 l -32.48,-18.738 v 37.352 z"
                   style="fill:none;stroke:#231f20;stroke-width:1.67900002;stroke-linecap:butt;stroke-linejoin:round;stroke-miterlimit:4;stroke-dasharray:none;stroke-opacity:1"
                   id="path264"
                   inkscape:connector-curvature="0" /><path
                   d="m 372.501,347.742 c 0,-4.264 -3.457,-7.722 -7.722,-7.722 -4.264,0 -7.722,3.458 -7.722,7.722 0,4.265 3.458,7.723 7.722,7.723 4.265,0 7.722,-3.458 7.722,-7.723"
                   style="fill:#f26649;fill-opacity:1;fill-rule:nonzero;stroke:none"
                   id="path266"
                   inkscape:connector-curvature="0" /><path
                   d="m 372.501,347.742 c 0,-4.264 -3.457,-7.722 -7.722,-7.722 -4.264,0 -7.722,3.458 -7.722,7.722 0,4.265 3.458,7.723 7.722,7.723 4.265,0 7.722,-3.458 7.722,-7.723 z"
                   style="fill:none;stroke:#231f20;stroke-width:1.67900002;stroke-linecap:butt;stroke-linejoin:miter;stroke-miterlimit:4;stroke-dasharray:none;stroke-opacity:1"
                   id="path268"
                   inkscape:connector-curvature="0" /><path
                   d="m 427.526,389.861 -32.73,-16.739 32.73,-16.365 32.48,16.365 -32.48,16.739"
                   style="fill:#ffffff;fill-opacity:1;fill-rule:nonzero;stroke:none"
                   id="path270"
                   inkscape:connector-curvature="0" /><path
                   d="m 427.526,389.861 -32.73,-16.739 32.73,-16.365 32.48,16.365 z"
                   style="fill:none;stroke:#231f20;stroke-width:1.67900002;stroke-linecap:round;stroke-linejoin:bevel;stroke-miterlimit:4;stroke-dasharray:none;stroke-opacity:1"
                   id="path272"
                   inkscape:connector-curvature="0" /><path
                   d="m 394.796,338.274 v 35.223 l 32.73,-16.48 -17.002,-9.559 -15.728,-9.184"
                   style="fill:#3a89c9;fill-opacity:1;fill-rule:nonzero;stroke:none"
                   id="path274"
                   inkscape:connector-curvature="0" /><path
                   d="m 394.796,338.274 v 35.223 l 32.73,-16.48 -17.002,-9.559 z"
                   style="fill:none;stroke:#231f20;stroke-width:1.67900002;stroke-linecap:butt;stroke-linejoin:bevel;stroke-miterlimit:4;stroke-dasharray:none;stroke-opacity:1"
                   id="path276"
                   inkscape:connector-curvature="0" /><path
                   d="m 460.006,373.122 v -34.979 l -32.48,-18.738 v 37.352 l 32.48,16.365"
                   style="fill:#f26649;fill-opacity:1;fill-rule:nonzero;stroke:none"
                   id="path278"
                   inkscape:connector-curvature="0" /><path
                   d="m 460.006,373.122 v -34.979 l -32.48,-18.738 v 37.352 z"
                   style="fill:none;stroke:#231f20;stroke-width:1.67900002;stroke-linecap:butt;stroke-linejoin:round;stroke-miterlimit:4;stroke-dasharray:none;stroke-opacity:1"
                   id="path280"
                   inkscape:connector-curvature="0" /><path
                   d="m 435.268,373.158 c 0,-4.265 -3.457,-7.722 -7.722,-7.722 -4.264,0 -7.722,3.457 -7.722,7.722 0,4.265 3.458,7.722 7.722,7.722 4.265,0 7.722,-3.457 7.722,-7.722"
                   style="fill:#3a89c9;fill-opacity:1;fill-rule:nonzero;stroke:none"
                   id="path282"
                   inkscape:connector-curvature="0" /><path
                   d="m 435.268,373.158 c 0,-4.265 -3.457,-7.722 -7.722,-7.722 -4.264,0 -7.722,3.457 -7.722,7.722 0,4.265 3.458,7.722 7.722,7.722 4.265,0 7.722,-3.457 7.722,-7.722 z"
                   style="fill:none;stroke:#231f20;stroke-width:1.67900002;stroke-linecap:butt;stroke-linejoin:miter;stroke-miterlimit:4;stroke-dasharray:none;stroke-opacity:1"
                   id="path284"
                   inkscape:connector-curvature="0" /><path
                   d="m 394.307,338.143 33.339,-19.217 v 38.491 l -33.339,-19.274"
                   style="fill:#ffffff;fill-opacity:1;fill-rule:nonzero;stroke:none"
                   id="path286"
                   inkscape:connector-curvature="0" /><path
                   d="m 394.307,338.143 33.339,-19.217 v 38.491 z"
                   style="fill:none;stroke:#231f20;stroke-width:1.67900002;stroke-linecap:butt;stroke-linejoin:bevel;stroke-miterlimit:4;stroke-dasharray:none;stroke-opacity:1"
                   id="path288"
                   inkscape:connector-curvature="0" /></g></g></g></g></g></g><g
       id="g330"><g
         id="g332"
         clip-path="url(#clipPath336)"><g
           id="g338"><path
             d="m 117.5,688.5 v -24 m -36,-12 h 24 m 390,36 v -24 m 36,-12 h -24 m -390,-549 v 24 m -36,12 h 24 m 390,-36 v 24 m 36,12 h -24"
             style="fill:none;stroke:#ffffff;stroke-width:0.5;stroke-linecap:butt;stroke-linejoin:miter;stroke-miterlimit:10;stroke-dasharray:none;stroke-opacity:1"
             id="path340"
             inkscape:connector-curvature="0" /><path
             d="m 117.5,688.5 v -24 m -36,-12 h 24 m 390,36 v -24 m 36,-12 h -24 m -390,-549 v 24 m -36,12 h 24 m 390,-36 v 24 m 36,12 h -24"
             style="fill:none;stroke:#000000;stroke-width:0.25;stroke-linecap:butt;stroke-linejoin:miter;stroke-miterlimit:10;stroke-dasharray:none;stroke-opacity:1"
             id="path342"
             inkscape:connector-curvature="0" /><path
             d="m 282.5,676.5 h 48 m -48,-561 h 48 M 93.5,420 v -48 m 426,48 v -48 m -213,316.5 v -24 m 0,-537 v -24 M 81.5,396 h 24 m 402,0 h 24 m -225,280.5 h 6 c 0,-3.312 -2.688,-6 -6,-6 -3.312,0 -6,2.688 -6,6 0,3.312 2.688,6 6,6 3.312,0 6,-2.688 6,-6 m -6,-561 h 6 c 0,-3.312 -2.688,-6 -6,-6 -3.312,0 -6,2.688 -6,6 0,3.312 2.688,6 6,6 3.312,0 6,-2.688 6,-6 M 93.5,396 h 6 c 0,-3.312 -2.688,-6 -6,-6 -3.312,0 -6,2.688 -6,6 0,3.312 2.688,6 6,6 3.312,0 6,-2.688 6,-6 m 420,0 h 6 c 0,-3.312 -2.688,-6 -6,-6 -3.312,0 -6,2.688 -6,6 0,3.312 2.688,6 6,6 3.312,0 6,-2.688 6,-6"
             style="fill:none;stroke:#ffffff;stroke-width:0.5;stroke-linecap:butt;stroke-linejoin:miter;stroke-miterlimit:10;stroke-dasharray:none;stroke-opacity:1"
             id="path344"
             inkscape:connector-curvature="0" /><path
             d="m 282.5,676.5 h 48 m -48,-561 h 48 M 93.5,420 v -48 m 426,48 v -48 m -213,316.5 v -24 m 0,-537 v -24 M 81.5,396 h 24 m 402,0 h 24 m -225,280.5 h 6 c 0,-3.312 -2.688,-6 -6,-6 -3.312,0 -6,2.688 -6,6 0,3.312 2.688,6 6,6 3.312,0 6,-2.688 6,-6 m -6,-561 h 6 c 0,-3.312 -2.688,-6 -6,-6 -3.312,0 -6,2.688 -6,6 0,3.312 2.688,6 6,6 3.312,0 6,-2.688 6,-6 M 93.5,396 h 6 c 0,-3.312 -2.688,-6 -6,-6 -3.312,0 -6,2.688 -6,6 0,3.312 2.688,6 6,6 3.312,0 6,-2.688 6,-6 m 420,0 h 6 c 0,-3.312 -2.688,-6 -6,-6 -3.312,0 -6,2.688 -6,6 0,3.312 2.688,6 6,6 3.312,0 6,-2.688 6,-6"
             style="fill:none;stroke:#000000;stroke-width:0.25;stroke-linecap:butt;stroke-linejoin:miter;stroke-miterlimit:10;stroke-dasharray:none;stroke-opacity:1"
             id="path346"
             inkscape:connector-curvature="0" /></g></g></g><text
       xml:space="preserve"
       style="font-style:normal;font-weight:normal;font-size:16px;line-height:125%;font-family:sans-serif;text-align:end;letter-spacing:0px;word-spacing:0px;text-anchor:end;fill:#000000;fill-opacity:1;stroke:none;stroke-width:0.75px;stroke-linecap:butt;stroke-linejoin:miter;stroke-opacity:1"
       x="91.712791"
       y="-228.86842"
       id="text1155"
       transform="scale(1,-1)"><tspan
         sodipodi:role="line"
         id="tspan1153"
         x="91.712791"
         y="-228.86842"
         style="font-weight:bold;stroke-width:0.75px">A</tspan></text>
<text
       transform="scale(1,-1)"
       id="text1159"
       y="-228.86842"
       x="172.7128"
       style="font-style:normal;font-weight:normal;font-size:16px;line-height:125%;font-family:sans-serif;text-align:end;letter-spacing:0px;word-spacing:0px;text-anchor:end;fill:#000000;fill-opacity:1;stroke:none;stroke-width:0.75px;stroke-linecap:butt;stroke-linejoin:miter;stroke-opacity:1"
       xml:space="preserve"><tspan
         style="font-weight:bold;stroke-width:0.75px"
         y="-228.86842"
         x="172.7128"
         id="tspan1157"
         sodipodi:role="line">B</tspan></text>
<text
       xml:space="preserve"
       style="font-style:normal;font-weight:normal;font-size:16px;line-height:125%;font-family:sans-serif;text-align:end;letter-spacing:0px;word-spacing:0px;text-anchor:end;fill:#000000;fill-opacity:1;stroke:none;stroke-width:0.75px;stroke-linecap:butt;stroke-linejoin:miter;stroke-opacity:1"
       x="248.77139"
       y="-227.42157"
       id="text1163"
       transform="scale(1,-1)"><tspan
         sodipodi:role="line"
         id="tspan1161"
         x="248.77139"
         y="-227.42157"
         style="font-weight:bold;stroke-width:0.75px">C</tspan></text>
<text
       transform="scale(1,-1)"
       id="text1167"
       y="-227.42157"
       x="328.27139"
       style="font-style:normal;font-weight:normal;font-size:16px;line-height:125%;font-family:sans-serif;text-align:end;letter-spacing:0px;word-spacing:0px;text-anchor:end;fill:#000000;fill-opacity:1;stroke:none;stroke-width:0.75px;stroke-linecap:butt;stroke-linejoin:miter;stroke-opacity:1"
       xml:space="preserve"><tspan
         style="font-weight:bold;stroke-width:0.75px"
         y="-227.42157"
         x="328.27139"
         id="tspan1165"
         sodipodi:role="line">D</tspan></text>
<text
       xml:space="preserve"
       style="font-style:normal;font-weight:normal;font-size:16px;line-height:125%;font-family:sans-serif;text-align:end;letter-spacing:0px;word-spacing:0px;text-anchor:end;fill:#000000;fill-opacity:1;stroke:none;stroke-width:0.75px;stroke-linecap:butt;stroke-linejoin:miter;stroke-opacity:1"
       x="406.27139"
       y="-227.42157"
       id="text1171"
       transform="scale(1,-1)"><tspan
         sodipodi:role="line"
         id="tspan1169"
         x="406.27139"
         y="-227.42157"
         style="font-weight:bold;stroke-width:0.75px">E</tspan></text>
</g></svg>