<?xml version="1.0" encoding="UTF-8" standalone="no"?>
<svg
   xmlns:dc="http://purl.org/dc/elements/1.1/"
   xmlns:cc="http://creativecommons.org/ns#"
   xmlns:rdf="http://www.w3.org/1999/02/22-rdf-syntax-ns#"
   xmlns:svg="http://www.w3.org/2000/svg"
   xmlns="http://www.w3.org/2000/svg"
   xmlns:xlink="http://www.w3.org/1999/xlink"
   xmlns:sodipodi="http://sodipodi.sourceforge.net/DTD/sodipodi-0.dtd"
   xmlns:inkscape="http://www.inkscape.org/namespaces/inkscape"
   width="153.84062pt"
   height="153.84062pt"
   viewBox="0 0 153.84062 153.84062"
   version="1.2"
   id="svg1121"
   sodipodi:docname="2020_Fri_Junior.svg"
   inkscape:version="1.0 (9f2f71dc58, 2020-08-02)">
  <metadata
     id="metadata1125">
    <rdf:RDF>
      <cc:Work
         rdf:about="">
        <dc:format>image/svg+xml</dc:format>
        <dc:type
           rdf:resource="http://purl.org/dc/dcmitype/StillImage" />
        <dc:title></dc:title>
      </cc:Work>
    </rdf:RDF>
  </metadata>
  <sodipodi:namedview
     pagecolor="#ffffff"
     bordercolor="#666666"
     borderopacity="1"
     objecttolerance="10"
     gridtolerance="10"
     guidetolerance="10"
     inkscape:pageopacity="0"
     inkscape:pageshadow="2"
     inkscape:window-width="1656"
     inkscape:window-height="1088"
     id="namedview1123"
     showgrid="false"
     inkscape:zoom="0.7512605"
     inkscape:cx="-35.132275"
     inkscape:cy="467.48083"
     inkscape:window-x="72"
     inkscape:window-y="27"
     inkscape:window-maximized="1"
     inkscape:current-layer="svg1121" />
  <defs
     id="defs58">
    <g
       id="g56">
      <symbol
         overflow="visible"
         id="glyph0-0">
        <path
           style="stroke:none"
           d="M 1.5,-10.3125 H 9.734375 V 0 H 1.5 Z m 0.5625,0.546875 V -0.5625 h 7.125 v -9.203125 z m 0,0"
           id="path2" />
      </symbol>
      <symbol
         overflow="visible"
         id="glyph0-1">
        <path
           style="stroke:none"
           d="m 1.140625,0 v -1.125 h 2.625 V -9.0625 L 1.4375,-7.390625 v -1.25 L 3.875,-10.3125 H 5.09375 V -1.125 H 7.609375 V 0 Z m 0,0"
           id="path5" />
      </symbol>
      <symbol
         overflow="visible"
         id="glyph0-2">
        <path
           style="stroke:none"
           d="M 0.75,0 V -0.9375 C 1,-1.5 1.300781,-2 1.65625,-2.4375 2.019531,-2.875 2.398438,-3.269531 2.796875,-3.625 3.191406,-3.976562 3.582031,-4.304688 3.96875,-4.609375 c 0.394531,-0.300781 0.75,-0.601563 1.0625,-0.90625 0.3125,-0.3125 0.5625,-0.628906 0.75,-0.953125 0.195312,-0.332031 0.296875,-0.710938 0.296875,-1.140625 0,-0.5625 -0.167969,-1 -0.5,-1.3125 -0.335937,-0.3125 -0.796875,-0.46875 -1.390625,-0.46875 -0.5625,0 -1.027344,0.15625 -1.390625,0.46875 -0.367187,0.304687 -0.578125,0.730469 -0.640625,1.28125 l -1.34375,-0.125 c 0.09375,-0.832031 0.441406,-1.488281 1.046875,-1.96875 0.601563,-0.488281 1.378906,-0.734375 2.328125,-0.734375 1.039062,0 1.835938,0.246094 2.390625,0.734375 0.5625,0.492187 0.84375,1.1875 0.84375,2.09375 0,0.398437 -0.09375,0.792969 -0.28125,1.1875 -0.179687,0.398437 -0.449219,0.792969 -0.8125,1.1875 -0.355469,0.398437 -1.042969,1.011719 -2.0625,1.84375 -0.5625,0.460937 -1.011719,0.871094 -1.34375,1.234375 -0.335937,0.367188 -0.574219,0.71875 -0.71875,1.0625 H 7.59375 V 0 Z m 0,0"
           id="path8" />
      </symbol>
      <symbol
         overflow="visible"
         id="glyph0-3">
        <path
           style="stroke:none"
           d="m 7.6875,-2.84375 c 0,0.949219 -0.308594,1.683594 -0.921875,2.203125 C 6.160156,-0.117188 5.300781,0.140625 4.1875,0.140625 3.132812,0.140625 2.296875,-0.09375 1.671875,-0.5625 1.054688,-1.03125 0.691406,-1.726562 0.578125,-2.65625 l 1.359375,-0.125 c 0.175781,1.230469 0.925781,1.84375 2.25,1.84375 0.65625,0 1.171875,-0.160156 1.546875,-0.484375 0.382813,-0.332031 0.578125,-0.820313 0.578125,-1.46875 0,-0.5625 -0.21875,-1 -0.65625,-1.3125 C 5.226562,-4.523438 4.609375,-4.6875 3.796875,-4.6875 h -0.75 v -1.140625 h 0.71875 c 0.71875,0 1.273437,-0.15625 1.671875,-0.46875 0.40625,-0.3125 0.609375,-0.75 0.609375,-1.3125 0,-0.550781 -0.167969,-0.984375 -0.5,-1.296875 -0.324219,-0.320312 -0.804687,-0.484375 -1.4375,-0.484375 -0.585937,0 -1.058594,0.152344 -1.421875,0.453125 -0.355469,0.292969 -0.558594,0.710938 -0.609375,1.25 L 0.75,-7.78125 c 0.09375,-0.84375 0.441406,-1.5 1.046875,-1.96875 0.601563,-0.476562 1.378906,-0.71875 2.328125,-0.71875 1.03125,0 1.832031,0.242188 2.40625,0.71875 0.570312,0.480469 0.859375,1.152344 0.859375,2.015625 0,0.65625 -0.183594,1.195313 -0.546875,1.609375 -0.367188,0.40625 -0.902344,0.683594 -1.609375,0.828125 v 0.03125 c 0.769531,0.085937 1.367187,0.34375 1.796875,0.78125 0.4375,0.429687 0.65625,0.976563 0.65625,1.640625 z m 0,0"
           id="path11" />
      </symbol>
      <symbol
         overflow="visible"
         id="glyph0-4">
        <path
           style="stroke:none"
           d="M 6.453125,-2.34375 V 0 h -1.25 V -2.34375 H 0.34375 V -3.359375 L 5.0625,-10.3125 H 6.453125 V -3.375 H 7.90625 v 1.03125 z m -1.25,-6.484375 C 5.191406,-8.804688 5.125,-8.675781 5,-8.4375 4.875,-8.207031 4.78125,-8.050781 4.71875,-7.96875 L 2.078125,-4.0625 1.671875,-3.515625 1.5625,-3.375 h 3.640625 z m 0,0"
           id="path14" />
      </symbol>
      <symbol
         overflow="visible"
         id="glyph0-5">
        <path
           style="stroke:none"
           d="m 7.71875,-3.359375 c 0,1.085937 -0.328125,1.9375 -0.984375,2.5625 -0.648437,0.625 -1.542969,0.9375 -2.6875,0.9375 -0.960937,0 -1.734375,-0.2070312 -2.328125,-0.625 C 1.125,-0.898438 0.75,-1.507812 0.59375,-2.3125 L 1.9375,-2.46875 c 0.269531,1.023438 0.984375,1.53125 2.140625,1.53125 0.707031,0 1.257813,-0.210938 1.65625,-0.640625 0.40625,-0.425781 0.609375,-1.007813 0.609375,-1.75 0,-0.65625 -0.203125,-1.179687 -0.609375,-1.578125 -0.398437,-0.40625 -0.9375,-0.609375 -1.625,-0.609375 -0.355469,0 -0.6875,0.058594 -1,0.171875 C 2.804688,-5.226562 2.5,-5.035156 2.1875,-4.765625 H 0.90625 L 1.25,-10.3125 h 5.859375 v 1.109375 H 2.453125 L 2.25,-5.921875 c 0.570312,-0.4375 1.28125,-0.65625 2.125,-0.65625 1.019531,0 1.832031,0.296875 2.4375,0.890625 0.601562,0.59375 0.90625,1.371094 0.90625,2.328125 z m 0,0"
           id="path17" />
      </symbol>
      <symbol
         overflow="visible"
         id="glyph0-6">
        <path
           style="stroke:none"
           d="m 7.6875,-3.375 c 0,1.085938 -0.296875,1.945312 -0.890625,2.578125 -0.59375,0.625 -1.414063,0.9375 -2.453125,0.9375 -1.15625,0 -2.042969,-0.429687 -2.65625,-1.296875 -0.617188,-0.863281 -0.921875,-2.117188 -0.921875,-3.765625 0,-1.789063 0.316406,-3.160156 0.953125,-4.109375 0.644531,-0.957031 1.554688,-1.4375 2.734375,-1.4375 1.5625,0 2.539063,0.699219 2.9375,2.09375 l -1.25,0.234375 C 5.878906,-8.984375 5.3125,-9.40625 4.4375,-9.40625 c -0.75,0 -1.335938,0.355469 -1.75,1.0625 -0.40625,0.699219 -0.609375,1.710938 -0.609375,3.03125 0.238281,-0.445312 0.570313,-0.785156 1,-1.015625 0.4375,-0.226563 0.9375,-0.34375 1.5,-0.34375 0.945313,0 1.703125,0.296875 2.265625,0.890625 0.5625,0.59375 0.84375,1.398438 0.84375,2.40625 z m -1.34375,0.0625 c 0,-0.75 -0.183594,-1.328125 -0.546875,-1.734375 -0.367187,-0.40625 -0.875,-0.609375 -1.53125,-0.609375 -0.617187,0 -1.117187,0.183594 -1.5,0.546875 -0.375,0.355469 -0.5625,0.84375 -0.5625,1.46875 0,0.804687 0.195313,1.460937 0.59375,1.96875 0.394531,0.5 0.898437,0.75 1.515625,0.75 0.632812,0 1.128906,-0.210937 1.484375,-0.640625 0.363281,-0.425781 0.546875,-1.007812 0.546875,-1.75 z m 0,0"
           id="path20" />
      </symbol>
      <symbol
         overflow="visible"
         id="glyph0-7">
        <path
           style="stroke:none"
           d="m 7.59375,-9.25 c -1.0625,1.617188 -1.8125,2.882812 -2.25,3.796875 C 4.914062,-4.546875 4.59375,-3.644531 4.375,-2.75 4.15625,-1.863281 4.046875,-0.945312 4.046875,0 h -1.375 C 2.671875,-1.320312 2.945312,-2.707031 3.5,-4.15625 4.0625,-5.613281 5,-7.296875 6.3125,-9.203125 H 0.765625 V -10.3125 H 7.59375 Z m 0,0"
           id="path23" />
      </symbol>
      <symbol
         overflow="visible"
         id="glyph0-8">
        <path
           style="stroke:none"
           d="m 7.6875,-2.875 c 0,0.949219 -0.304688,1.6875 -0.90625,2.21875 -0.605469,0.53125 -1.476562,0.796875 -2.609375,0.796875 -1.105469,0 -1.96875,-0.257813 -2.59375,-0.78125 -0.617187,-0.519531 -0.921875,-1.257813 -0.921875,-2.21875 0,-0.675781 0.191406,-1.242187 0.578125,-1.703125 0.382813,-0.457031 0.875,-0.734375 1.46875,-0.828125 v -0.03125 C 2.148438,-5.554688 1.707031,-5.84375 1.375,-6.28125 1.050781,-6.71875 0.890625,-7.234375 0.890625,-7.828125 c 0,-0.789063 0.289063,-1.425781 0.875,-1.90625 0.59375,-0.488281 1.382813,-0.734375 2.375,-0.734375 1.019531,0 1.820313,0.242188 2.40625,0.71875 0.59375,0.480469 0.890625,1.125 0.890625,1.9375 0,0.59375 -0.167969,1.109375 -0.5,1.546875 -0.324219,0.4375 -0.765625,0.714844 -1.328125,0.828125 v 0.03125 c 0.65625,0.105469 1.164063,0.386719 1.53125,0.84375 C 7.503906,-4.113281 7.6875,-3.550781 7.6875,-2.875 Z M 6.0625,-7.734375 C 6.0625,-8.910156 5.421875,-9.5 4.140625,-9.5 c -0.617187,0 -1.089844,0.152344 -1.421875,0.453125 -0.324219,0.292969 -0.484375,0.730469 -0.484375,1.3125 0,0.585937 0.164063,1.03125 0.5,1.34375 0.34375,0.3125 0.816406,0.46875 1.421875,0.46875 0.625,0 1.097656,-0.140625 1.421875,-0.421875 C 5.898438,-6.632812 6.0625,-7.097656 6.0625,-7.734375 Z M 6.328125,-3 C 6.328125,-3.644531 6.132812,-4.128906 5.75,-4.453125 5.363281,-4.773438 4.828125,-4.9375 4.140625,-4.9375 c -0.667969,0 -1.1875,0.179688 -1.5625,0.53125 -0.375,0.34375 -0.5625,0.824219 -0.5625,1.4375 0,1.417969 0.722656,2.125 2.171875,2.125 0.71875,0 1.253906,-0.171875 1.609375,-0.515625 C 6.148438,-1.703125 6.328125,-2.25 6.328125,-3 Z m 0,0"
           id="path26" />
      </symbol>
      <symbol
         overflow="visible"
         id="glyph0-9">
        <path
           style="stroke:none"
           d="m 7.625,-5.375 c 0,1.78125 -0.324219,3.148438 -0.96875,4.09375 -0.648438,0.949219 -1.570312,1.421875 -2.765625,1.421875 -0.804687,0 -1.449219,-0.1640625 -1.9375,-0.5 C 1.472656,-0.703125 1.128906,-1.25 0.921875,-2 l 1.25,-0.203125 c 0.269531,0.855469 0.851563,1.28125 1.75,1.28125 0.75,0 1.332031,-0.347656 1.75,-1.046875 0.414063,-0.707031 0.632813,-1.710938 0.65625,-3.015625 -0.199219,0.4375 -0.539063,0.792969 -1.015625,1.0625 -0.46875,0.273437 -0.984375,0.40625 -1.546875,0.40625 -0.929687,0 -1.671875,-0.316406 -2.234375,-0.953125 C 0.976562,-5.101562 0.703125,-5.945312 0.703125,-7 c 0,-1.082031 0.300781,-1.929688 0.90625,-2.546875 0.601563,-0.613281 1.445313,-0.921875 2.53125,-0.921875 1.144531,0 2.007813,0.429688 2.59375,1.28125 C 7.328125,-8.34375 7.625,-7.070312 7.625,-5.375 Z M 6.203125,-6.640625 c 0,-0.832031 -0.195313,-1.5 -0.578125,-2 C 5.238281,-9.148438 4.726562,-9.40625 4.09375,-9.40625 c -0.636719,0 -1.136719,0.21875 -1.5,0.65625 -0.367188,0.429688 -0.546875,1.011719 -0.546875,1.75 0,0.75 0.179687,1.34375 0.546875,1.78125 0.363281,0.4375 0.859375,0.65625 1.484375,0.65625 0.382813,0 0.738281,-0.082031 1.0625,-0.25 0.320313,-0.175781 0.578125,-0.421875 0.765625,-0.734375 0.195312,-0.320313 0.296875,-0.6875 0.296875,-1.09375 z m 0,0"
           id="path29" />
      </symbol>
      <symbol
         overflow="visible"
         id="glyph0-10">
        <path
           style="stroke:none"
           d="m 7.75,-5.15625 c 0,1.71875 -0.304688,3.03125 -0.90625,3.9375 -0.605469,0.90625 -1.5,1.359375 -2.6875,1.359375 -1.1875,0 -2.078125,-0.445313 -2.671875,-1.34375 -0.59375,-0.90625 -0.890625,-2.222656 -0.890625,-3.953125 0,-1.78125 0.285156,-3.109375 0.859375,-3.984375 0.582031,-0.882813 1.5,-1.328125 2.75,-1.328125 1.207031,0 2.097656,0.449219 2.671875,1.34375 0.582031,0.886719 0.875,2.210938 0.875,3.96875 z m -1.328125,0 C 6.421875,-6.644531 6.25,-7.722656 5.90625,-8.390625 5.5625,-9.066406 4.992188,-9.40625 4.203125,-9.40625 c -0.8125,0 -1.398437,0.335938 -1.75,1 -0.355469,0.65625 -0.53125,1.742188 -0.53125,3.25 0,1.460938 0.175781,2.527344 0.53125,3.203125 0.363281,0.679687 0.9375,1.015625 1.71875,1.015625 0.769531,0 1.335937,-0.34375 1.703125,-1.03125 0.363281,-0.695312 0.546875,-1.757812 0.546875,-3.1875 z m 0,0"
           id="path32" />
      </symbol>
      <symbol
         overflow="visible"
         id="glyph1-0">
        <path
           style="stroke:none"
           d="M 2.046875,-14.046875 H 13.25 V 0 H 2.046875 Z m 0.75,0.765625 V -0.75 H 12.5 v -12.53125 z m 0,0"
           id="path35" />
      </symbol>
      <symbol
         overflow="visible"
         id="glyph1-1">
        <path
           style="stroke:none"
           d="m 10.484375,-4.578125 c 0,1.492187 -0.4375,2.664063 -1.3125,3.515625 -0.875,0.84375 -2.09375,1.265625 -3.65625,1.265625 -1.3125,0 -2.371094,-0.2851562 -3.171875,-0.859375 C 1.539062,-1.226562 1.03125,-2.054688 0.8125,-3.140625 L 2.625,-3.34375 c 0.382812,1.386719 1.359375,2.078125 2.921875,2.078125 0.96875,0 1.722656,-0.289063 2.265625,-0.875 C 8.351562,-2.722656 8.625,-3.519531 8.625,-4.53125 8.625,-5.414062 8.347656,-6.128906 7.796875,-6.671875 7.253906,-7.222656 6.519531,-7.5 5.59375,-7.5 c -0.492188,0 -0.945312,0.078125 -1.359375,0.234375 -0.417969,0.15625 -0.835937,0.417969 -1.25,0.78125 H 1.21875 l 0.46875,-7.5625 h 7.984375 v 1.53125 H 3.328125 L 3.0625,-8.0625 c 0.769531,-0.59375 1.734375,-0.890625 2.890625,-0.890625 1.382813,0 2.484375,0.40625 3.296875,1.21875 0.820312,0.804687 1.234375,1.855469 1.234375,3.15625 z m 0,0"
           id="path38" />
      </symbol>
      <symbol
         overflow="visible"
         id="glyph1-2">
        <path
           style="stroke:none"
           d="M 1.546875,0 V -1.53125 H 5.125 V -12.328125 L 1.96875,-10.0625 V -11.75 l 3.3125,-2.296875 H 6.9375 V -1.53125 h 3.421875 V 0 Z m 0,0"
           id="path41" />
      </symbol>
      <symbol
         overflow="visible"
         id="glyph1-3">
        <path
           style="stroke:none"
           d="M 8.78125,-3.171875 V 0 H 7.078125 V -3.171875 H 0.46875 v -1.40625 l 6.421875,-9.46875 H 8.78125 V -4.59375 H 10.75 v 1.421875 z m -1.703125,-8.84375 c -0.011719,0.04297 -0.105469,0.21875 -0.28125,0.53125 -0.167969,0.3125 -0.292969,0.53125 -0.375,0.65625 L 2.8125,-5.53125 2.28125,-4.796875 2.125,-4.59375 h 4.953125 z m 0,0"
           id="path44" />
      </symbol>
      <symbol
         overflow="visible"
         id="glyph1-4">
        <path
           style="stroke:none"
           d="m 10.453125,-4.59375 c 0,1.480469 -0.402344,2.652344 -1.203125,3.515625 -0.804688,0.855469 -1.914062,1.28125 -3.328125,1.28125 -1.585937,0 -2.796875,-0.585937 -3.640625,-1.765625 -0.835938,-1.175781 -1.25,-2.890625 -1.25,-5.140625 0,-2.425781 0.429688,-4.289063 1.296875,-5.59375 0.875,-1.300781 2.117187,-1.953125 3.734375,-1.953125 2.113281,0 3.445312,0.953125 4,2.859375 l -1.71875,0.3125 C 8,-12.222656 7.226562,-12.796875 6.03125,-12.796875 c -1.023438,0 -1.8125,0.480469 -2.375,1.4375 -0.5625,0.949219 -0.84375,2.328125 -0.84375,4.140625 0.332031,-0.601562 0.789062,-1.0625 1.375,-1.375 0.59375,-0.320312 1.273438,-0.484375 2.046875,-0.484375 1.289063,0 2.316406,0.40625 3.078125,1.21875 0.757812,0.8125 1.140625,1.902344 1.140625,3.265625 z M 8.625,-4.515625 c 0,-1.007813 -0.25,-1.789063 -0.75,-2.34375 C 7.382812,-7.410156 6.691406,-7.6875 5.796875,-7.6875 c -0.835937,0 -1.511719,0.246094 -2.03125,0.734375 C 3.253906,-6.472656 3,-5.800781 3,-4.9375 c 0,1.085938 0.265625,1.96875 0.796875,2.65625 0.539063,0.6875 1.226563,1.03125 2.0625,1.03125 0.863281,0 1.539063,-0.285156 2.03125,-0.859375 C 8.378906,-2.691406 8.625,-3.492188 8.625,-4.515625 Z m 0,0"
           id="path47" />
      </symbol>
      <symbol
         overflow="visible"
         id="glyph1-5">
        <path
           style="stroke:none"
           d="m 10.453125,-3.875 c 0,1.292969 -0.414063,2.296875 -1.234375,3.015625 -0.824219,0.710937 -2,1.0625 -3.53125,1.0625 -1.417969,0 -2.554688,-0.316406 -3.40625,-0.953125 -0.84375,-0.644531 -1.34375,-1.597656 -1.5,-2.859375 L 2.625,-3.78125 c 0.238281,1.667969 1.257812,2.5 3.0625,2.5 0.90625,0 1.613281,-0.222656 2.125,-0.671875 C 8.332031,-2.398438 8.59375,-3.0625 8.59375,-3.9375 8.59375,-4.695312 8.296875,-5.289062 7.703125,-5.71875 7.117188,-6.144531 6.269531,-6.359375 5.15625,-6.359375 H 4.140625 v -1.5625 H 5.125 c 0.976562,0 1.738281,-0.210937 2.28125,-0.640625 0.539062,-0.425781 0.8125,-1.019531 0.8125,-1.78125 0,-0.75 -0.226562,-1.34375 -0.671875,-1.78125 -0.4375,-0.4375 -1.089844,-0.65625 -1.953125,-0.65625 -0.792969,0 -1.433594,0.203125 -1.921875,0.609375 -0.492187,0.40625 -0.777344,0.980469 -0.859375,1.71875 L 1.015625,-10.59375 C 1.148438,-11.738281 1.625,-12.632812 2.4375,-13.28125 3.257812,-13.925781 4.316406,-14.25 5.609375,-14.25 c 1.40625,0 2.5,0.328125 3.28125,0.984375 0.78125,0.65625 1.171875,1.570313 1.171875,2.734375 0,0.898438 -0.25,1.625 -0.75,2.1875 -0.5,0.5625 -1.230469,0.945312 -2.1875,1.140625 v 0.03125 c 1.050781,0.117187 1.867188,0.46875 2.453125,1.0625 0.582031,0.59375 0.875,1.339844 0.875,2.234375 z m 0,0"
           id="path50" />
      </symbol>
      <symbol
         overflow="visible"
         id="glyph1-6">
        <path
           style="stroke:none"
           d="m 1.03125,0 v -1.265625 c 0.332031,-0.78125 0.742188,-1.46875 1.234375,-2.0625 0.488281,-0.59375 1,-1.128906 1.53125,-1.609375 C 4.335938,-5.414062 4.875,-5.859375 5.40625,-6.265625 5.9375,-6.679688 6.410156,-7.09375 6.828125,-7.5 c 0.425781,-0.414062 0.769531,-0.847656 1.03125,-1.296875 0.269531,-0.457031 0.40625,-0.972656 0.40625,-1.546875 0,-0.769531 -0.230469,-1.367188 -0.6875,-1.796875 -0.449219,-0.425781 -1.074219,-0.640625 -1.875,-0.640625 -0.773437,0 -1.40625,0.210938 -1.90625,0.625 -0.492187,0.417969 -0.777344,1 -0.859375,1.75 L 1.109375,-10.578125 C 1.242188,-11.691406 1.71875,-12.582031 2.53125,-13.25 c 0.820312,-0.664062 1.878906,-1 3.171875,-1 1.414063,0 2.503906,0.335938 3.265625,1 0.757812,0.667969 1.140625,1.617188 1.140625,2.84375 0,0.554688 -0.125,1.101562 -0.375,1.640625 -0.25,0.53125 -0.625,1.070313 -1.125,1.609375 -0.492187,0.53125 -1.429687,1.367188 -2.8125,2.5 -0.761719,0.625 -1.371094,1.1875 -1.828125,1.6875 -0.449219,0.5 -0.773438,0.980469 -0.96875,1.4375 h 7.328125 V 0 Z m 0,0"
           id="path53" />
      </symbol>
    </g>
  </defs>
  <g
     style="fill:#000000;fill-opacity:1"
     id="g590"
     transform="translate(-447.34922,-36.599219)">
    <use
       xlink:href="#glyph1-5"
       x="454.91061"
       y="57.48"
       id="use588"
       width="100%"
       height="100%" />
  </g>
  <g
     style="fill:#000000;fill-opacity:1"
     id="g594"
     transform="translate(-447.34922,-36.599219)">
    <use
       xlink:href="#glyph1-6"
       x="531.23053"
       y="82.919899"
       id="use592"
       width="100%"
       height="100%" />
  </g>
  <g
     style="fill:#000000;fill-opacity:1"
     id="g598"
     transform="translate(-447.34922,-36.599219)">
    <use
       xlink:href="#glyph1-1"
       x="582.11053"
       y="82.919899"
       id="use596"
       width="100%"
       height="100%" />
  </g>
  <g
     style="fill:#000000;fill-opacity:1"
     id="g602"
     transform="translate(-447.34922,-36.599219)">
    <use
       xlink:href="#glyph1-3"
       x="454.91061"
       y="108.36001"
       id="use600"
       width="100%"
       height="100%" />
  </g>
  <g
     style="fill:#000000;fill-opacity:1"
     id="g606"
     transform="translate(-447.34922,-36.599219)">
    <use
       xlink:href="#glyph1-1"
       x="480.35049"
       y="108.36001"
       id="use604"
       width="100%"
       height="100%" />
  </g>
  <g
     style="fill:#000000;fill-opacity:1"
     id="g610"
     transform="translate(-447.34922,-36.599219)">
    <use
       xlink:href="#glyph1-4"
       x="531.23053"
       y="108.36001"
       id="use608"
       width="100%"
       height="100%" />
  </g>
  <g
     style="fill:#000000;fill-opacity:1"
     id="g614"
     transform="translate(-447.34922,-36.599219)">
    <use
       xlink:href="#glyph1-4"
       x="480.35049"
       y="133.79991"
       id="use612"
       width="100%"
       height="100%" />
  </g>
  <g
     style="fill:#000000;fill-opacity:1"
     id="g618"
     transform="translate(-447.34922,-36.599219)">
    <use
       xlink:href="#glyph1-3"
       x="556.67059"
       y="133.79991"
       id="use616"
       width="100%"
       height="100%" />
  </g>
  <g
     style="fill:#000000;fill-opacity:1"
     id="g622"
     transform="translate(-447.34922,-36.599219)">
    <use
       xlink:href="#glyph1-2"
       x="582.11072"
       y="133.79991"
       id="use620"
       width="100%"
       height="100%" />
  </g>
  <g
     style="fill:#000000;fill-opacity:1"
     id="g626"
     transform="translate(-447.34922,-36.599219)">
    <use
       xlink:href="#glyph1-6"
       x="505.79062"
       y="159.24001"
       id="use624"
       width="100%"
       height="100%" />
  </g>
  <g
     style="fill:#000000;fill-opacity:1"
     id="g630"
     transform="translate(-447.34922,-36.599219)">
    <use
       xlink:href="#glyph1-3"
       x="531.23071"
       y="159.24001"
       id="use628"
       width="100%"
       height="100%" />
  </g>
  <g
     style="fill:#000000;fill-opacity:1"
     id="g634"
     transform="translate(-447.34922,-36.599219)">
    <use
       xlink:href="#glyph1-1"
       x="556.67084"
       y="159.24001"
       id="use632"
       width="100%"
       height="100%" />
  </g>
  <g
     style="fill:#000000;fill-opacity:1"
     id="g638"
     transform="translate(-447.34922,-36.599219)">
    <use
       xlink:href="#glyph1-3"
       x="480.35071"
       y="184.68011"
       id="use636"
       width="100%"
       height="100%" />
  </g>
  <g
     style="fill:#000000;fill-opacity:1"
     id="g642"
     transform="translate(-447.34922,-36.599219)">
    <use
       xlink:href="#glyph1-4"
       x="505.7908"
       y="184.68011"
       id="use640"
       width="100%"
       height="100%" />
  </g>
  <g
     style="fill:#000000;fill-opacity:1"
     id="g646"
     transform="translate(-447.34922,-36.599219)">
    <use
       xlink:href="#glyph1-6"
       x="582.1109"
       y="184.68011"
       id="use644"
       width="100%"
       height="100%" />
  </g>
  <path
     style="fill:none;stroke:#000000;stroke-width:0.12;stroke-linecap:round;stroke-linejoin:round;stroke-miterlimit:10;stroke-opacity:1"
     d="M 0.60000002,26.041406 H 153.24062"
     id="path648" />
  <path
     style="fill:none;stroke:#000000;stroke-width:0.12;stroke-linecap:round;stroke-linejoin:round;stroke-miterlimit:10;stroke-opacity:1"
     d="M 0.60000002,76.920311 H 153.24062"
     id="path650" />
  <path
     style="fill:none;stroke:#000000;stroke-width:0.12;stroke-linecap:round;stroke-linejoin:round;stroke-miterlimit:10;stroke-opacity:1"
     d="M 0.60000002,127.79922 H 153.24062"
     id="path652" />
  <path
     style="fill:none;stroke:#000000;stroke-width:0.12;stroke-linecap:round;stroke-linejoin:round;stroke-miterlimit:10;stroke-opacity:1"
     d="M 26.0414,0.60000002 V 153.24062"
     id="path654" />
  <path
     style="fill:none;stroke:#000000;stroke-width:0.12;stroke-linecap:round;stroke-linejoin:round;stroke-miterlimit:10;stroke-opacity:1"
     d="M 51.48281,0.60000002 V 153.24062"
     id="path656" />
  <path
     style="fill:none;stroke:#000000;stroke-width:1.2;stroke-linecap:round;stroke-linejoin:round;stroke-miterlimit:10;stroke-opacity:1"
     d="M 76.92031,0.60000002 V 153.24062"
     id="path658" />
  <path
     style="fill:none;stroke:#000000;stroke-width:0.12;stroke-linecap:round;stroke-linejoin:round;stroke-miterlimit:10;stroke-opacity:1"
     d="M 102.36172,0.60000002 V 153.24062"
     id="path660" />
  <path
     style="fill:none;stroke:#000000;stroke-width:0.12;stroke-linecap:round;stroke-linejoin:round;stroke-miterlimit:10;stroke-opacity:1"
     d="M 127.80312,0.60000002 V 153.24062"
     id="path662" />
  <path
     style="fill:none;stroke:#000000;stroke-width:1.2;stroke-linecap:round;stroke-linejoin:round;stroke-miterlimit:10;stroke-opacity:1"
     d="M 0.60000002,51.478906 H 153.24062"
     id="path664" />
  <path
     style="fill:none;stroke:#000000;stroke-width:1.2;stroke-linecap:round;stroke-linejoin:round;stroke-miterlimit:10;stroke-opacity:1"
     d="M 0.60000002,102.36172 H 153.24062"
     id="path666" />
  <path
     style="fill:none;stroke:#000000;stroke-width:1.2;stroke-linecap:round;stroke-linejoin:round;stroke-miterlimit:10;stroke-opacity:1"
     d="M 0.60000002,0.60000002 H 153.24062"
     id="path668" />
  <path
     style="fill:none;stroke:#000000;stroke-width:1.2;stroke-linecap:round;stroke-linejoin:round;stroke-miterlimit:10;stroke-opacity:1"
     d="M 153.24062,0.60000002 V 153.24062"
     id="path670" />
  <path
     style="fill:none;stroke:#000000;stroke-width:1.2;stroke-linecap:round;stroke-linejoin:round;stroke-miterlimit:10;stroke-opacity:1"
     d="M 153.24062,153.24062 H 0.60000002"
     id="path672" />
  <path
     style="fill:none;stroke:#000000;stroke-width:1.2;stroke-linecap:round;stroke-linejoin:round;stroke-miterlimit:10;stroke-opacity:1"
     d="M 0.60000002,153.24062 V 0.60000002"
     id="path674" />
</svg>
