<?xml version="1.0" encoding="UTF-8" standalone="no"?>
<!-- Created with Inkscape (http://www.inkscape.org/) -->

<svg
   xmlns:dc="http://purl.org/dc/elements/1.1/"
   xmlns:cc="http://creativecommons.org/ns#"
   xmlns:rdf="http://www.w3.org/1999/02/22-rdf-syntax-ns#"
   xmlns:svg="http://www.w3.org/2000/svg"
   xmlns="http://www.w3.org/2000/svg"
   xmlns:sodipodi="http://sodipodi.sourceforge.net/DTD/sodipodi-0.dtd"
   xmlns:inkscape="http://www.inkscape.org/namespaces/inkscape"
   version="1.1"
   id="svg2"
   xml:space="preserve"
   width="409.75949"
   height="211.282"
   viewBox="0 0 409.75949 211.282"
   sodipodi:docname="2018_Tue_Junior.svg"
   inkscape:version="0.92.3 (unknown)"><metadata
     id="metadata8"><rdf:RDF><cc:Work
         rdf:about=""><dc:format>image/svg+xml</dc:format><dc:type
           rdf:resource="http://purl.org/dc/dcmitype/StillImage" /><dc:title></dc:title></cc:Work></rdf:RDF></metadata><defs
     id="defs6"><clipPath
       clipPathUnits="userSpaceOnUse"
       id="clipPath18"><path
         d="m 81.5,688.53 h 450 v -585 h -450 z"
         id="path16"
         inkscape:connector-curvature="0" /></clipPath><clipPath
       clipPathUnits="userSpaceOnUse"
       id="clipPath24"><path
         d="m 108.5,661.5 h 396 v -531 h -396 z"
         id="path22"
         inkscape:connector-curvature="0" /></clipPath><clipPath
       clipPathUnits="userSpaceOnUse"
       id="clipPath30"><path
         d="m 117.5,139.5 h 377 v 513 h -377 z"
         id="path28"
         inkscape:connector-curvature="0" /></clipPath><clipPath
       clipPathUnits="userSpaceOnUse"
       id="clipPath50"><path
         d="M 174.84,596.517 V 452.19 h 287.212 v 144.327"
         id="path48"
         inkscape:connector-curvature="0" /></clipPath><clipPath
       clipPathUnits="userSpaceOnUse"
       id="clipPath62"><path
         d="M 174.84,596.517 V 452.19 h 287.212 v 144.327"
         id="path60"
         inkscape:connector-curvature="0" /></clipPath><clipPath
       clipPathUnits="userSpaceOnUse"
       id="clipPath74"><path
         d="M 174.84,596.517 V 452.19 h 287.212 v 144.327"
         id="path72"
         inkscape:connector-curvature="0" /></clipPath><clipPath
       clipPathUnits="userSpaceOnUse"
       id="clipPath86"><path
         d="M 174.84,596.517 V 452.19 h 287.212 v 144.327"
         id="path84"
         inkscape:connector-curvature="0" /></clipPath><clipPath
       clipPathUnits="userSpaceOnUse"
       id="clipPath98"><path
         d="M 174.84,596.517 V 452.19 h 287.212 v 144.327"
         id="path96"
         inkscape:connector-curvature="0" /></clipPath><clipPath
       clipPathUnits="userSpaceOnUse"
       id="clipPath110"><path
         d="M 174.84,596.517 V 452.19 h 287.212 v 144.327"
         id="path108"
         inkscape:connector-curvature="0" /></clipPath><clipPath
       clipPathUnits="userSpaceOnUse"
       id="clipPath122"><path
         d="M 174.84,596.517 V 452.19 h 287.212 v 144.327"
         id="path120"
         inkscape:connector-curvature="0" /></clipPath><clipPath
       clipPathUnits="userSpaceOnUse"
       id="clipPath214"><path
         d="M 174.84,596.517 V 452.19 h 287.212 v 144.327"
         id="path212"
         inkscape:connector-curvature="0" /></clipPath><clipPath
       clipPathUnits="userSpaceOnUse"
       id="clipPath332"><path
         d="m 81.5,688.53 h 450 v -585 h -450 z"
         id="path330"
         inkscape:connector-curvature="0" /></clipPath><clipPath
       clipPathUnits="userSpaceOnUse"
       id="clipPath338"><path
         d="m 108.5,661.5 h 396 v -531 h -396 z"
         id="path336"
         inkscape:connector-curvature="0" /></clipPath><clipPath
       clipPathUnits="userSpaceOnUse"
       id="clipPath344"><path
         d="m 117.5,139.5 h 377 v 513 h -377 z"
         id="path342"
         inkscape:connector-curvature="0" /></clipPath><clipPath
       clipPathUnits="userSpaceOnUse"
       id="clipPath406"><path
         d="m 81.5,688.53 h 450 v -585 h -450 z"
         id="path404"
         inkscape:connector-curvature="0" /></clipPath><clipPath
       clipPathUnits="userSpaceOnUse"
       id="clipPath412"><path
         d="m 108.5,661.5 h 396 v -531 h -396 z"
         id="path410"
         inkscape:connector-curvature="0" /></clipPath><clipPath
       clipPathUnits="userSpaceOnUse"
       id="clipPath418"><path
         d="m 372.47,381.98 h 79.97 V 276.13 h -79.97 z"
         id="path416"
         inkscape:connector-curvature="0"
         style="clip-rule:evenodd" /></clipPath><clipPath
       clipPathUnits="userSpaceOnUse"
       id="clipPath424"><path
         d="M 197.14,355.956 H 494.5 V 139.5 H 197.14 Z"
         id="path422"
         inkscape:connector-curvature="0" /></clipPath><clipPath
       clipPathUnits="userSpaceOnUse"
       id="clipPath436"><path
         d="m 81.5,688.53 h 450 v -585 h -450 z"
         id="path434"
         inkscape:connector-curvature="0" /></clipPath><clipPath
       clipPathUnits="userSpaceOnUse"
       id="clipPath442"><path
         d="m 108.5,661.5 h 396 v -531 h -396 z"
         id="path440"
         inkscape:connector-curvature="0" /></clipPath><clipPath
       clipPathUnits="userSpaceOnUse"
       id="clipPath448"><path
         d="m 153.5,277.52 h 80.37 V 198 H 153.5 Z"
         id="path446"
         inkscape:connector-curvature="0"
         style="clip-rule:evenodd" /></clipPath><clipPath
       clipPathUnits="userSpaceOnUse"
       id="clipPath454"><path
         d="M 155.07,311.696 H 493.23 V 139.5 H 155.07 Z"
         id="path452"
         inkscape:connector-curvature="0" /></clipPath><clipPath
       clipPathUnits="userSpaceOnUse"
       id="clipPath466"><path
         d="m 81.5,688.53 h 450 v -585 h -450 z"
         id="path464"
         inkscape:connector-curvature="0" /></clipPath><clipPath
       clipPathUnits="userSpaceOnUse"
       id="clipPath472"><path
         d="m 108.5,661.5 h 396 v -531 h -396 z"
         id="path470"
         inkscape:connector-curvature="0" /></clipPath><clipPath
       clipPathUnits="userSpaceOnUse"
       id="clipPath478"><path
         d="m 218.37,292.5 h 67.56 v -75.59 h -67.56 z"
         id="path476"
         inkscape:connector-curvature="0"
         style="clip-rule:evenodd" /></clipPath><clipPath
       clipPathUnits="userSpaceOnUse"
       id="clipPath484"><path
         d="M 117.5,377.136 H 419.34 V 139.5 H 117.5 Z"
         id="path482"
         inkscape:connector-curvature="0" /></clipPath><clipPath
       clipPathUnits="userSpaceOnUse"
       id="clipPath496"><path
         d="m 81.5,688.53 h 450 v -585 h -450 z"
         id="path494"
         inkscape:connector-curvature="0" /></clipPath><clipPath
       clipPathUnits="userSpaceOnUse"
       id="clipPath502"><path
         d="m 108.5,661.5 h 396 v -531 h -396 z"
         id="path500"
         inkscape:connector-curvature="0" /></clipPath><clipPath
       clipPathUnits="userSpaceOnUse"
       id="clipPath508"><path
         d="m 325.24,307.32 h 79.35 v -94.64 h -79.35 z"
         id="path506"
         inkscape:connector-curvature="0"
         style="clip-rule:evenodd" /></clipPath><clipPath
       clipPathUnits="userSpaceOnUse"
       id="clipPath514"><path
         d="M 188.62,494.306 H 494.5 V 139.5 H 188.62 Z"
         id="path512"
         inkscape:connector-curvature="0" /></clipPath><clipPath
       clipPathUnits="userSpaceOnUse"
       id="clipPath526"><path
         d="m 81.5,688.53 h 450 v -585 h -450 z"
         id="path524"
         inkscape:connector-curvature="0" /></clipPath><clipPath
       clipPathUnits="userSpaceOnUse"
       id="clipPath532"><path
         d="m 108.5,661.5 h 396 v -531 h -396 z"
         id="path530"
         inkscape:connector-curvature="0" /></clipPath><clipPath
       clipPathUnits="userSpaceOnUse"
       id="clipPath538"><path
         d="m 117.5,139.5 h 377 v 513 h -377 z"
         id="path536"
         inkscape:connector-curvature="0" /></clipPath><clipPath
       clipPathUnits="userSpaceOnUse"
       id="clipPath554"><path
         d="m 81.5,688.53 h 450 v -585 h -450 z"
         id="path552"
         inkscape:connector-curvature="0" /></clipPath><clipPath
       clipPathUnits="userSpaceOnUse"
       id="clipPath560"><path
         d="m 108.5,661.5 h 396 v -531 h -396 z"
         id="path558"
         inkscape:connector-curvature="0" /></clipPath><clipPath
       clipPathUnits="userSpaceOnUse"
       id="clipPath566"><path
         d="M 270.36,298.27 H 329 V 192.45 h -58.64 z"
         id="path564"
         inkscape:connector-curvature="0"
         style="clip-rule:evenodd" /></clipPath><clipPath
       clipPathUnits="userSpaceOnUse"
       id="clipPath572"><path
         d="M 259.66,418.006 H 494.5 V 139.5 H 259.66 Z"
         id="path570"
         inkscape:connector-curvature="0" /></clipPath><clipPath
       clipPathUnits="userSpaceOnUse"
       id="clipPath584"><path
         d="m 81.5,688.53 h 450 v -585 h -450 z"
         id="path582"
         inkscape:connector-curvature="0" /></clipPath><clipPath
       clipPathUnits="userSpaceOnUse"
       id="clipPath590"><path
         d="m 108.5,661.5 h 396 v -531 h -396 z"
         id="path588"
         inkscape:connector-curvature="0" /></clipPath><clipPath
       clipPathUnits="userSpaceOnUse"
       id="clipPath596"><path
         d="M 389.5,273.14 H 473 v -81.87 h -83.5 z"
         id="path594"
         inkscape:connector-curvature="0"
         style="clip-rule:evenodd" /></clipPath><clipPath
       clipPathUnits="userSpaceOnUse"
       id="clipPath602"><path
         d="M 392.61,525.836 H 494.5 V 139.5 H 392.61 Z"
         id="path600"
         inkscape:connector-curvature="0" /></clipPath><clipPath
       clipPathUnits="userSpaceOnUse"
       id="clipPath614"><path
         d="m 81.5,688.53 h 450 v -585 h -450 z"
         id="path612"
         inkscape:connector-curvature="0" /></clipPath><clipPath
       clipPathUnits="userSpaceOnUse"
       id="clipPath620"><path
         d="m 108.5,661.5 h 396 v -531 h -396 z"
         id="path618"
         inkscape:connector-curvature="0" /></clipPath><clipPath
       clipPathUnits="userSpaceOnUse"
       id="clipPath626"><path
         d="m 117.5,139.5 h 377 v 513 h -377 z"
         id="path624"
         inkscape:connector-curvature="0" /></clipPath><clipPath
       clipPathUnits="userSpaceOnUse"
       id="clipPath646"><path
         d="m 117.5,139.5 h 377 v 513 h -377 z"
         id="path644"
         inkscape:connector-curvature="0" /></clipPath></defs><sodipodi:namedview
     pagecolor="#ffffff"
     bordercolor="#666666"
     borderopacity="1"
     objecttolerance="10"
     gridtolerance="10"
     guidetolerance="10"
     inkscape:pageopacity="0"
     inkscape:pageshadow="2"
     inkscape:window-width="1855"
     inkscape:window-height="1056"
     id="namedview4"
     showgrid="false"
     fit-margin-top="0"
     fit-margin-left="0"
     fit-margin-right="0"
     fit-margin-bottom="0"
     inkscape:zoom="1.9479829"
     inkscape:cx="173.53379"
     inkscape:cy="88.075708"
     inkscape:window-x="65"
     inkscape:window-y="24"
     inkscape:window-maximized="1"
     inkscape:current-layer="g10" /><g
     id="g10"
     inkscape:groupmode="layer"
     inkscape:label="brainteasers"
     transform="matrix(1.3333333,0,0,-1.3333333,-206.75999,482.60799)"><g
       id="g400"
       transform="translate(-111,6)"><g
         clip-path="url(#clipPath406)"
         id="g402"><g
           clip-path="url(#clipPath412)"
           id="g408"><g
             clip-path="url(#clipPath418)"
             id="g414"><g
               clip-path="url(#clipPath424)"
               id="g420"><path
                 inkscape:connector-curvature="0"
                 id="path426"
                 style="fill:#fdba4c;fill-opacity:1;fill-rule:evenodd;stroke:none"
                 d="m 395.11,317.039 c -28.392,-5.476 -12.034,41.7 7.096,20.102 -19.119,22.815 40.567,25.362 20.496,-0.787 16.601,24.051 37.945,-25.358 7.094,-19.315 25.827,-10.829 -12.812,-41.33 -17.343,-12.613 -3.885,-29.273 -42.676,2.229 -17.343,12.613" /><path
                 inkscape:connector-curvature="0"
                 id="path428"
                 style="fill:none;stroke:#231f20;stroke-width:1.69000006;stroke-linecap:butt;stroke-linejoin:miter;stroke-miterlimit:4;stroke-dasharray:none;stroke-opacity:1"
                 d="m 395.11,317.039 c -28.392,-5.476 -12.034,41.7 7.096,20.102 -19.119,22.815 40.567,25.362 20.496,-0.787 16.601,24.051 37.945,-25.358 7.094,-19.315 25.827,-10.829 -12.812,-41.33 -17.343,-12.613 -3.885,-29.273 -42.676,2.229 -17.343,12.613" /></g></g></g></g></g><g
       id="g430"><g
         clip-path="url(#clipPath436)"
         id="g432"><g
           clip-path="url(#clipPath442)"
           id="g438"><g
             clip-path="url(#clipPath448)"
             id="g444"><g
               clip-path="url(#clipPath454)"
               id="g450"><path
                 inkscape:connector-curvature="0"
                 id="path456"
                 style="fill:#7dccc0;fill-opacity:1;fill-rule:evenodd;stroke:none"
                 d="m 180.754,229.818 c 0.136,0.439 0.284,0.888 0.45,1.35 -0.143,-0.47 -0.294,-0.918 -0.45,-1.35 -9.005,-29.069 45.011,-8.763 20.203,6.872 17.267,-10.232 23.068,10.808 16.466,19.884 -6.971,-4.522 -13.744,-8.796 -19.769,-5.703 -6.117,2.471 -10.828,11.605 -15.999,2.844 -2.987,-4.51 3.361,-10.455 2.757,-16.861 -0.545,-1.063 -3.504,-2.901 -5.371,-2.614 -7.266,3.398 -15.078,5.083 -22.845,5.251 -2.935,-11.375 17.693,-28.59 24.558,-9.673" /><path
                 inkscape:connector-curvature="0"
                 id="path458"
                 style="fill:none;stroke:#231f20;stroke-width:1.69000006;stroke-linecap:butt;stroke-linejoin:miter;stroke-miterlimit:4;stroke-dasharray:none;stroke-opacity:1"
                 d="m 180.754,229.818 c 0.136,0.439 0.284,0.888 0.45,1.35 -0.143,-0.47 -0.294,-0.918 -0.45,-1.35 -9.005,-29.069 45.011,-8.763 20.203,6.872 17.267,-10.232 23.068,10.808 16.466,19.884 -6.971,-4.522 -13.744,-8.796 -19.769,-5.703 -6.117,2.471 -10.828,11.605 -15.999,2.844 -2.987,-4.51 3.361,-10.455 2.757,-16.861 -0.545,-1.063 -3.504,-2.901 -5.371,-2.614 -7.266,3.398 -15.078,5.083 -22.845,5.251 -2.935,-11.375 17.693,-28.59 24.558,-9.673 z" /></g></g></g></g></g><g
       id="g460"><g
         clip-path="url(#clipPath466)"
         id="g462"><g
           clip-path="url(#clipPath472)"
           id="g468"><g
             clip-path="url(#clipPath478)"
             id="g474"><g
               clip-path="url(#clipPath484)"
               id="g480"><path
                 inkscape:connector-curvature="0"
                 id="path486"
                 style="fill:#7dccc0;fill-opacity:1;fill-rule:evenodd;stroke:none"
                 d="m 260.869,260.287 c 1.69,2.534 6.758,3.379 7.603,5.069 3.379,5.913 -3.379,12.672 -9.293,11.827 -6.504,-0.465 -15.046,0.099 -21.142,3.364 -2.71,-8.339 0.416,-18.41 14.397,-15.713 -23.158,-9.492 7.266,-36.624 15.629,-18.849 -0.474,2.173 -1.312,4.196 -2.97,5.854 -2.534,2.534 -5.914,4.224 -4.224,8.448" /><path
                 inkscape:connector-curvature="0"
                 id="path488"
                 style="fill:none;stroke:#231f20;stroke-width:1.69000006;stroke-linecap:butt;stroke-linejoin:miter;stroke-miterlimit:4;stroke-dasharray:none;stroke-opacity:1"
                 d="m 260.869,260.287 c 1.69,2.534 6.758,3.379 7.603,5.069 3.379,5.913 -3.379,12.672 -9.293,11.827 -6.504,-0.465 -15.046,0.099 -21.142,3.364 -2.71,-8.339 0.416,-18.41 14.397,-15.713 -23.158,-9.492 7.266,-36.624 15.629,-18.849 -0.474,2.173 -1.312,4.196 -2.97,5.854 -2.534,2.534 -5.914,4.224 -4.224,8.448 z" /></g></g></g></g></g><g
       id="g490"><g
         clip-path="url(#clipPath496)"
         id="g492"><g
           clip-path="url(#clipPath502)"
           id="g498"><g
             clip-path="url(#clipPath508)"
             id="g504"><g
               clip-path="url(#clipPath514)"
               id="g510"><path
                 inkscape:connector-curvature="0"
                 id="path516"
                 style="fill:#7dccc0;fill-opacity:1;fill-rule:evenodd;stroke:none"
                 d="m 352.351,250.457 c 0.377,0.262 0.771,0.524 1.187,0.786 -0.403,-0.283 -0.798,-0.542 -1.187,-0.786 -25.022,-17.322 30.018,-34.664 20.139,-7.055 3.941,-10.132 10.897,-10.966 16.509,-7.821 -8.495,9.597 -21.239,17.733 -29.463,25.375 -3.378,3.049 7.303,2.705 12.729,5.204 -2.791,4.633 -6.461,6.89 -9.252,11.524 -0.999,2.169 -5.255,2.841 -6.253,5.011 -1.705,2.123 -2.232,5.19 -1.887,8.395 -6.495,-3.631 -10.06,-11.093 -1.298,-19.271 -26.393,16.085 -24.033,-35.592 -1.224,-21.362" /><path
                 inkscape:connector-curvature="0"
                 id="path518"
                 style="fill:none;stroke:#231f20;stroke-width:1.69000006;stroke-linecap:butt;stroke-linejoin:miter;stroke-miterlimit:4;stroke-dasharray:none;stroke-opacity:1"
                 d="m 352.351,250.457 c 0.377,0.262 0.771,0.524 1.187,0.786 -0.403,-0.283 -0.798,-0.542 -1.187,-0.786 -25.022,-17.322 30.018,-34.664 20.139,-7.055 3.941,-10.132 10.897,-10.966 16.509,-7.821 -8.495,9.597 -21.239,17.733 -29.463,25.375 -3.378,3.049 7.303,2.705 12.729,5.204 -2.791,4.633 -6.461,6.89 -9.252,11.524 -0.999,2.169 -5.255,2.841 -6.253,5.011 -1.705,2.123 -2.232,5.19 -1.887,8.395 -6.495,-3.631 -10.06,-11.093 -1.298,-19.271 -26.393,16.085 -24.033,-35.592 -1.224,-21.362 z" /></g></g></g></g></g><g
       id="g548"><g
         clip-path="url(#clipPath554)"
         id="g550"><g
           clip-path="url(#clipPath560)"
           id="g556"><g
             clip-path="url(#clipPath566)"
             id="g562"><g
               clip-path="url(#clipPath572)"
               id="g568"><path
                 inkscape:connector-curvature="0"
                 id="path574"
                 style="fill:#7dccc0;fill-opacity:1;fill-rule:evenodd;stroke:none"
                 d="m 298.657,232.416 c -0.346,0.304 -0.695,0.622 -1.05,0.962 0.372,-0.322 0.719,-0.643 1.05,-0.962 22.869,-20.077 26.358,37.524 1.965,21.25 13.533,9.575 4.395,20.709 -5.382,22.986 -1.321,-2.354 -2.167,-5.19 -2.494,-8.174 -1.196,-10.916 4.326,-22.569 -1.069,-33.026 -0.84,0.092 -2.519,0.275 -3.359,0.367 -1.496,1.864 -1.22,4.383 -2.715,6.247 -2.243,2.795 -4.855,2.232 -5.879,0.644 -2.103,-4.574 -2.05,-10.139 -2.499,-14.981 0.137,0.23 0.276,0.456 0.41,0.699 -9.209,-29.504 40.356,-14.692 21.022,3.988" /><path
                 inkscape:connector-curvature="0"
                 id="path576"
                 style="fill:none;stroke:#231f20;stroke-width:1.69000006;stroke-linecap:butt;stroke-linejoin:miter;stroke-miterlimit:4;stroke-dasharray:none;stroke-opacity:1"
                 d="m 298.657,232.416 c -0.346,0.304 -0.695,0.622 -1.05,0.962 0.372,-0.322 0.719,-0.643 1.05,-0.962 22.869,-20.077 26.358,37.524 1.965,21.25 13.533,9.575 4.395,20.709 -5.382,22.986 -1.321,-2.354 -2.167,-5.19 -2.494,-8.174 -1.196,-10.916 4.326,-22.569 -1.069,-33.026 -0.84,0.092 -2.519,0.275 -3.359,0.367 -1.496,1.864 -1.22,4.383 -2.715,6.247 -2.243,2.795 -4.855,2.232 -5.879,0.644 -2.103,-4.574 -2.05,-10.139 -2.499,-14.981 0.137,0.23 0.276,0.456 0.41,0.699 -9.209,-29.504 40.356,-14.692 21.022,3.988 z" /></g></g></g></g></g><g
       id="g578"><g
         clip-path="url(#clipPath584)"
         id="g580"><g
           clip-path="url(#clipPath590)"
           id="g586"><g
             clip-path="url(#clipPath596)"
             id="g592"><g
               clip-path="url(#clipPath602)"
               id="g598"><path
                 inkscape:connector-curvature="0"
                 id="path604"
                 style="fill:#7dccc0;fill-opacity:1;fill-rule:evenodd;stroke:none"
                 d="m 439.142,213.825 c -2.07,6.091 -10.295,8.921 -9.414,14.257 1.134,10.11 9.169,3.702 15.762,3.951 6.763,-0.359 11.195,6.313 15.706,13.291 -4.26,2.441 -9.746,1.827 -15.056,-5.189 11.892,24.661 -38.016,22.145 -21.33,-2.218 -22.572,18.323 -30.906,-30.195 -4.461,-20.977 -6.669,-3.988 -8.697,-8.362 -8.033,-12.252 7.156,3.024 14.973,4.683 22.993,4.554 1.822,0.502 3.77,3.39 3.833,4.583" /><path
                 inkscape:connector-curvature="0"
                 id="path606"
                 style="fill:none;stroke:#231f20;stroke-width:1.69000006;stroke-linecap:butt;stroke-linejoin:miter;stroke-miterlimit:4;stroke-dasharray:none;stroke-opacity:1"
                 d="m 439.142,213.825 c -2.07,6.091 -10.295,8.921 -9.414,14.257 1.134,10.11 9.169,3.702 15.762,3.951 6.763,-0.359 11.195,6.313 15.706,13.291 -4.26,2.441 -9.746,1.827 -15.056,-5.189 11.892,24.661 -38.016,22.145 -21.33,-2.218 -22.572,18.323 -30.906,-30.195 -4.461,-20.977 -6.669,-3.988 -8.697,-8.362 -8.033,-12.252 7.156,3.024 14.973,4.683 22.993,4.554 1.822,0.502 3.77,3.39 3.833,4.583 z" /></g></g></g></g></g><g
       id="g640"><g
         clip-path="url(#clipPath646)"
         id="g642"><path
           inkscape:connector-curvature="0"
           id="path648"
           style="fill:none;stroke:#ffffff;stroke-width:0.5;stroke-linecap:butt;stroke-linejoin:miter;stroke-miterlimit:10;stroke-dasharray:none;stroke-opacity:1"
           d="m 117.5,688.5 v -24 m -36,-12 h 24 m 390,36 v -24 m 36,-12 h -24 m -390,-549 v 24 m -36,12 h 24 m 390,-36 v 24 m 36,12 h -24" /><path
           inkscape:connector-curvature="0"
           id="path650"
           style="fill:none;stroke:#000000;stroke-width:0.25;stroke-linecap:butt;stroke-linejoin:miter;stroke-miterlimit:10;stroke-dasharray:none;stroke-opacity:1"
           d="m 117.5,688.5 v -24 m -36,-12 h 24 m 390,36 v -24 m 36,-12 h -24 m -390,-549 v 24 m -36,12 h 24 m 390,-36 v 24 m 36,12 h -24" /><path
           inkscape:connector-curvature="0"
           id="path652"
           style="fill:none;stroke:#ffffff;stroke-width:0.5;stroke-linecap:butt;stroke-linejoin:miter;stroke-miterlimit:10;stroke-dasharray:none;stroke-opacity:1"
           d="m 282.5,676.5 h 48 m -48,-561 h 48 M 93.5,420 v -48 m 426,48 v -48 m -213,316.5 v -24 m 0,-537 v -24 M 81.5,396 h 24 m 402,0 h 24 m -225,280.5 h 6 c 0,-3.312 -2.688,-6 -6,-6 -3.312,0 -6,2.688 -6,6 0,3.312 2.688,6 6,6 3.312,0 6,-2.688 6,-6 m -6,-561 h 6 c 0,-3.312 -2.688,-6 -6,-6 -3.312,0 -6,2.688 -6,6 0,3.312 2.688,6 6,6 3.312,0 6,-2.688 6,-6 M 93.5,396 h 6 c 0,-3.312 -2.688,-6 -6,-6 -3.312,0 -6,2.688 -6,6 0,3.312 2.688,6 6,6 3.312,0 6,-2.688 6,-6 m 420,0 h 6 c 0,-3.312 -2.688,-6 -6,-6 -3.312,0 -6,2.688 -6,6 0,3.312 2.688,6 6,6 3.312,0 6,-2.688 6,-6" /><path
           inkscape:connector-curvature="0"
           id="path654"
           style="fill:none;stroke:#000000;stroke-width:0.25;stroke-linecap:butt;stroke-linejoin:miter;stroke-miterlimit:10;stroke-dasharray:none;stroke-opacity:1"
           d="m 282.5,676.5 h 48 m -48,-561 h 48 M 93.5,420 v -48 m 426,48 v -48 m -213,316.5 v -24 m 0,-537 v -24 M 81.5,396 h 24 m 402,0 h 24 m -225,280.5 h 6 c 0,-3.312 -2.688,-6 -6,-6 -3.312,0 -6,2.688 -6,6 0,3.312 2.688,6 6,6 3.312,0 6,-2.688 6,-6 m -6,-561 h 6 c 0,-3.312 -2.688,-6 -6,-6 -3.312,0 -6,2.688 -6,6 0,3.312 2.688,6 6,6 3.312,0 6,-2.688 6,-6 M 93.5,396 h 6 c 0,-3.312 -2.688,-6 -6,-6 -3.312,0 -6,2.688 -6,6 0,3.312 2.688,6 6,6 3.312,0 6,-2.688 6,-6 m 420,0 h 6 c 0,-3.312 -2.688,-6 -6,-6 -3.312,0 -6,2.688 -6,6 0,3.312 2.688,6 6,6 3.312,0 6,-2.688 6,-6" /></g></g><text
       xml:space="preserve"
       style="font-style:normal;font-weight:normal;font-size:80.625px;line-height:125%;font-family:sans-serif;text-align:end;letter-spacing:0px;word-spacing:0px;text-anchor:end;fill:#000000;fill-opacity:1;stroke:none;stroke-width:0.75px;stroke-linecap:butt;stroke-linejoin:miter;stroke-opacity:1"
       x="163.19279"
       y="-410.1568"
       id="text1686"
       transform="scale(1,-1)"><tspan
         sodipodi:role="line"
         id="tspan1684"
         x="163.19279"
         y="-338.82257"
         style="stroke-width:0.75px" /></text>
<text
       xml:space="preserve"
       style="font-style:normal;font-weight:normal;font-size:80.625px;line-height:125%;font-family:sans-serif;text-align:end;letter-spacing:0px;word-spacing:0px;text-anchor:end;fill:#000000;fill-opacity:1;stroke:none;stroke-width:0.75px;stroke-linecap:butt;stroke-linejoin:miter;stroke-opacity:1"
       x="177.89407"
       y="-248.9873"
       id="text1690"
       transform="scale(1,-1)"><tspan
         sodipodi:role="line"
         id="tspan1688"
         x="177.89407"
         y="-248.9873"
         style="font-weight:bold;font-size:16px;stroke-width:0.75px">A</tspan></text>
<text
       transform="scale(1,-1)"
       id="text1694"
       y="-242.9873"
       x="242.39407"
       style="font-style:normal;font-weight:normal;font-size:80.625px;line-height:125%;font-family:sans-serif;text-align:end;letter-spacing:0px;word-spacing:0px;text-anchor:end;fill:#000000;fill-opacity:1;stroke:none;stroke-width:0.75px;stroke-linecap:butt;stroke-linejoin:miter;stroke-opacity:1"
       xml:space="preserve"><tspan
         style="font-weight:bold;font-size:16px;stroke-width:0.75px"
         y="-242.9873"
         x="242.39407"
         id="tspan1692"
         sodipodi:role="line">B</tspan></text>
<text
       xml:space="preserve"
       style="font-style:normal;font-weight:normal;font-size:80.625px;line-height:125%;font-family:sans-serif;text-align:end;letter-spacing:0px;word-spacing:0px;text-anchor:end;fill:#000000;fill-opacity:1;stroke:none;stroke-width:0.75px;stroke-linecap:butt;stroke-linejoin:miter;stroke-opacity:1"
       x="318.89407"
       y="-208.4873"
       id="text1698"
       transform="scale(1,-1)"><tspan
         sodipodi:role="line"
         id="tspan1696"
         x="318.89407"
         y="-208.4873"
         style="font-weight:bold;font-size:16px;stroke-width:0.75px">C</tspan></text>
<text
       transform="scale(1,-1)"
       id="text1702"
       y="-230.9873"
       x="341.39407"
       style="font-style:normal;font-weight:normal;font-size:80.625px;line-height:125%;font-family:sans-serif;text-align:end;letter-spacing:0px;word-spacing:0px;text-anchor:end;fill:#000000;fill-opacity:1;stroke:none;stroke-width:0.75px;stroke-linecap:butt;stroke-linejoin:miter;stroke-opacity:1"
       xml:space="preserve"><tspan
         style="font-weight:bold;font-size:16px;stroke-width:0.75px"
         y="-230.9873"
         x="341.39407"
         id="tspan1700"
         sodipodi:role="line">D</tspan></text>
<text
       xml:space="preserve"
       style="font-style:normal;font-weight:normal;font-size:80.625px;line-height:125%;font-family:sans-serif;text-align:end;letter-spacing:0px;word-spacing:0px;text-anchor:end;fill:#000000;fill-opacity:1;stroke:none;stroke-width:0.75px;stroke-linecap:butt;stroke-linejoin:miter;stroke-opacity:1"
       x="456.89407"
       y="-215.9873"
       id="text1706"
       transform="scale(1,-1)"><tspan
         sodipodi:role="line"
         id="tspan1704"
         x="456.89407"
         y="-215.9873"
         style="font-weight:bold;font-size:16px;stroke-width:0.75px">E</tspan></text>
</g></svg>