<?xml version="1.0" encoding="UTF-8" standalone="no"?>
<!-- Created with Inkscape (http://www.inkscape.org/) -->

<svg
   xmlns:dc="http://purl.org/dc/elements/1.1/"
   xmlns:cc="http://creativecommons.org/ns#"
   xmlns:rdf="http://www.w3.org/1999/02/22-rdf-syntax-ns#"
   xmlns:svg="http://www.w3.org/2000/svg"
   xmlns="http://www.w3.org/2000/svg"
   xmlns:sodipodi="http://sodipodi.sourceforge.net/DTD/sodipodi-0.dtd"
   xmlns:inkscape="http://www.inkscape.org/namespaces/inkscape"
   width="88.547226mm"
   height="88.088615mm"
   viewBox="0 0 88.547226 88.088615"
   version="1.1"
   id="svg620"
   inkscape:version="0.92.4 (unknown)"
   sodipodi:docname="2019_Thu_Senior.svg">
  <defs
     id="defs614">
    <clipPath
       clipPathUnits="userSpaceOnUse"
       id="clipPath174">
      <path
         d="M 183.5,461.382 H 426.48 V 223.47 H 183.5 Z"
         id="path172"
         inkscape:connector-curvature="0" />
    </clipPath>
    <clipPath
       clipPathUnits="userSpaceOnUse"
       id="clipPath162">
      <path
         d="M 183.5,461.382 H 426.48 V 223.47 H 183.5 Z"
         id="path160"
         inkscape:connector-curvature="0" />
    </clipPath>
    <clipPath
       clipPathUnits="userSpaceOnUse"
       id="clipPath142">
      <path
         d="M 183.5,461.382 H 426.48 V 223.47 H 183.5 Z"
         id="path140"
         inkscape:connector-curvature="0" />
    </clipPath>
    <clipPath
       clipPathUnits="userSpaceOnUse"
       id="clipPath130">
      <path
         d="M 183.5,461.382 H 426.48 V 223.47 H 183.5 Z"
         id="path128"
         inkscape:connector-curvature="0" />
    </clipPath>
    <clipPath
       clipPathUnits="userSpaceOnUse"
       id="clipPath118">
      <path
         d="M 183.5,461.382 H 426.48 V 223.47 H 183.5 Z"
         id="path116"
         inkscape:connector-curvature="0" />
    </clipPath>
    <clipPath
       clipPathUnits="userSpaceOnUse"
       id="clipPath106">
      <path
         d="M 183.5,461.382 H 426.48 V 223.47 H 183.5 Z"
         id="path104"
         inkscape:connector-curvature="0" />
    </clipPath>
    <clipPath
       clipPathUnits="userSpaceOnUse"
       id="clipPath94">
      <path
         d="M 183.5,461.382 H 426.48 V 223.47 H 183.5 Z"
         id="path92"
         inkscape:connector-curvature="0" />
    </clipPath>
    <clipPath
       clipPathUnits="userSpaceOnUse"
       id="clipPath82">
      <path
         d="M 183.5,461.382 H 426.48 V 223.47 H 183.5 Z"
         id="path80"
         inkscape:connector-curvature="0" />
    </clipPath>
    <clipPath
       clipPathUnits="userSpaceOnUse"
       id="clipPath62">
      <path
         d="M 183.5,461.382 H 426.48 V 223.47 H 183.5 Z"
         id="path60"
         inkscape:connector-curvature="0" />
    </clipPath>
    <clipPath
       clipPathUnits="userSpaceOnUse"
       id="clipPath50">
      <path
         d="M 183.5,461.382 H 426.48 V 223.47 H 183.5 Z"
         id="path48"
         inkscape:connector-curvature="0" />
    </clipPath>
  </defs>
  <sodipodi:namedview
     id="base"
     pagecolor="#ffffff"
     bordercolor="#666666"
     borderopacity="1.0"
     inkscape:pageopacity="0.0"
     inkscape:pageshadow="2"
     inkscape:zoom="0.7"
     inkscape:cx="970.19049"
     inkscape:cy="-170.67618"
     inkscape:document-units="mm"
     inkscape:current-layer="layer1"
     showgrid="false"
     fit-margin-top="0"
     fit-margin-left="0"
     fit-margin-right="0"
     fit-margin-bottom="0"
     inkscape:window-width="1855"
     inkscape:window-height="1056"
     inkscape:window-x="65"
     inkscape:window-y="24"
     inkscape:window-maximized="1" />
  <metadata
     id="metadata617">
    <rdf:RDF>
      <cc:Work
         rdf:about="">
        <dc:format>image/svg+xml</dc:format>
        <dc:type
           rdf:resource="http://purl.org/dc/dcmitype/StillImage" />
        <dc:title></dc:title>
      </cc:Work>
    </rdf:RDF>
  </metadata>
  <g
     inkscape:label="Layer 1"
     inkscape:groupmode="layer"
     id="layer1"
     transform="translate(150.8629,-15.586647)">
    <path
       inkscape:connector-curvature="0"
       id="path38"
       style="fill:#cce7d4;fill-opacity:1;fill-rule:nonzero;stroke:none;stroke-width:0.35277775"
       d="m -150.8629,103.67526 h 88.547224 V 15.586647 H -150.8629" />
    <path
       inkscape:connector-curvature="0"
       id="path42"
       style="fill:#ffffff;fill-opacity:1;fill-rule:nonzero;stroke:none;stroke-width:0.35277775"
       d="m -106.2351,101.60833 h 19.81941 V 81.788924 h -19.81941 z" />
    <g
       transform="matrix(0.35277777,0,0,-0.35277777,-215.59762,180.68664)"
       id="g44">
      <g
         clip-path="url(#clipPath50)"
         id="g46">
        <path
           inkscape:connector-curvature="0"
           id="path52"
           style="fill:none;stroke:#00b5ad;stroke-width:1.38;stroke-linecap:butt;stroke-linejoin:miter;stroke-miterlimit:4;stroke-dasharray:none;stroke-opacity:1"
           d="m 310.004,280.34 h 56.181 v -56.181 h -56.181 z" />
      </g>
    </g>
    <path
       inkscape:connector-curvature="0"
       id="path54"
       style="fill:#ffffff;fill-opacity:1;fill-rule:nonzero;stroke:none;stroke-width:0.35277775"
       d="m -106.2351,37.984155 h 19.81941 V 18.164747 h -19.81941 z" />
    <g
       transform="matrix(0.35277777,0,0,-0.35277777,-215.59762,180.68664)"
       id="g56">
      <g
         clip-path="url(#clipPath62)"
         id="g58">
        <path
           inkscape:connector-curvature="0"
           id="path64"
           style="fill:none;stroke:#00b5ad;stroke-width:1.38;stroke-linecap:butt;stroke-linejoin:miter;stroke-miterlimit:4;stroke-dasharray:none;stroke-opacity:1"
           d="m 310.004,460.692 h 56.181 v -56.181 h -56.181 z" />
      </g>
    </g>
    <path
       inkscape:connector-curvature="0"
       id="path66"
       style="fill:#ffffff;fill-opacity:1;fill-rule:nonzero;stroke:none;stroke-width:0.35277775"
       d="m -106.2351,59.138122 h 19.81941 V 39.336705 h -19.81941 z" />
    <path
       inkscape:connector-curvature="0"
       id="path68"
       style="fill:none;stroke:#00b5ad;stroke-width:0.4868333;stroke-linecap:butt;stroke-linejoin:miter;stroke-miterlimit:4;stroke-dasharray:none;stroke-opacity:1"
       d="m -106.2351,39.336705 h 19.81941 v 19.801417 h -19.81941 z" />
    <path
       inkscape:connector-curvature="0"
       id="path70"
       style="fill:#ffffff;fill-opacity:1;fill-rule:nonzero;stroke:none;stroke-width:0.35277775"
       d="m -106.2351,80.310078 h 19.81941 V 60.491024 h -19.81941 z" />
    <path
       inkscape:connector-curvature="0"
       id="path72"
       style="fill:none;stroke:#00b5ad;stroke-width:0.4868333;stroke-linecap:butt;stroke-linejoin:miter;stroke-miterlimit:4;stroke-dasharray:none;stroke-opacity:1"
       d="m -106.2351,60.491024 h 19.81941 v 19.819054 h -19.81941 z" />
    <path
       inkscape:connector-curvature="0"
       id="path74"
       style="fill:#ffffff;fill-opacity:1;fill-rule:nonzero;stroke:none;stroke-width:0.35277775"
       d="m -85.207426,101.60833 h 19.819409 V 81.788924 h -19.819409 z" />
    <g
       transform="matrix(0.35277777,0,0,-0.35277777,-215.59762,180.68664)"
       id="g76">
      <g
         clip-path="url(#clipPath82)"
         id="g78">
        <path
           inkscape:connector-curvature="0"
           id="path84"
           style="fill:none;stroke:#00b5ad;stroke-width:1.38;stroke-linecap:butt;stroke-linejoin:miter;stroke-miterlimit:4;stroke-dasharray:none;stroke-opacity:1"
           d="m 369.61,280.34 h 56.181 V 224.159 H 369.61 Z" />
      </g>
    </g>
    <path
       inkscape:connector-curvature="0"
       id="path86"
       style="fill:#ffffff;fill-opacity:1;fill-rule:nonzero;stroke:none;stroke-width:0.35277775"
       d="m -85.207426,37.984155 h 19.819409 V 18.164747 h -19.819409 z" />
    <g
       transform="matrix(0.35277777,0,0,-0.35277777,-215.59762,180.68664)"
       id="g88">
      <g
         clip-path="url(#clipPath94)"
         id="g90">
        <path
           inkscape:connector-curvature="0"
           id="path96"
           style="fill:none;stroke:#00b5ad;stroke-width:1.38;stroke-linecap:butt;stroke-linejoin:miter;stroke-miterlimit:4;stroke-dasharray:none;stroke-opacity:1"
           d="m 369.61,460.692 h 56.181 V 404.511 H 369.61 Z" />
      </g>
    </g>
    <path
       inkscape:connector-curvature="0"
       id="path98"
       style="fill:#ffffff;fill-opacity:1;fill-rule:nonzero;stroke:none;stroke-width:0.35277775"
       d="m -85.207426,59.138122 h 19.819409 V 39.336705 h -19.819409 z" />
    <g
       transform="matrix(0.35277777,0,0,-0.35277777,-215.59762,180.68664)"
       id="g100">
      <g
         clip-path="url(#clipPath106)"
         id="g102">
        <path
           inkscape:connector-curvature="0"
           id="path108"
           style="fill:none;stroke:#00b5ad;stroke-width:1.38;stroke-linecap:butt;stroke-linejoin:miter;stroke-miterlimit:4;stroke-dasharray:none;stroke-opacity:1"
           d="m 369.61,400.677 h 56.181 v -56.13 H 369.61 Z" />
      </g>
    </g>
    <path
       inkscape:connector-curvature="0"
       id="path110"
       style="fill:#ffffff;fill-opacity:1;fill-rule:nonzero;stroke:none;stroke-width:0.35277775"
       d="m -85.207426,80.310078 h 19.819409 V 60.491024 h -19.819409 z" />
    <g
       transform="matrix(0.35277777,0,0,-0.35277777,-215.59762,180.68664)"
       id="g112">
      <g
         clip-path="url(#clipPath118)"
         id="g114">
        <path
           inkscape:connector-curvature="0"
           id="path120"
           style="fill:none;stroke:#00b5ad;stroke-width:1.38;stroke-linecap:butt;stroke-linejoin:miter;stroke-miterlimit:4;stroke-dasharray:none;stroke-opacity:1"
           d="m 369.61,340.712 h 56.181 v -56.18 H 369.61 Z" />
      </g>
    </g>
    <path
       inkscape:connector-curvature="0"
       id="path122"
       style="fill:#ffffff;fill-opacity:1;fill-rule:nonzero;stroke:none;stroke-width:0.35277775"
       d="m -148.29044,101.60833 h 19.81941 V 81.788924 h -19.81941 z" />
    <g
       transform="matrix(0.35277777,0,0,-0.35277777,-215.59762,180.68664)"
       id="g124">
      <g
         clip-path="url(#clipPath130)"
         id="g126">
        <path
           inkscape:connector-curvature="0"
           id="path132"
           style="fill:none;stroke:#00b5ad;stroke-width:1.38;stroke-linecap:butt;stroke-linejoin:miter;stroke-miterlimit:4;stroke-dasharray:none;stroke-opacity:1"
           d="m 190.792,280.34 h 56.181 v -56.181 h -56.181 z" />
      </g>
    </g>
    <path
       inkscape:connector-curvature="0"
       id="path134"
       style="fill:#ffffff;fill-opacity:1;fill-rule:nonzero;stroke:none;stroke-width:0.35277775"
       d="m -148.29044,37.984155 h 19.81941 V 18.164747 h -19.81941 z" />
    <g
       transform="matrix(0.35277777,0,0,-0.35277777,-215.59762,180.68664)"
       id="g138"
       clip-path="url(#clipPath142)">
      <path
         d="m 190.792,460.692 h 56.181 v -56.181 h -56.181 z"
         style="fill:none;stroke:#00b5ad;stroke-width:1.38;stroke-linecap:butt;stroke-linejoin:miter;stroke-miterlimit:4;stroke-dasharray:none;stroke-opacity:1"
         id="path144"
         inkscape:connector-curvature="0" />
    </g>
    <path
       inkscape:connector-curvature="0"
       id="path146"
       style="fill:#ffffff;fill-opacity:1;fill-rule:nonzero;stroke:none;stroke-width:0.35277775"
       d="m -148.29044,59.138122 h 19.81941 V 39.336705 h -19.81941 z" />
    <path
       inkscape:connector-curvature="0"
       id="path148"
       style="fill:none;stroke:#00b5ad;stroke-width:0.4868333;stroke-linecap:butt;stroke-linejoin:miter;stroke-miterlimit:4;stroke-dasharray:none;stroke-opacity:1"
       d="m -148.29044,39.336705 h 19.81941 v 19.801417 h -19.81941 z" />
    <path
       inkscape:connector-curvature="0"
       id="path150"
       style="fill:#ffffff;fill-opacity:1;fill-rule:nonzero;stroke:none;stroke-width:0.35277775"
       d="m -148.29044,80.310078 h 19.81941 V 60.491024 h -19.81941 z" />
    <path
       inkscape:connector-curvature="0"
       id="path152"
       style="fill:none;stroke:#00b5ad;stroke-width:0.4868333;stroke-linecap:butt;stroke-linejoin:miter;stroke-miterlimit:4;stroke-dasharray:none;stroke-opacity:1"
       d="m -148.29044,60.491024 h 19.81941 v 19.819054 h -19.81941 z" />
    <path
       inkscape:connector-curvature="0"
       id="path154"
       style="fill:#ffffff;fill-opacity:1;fill-rule:nonzero;stroke:none;stroke-width:0.35277775"
       d="m -127.26277,101.60833 h 19.81941 V 81.788924 h -19.81941 z" />
    <g
       transform="matrix(0.35277777,0,0,-0.35277777,-215.59762,180.68664)"
       id="g156">
      <g
         clip-path="url(#clipPath162)"
         id="g158">
        <path
           inkscape:connector-curvature="0"
           id="path164"
           style="fill:none;stroke:#00b5ad;stroke-width:1.38;stroke-linecap:butt;stroke-linejoin:miter;stroke-miterlimit:4;stroke-dasharray:none;stroke-opacity:1"
           d="m 250.398,280.34 h 56.181 v -56.181 h -56.181 z" />
      </g>
    </g>
    <path
       inkscape:connector-curvature="0"
       id="path166"
       style="fill:#ffffff;fill-opacity:1;fill-rule:nonzero;stroke:none;stroke-width:0.35277775"
       d="m -127.26277,37.984155 h 19.81941 V 18.164747 h -19.81941 z" />
    <g
       transform="matrix(0.35277777,0,0,-0.35277777,-215.59762,180.68664)"
       id="g168">
      <g
         clip-path="url(#clipPath174)"
         id="g170">
        <path
           inkscape:connector-curvature="0"
           id="path176"
           style="fill:none;stroke:#00b5ad;stroke-width:1.38;stroke-linecap:butt;stroke-linejoin:miter;stroke-miterlimit:4;stroke-dasharray:none;stroke-opacity:1"
           d="m 250.398,460.692 h 56.181 v -56.181 h -56.181 z" />
      </g>
    </g>
    <path
       inkscape:connector-curvature="0"
       id="path178"
       style="fill:#ffffff;fill-opacity:1;fill-rule:nonzero;stroke:none;stroke-width:0.35277775"
       d="m -127.26277,59.138122 h 19.81941 V 39.336705 h -19.81941 z" />
    <path
       inkscape:connector-curvature="0"
       id="path180"
       style="fill:none;stroke:#00b5ad;stroke-width:0.4868333;stroke-linecap:butt;stroke-linejoin:miter;stroke-miterlimit:4;stroke-dasharray:none;stroke-opacity:1"
       d="m -127.26277,39.336705 h 19.81941 v 19.801417 h -19.81941 z" />
    <path
       inkscape:connector-curvature="0"
       id="path182"
       style="fill:#ffffff;fill-opacity:1;fill-rule:nonzero;stroke:none;stroke-width:0.35277775"
       d="m -127.26277,80.310078 h 19.81941 V 60.491024 h -19.81941 z" />
    <path
       inkscape:connector-curvature="0"
       id="path184"
       style="fill:none;stroke:#00b5ad;stroke-width:0.4868333;stroke-linecap:butt;stroke-linejoin:miter;stroke-miterlimit:4;stroke-dasharray:none;stroke-opacity:1"
       d="m -127.26277,60.491024 h 19.81941 v 19.819054 h -19.81941 z" />
    <path
       inkscape:connector-curvature="0"
       id="path186"
       style="fill:#ed1c24;fill-opacity:1;fill-rule:nonzero;stroke:none;stroke-width:0.35277775"
       d="m -71.303042,43.232076 4.832702,5.969354 -4.832702,5.969352 -4.8514,-5.969352 4.8514,-5.969354" />
    <path
       inkscape:connector-curvature="0"
       id="path188"
       style="fill:none;stroke:#231f20;stroke-width:0.053975;stroke-linecap:butt;stroke-linejoin:miter;stroke-miterlimit:4;stroke-dasharray:none;stroke-opacity:1"
       d="m -71.303042,43.232076 4.832702,5.969354 -4.832702,5.969352 -4.8514,-5.969352 z" />
    <path
       inkscape:connector-curvature="0"
       id="path190"
       style="fill:#ed1c24;fill-opacity:1;fill-rule:nonzero;stroke:none;stroke-width:0.35277775"
       d="m -92.907859,86.044834 4.851048,5.969352 -4.851048,5.987346 -4.833056,-5.987346 4.833056,-5.969352" />
    <path
       inkscape:connector-curvature="0"
       id="path192"
       style="fill:none;stroke:#231f20;stroke-width:0.053975;stroke-linecap:butt;stroke-linejoin:miter;stroke-miterlimit:4;stroke-dasharray:none;stroke-opacity:1"
       d="m -92.907859,86.044834 4.851048,5.969352 -4.851048,5.987346 -4.833056,-5.987346 z" />
    <path
       inkscape:connector-curvature="0"
       id="path194"
       style="fill:#ed1c24;fill-opacity:1;fill-rule:nonzero;stroke:none;stroke-width:0.35277775"
       d="m -134.67463,46.568297 c 0.23425,-0.865365 0.5588,-1.4605 0.97367,-1.785408 0.39652,-0.324557 0.84737,-0.486834 1.35255,-0.486834 0.70308,0 1.29822,0.234596 1.78541,0.685446 0.46884,0.468841 0.72143,1.027996 0.72143,1.71309 0,0.595135 -0.10831,1.118306 -0.3429,1.605139 -0.21626,0.486834 -0.63112,1.099961 -1.20827,1.821392 -0.73942,0.919692 -1.2259,1.532819 -1.46085,1.839383 -0.21625,0.306562 -0.48648,0.739421 -0.77541,1.280584 -0.30621,0.540808 -0.50482,0.956027 -0.63112,1.262237 -0.072,0.162279 -0.12629,0.288925 -0.18026,0.342548 -0.036,0.05433 -0.10795,0.108302 -0.19827,0.14464 h -0.09 c -0.0903,-0.03634 -0.16263,-0.09031 -0.19861,-0.14464 -0.0543,-0.07197 -0.1083,-0.180269 -0.16228,-0.342548 -0.12629,-0.30621 -0.32455,-0.703437 -0.63147,-1.244246 -0.28822,-0.541163 -0.5588,-0.974021 -0.77541,-1.280583 -0.23424,-0.306565 -0.72143,-0.937683 -1.47884,-1.857375 -0.52282,-0.667105 -0.91969,-1.226256 -1.15394,-1.731433 -0.25223,-0.486834 -0.37853,-1.027642 -0.37853,-1.604788 0,-0.757412 0.25259,-1.35255 0.73907,-1.8034 0.48684,-0.468842 1.06398,-0.685446 1.74943,-0.685446 0.52281,0 0.97366,0.162277 1.37054,0.486834 0.39652,0.324908 0.72143,0.920043 0.97402,1.785408" />
    <path
       inkscape:connector-curvature="0"
       id="path196"
       style="fill:none;stroke:#231f20;stroke-width:0.053975;stroke-linecap:butt;stroke-linejoin:miter;stroke-miterlimit:4;stroke-dasharray:none;stroke-opacity:1"
       d="m -134.67463,46.568297 c 0.23425,-0.865365 0.5588,-1.4605 0.97367,-1.785408 0.39652,-0.324557 0.84737,-0.486834 1.35255,-0.486834 0.70308,0 1.29822,0.234596 1.78541,0.685446 0.46884,0.468841 0.72143,1.027996 0.72143,1.71309 0,0.595135 -0.10831,1.118306 -0.3429,1.605139 -0.21626,0.486834 -0.63112,1.099961 -1.20827,1.821392 -0.73942,0.919692 -1.2259,1.532819 -1.46085,1.839383 -0.21625,0.306562 -0.48648,0.739421 -0.77541,1.280584 -0.30621,0.540808 -0.50482,0.956027 -0.63112,1.262237 -0.072,0.162279 -0.12629,0.288925 -0.18026,0.342548 -0.036,0.05433 -0.10795,0.108302 -0.19827,0.14464 h -0.09 c -0.0903,-0.03634 -0.16263,-0.09031 -0.19861,-0.14464 -0.0543,-0.07197 -0.1083,-0.180269 -0.16228,-0.342548 -0.12629,-0.30621 -0.32455,-0.703437 -0.63147,-1.244246 -0.28822,-0.541163 -0.5588,-0.974021 -0.77541,-1.280583 -0.23424,-0.306565 -0.72143,-0.937683 -1.47884,-1.857375 -0.52282,-0.667105 -0.91969,-1.226256 -1.15394,-1.731433 -0.25223,-0.486834 -0.37853,-1.027642 -0.37853,-1.604788 0,-0.757412 0.25259,-1.35255 0.73907,-1.8034 0.48684,-0.468842 1.06398,-0.685446 1.74943,-0.685446 0.52281,0 0.97366,0.162277 1.37054,0.486834 0.39652,0.324908 0.72143,0.920043 0.97402,1.785408 z" />
    <path
       inkscape:connector-curvature="0"
       id="path198"
       style="fill:#231f20;fill-opacity:1;fill-rule:nonzero;stroke:none;stroke-width:0.35277775"
       d="m -71.339377,22.709583 h 0.306562 c 0.08996,0.05398 0.144288,0.10795 0.198614,0.18027 0.03563,0.05398 0.08996,0.180269 0.179917,0.342547 0.144285,0.252589 0.306565,0.505178 0.505177,0.739422 0.198263,0.252589 0.540808,0.595136 0.991658,1.010003 0.685448,0.595136 1.208265,1.099961 1.569157,1.478844 0.36054,0.37853 0.631118,0.757414 0.811741,1.153936 0.180269,0.414867 0.270227,0.79375 0.270227,1.154289 0,0.342547 -0.07197,0.685447 -0.252587,1.027994 -0.161925,0.360539 -0.414515,0.613128 -0.739071,0.775406 -0.324908,0.162278 -0.649462,0.252589 -0.956027,0.252589 -0.270581,0 -0.522817,-0.05433 -0.793398,-0.162278 -0.270579,-0.126295 -0.487185,-0.252589 -0.64911,-0.414867 -0.162632,-0.162278 -0.378884,-0.414866 -0.631473,-0.739422 0.07232,0.955675 0.216606,1.713089 0.396875,2.290233 0.198263,0.577145 0.432858,1.08197 0.703439,1.514828 h -3.534833 c 0.270582,-0.432858 0.504825,-0.937683 0.70344,-1.514828 0.180268,-0.577144 0.324554,-1.334558 0.39652,-2.290233 -0.252235,0.324556 -0.45085,0.559153 -0.612775,0.721431 -0.162628,0.162277 -0.378883,0.306563 -0.649462,0.414866 -0.270581,0.125942 -0.541163,0.18027 -0.793398,0.18027 -0.306917,0 -0.631118,-0.09031 -0.955675,-0.252589 -0.3429,-0.162278 -0.595135,-0.414867 -0.757767,-0.757414 -0.161925,-0.360539 -0.252589,-0.703439 -0.252589,-1.045986 0,-0.378531 0.09066,-0.757414 0.270933,-1.136297 0.179917,-0.378531 0.414867,-0.73907 0.72108,-1.063978 0.288925,-0.342547 0.847725,-0.865364 1.659112,-1.586794 0.45085,-0.414867 0.793398,-0.739422 0.992013,-0.992011 0.19826,-0.252236 0.378528,-0.504825 0.504825,-0.757414 0.09031,-0.162278 0.144285,-0.288572 0.19826,-0.342547 0.03633,-0.07232 0.09031,-0.126295 0.198615,-0.18027" />
    <path
       inkscape:connector-curvature="0"
       id="path200"
       style="fill:none;stroke:#231f20;stroke-width:0.053975;stroke-linecap:butt;stroke-linejoin:miter;stroke-miterlimit:4;stroke-dasharray:none;stroke-opacity:1"
       d="m -71.339377,22.709583 h 0.306562 c 0.08996,0.05398 0.144288,0.10795 0.198614,0.18027 0.03563,0.05398 0.08996,0.180269 0.179917,0.342547 0.144285,0.252589 0.306565,0.505178 0.505177,0.739422 0.198263,0.252589 0.540808,0.595136 0.991658,1.010003 0.685448,0.595136 1.208265,1.099961 1.569157,1.478844 0.36054,0.37853 0.631118,0.757414 0.811741,1.153936 0.180269,0.414867 0.270227,0.79375 0.270227,1.154289 0,0.342547 -0.07197,0.685447 -0.252587,1.027994 -0.161925,0.360539 -0.414515,0.613128 -0.739071,0.775406 -0.324908,0.162278 -0.649462,0.252589 -0.956027,0.252589 -0.270581,0 -0.522817,-0.05433 -0.793398,-0.162278 -0.270579,-0.126295 -0.487185,-0.252589 -0.64911,-0.414867 -0.162632,-0.162278 -0.378884,-0.414866 -0.631473,-0.739422 0.07232,0.955675 0.216606,1.713089 0.396875,2.290233 0.198263,0.577145 0.432858,1.08197 0.703439,1.514828 h -3.534833 c 0.270582,-0.432858 0.504825,-0.937683 0.70344,-1.514828 0.180268,-0.577144 0.324554,-1.334558 0.39652,-2.290233 -0.252235,0.324556 -0.45085,0.559153 -0.612775,0.721431 -0.162628,0.162277 -0.378883,0.306563 -0.649462,0.414866 -0.270581,0.125942 -0.541163,0.18027 -0.793398,0.18027 -0.306917,0 -0.631118,-0.09031 -0.955675,-0.252589 -0.3429,-0.162278 -0.595135,-0.414867 -0.757767,-0.757414 -0.161925,-0.360539 -0.252589,-0.703439 -0.252589,-1.045986 0,-0.378531 0.09066,-0.757414 0.270933,-1.136297 0.179917,-0.378531 0.414867,-0.73907 0.72108,-1.063978 0.288925,-0.342547 0.847725,-0.865364 1.659112,-1.586794 0.45085,-0.414867 0.793398,-0.739422 0.992013,-0.992011 0.19826,-0.252236 0.378528,-0.504825 0.504825,-0.757414 0.09031,-0.162278 0.144285,-0.288572 0.19826,-0.342547 0.03633,-0.07232 0.09031,-0.126295 0.198615,-0.18027 z" />
    <path
       inkscape:connector-curvature="0"
       id="path202"
       style="fill:#231f20;fill-opacity:1;fill-rule:nonzero;stroke:none;stroke-width:0.35277775"
       d="m -115.595,68.659944 c -0.16228,-0.28857 -0.28857,-0.522814 -0.36054,-0.721077 -0.0723,-0.216251 -0.1083,-0.432858 -0.1083,-0.667453 0,-0.612775 0.2346,-1.117955 0.70344,-1.532822 0.46884,-0.414866 1.04599,-0.631118 1.69545,-0.631118 0.64876,0 1.2259,0.216252 1.69475,0.631118 0.46884,0.414867 0.72142,0.920047 0.72142,1.532822 0,0.234595 -0.036,0.451202 -0.1083,0.667453 -0.072,0.198263 -0.21625,0.432507 -0.37817,0.721077 0.37817,-0.10795 0.70308,-0.180268 0.95532,-0.180268 0.63147,0 1.19027,0.216606 1.65911,0.64911 0.48719,0.414867 0.72143,0.974373 0.72143,1.677458 0,0.685097 -0.23424,1.244248 -0.70344,1.695098 -0.46884,0.432859 -1.00965,0.649111 -1.62277,0.649111 -0.3609,0 -0.72144,-0.08996 -1.10032,-0.288571 -0.37853,-0.198263 -0.77505,-0.577146 -1.17193,-1.117954 0.09,0.883708 0.16228,1.460854 0.23425,1.731081 0.054,0.270582 0.14428,0.595135 0.27058,0.99201 0.14428,0.378884 0.32455,0.775407 0.55915,1.15429 h -3.46251 c 0.23424,-0.378883 0.4325,-0.775406 0.55915,-1.172281 0.12629,-0.396875 0.21625,-0.721429 0.28822,-0.992011 0.0543,-0.252235 0.12629,-0.829381 0.21661,-1.713089 -0.39653,0.559154 -0.7934,0.937683 -1.17193,1.117954 -0.37924,0.198612 -0.75777,0.288571 -1.10067,0.288571 -0.61313,0 -1.15358,-0.216252 -1.62278,-0.649111 -0.46884,-0.45085 -0.70344,-1.010001 -0.70344,-1.695098 0,-0.703085 0.2346,-1.262591 0.72143,-1.677458 0.46885,-0.432504 1.028,-0.64911 1.65912,-0.64911 0.25259,0 0.57714,0.07232 0.95567,0.180268" />
    <path
       inkscape:connector-curvature="0"
       id="path204"
       style="fill:none;stroke:#231f20;stroke-width:0.053975;stroke-linecap:butt;stroke-linejoin:miter;stroke-miterlimit:4;stroke-dasharray:none;stroke-opacity:1"
       d="m -115.595,68.659944 c -0.16228,-0.28857 -0.28857,-0.522814 -0.36054,-0.721077 -0.0723,-0.216251 -0.1083,-0.432858 -0.1083,-0.667453 0,-0.612775 0.2346,-1.117955 0.70344,-1.532822 0.46884,-0.414866 1.04599,-0.631118 1.69545,-0.631118 0.64876,0 1.2259,0.216252 1.69475,0.631118 0.46884,0.414867 0.72142,0.920047 0.72142,1.532822 0,0.234595 -0.036,0.451202 -0.1083,0.667453 -0.072,0.198263 -0.21625,0.432507 -0.37817,0.721077 0.37817,-0.10795 0.70308,-0.180268 0.95532,-0.180268 0.63147,0 1.19027,0.216606 1.65911,0.64911 0.48719,0.414867 0.72143,0.974373 0.72143,1.677458 0,0.685097 -0.23424,1.244248 -0.70344,1.695098 -0.46884,0.432859 -1.00965,0.649111 -1.62277,0.649111 -0.3609,0 -0.72144,-0.08996 -1.10032,-0.288571 -0.37853,-0.198263 -0.77505,-0.577146 -1.17193,-1.117954 0.09,0.883708 0.16228,1.460854 0.23425,1.731081 0.054,0.270582 0.14428,0.595135 0.27058,0.99201 0.14428,0.378884 0.32455,0.775407 0.55915,1.15429 h -3.46251 c 0.23424,-0.378883 0.4325,-0.775406 0.55915,-1.172281 0.12629,-0.396875 0.21625,-0.721429 0.28822,-0.992011 0.0543,-0.252235 0.12629,-0.829381 0.21661,-1.713089 -0.39653,0.559154 -0.7934,0.937683 -1.17193,1.117954 -0.37924,0.198612 -0.75777,0.288571 -1.10067,0.288571 -0.61313,0 -1.15358,-0.216252 -1.62278,-0.649111 -0.46884,-0.45085 -0.70344,-1.010001 -0.70344,-1.695098 0,-0.703085 0.2346,-1.262591 0.72143,-1.677458 0.46885,-0.432504 1.028,-0.64911 1.65912,-0.64911 0.25259,0 0.57714,0.07232 0.95567,0.180268 z" />
    <text
       id="text208"
       style="font-variant:normal;font-weight:bold;font-size:13.86815166px;font-family:GillSans;-inkscape-font-specification:GillSans-Bold;writing-mode:lr-tb;fill:#231f20;fill-opacity:1;fill-rule:nonzero;stroke:none;stroke-width:0.35277775"
       x="-104.91856"
       y="97.009521">
      <tspan
         style="stroke-width:0.35277775"
         id="tspan206"
         y="97.009521"
         x="-104.91856">2</tspan>
    </text>
    <text
       id="text212"
       style="font-variant:normal;font-weight:bold;font-size:14.38682556px;font-family:GillSans;-inkscape-font-specification:GillSans-Bold;writing-mode:lr-tb;fill:#231f20;fill-opacity:1;fill-rule:nonzero;stroke:none;stroke-width:0.34005943"
       transform="scale(1.0374003,0.96394805)"
       x="-81.475143"
       y="34.652885">
      <tspan
         id="tspan210"
         y="34.652885"
         x="-81.475143"
         style="stroke-width:0.34005943">3</tspan>
    </text>
    <text
       id="text218"
       style="font-variant:normal;font-weight:bold;font-size:13.86815166px;font-family:GillSans;-inkscape-font-specification:GillSans-Bold;writing-mode:lr-tb;fill:#231f20;fill-opacity:1;fill-rule:nonzero;stroke:none;stroke-width:0.35277775"
       x="-84.291893"
       y="54.55748">
      <tspan
         style="stroke-width:0.35277775"
         id="tspan214"
         sodipodi:role="line"
         y="54.55748"
         x="-84.291893 -147.12434">45</tspan>
      <tspan
         style="stroke-width:0.35277775"
         id="tspan216"
         y="75.71196"
         x="-126.84771">4</tspan>
    </text>
  </g>
</svg>
