<?xml version="1.0" encoding="UTF-8" standalone="no"?>
<!-- Created with Inkscape (http://www.inkscape.org/) -->

<svg
   xmlns:dc="http://purl.org/dc/elements/1.1/"
   xmlns:cc="http://creativecommons.org/ns#"
   xmlns:rdf="http://www.w3.org/1999/02/22-rdf-syntax-ns#"
   xmlns:svg="http://www.w3.org/2000/svg"
   xmlns="http://www.w3.org/2000/svg"
   xmlns:sodipodi="http://sodipodi.sourceforge.net/DTD/sodipodi-0.dtd"
   xmlns:inkscape="http://www.inkscape.org/namespaces/inkscape"
   version="1.1"
   id="svg2"
   xml:space="preserve"
   width="327.992"
   height="327.90933"
   viewBox="0 0 327.992 327.90933"
   sodipodi:docname="2018_Tue_Senior.svg"
   inkscape:version="0.92.3 (unknown)"><metadata
     id="metadata8"><rdf:RDF><cc:Work
         rdf:about=""><dc:format>image/svg+xml</dc:format><dc:type
           rdf:resource="http://purl.org/dc/dcmitype/StillImage" /><dc:title></dc:title></cc:Work></rdf:RDF></metadata><defs
     id="defs6"><clipPath
       clipPathUnits="userSpaceOnUse"
       id="clipPath18"><path
         d="m 81.5,688.53 h 450 v -585 h -450 z"
         id="path16"
         inkscape:connector-curvature="0" /></clipPath><clipPath
       clipPathUnits="userSpaceOnUse"
       id="clipPath24"><path
         d="m 108.5,661.5 h 396 v -531 h -396 z"
         id="path22"
         inkscape:connector-curvature="0" /></clipPath><clipPath
       clipPathUnits="userSpaceOnUse"
       id="clipPath30"><path
         d="m 117.5,139.5 h 377 v 513 h -377 z"
         id="path28"
         inkscape:connector-curvature="0" /></clipPath><clipPath
       clipPathUnits="userSpaceOnUse"
       id="clipPath114"><path
         d="M 183.98,442.5 H 438.5 v -267 H 183.98 Z"
         id="path112"
         inkscape:connector-curvature="0" /></clipPath><clipPath
       clipPathUnits="userSpaceOnUse"
       id="clipPath138"><path
         d="M 183.98,442.5 H 438.5 v -267 H 183.98 Z"
         id="path136"
         inkscape:connector-curvature="0" /></clipPath><clipPath
       clipPathUnits="userSpaceOnUse"
       id="clipPath166"><path
         d="M 183.98,442.5 H 438.5 v -267 H 183.98 Z"
         id="path164"
         inkscape:connector-curvature="0" /></clipPath><clipPath
       clipPathUnits="userSpaceOnUse"
       id="clipPath186"><path
         d="M 183.98,442.5 H 438.5 v -267 H 183.98 Z"
         id="path184"
         inkscape:connector-curvature="0" /></clipPath><clipPath
       clipPathUnits="userSpaceOnUse"
       id="clipPath210"><path
         d="M 183.98,442.5 H 438.5 v -267 H 183.98 Z"
         id="path208"
         inkscape:connector-curvature="0" /></clipPath><clipPath
       clipPathUnits="userSpaceOnUse"
       id="clipPath254"><path
         d="m 117.5,139.5 h 377 v 513 h -377 z"
         id="path252"
         inkscape:connector-curvature="0" /></clipPath></defs><sodipodi:namedview
     pagecolor="#ffffff"
     bordercolor="#666666"
     borderopacity="1"
     objecttolerance="10"
     gridtolerance="10"
     guidetolerance="10"
     inkscape:pageopacity="0"
     inkscape:pageshadow="2"
     inkscape:window-width="1855"
     inkscape:window-height="1056"
     id="namedview4"
     showgrid="false"
     fit-margin-top="0"
     fit-margin-left="0"
     fit-margin-right="0"
     fit-margin-bottom="0"
     inkscape:zoom="0.97399147"
     inkscape:cx="164.02667"
     inkscape:cy="279.55735"
     inkscape:window-x="65"
     inkscape:window-y="24"
     inkscape:window-maximized="1"
     inkscape:current-layer="g10" /><g
     id="g10"
     inkscape:groupmode="layer"
     inkscape:label="brainteasers"
     transform="matrix(1.3333333,0,0,-1.3333333,-245.30666,576.35199)"><path
       inkscape:connector-curvature="0"
       id="path82"
       style="fill:#ffffff;fill-opacity:1;fill-rule:nonzero;stroke:none"
       d="m 331.396,235.947 h 48.901 v 48.839 h -48.901 z" /><path
       inkscape:connector-curvature="0"
       id="path84"
       style="fill:none;stroke:#1d9ad6;stroke-width:1.676;stroke-linecap:butt;stroke-linejoin:miter;stroke-miterlimit:4;stroke-dasharray:none;stroke-opacity:1"
       d="m 331.396,284.786 h 48.901 v -48.839 h -48.901 z m 48.901,0 z" /><path
       inkscape:connector-curvature="0"
       id="path86"
       style="fill:#ffffff;fill-opacity:1;fill-rule:nonzero;stroke:none"
       d="m 282.558,187.17 h 48.838 v 48.777 h -48.838 z" /><path
       inkscape:connector-curvature="0"
       id="path88"
       style="fill:none;stroke:#1d9ad6;stroke-width:1.676;stroke-linecap:butt;stroke-linejoin:miter;stroke-miterlimit:4;stroke-dasharray:none;stroke-opacity:1"
       d="m 282.558,235.947 h 48.838 V 187.17 h -48.838 z m 48.838,0 z" /><path
       inkscape:connector-curvature="0"
       id="path90"
       style="fill:#ffffff;fill-opacity:1;fill-rule:nonzero;stroke:none"
       d="m 380.297,382.525 h 48.839 v 48.901 h -48.839 z" /><path
       inkscape:connector-curvature="0"
       id="path92"
       style="fill:none;stroke:#1d9ad6;stroke-width:1.676;stroke-linecap:butt;stroke-linejoin:miter;stroke-miterlimit:4;stroke-dasharray:none;stroke-opacity:1"
       d="m 380.297,431.426 h 48.839 v -48.901 h -48.839 z m 48.838,0 z" /><path
       inkscape:connector-curvature="0"
       id="path94"
       style="fill:#ffffff;fill-opacity:1;fill-rule:nonzero;stroke:none"
       d="m 331.396,382.525 h 48.901 v 48.901 h -48.901 z" /><path
       inkscape:connector-curvature="0"
       id="path96"
       style="fill:none;stroke:#1d9ad6;stroke-width:1.676;stroke-linecap:butt;stroke-linejoin:miter;stroke-miterlimit:4;stroke-dasharray:none;stroke-opacity:1"
       d="m 331.396,431.426 h 48.901 v -48.901 h -48.901 z m 48.901,0 z" /><path
       inkscape:connector-curvature="0"
       id="path98"
       style="fill:#ffffff;fill-opacity:1;fill-rule:nonzero;stroke:none"
       d="m 282.558,382.525 h 48.838 v 48.901 h -48.838 z" /><path
       inkscape:connector-curvature="0"
       id="path100"
       style="fill:none;stroke:#1d9ad6;stroke-width:1.676;stroke-linecap:butt;stroke-linejoin:miter;stroke-miterlimit:4;stroke-dasharray:none;stroke-opacity:1"
       d="m 282.558,431.426 h 48.838 v -48.901 h -48.838 z m 48.838,0 z" /><path
       inkscape:connector-curvature="0"
       id="path102"
       style="fill:#ffffff;fill-opacity:1;fill-rule:nonzero;stroke:none"
       d="m 233.719,382.525 h 48.839 v 48.901 h -48.839 z" /><path
       inkscape:connector-curvature="0"
       id="path104"
       style="fill:none;stroke:#1d9ad6;stroke-width:1.676;stroke-linecap:butt;stroke-linejoin:miter;stroke-miterlimit:4;stroke-dasharray:none;stroke-opacity:1"
       d="m 233.719,431.426 h 48.839 v -48.901 h -48.839 z m 48.839,0 z" /><path
       inkscape:connector-curvature="0"
       id="path106"
       style="fill:#ffffff;fill-opacity:1;fill-rule:nonzero;stroke:none"
       d="m 184.818,382.525 h 48.901 v 48.901 h -48.901 z" /><g
       id="g108"><g
         clip-path="url(#clipPath114)"
         id="g110"><path
           inkscape:connector-curvature="0"
           id="path116"
           style="fill:none;stroke:#1d9ad6;stroke-width:1.676;stroke-linecap:butt;stroke-linejoin:miter;stroke-miterlimit:4;stroke-dasharray:none;stroke-opacity:1"
           d="m 184.818,431.426 h 48.901 v -48.901 h -48.901 z m 48.901,0 z" /></g></g><path
       inkscape:connector-curvature="0"
       id="path118"
       style="fill:#ffffff;fill-opacity:1;fill-rule:nonzero;stroke:none"
       d="m 380.297,333.686 h 48.839 v 48.839 h -48.839 z" /><path
       inkscape:connector-curvature="0"
       id="path120"
       style="fill:none;stroke:#1d9ad6;stroke-width:1.676;stroke-linecap:butt;stroke-linejoin:miter;stroke-miterlimit:4;stroke-dasharray:none;stroke-opacity:1"
       d="m 380.297,382.525 h 48.839 v -48.839 h -48.839 z m 48.838,0 z" /><path
       inkscape:connector-curvature="0"
       id="path122"
       style="fill:#ffffff;fill-opacity:1;fill-rule:nonzero;stroke:none"
       d="m 331.396,333.686 h 48.901 v 48.839 h -48.901 z" /><path
       inkscape:connector-curvature="0"
       id="path124"
       style="fill:none;stroke:#1d9ad6;stroke-width:1.676;stroke-linecap:butt;stroke-linejoin:miter;stroke-miterlimit:4;stroke-dasharray:none;stroke-opacity:1"
       d="m 331.396,382.525 h 48.901 v -48.839 h -48.901 z m 48.901,0 z" /><path
       inkscape:connector-curvature="0"
       id="path126"
       style="fill:#ffffff;fill-opacity:1;fill-rule:nonzero;stroke:none"
       d="m 233.719,333.686 h 48.839 v 48.839 h -48.839 z" /><path
       inkscape:connector-curvature="0"
       id="path128"
       style="fill:none;stroke:#1d9ad6;stroke-width:1.676;stroke-linecap:butt;stroke-linejoin:miter;stroke-miterlimit:4;stroke-dasharray:none;stroke-opacity:1"
       d="m 233.719,382.525 h 48.839 v -48.839 h -48.839 z m 48.839,0 z" /><path
       inkscape:connector-curvature="0"
       id="path130"
       style="fill:#ffffff;fill-opacity:1;fill-rule:nonzero;stroke:none"
       d="m 184.818,333.686 h 48.901 v 48.839 h -48.901 z" /><g
       id="g132"><g
         clip-path="url(#clipPath138)"
         id="g134"><path
           inkscape:connector-curvature="0"
           id="path140"
           style="fill:none;stroke:#1d9ad6;stroke-width:1.676;stroke-linecap:butt;stroke-linejoin:miter;stroke-miterlimit:4;stroke-dasharray:none;stroke-opacity:1"
           d="m 184.818,382.525 h 48.901 v -48.839 h -48.901 z m 48.901,0 z" /></g></g><path
       inkscape:connector-curvature="0"
       id="path142"
       style="fill:#ffffff;fill-opacity:1;fill-rule:nonzero;stroke:none"
       d="m 380.297,284.786 h 48.839 v 48.901 h -48.839 z" /><path
       inkscape:connector-curvature="0"
       id="path144"
       style="fill:none;stroke:#1d9ad6;stroke-width:1.676;stroke-linecap:butt;stroke-linejoin:miter;stroke-miterlimit:4;stroke-dasharray:none;stroke-opacity:1"
       d="m 380.297,333.686 h 48.839 v -48.901 h -48.839 z m 48.838,0 z" /><path
       inkscape:connector-curvature="0"
       id="path146"
       style="fill:#ffffff;fill-opacity:1;fill-rule:nonzero;stroke:none"
       d="m 331.396,284.786 h 48.901 v 48.901 h -48.901 z" /><path
       inkscape:connector-curvature="0"
       id="path148"
       style="fill:none;stroke:#1d9ad6;stroke-width:1.676;stroke-linecap:butt;stroke-linejoin:miter;stroke-miterlimit:4;stroke-dasharray:none;stroke-opacity:1"
       d="m 331.396,333.686 h 48.901 v -48.901 h -48.901 z m 48.901,0 z" /><path
       inkscape:connector-curvature="0"
       id="path150"
       style="fill:#ffffff;fill-opacity:1;fill-rule:nonzero;stroke:none"
       d="m 282.558,284.786 h 48.838 v 48.901 h -48.838 z" /><path
       inkscape:connector-curvature="0"
       id="path152"
       style="fill:none;stroke:#1d9ad6;stroke-width:1.676;stroke-linecap:butt;stroke-linejoin:miter;stroke-miterlimit:4;stroke-dasharray:none;stroke-opacity:1"
       d="m 282.558,333.686 h 48.838 v -48.901 h -48.838 z m 48.838,0 z" /><path
       inkscape:connector-curvature="0"
       id="path154"
       style="fill:#ffffff;fill-opacity:1;fill-rule:nonzero;stroke:none"
       d="m 233.719,284.786 h 48.839 v 48.901 h -48.839 z" /><path
       inkscape:connector-curvature="0"
       id="path156"
       style="fill:none;stroke:#1d9ad6;stroke-width:1.676;stroke-linecap:butt;stroke-linejoin:miter;stroke-miterlimit:4;stroke-dasharray:none;stroke-opacity:1"
       d="m 233.719,333.686 h 48.839 v -48.901 h -48.839 z m 48.839,0 z" /><path
       inkscape:connector-curvature="0"
       id="path158"
       style="fill:#ffffff;fill-opacity:1;fill-rule:nonzero;stroke:none"
       d="m 184.818,284.786 h 48.901 v 48.901 h -48.901 z" /><g
       id="g160"><g
         clip-path="url(#clipPath166)"
         id="g162"><path
           inkscape:connector-curvature="0"
           id="path168"
           style="fill:none;stroke:#1d9ad6;stroke-width:1.676;stroke-linecap:butt;stroke-linejoin:miter;stroke-miterlimit:4;stroke-dasharray:none;stroke-opacity:1"
           d="m 184.818,333.686 h 48.901 v -48.901 h -48.901 z m 48.901,0 z" /></g></g><path
       inkscape:connector-curvature="0"
       id="path170"
       style="fill:#ffffff;fill-opacity:1;fill-rule:nonzero;stroke:none"
       d="m 380.297,235.947 h 48.839 v 48.839 h -48.839 z" /><path
       inkscape:connector-curvature="0"
       id="path172"
       style="fill:none;stroke:#1d9ad6;stroke-width:1.676;stroke-linecap:butt;stroke-linejoin:miter;stroke-miterlimit:4;stroke-dasharray:none;stroke-opacity:1"
       d="m 380.297,284.786 h 48.839 v -48.839 h -48.839 z m 48.838,0 z" /><path
       inkscape:connector-curvature="0"
       id="path174"
       style="fill:#ffffff;fill-opacity:1;fill-rule:nonzero;stroke:none"
       d="m 282.558,235.947 h 48.838 v 48.839 h -48.838 z" /><path
       inkscape:connector-curvature="0"
       id="path176"
       style="fill:none;stroke:#1d9ad6;stroke-width:1.676;stroke-linecap:butt;stroke-linejoin:miter;stroke-miterlimit:4;stroke-dasharray:none;stroke-opacity:1"
       d="m 282.558,284.786 h 48.838 v -48.839 h -48.838 z m 48.838,0 z" /><path
       inkscape:connector-curvature="0"
       id="path178"
       style="fill:#ffffff;fill-opacity:1;fill-rule:nonzero;stroke:none"
       d="m 184.818,235.947 h 48.901 v 48.839 h -48.901 z" /><g
       id="g180"><g
         clip-path="url(#clipPath186)"
         id="g182"><path
           inkscape:connector-curvature="0"
           id="path188"
           style="fill:none;stroke:#1d9ad6;stroke-width:1.676;stroke-linecap:butt;stroke-linejoin:miter;stroke-miterlimit:4;stroke-dasharray:none;stroke-opacity:1"
           d="m 184.818,284.786 h 48.901 v -48.839 h -48.901 z m 48.901,0 z" /></g></g><path
       inkscape:connector-curvature="0"
       id="path190"
       style="fill:#ffffff;fill-opacity:1;fill-rule:nonzero;stroke:none"
       d="m 380.297,187.17 h 48.839 v 48.777 h -48.839 z" /><path
       inkscape:connector-curvature="0"
       id="path192"
       style="fill:none;stroke:#1d9ad6;stroke-width:1.676;stroke-linecap:butt;stroke-linejoin:miter;stroke-miterlimit:4;stroke-dasharray:none;stroke-opacity:1"
       d="m 380.297,235.947 h 48.839 V 187.17 h -48.839 z m 48.838,0 z" /><path
       inkscape:connector-curvature="0"
       id="path194"
       style="fill:#ffffff;fill-opacity:1;fill-rule:nonzero;stroke:none"
       d="m 331.396,187.17 h 48.901 v 48.777 h -48.901 z" /><path
       inkscape:connector-curvature="0"
       id="path196"
       style="fill:none;stroke:#1d9ad6;stroke-width:1.676;stroke-linecap:butt;stroke-linejoin:miter;stroke-miterlimit:4;stroke-dasharray:none;stroke-opacity:1"
       d="m 331.396,235.947 h 48.901 V 187.17 h -48.901 z m 48.901,0 z" /><path
       inkscape:connector-curvature="0"
       id="path198"
       style="fill:#ffffff;fill-opacity:1;fill-rule:nonzero;stroke:none"
       d="m 233.719,187.17 h 48.839 v 48.777 h -48.839 z" /><path
       inkscape:connector-curvature="0"
       id="path200"
       style="fill:none;stroke:#1d9ad6;stroke-width:1.676;stroke-linecap:butt;stroke-linejoin:miter;stroke-miterlimit:4;stroke-dasharray:none;stroke-opacity:1"
       d="m 233.719,235.947 h 48.839 V 187.17 h -48.839 z m 48.839,0 z" /><path
       inkscape:connector-curvature="0"
       id="path202"
       style="fill:#ffffff;fill-opacity:1;fill-rule:nonzero;stroke:none"
       d="m 184.818,187.17 h 48.901 v 48.777 h -48.901 z" /><g
       id="g204"><g
         clip-path="url(#clipPath210)"
         id="g206"><path
           inkscape:connector-curvature="0"
           id="path212"
           style="fill:none;stroke:#1d9ad6;stroke-width:1.676;stroke-linecap:butt;stroke-linejoin:miter;stroke-miterlimit:4;stroke-dasharray:none;stroke-opacity:1"
           d="m 184.818,235.947 h 48.901 V 187.17 h -48.901 z m 48.901,0 z" /></g></g><path
       inkscape:connector-curvature="0"
       id="path214"
       style="fill:#d1d3d4;fill-opacity:1;fill-rule:nonzero;stroke:none"
       d="m 307.008,232.41 10.984,-8.006 10.984,-7.943 -4.219,-12.907 -4.221,-12.846 h -27.119 l -4.22,12.846 -4.157,12.907 10.984,7.943 10.984,8.006" /><path
       inkscape:connector-curvature="0"
       id="path216"
       style="fill:#d1d3d4;fill-opacity:1;fill-rule:nonzero;stroke:none"
       d="m 377.876,260.397 c 0,-12.101 -9.929,-22.03 -22.03,-22.03 -12.101,0 -21.967,9.929 -21.967,22.03 0,12.101 9.866,21.968 21.967,21.968 12.101,0 22.03,-9.867 22.03,-21.968" /><path
       inkscape:connector-curvature="0"
       id="path218"
       style="fill:#d1d3d4;fill-opacity:1;fill-rule:nonzero;stroke:none"
       d="m 427.212,309.236 -21.844,-21.844 -21.906,21.844 21.906,21.906 21.844,-21.906" /><path
       inkscape:connector-curvature="0"
       id="path220"
       style="fill:#d1d3d4;fill-opacity:1;fill-rule:nonzero;stroke:none"
       d="m 313.213,316.373 16.57,-1.8 -12.35,-11.232 3.289,-16.508 -14.335,8.44 -14.956,-8.253 3.786,16.321 -12.287,11.17 16.569,1.862 6.888,15.265 6.826,-15.265" /><path
       inkscape:connector-curvature="0"
       id="path222"
       style="fill:#d1d3d4;fill-opacity:1;fill-rule:nonzero;stroke:none"
       d="m 216.095,365.211 16.631,-1.737 -12.412,-11.295 3.289,-16.507 -14.335,8.44 -14.893,-8.192 3.723,16.259 -12.287,11.171 16.631,1.861 6.826,15.328 6.827,-15.328" /><path
       inkscape:connector-curvature="0"
       id="path224"
       style="fill:#d1d3d4;fill-opacity:1;fill-rule:nonzero;stroke:none"
       d="m 256.803,428.819 21.969,-21.844 h -11.356 v -21.844 h -21.162 v 21.844 H 234.96 l 21.843,21.844" /><text
       id="text238"
       style="font-variant:normal;font-weight:bold;font-size:25.85700035px;font-family:GillSans;-inkscape-font-specification:GillSans-Bold;writing-mode:lr-tb;fill:#f99d34;fill-opacity:1;fill-rule:nonzero;stroke:none"
       transform="scale(1,-1)"
       x="248.2332"
       y="-395.30869"><tspan
         id="tspan226"
         y="-395.30869"
         x="248.2332">B</tspan><tspan
         id="tspan228"
         y="-346.47"
         x="198.02925">C</tspan><tspan
         id="tspan230"
         y="-298.43027"
         x="298.61557">B</tspan><tspan
         id="tspan232"
         y="-301.01596"
         x="395.96976">D</tspan><tspan
         id="tspan234"
         y="-251.31624"
         x="347.40512">E</tspan><tspan
         id="tspan236"
         y="-200.75287"
         x="297.62265">A</tspan></text>
<path
       inkscape:connector-curvature="0"
       id="path240"
       style="fill:#ffffff;fill-opacity:1;fill-rule:nonzero;stroke:none"
       d="m 282.558,333.686 h 48.838 v 48.839 h -48.838 z" /><path
       inkscape:connector-curvature="0"
       id="path242"
       style="fill:none;stroke:#1d9ad6;stroke-width:1.676;stroke-linecap:butt;stroke-linejoin:miter;stroke-miterlimit:4;stroke-dasharray:none;stroke-opacity:1"
       d="m 282.558,382.525 h 48.838 v -48.839 h -48.838 z m 48.838,0 z" /><path
       inkscape:connector-curvature="0"
       id="path244"
       style="fill:#ffffff;fill-opacity:1;fill-rule:nonzero;stroke:none"
       d="m 233.719,235.947 h 48.839 v 48.839 h -48.839 z" /><path
       inkscape:connector-curvature="0"
       id="path246"
       style="fill:none;stroke:#1d9ad6;stroke-width:1.676;stroke-linecap:butt;stroke-linejoin:miter;stroke-miterlimit:4;stroke-dasharray:none;stroke-opacity:1"
       d="m 233.719,284.786 h 48.839 v -48.839 h -48.839 z m 48.839,0 z" /><g
       id="g248"><g
         clip-path="url(#clipPath254)"
         id="g250"><path
           inkscape:connector-curvature="0"
           id="path256"
           style="fill:none;stroke:#ffffff;stroke-width:0.5;stroke-linecap:butt;stroke-linejoin:miter;stroke-miterlimit:10;stroke-dasharray:none;stroke-opacity:1"
           d="m 117.5,688.5 v -24 m -36,-12 h 24 m 390,36 v -24 m 36,-12 h -24 m -390,-549 v 24 m -36,12 h 24 m 390,-36 v 24 m 36,12 h -24" /><path
           inkscape:connector-curvature="0"
           id="path258"
           style="fill:none;stroke:#000000;stroke-width:0.25;stroke-linecap:butt;stroke-linejoin:miter;stroke-miterlimit:10;stroke-dasharray:none;stroke-opacity:1"
           d="m 117.5,688.5 v -24 m -36,-12 h 24 m 390,36 v -24 m 36,-12 h -24 m -390,-549 v 24 m -36,12 h 24 m 390,-36 v 24 m 36,12 h -24" /><path
           inkscape:connector-curvature="0"
           id="path260"
           style="fill:none;stroke:#ffffff;stroke-width:0.5;stroke-linecap:butt;stroke-linejoin:miter;stroke-miterlimit:10;stroke-dasharray:none;stroke-opacity:1"
           d="m 282.5,676.5 h 48 m -48,-561 h 48 M 93.5,420 v -48 m 426,48 v -48 m -213,316.5 v -24 m 0,-537 v -24 M 81.5,396 h 24 m 402,0 h 24 m -225,280.5 h 6 c 0,-3.312 -2.688,-6 -6,-6 -3.312,0 -6,2.688 -6,6 0,3.312 2.688,6 6,6 3.312,0 6,-2.688 6,-6 m -6,-561 h 6 c 0,-3.312 -2.688,-6 -6,-6 -3.312,0 -6,2.688 -6,6 0,3.312 2.688,6 6,6 3.312,0 6,-2.688 6,-6 M 93.5,396 h 6 c 0,-3.312 -2.688,-6 -6,-6 -3.312,0 -6,2.688 -6,6 0,3.312 2.688,6 6,6 3.312,0 6,-2.688 6,-6 m 420,0 h 6 c 0,-3.312 -2.688,-6 -6,-6 -3.312,0 -6,2.688 -6,6 0,3.312 2.688,6 6,6 3.312,0 6,-2.688 6,-6" /><path
           inkscape:connector-curvature="0"
           id="path262"
           style="fill:none;stroke:#000000;stroke-width:0.25;stroke-linecap:butt;stroke-linejoin:miter;stroke-miterlimit:10;stroke-dasharray:none;stroke-opacity:1"
           d="m 282.5,676.5 h 48 m -48,-561 h 48 M 93.5,420 v -48 m 426,48 v -48 m -213,316.5 v -24 m 0,-537 v -24 M 81.5,396 h 24 m 402,0 h 24 m -225,280.5 h 6 c 0,-3.312 -2.688,-6 -6,-6 -3.312,0 -6,2.688 -6,6 0,3.312 2.688,6 6,6 3.312,0 6,-2.688 6,-6 m -6,-561 h 6 c 0,-3.312 -2.688,-6 -6,-6 -3.312,0 -6,2.688 -6,6 0,3.312 2.688,6 6,6 3.312,0 6,-2.688 6,-6 M 93.5,396 h 6 c 0,-3.312 -2.688,-6 -6,-6 -3.312,0 -6,2.688 -6,6 0,3.312 2.688,6 6,6 3.312,0 6,-2.688 6,-6 m 420,0 h 6 c 0,-3.312 -2.688,-6 -6,-6 -3.312,0 -6,2.688 -6,6 0,3.312 2.688,6 6,6 3.312,0 6,-2.688 6,-6" /></g></g></g></svg>