<?xml version="1.0" encoding="UTF-8" standalone="no"?>
<!-- Created with Inkscape (http://www.inkscape.org/) -->

<svg
   xmlns:dc="http://purl.org/dc/elements/1.1/"
   xmlns:cc="http://creativecommons.org/ns#"
   xmlns:rdf="http://www.w3.org/1999/02/22-rdf-syntax-ns#"
   xmlns:svg="http://www.w3.org/2000/svg"
   xmlns="http://www.w3.org/2000/svg"
   xmlns:sodipodi="http://sodipodi.sourceforge.net/DTD/sodipodi-0.dtd"
   xmlns:inkscape="http://www.inkscape.org/namespaces/inkscape"
   width="151.36868mm"
   height="18.104168mm"
   viewBox="0 0 151.36868 18.104168"
   version="1.1"
   id="svg2532"
   inkscape:version="0.92.3 (unknown)"
   sodipodi:docname="2018-19_3-1.svg">
  <defs
     id="defs2526">
    <clipPath
       clipPathUnits="userSpaceOnUse"
       id="clipPath616">
      <path
         d="m 34.166,231.174 h 461.747 v 89.464 H 34.166 Z"
         id="path614"
         inkscape:connector-curvature="0" />
    </clipPath>
  </defs>
  <sodipodi:namedview
     id="base"
     pagecolor="#ffffff"
     bordercolor="#666666"
     borderopacity="1.0"
     inkscape:pageopacity="0.0"
     inkscape:pageshadow="2"
     inkscape:zoom="0.98994949"
     inkscape:cx="693.19393"
     inkscape:cy="-54.358838"
     inkscape:document-units="mm"
     inkscape:current-layer="layer1"
     showgrid="false"
     fit-margin-top="0"
     fit-margin-left="0"
     fit-margin-right="0"
     fit-margin-bottom="0"
     inkscape:window-width="1855"
     inkscape:window-height="1056"
     inkscape:window-x="65"
     inkscape:window-y="24"
     inkscape:window-maximized="1" />
  <metadata
     id="metadata2529">
    <rdf:RDF>
      <cc:Work
         rdf:about="">
        <dc:format>image/svg+xml</dc:format>
        <dc:type
           rdf:resource="http://purl.org/dc/dcmitype/StillImage" />
        <dc:title></dc:title>
      </cc:Work>
    </rdf:RDF>
  </metadata>
  <g
     inkscape:label="Layer 1"
     inkscape:groupmode="layer"
     id="layer1"
     transform="translate(191.34506,-116.34672)">
    <g
       id="g606"
       transform="matrix(0.35277777,0,0,-0.35277777,-191.02886,127.27445)">
      <path
         d="M 0,0 H 97.056"
         style="fill:none;stroke:#000000;stroke-width:1.28299999;stroke-linecap:butt;stroke-linejoin:miter;stroke-miterlimit:22.9260006;stroke-dasharray:none;stroke-opacity:1"
         id="path608"
         inkscape:connector-curvature="0" />
    </g>
    <g
       transform="matrix(0.35277777,0,0,-0.35277777,-209.95056,225.46558)"
       id="g610">
      <g
         id="g612"
         clip-path="url(#clipPath616)">
        <g
           id="g618"
           transform="translate(142.5949,292.9879)">
          <path
             d="M 0,0 1.405,-4.47 5.978,-3.452 2.81,-6.903 5.978,-10.355 1.405,-9.337 0,-13.807 l -1.404,4.47 -4.574,-1.018 3.168,3.452 -3.168,3.451 4.574,-1.018 z m -83.529,-4.152 c 2.799,0 5.069,-2.269 5.069,-5.069 0,-2.8 -2.27,-5.069 -5.069,-5.069 -2.8,0 -5.069,2.269 -5.069,5.069 0,2.8 2.269,5.069 5.069,5.069 z m 42.925,-11.178 2.792,-9.671 2.792,-9.672 h -5.584 -5.584 l 2.792,9.672 z"
             style="fill:none;stroke:#000000;stroke-width:0.64099997;stroke-linecap:butt;stroke-linejoin:miter;stroke-miterlimit:22.9260006;stroke-dasharray:none;stroke-opacity:1"
             id="path620"
             inkscape:connector-curvature="0" />
        </g>
        <g
           id="g622"
           transform="translate(164.8577,278.3371)">
          <path
             d="M 0,0 H 97.055"
             style="fill:none;stroke:#000000;stroke-width:1.28299999;stroke-linecap:butt;stroke-linejoin:miter;stroke-miterlimit:22.9260006;stroke-dasharray:none;stroke-opacity:1"
             id="path624"
             inkscape:connector-curvature="0" />
        </g>
        <g
           id="g626"
           transform="translate(213.2121,277.6584)">
          <path
             d="m 0,0 2.792,-9.672 2.792,-9.671 H 0 -5.584 l 2.791,9.671 z"
             style="fill:none;stroke:#000000;stroke-width:0.64099997;stroke-linecap:butt;stroke-linejoin:miter;stroke-miterlimit:22.9260006;stroke-dasharray:none;stroke-opacity:1"
             id="path628"
             inkscape:connector-curvature="0" />
        </g>
        <g
           id="g630"
           transform="translate(274.8087,278.3371)">
          <path
             d="M 0,0 H 97.056"
             style="fill:none;stroke:#000000;stroke-width:1.28299999;stroke-linecap:butt;stroke-linejoin:miter;stroke-miterlimit:22.9260006;stroke-dasharray:none;stroke-opacity:1"
             id="path632"
             inkscape:connector-curvature="0" />
        </g>
        <g
           id="g634"
           transform="translate(323.164,277.6584)">
          <path
             d="m 0,0 2.792,-9.672 2.792,-9.671 H 0 -5.585 l 2.792,9.671 z"
             style="fill:none;stroke:#000000;stroke-width:0.64099997;stroke-linecap:butt;stroke-linejoin:miter;stroke-miterlimit:22.9260006;stroke-dasharray:none;stroke-opacity:1"
             id="path636"
             inkscape:connector-curvature="0" />
        </g>
        <g
           id="g638"
           transform="translate(384.7606,278.3371)">
          <path
             d="M 0,0 H 97.056"
             style="fill:none;stroke:#000000;stroke-width:1.28299999;stroke-linecap:butt;stroke-linejoin:miter;stroke-miterlimit:22.9260006;stroke-dasharray:none;stroke-opacity:1"
             id="path640"
             inkscape:connector-curvature="0" />
        </g>
        <g
           id="g642"
           transform="translate(460.8664,288.836)">
          <path
             d="m 0,0 c 2.798,0 5.068,-2.269 5.068,-5.069 0,-2.8 -2.27,-5.069 -5.068,-5.069 -2.8,0 -5.07,2.269 -5.07,5.069 C -5.07,-2.269 -2.8,0 0,0 Z m 12.942,4.152 1.405,-4.47 4.574,1.018 -3.168,-3.452 3.168,-3.451 -4.574,1.018 -1.405,-4.47 -1.404,4.47 -4.573,-1.018 3.168,3.451 -3.168,3.452 4.573,-1.018 z m -140.411,0 1.405,-4.47 4.574,1.018 -3.169,-3.452 3.169,-3.451 -4.574,1.018 -1.405,-4.47 -1.405,4.47 -4.573,-1.018 3.168,3.451 -3.168,3.452 4.573,-1.018 z m 16.289,0 1.405,-4.47 4.573,1.018 -3.168,-3.452 3.168,-3.451 -4.573,1.018 -1.405,-4.47 -1.404,4.47 -4.574,-1.018 3.168,3.451 -3.168,3.452 4.574,-1.018 z m 14.218,0 1.405,-4.47 4.574,1.018 -3.169,-3.452 3.169,-3.451 -4.574,1.018 -1.405,-4.47 -1.406,4.47 -4.572,-1.018 3.168,3.451 -3.168,3.452 4.572,-1.018 z m -111.404,0 1.404,-4.47 4.574,1.018 -3.169,-3.452 3.169,-3.451 -4.574,1.018 -1.404,-4.47 -1.405,4.47 -4.574,-1.018 3.169,3.451 -3.169,3.452 4.574,-1.018 z m -126.194,0 1.405,-4.47 4.573,1.018 -3.169,-3.452 3.169,-3.451 -4.573,1.018 -1.405,-4.47 -1.405,4.47 -4.574,-1.018 3.168,3.451 -3.168,3.452 4.574,-1.018 z M -365.829,0 c 2.799,0 5.069,-2.269 5.069,-5.069 0,-2.8 -2.27,-5.069 -5.069,-5.069 -2.799,0 -5.069,2.269 -5.069,5.069 0,2.8 2.27,5.069 5.069,5.069 z m -11.538,0 c 2.8,0 5.069,-2.269 5.069,-5.069 0,-2.8 -2.269,-5.069 -5.069,-5.069 -2.799,0 -5.069,2.269 -5.069,5.069 0,2.8 2.27,5.069 5.069,5.069 z m -12.216,0 c 2.799,0 5.068,-2.269 5.068,-5.069 0,-2.8 -2.269,-5.069 -5.068,-5.069 -2.8,0 -5.07,2.269 -5.07,5.069 0,2.8 2.27,5.069 5.07,5.069 z m 361.833,-11.178 2.791,-9.671 2.792,-9.672 h -5.583 -5.585 l 2.792,9.672 z"
             style="fill:none;stroke:#000000;stroke-width:0.64099997;stroke-linecap:butt;stroke-linejoin:miter;stroke-miterlimit:22.9260006;stroke-dasharray:none;stroke-opacity:1"
             id="path644"
             inkscape:connector-curvature="0" />
        </g>
      </g>
    </g>
    <text
       y="120.08999"
       x="-190.07005"
       style="font-variant:normal;font-weight:normal;font-stretch:normal;font-size:3.83088422px;font-family:'ADLNF P +Arial MT';-inkscape-font-specification:ArialMT;writing-mode:lr-tb;fill:#000000;fill-opacity:1;fill-rule:nonzero;stroke:none;stroke-width:0.35277775"
       id="text650">
      <tspan
         style="stroke-width:0.35277775"
         x="-190.07005 -187.94008"
         y="120.08999"
         sodipodi:role="line"
         id="tspan646">a)</tspan>
      <tspan
         style="stroke-width:0.35277775"
         x="-150.76135 -148.63138 -111.86637 -109.95093 -73.423431 -71.293488"
         y="120.1283"
         sodipodi:role="line"
         id="tspan648">b)c)d)</tspan>
    </text>
    <path
       d="m -191.34506,121.14073 h 5.21653 v -4.66654 h -5.21653 z"
       style="fill:#ffffff;fill-opacity:1;fill-rule:nonzero;stroke:none;stroke-width:0.35277775"
       id="path1654"
       inkscape:connector-curvature="0" />
    <text
       y="119.29504"
       x="-191.34499"
       style="font-variant:normal;font-weight:bold;font-stretch:normal;font-size:3.88055539px;font-family:'Minion Pro';-inkscape-font-specification:MinionPro-Bold;writing-mode:lr-tb;fill:#7c7c7c;fill-opacity:1;fill-rule:nonzero;stroke:none;stroke-width:0.35277775"
       id="text1658">
      <tspan
         style="stroke-width:0.35277775"
         x="-191.34499 -189.53665"
         y="119.29504"
         sodipodi:role="line"
         id="tspan1656">a)</tspan>
    </text>
    <path
       d="m -152.12816,121.14073 h 5.21652 v -4.66654 h -5.21652 z"
       style="fill:#ffffff;fill-opacity:1;fill-rule:nonzero;stroke:none;stroke-width:0.35277775"
       id="path1660"
       inkscape:connector-curvature="0" />
    <text
       y="119.29504"
       x="-152.12834"
       style="font-variant:normal;font-weight:bold;font-stretch:normal;font-size:3.88055539px;font-family:'Minion Pro';-inkscape-font-specification:MinionPro-Bold;writing-mode:lr-tb;fill:#7c7c7c;fill-opacity:1;fill-rule:nonzero;stroke:none;stroke-width:0.35277775"
       id="text1664">
      <tspan
         style="stroke-width:0.35277775"
         x="-152.12834 -150.05612"
         y="119.29504"
         sodipodi:role="line"
         id="tspan1662">b)</tspan>
    </text>
    <path
       d="m -113.12823,121.14073 h 5.21653 v -4.66654 h -5.21653 z"
       style="fill:#ffffff;fill-opacity:1;fill-rule:nonzero;stroke:none;stroke-width:0.35277775"
       id="path1666"
       inkscape:connector-curvature="0" />
    <text
       y="119.29504"
       x="-113.12833"
       style="font-variant:normal;font-weight:bold;font-stretch:normal;font-size:3.88055539px;font-family:'Minion Pro';-inkscape-font-specification:MinionPro-Bold;writing-mode:lr-tb;fill:#7c7c7c;fill-opacity:1;fill-rule:nonzero;stroke:none;stroke-width:0.35277775"
       id="text1670">
      <tspan
         style="stroke-width:0.35277775"
         x="-113.12833 -111.49074"
         y="119.29504"
         sodipodi:role="line"
         id="tspan1668">c)</tspan>
    </text>
    <path
       d="m -74.128298,121.14073 h 5.21653 v -4.66654 h -5.21653 z"
       style="fill:#ffffff;fill-opacity:1;fill-rule:nonzero;stroke:none;stroke-width:0.35277775"
       id="path1672"
       inkscape:connector-curvature="0" />
    <text
       y="119.29504"
       x="-74.128326"
       style="font-variant:normal;font-weight:bold;font-stretch:normal;font-size:3.88055539px;font-family:'Minion Pro';-inkscape-font-specification:MinionPro-Bold;writing-mode:lr-tb;fill:#7c7c7c;fill-opacity:1;fill-rule:nonzero;stroke:none;stroke-width:0.35277775"
       id="text1676">
      <tspan
         style="stroke-width:0.35277775"
         x="-74.128326 -72.005661"
         y="119.29504"
         sodipodi:role="line"
         id="tspan1674">d)</tspan>
    </text>
  </g>
</svg>
