<?xml version="1.0" encoding="UTF-8" standalone="no"?>
<!-- Created with Inkscape (http://www.inkscape.org/) -->

<svg
   xmlns:dc="http://purl.org/dc/elements/1.1/"
   xmlns:cc="http://creativecommons.org/ns#"
   xmlns:rdf="http://www.w3.org/1999/02/22-rdf-syntax-ns#"
   xmlns:svg="http://www.w3.org/2000/svg"
   xmlns="http://www.w3.org/2000/svg"
   xmlns:sodipodi="http://sodipodi.sourceforge.net/DTD/sodipodi-0.dtd"
   xmlns:inkscape="http://www.inkscape.org/namespaces/inkscape"
   version="1.1"
   id="svg2"
   xml:space="preserve"
   width="724"
   height="724.88666"
   viewBox="0 0 724 724.88663"
   sodipodi:docname="2018-19_15-2b.svg"
   inkscape:version="0.92.4 (unknown)"><metadata
     id="metadata8"><rdf:RDF><cc:Work
         rdf:about=""><dc:format>image/svg+xml</dc:format><dc:type
           rdf:resource="http://purl.org/dc/dcmitype/StillImage" /><dc:title></dc:title></cc:Work></rdf:RDF></metadata><defs
     id="defs6" /><sodipodi:namedview
     pagecolor="#ffffff"
     bordercolor="#666666"
     borderopacity="1"
     objecttolerance="10"
     gridtolerance="10"
     guidetolerance="10"
     inkscape:pageopacity="0"
     inkscape:pageshadow="2"
     inkscape:window-width="1855"
     inkscape:window-height="1056"
     id="namedview4"
     showgrid="false"
     fit-margin-top="0"
     fit-margin-left="0"
     fit-margin-right="0"
     fit-margin-bottom="0"
     inkscape:zoom="0.84085505"
     inkscape:cx="234.5675"
     inkscape:cy="-10.100722"
     inkscape:window-x="65"
     inkscape:window-y="24"
     inkscape:window-maximized="1"
     inkscape:current-layer="g10" /><g
     id="g10"
     inkscape:groupmode="layer"
     inkscape:label="penrose_easy_puzzles"
     transform="matrix(1.3333333,0,0,-1.3333333,-31.333333,1018)"><g
       id="g60"><path
         d="m 295,760.5 c 0.828,0 1.5,0.672 1.5,1.5 0,0.828 -0.672,1.5 -1.5,1.5 -0.828,0 -1.5,-0.672 -1.5,-1.5 0,-0.828 0.672,-1.5 1.5,-1.5"
         style="fill:#000000;fill-opacity:1;fill-rule:nonzero;stroke:none"
         id="path62"
         inkscape:connector-curvature="0" /></g><g
       id="g64"><path
         d="m 346.576,689.528 c 0.828,0 1.5,0.672 1.5,1.5 0,0.829 -0.672,1.5 -1.5,1.5 -0.828,0 -1.5,-0.671 -1.5,-1.5 0,-0.828 0.672,-1.5 1.5,-1.5"
         style="fill:#000000;fill-opacity:1;fill-rule:nonzero;stroke:none"
         id="path66"
         inkscape:connector-curvature="0" /></g><g
       id="g68"><path
         d="m 295,618.567 c 0.828,0 1.5,0.672 1.5,1.5 0,0.828 -0.672,1.5 -1.5,1.5 -0.828,0 -1.5,-0.672 -1.5,-1.5 0,-0.828 0.672,-1.5 1.5,-1.5"
         style="fill:#000000;fill-opacity:1;fill-rule:nonzero;stroke:none"
         id="path70"
         inkscape:connector-curvature="0" /></g><g
       id="g72"><path
         d="m 243.434,689.528 c 0.829,0 1.5,0.672 1.5,1.5 0,0.829 -0.671,1.5 -1.5,1.5 -0.828,0 -1.5,-0.671 -1.5,-1.5 0,-0.828 0.672,-1.5 1.5,-1.5"
         style="fill:#000000;fill-opacity:1;fill-rule:nonzero;stroke:none"
         id="path74"
         inkscape:connector-curvature="0" /></g><g
       id="g76"><path
         d="m 295,760.5 c 0.828,0 1.5,0.672 1.5,1.5 0,0.828 -0.672,1.5 -1.5,1.5 -0.828,0 -1.5,-0.672 -1.5,-1.5 0,-0.828 0.672,-1.5 1.5,-1.5"
         style="fill:#000000;fill-opacity:1;fill-rule:nonzero;stroke:none"
         id="path78"
         inkscape:connector-curvature="0" /></g><g
       id="g80"><path
         d="m 378.424,733.392 c 0.828,0 1.5,0.671 1.5,1.5 0,0.828 -0.672,1.5 -1.5,1.5 -0.828,0 -1.5,-0.672 -1.5,-1.5 0,-0.829 0.672,-1.5 1.5,-1.5"
         style="fill:#000000;fill-opacity:1;fill-rule:nonzero;stroke:none"
         id="path82"
         inkscape:connector-curvature="0" /></g><g
       id="g84"><path
         d="m 429.99,662.42 c 0.828,0 1.5,0.672 1.5,1.5 0,0.829 -0.672,1.5 -1.5,1.5 -0.829,0 -1.5,-0.671 -1.5,-1.5 0,-0.828 0.671,-1.5 1.5,-1.5"
         style="fill:#000000;fill-opacity:1;fill-rule:nonzero;stroke:none"
         id="path86"
         inkscape:connector-curvature="0" /></g><g
       id="g88"><path
         d="m 346.576,689.528 c 0.828,0 1.5,0.672 1.5,1.5 0,0.829 -0.672,1.5 -1.5,1.5 -0.828,0 -1.5,-0.671 -1.5,-1.5 0,-0.828 0.672,-1.5 1.5,-1.5"
         style="fill:#000000;fill-opacity:1;fill-rule:nonzero;stroke:none"
         id="path90"
         inkscape:connector-curvature="0" /></g><g
       id="g92"><path
         d="m 160,662.431 c 0.828,0 1.5,0.671 1.5,1.5 0,0.828 -0.672,1.5 -1.5,1.5 -0.828,0 -1.5,-0.672 -1.5,-1.5 0,-0.829 0.672,-1.5 1.5,-1.5"
         style="fill:#000000;fill-opacity:1;fill-rule:nonzero;stroke:none"
         id="path94"
         inkscape:connector-curvature="0" /></g><g
       id="g96"><path
         d="m 243.434,689.528 c 0.829,0 1.5,0.672 1.5,1.5 0,0.829 -0.671,1.5 -1.5,1.5 -0.828,0 -1.5,-0.671 -1.5,-1.5 0,-0.828 0.672,-1.5 1.5,-1.5"
         style="fill:#000000;fill-opacity:1;fill-rule:nonzero;stroke:none"
         id="path98"
         inkscape:connector-curvature="0" /></g><g
       id="g100"><path
         d="m 295,618.567 c 0.828,0 1.5,0.672 1.5,1.5 0,0.828 -0.672,1.5 -1.5,1.5 -0.828,0 -1.5,-0.672 -1.5,-1.5 0,-0.828 0.672,-1.5 1.5,-1.5"
         style="fill:#000000;fill-opacity:1;fill-rule:nonzero;stroke:none"
         id="path102"
         inkscape:connector-curvature="0" /></g><g
       id="g104"><path
         d="m 211.566,591.449 c 0.828,0 1.5,0.671 1.5,1.5 0,0.828 -0.672,1.5 -1.5,1.5 -0.829,0 -1.5,-0.672 -1.5,-1.5 0,-0.829 0.671,-1.5 1.5,-1.5"
         style="fill:#000000;fill-opacity:1;fill-rule:nonzero;stroke:none"
         id="path106"
         inkscape:connector-curvature="0" /></g><g
       id="g108"><path
         d="m 160,662.431 c 0.828,0 1.5,0.671 1.5,1.5 0,0.828 -0.672,1.5 -1.5,1.5 -0.828,0 -1.5,-0.672 -1.5,-1.5 0,-0.829 0.672,-1.5 1.5,-1.5"
         style="fill:#000000;fill-opacity:1;fill-rule:nonzero;stroke:none"
         id="path110"
         inkscape:connector-curvature="0" /></g><g
       id="g112"><path
         d="m 211.566,733.402 c 0.828,0 1.5,0.672 1.5,1.5 0,0.829 -0.672,1.5 -1.5,1.5 -0.829,0 -1.5,-0.671 -1.5,-1.5 0,-0.828 0.671,-1.5 1.5,-1.5"
         style="fill:#000000;fill-opacity:1;fill-rule:nonzero;stroke:none"
         id="path114"
         inkscape:connector-curvature="0" /></g><g
       id="g116"><path
         d="m 295,760.5 c 0.828,0 1.5,0.672 1.5,1.5 0,0.828 -0.672,1.5 -1.5,1.5 -0.828,0 -1.5,-0.672 -1.5,-1.5 0,-0.828 0.672,-1.5 1.5,-1.5"
         style="fill:#000000;fill-opacity:1;fill-rule:nonzero;stroke:none"
         id="path118"
         inkscape:connector-curvature="0" /></g><g
       id="g120"><path
         d="m 243.434,689.528 c 0.829,0 1.5,0.672 1.5,1.5 0,0.829 -0.671,1.5 -1.5,1.5 -0.828,0 -1.5,-0.671 -1.5,-1.5 0,-0.828 0.672,-1.5 1.5,-1.5"
         style="fill:#000000;fill-opacity:1;fill-rule:nonzero;stroke:none"
         id="path122"
         inkscape:connector-curvature="0" /></g><g
       id="g124"><path
         d="m 211.566,591.449 c 0.828,0 1.5,0.671 1.5,1.5 0,0.828 -0.672,1.5 -1.5,1.5 -0.829,0 -1.5,-0.672 -1.5,-1.5 0,-0.829 0.671,-1.5 1.5,-1.5"
         style="fill:#000000;fill-opacity:1;fill-rule:nonzero;stroke:none"
         id="path126"
         inkscape:connector-curvature="0" /></g><g
       id="g128"><path
         d="m 295,564.33 c 0.828,0 1.5,0.672 1.5,1.5 0,0.829 -0.672,1.5 -1.5,1.5 -0.828,0 -1.5,-0.671 -1.5,-1.5 0,-0.828 0.672,-1.5 1.5,-1.5"
         style="fill:#000000;fill-opacity:1;fill-rule:nonzero;stroke:none"
         id="path130"
         inkscape:connector-curvature="0" /></g><g
       id="g132"><path
         d="m 295,476.613 c 0.828,0 1.5,0.672 1.5,1.5 0,0.829 -0.672,1.5 -1.5,1.5 -0.828,0 -1.5,-0.671 -1.5,-1.5 0,-0.828 0.672,-1.5 1.5,-1.5"
         style="fill:#000000;fill-opacity:1;fill-rule:nonzero;stroke:none"
         id="path134"
         inkscape:connector-curvature="0" /></g><g
       id="g136"><path
         d="m 211.566,503.711 c 0.828,0 1.5,0.672 1.5,1.5 0,0.828 -0.672,1.5 -1.5,1.5 -0.829,0 -1.5,-0.672 -1.5,-1.5 0,-0.828 0.671,-1.5 1.5,-1.5"
         style="fill:#000000;fill-opacity:1;fill-rule:nonzero;stroke:none"
         id="path138"
         inkscape:connector-curvature="0" /></g><g
       id="g140"><path
         d="m 211.566,591.449 c 0.828,0 1.5,0.671 1.5,1.5 0,0.828 -0.672,1.5 -1.5,1.5 -0.829,0 -1.5,-0.672 -1.5,-1.5 0,-0.829 0.671,-1.5 1.5,-1.5"
         style="fill:#000000;fill-opacity:1;fill-rule:nonzero;stroke:none"
         id="path142"
         inkscape:connector-curvature="0" /></g><g
       id="g144"><path
         d="m 295,618.567 c 0.828,0 1.5,0.672 1.5,1.5 0,0.828 -0.672,1.5 -1.5,1.5 -0.828,0 -1.5,-0.672 -1.5,-1.5 0,-0.828 0.672,-1.5 1.5,-1.5"
         style="fill:#000000;fill-opacity:1;fill-rule:nonzero;stroke:none"
         id="path146"
         inkscape:connector-curvature="0" /></g><g
       id="g148"><path
         d="m 378.424,591.449 c 0.828,0 1.5,0.671 1.5,1.5 0,0.828 -0.672,1.5 -1.5,1.5 -0.828,0 -1.5,-0.672 -1.5,-1.5 0,-0.829 0.672,-1.5 1.5,-1.5"
         style="fill:#000000;fill-opacity:1;fill-rule:nonzero;stroke:none"
         id="path150"
         inkscape:connector-curvature="0" /></g><g
       id="g152"><path
         d="m 295,564.33 c 0.828,0 1.5,0.672 1.5,1.5 0,0.829 -0.672,1.5 -1.5,1.5 -0.828,0 -1.5,-0.671 -1.5,-1.5 0,-0.828 0.672,-1.5 1.5,-1.5"
         style="fill:#000000;fill-opacity:1;fill-rule:nonzero;stroke:none"
         id="path154"
         inkscape:connector-curvature="0" /></g><g
       id="g156"><path
         d="m 160,662.431 c 0.828,0 1.5,0.671 1.5,1.5 0,0.828 -0.672,1.5 -1.5,1.5 -0.828,0 -1.5,-0.672 -1.5,-1.5 0,-0.829 0.672,-1.5 1.5,-1.5"
         style="fill:#000000;fill-opacity:1;fill-rule:nonzero;stroke:none"
         id="path158"
         inkscape:connector-curvature="0" /></g><g
       id="g160"><path
         d="m 211.566,591.449 c 0.828,0 1.5,0.671 1.5,1.5 0,0.828 -0.672,1.5 -1.5,1.5 -0.829,0 -1.5,-0.672 -1.5,-1.5 0,-0.829 0.671,-1.5 1.5,-1.5"
         style="fill:#000000;fill-opacity:1;fill-rule:nonzero;stroke:none"
         id="path162"
         inkscape:connector-curvature="0" /></g><g
       id="g164"><path
         d="m 160,520.477 c 0.828,0 1.5,0.671 1.5,1.5 0,0.828 -0.672,1.5 -1.5,1.5 -0.828,0 -1.5,-0.672 -1.5,-1.5 0,-0.829 0.672,-1.5 1.5,-1.5"
         style="fill:#000000;fill-opacity:1;fill-rule:nonzero;stroke:none"
         id="path166"
         inkscape:connector-curvature="0" /></g><g
       id="g168"><path
         d="m 108.445,591.449 c 0.828,0 1.5,0.671 1.5,1.5 0,0.828 -0.672,1.5 -1.5,1.5 -0.829,0 -1.5,-0.672 -1.5,-1.5 0,-0.829 0.671,-1.5 1.5,-1.5"
         style="fill:#000000;fill-opacity:1;fill-rule:nonzero;stroke:none"
         id="path170"
         inkscape:connector-curvature="0" /></g><g
       id="g172"><path
         d="m 25.01,564.34 c 0.829,0 1.5,0.672 1.5,1.5 0,0.829 -0.671,1.5 -1.5,1.5 -0.828,0 -1.5,-0.671 -1.5,-1.5 0,-0.828 0.672,-1.5 1.5,-1.5"
         style="fill:#000000;fill-opacity:1;fill-rule:nonzero;stroke:none"
         id="path174"
         inkscape:connector-curvature="0" /></g><g
       id="g176"><path
         d="m 108.445,591.449 c 0.828,0 1.5,0.671 1.5,1.5 0,0.828 -0.672,1.5 -1.5,1.5 -0.829,0 -1.5,-0.672 -1.5,-1.5 0,-0.829 0.671,-1.5 1.5,-1.5"
         style="fill:#000000;fill-opacity:1;fill-rule:nonzero;stroke:none"
         id="path178"
         inkscape:connector-curvature="0" /></g><g
       id="g180"><path
         d="m 160,520.477 c 0.828,0 1.5,0.671 1.5,1.5 0,0.828 -0.672,1.5 -1.5,1.5 -0.828,0 -1.5,-0.672 -1.5,-1.5 0,-0.829 0.672,-1.5 1.5,-1.5"
         style="fill:#000000;fill-opacity:1;fill-rule:nonzero;stroke:none"
         id="path182"
         inkscape:connector-curvature="0" /></g><g
       id="g184"><path
         d="m 76.576,493.39 c 0.828,0 1.5,0.671 1.5,1.5 0,0.828 -0.672,1.5 -1.5,1.5 -0.828,0 -1.5,-0.672 -1.5,-1.5 0,-0.829 0.672,-1.5 1.5,-1.5"
         style="fill:#000000;fill-opacity:1;fill-rule:nonzero;stroke:none"
         id="path186"
         inkscape:connector-curvature="0" /></g><g
       id="g188"><path
         d="m 25.01,564.34 c 0.829,0 1.5,0.672 1.5,1.5 0,0.829 -0.671,1.5 -1.5,1.5 -0.828,0 -1.5,-0.671 -1.5,-1.5 0,-0.828 0.672,-1.5 1.5,-1.5"
         style="fill:#000000;fill-opacity:1;fill-rule:nonzero;stroke:none"
         id="path190"
         inkscape:connector-curvature="0" /></g><g
       id="g192"><path
         d="m 76.566,635.312 c 0.828,0 1.5,0.672 1.5,1.5 0,0.829 -0.672,1.5 -1.5,1.5 -0.829,0 -1.5,-0.671 -1.5,-1.5 0,-0.828 0.671,-1.5 1.5,-1.5"
         style="fill:#000000;fill-opacity:1;fill-rule:nonzero;stroke:none"
         id="path194"
         inkscape:connector-curvature="0" /></g><g
       id="g196"><path
         d="m 160,662.431 c 0.828,0 1.5,0.671 1.5,1.5 0,0.828 -0.672,1.5 -1.5,1.5 -0.828,0 -1.5,-0.672 -1.5,-1.5 0,-0.829 0.672,-1.5 1.5,-1.5"
         style="fill:#000000;fill-opacity:1;fill-rule:nonzero;stroke:none"
         id="path198"
         inkscape:connector-curvature="0" /></g><g
       id="g200"><path
         d="m 108.445,591.449 c 0.828,0 1.5,0.671 1.5,1.5 0,0.828 -0.672,1.5 -1.5,1.5 -0.829,0 -1.5,-0.672 -1.5,-1.5 0,-0.829 0.671,-1.5 1.5,-1.5"
         style="fill:#000000;fill-opacity:1;fill-rule:nonzero;stroke:none"
         id="path202"
         inkscape:connector-curvature="0" /></g><g
       id="g204"><path
         d="m 76.566,405.642 c 0.828,0 1.5,0.671 1.5,1.5 0,0.828 -0.672,1.5 -1.5,1.5 -0.829,0 -1.5,-0.672 -1.5,-1.5 0,-0.829 0.671,-1.5 1.5,-1.5"
         style="fill:#000000;fill-opacity:1;fill-rule:nonzero;stroke:none"
         id="path206"
         inkscape:connector-curvature="0" /></g><g
       id="g208"><path
         d="m 76.576,493.39 c 0.828,0 1.5,0.671 1.5,1.5 0,0.828 -0.672,1.5 -1.5,1.5 -0.828,0 -1.5,-0.672 -1.5,-1.5 0,-0.829 0.672,-1.5 1.5,-1.5"
         style="fill:#000000;fill-opacity:1;fill-rule:nonzero;stroke:none"
         id="path210"
         inkscape:connector-curvature="0" /></g><g
       id="g212"><path
         d="m 160,520.477 c 0.828,0 1.5,0.671 1.5,1.5 0,0.828 -0.672,1.5 -1.5,1.5 -0.828,0 -1.5,-0.672 -1.5,-1.5 0,-0.829 0.672,-1.5 1.5,-1.5"
         style="fill:#000000;fill-opacity:1;fill-rule:nonzero;stroke:none"
         id="path214"
         inkscape:connector-curvature="0" /></g><g
       id="g216"><path
         d="m 160,432.76 c 0.828,0 1.5,0.672 1.5,1.5 0,0.829 -0.672,1.5 -1.5,1.5 -0.828,0 -1.5,-0.671 -1.5,-1.5 0,-0.828 0.672,-1.5 1.5,-1.5"
         style="fill:#000000;fill-opacity:1;fill-rule:nonzero;stroke:none"
         id="path218"
         inkscape:connector-curvature="0" /></g><g
       id="g220"><path
         d="m 76.566,405.642 c 0.828,0 1.5,0.671 1.5,1.5 0,0.828 -0.672,1.5 -1.5,1.5 -0.829,0 -1.5,-0.672 -1.5,-1.5 0,-0.829 0.671,-1.5 1.5,-1.5"
         style="fill:#000000;fill-opacity:1;fill-rule:nonzero;stroke:none"
         id="path222"
         inkscape:connector-curvature="0" /></g><g
       id="g224"><path
         d="m 25,476.613 c 0.828,0 1.5,0.672 1.5,1.5 0,0.829 -0.672,1.5 -1.5,1.5 -0.828,0 -1.5,-0.671 -1.5,-1.5 0,-0.828 0.672,-1.5 1.5,-1.5"
         style="fill:#000000;fill-opacity:1;fill-rule:nonzero;stroke:none"
         id="path226"
         inkscape:connector-curvature="0" /></g><g
       id="g228"><path
         d="m 25.01,564.34 c 0.829,0 1.5,0.672 1.5,1.5 0,0.829 -0.671,1.5 -1.5,1.5 -0.828,0 -1.5,-0.671 -1.5,-1.5 0,-0.828 0.672,-1.5 1.5,-1.5"
         style="fill:#000000;fill-opacity:1;fill-rule:nonzero;stroke:none"
         id="path230"
         inkscape:connector-curvature="0" /></g><g
       id="g232"><path
         d="m 76.576,493.39 c 0.828,0 1.5,0.671 1.5,1.5 0,0.828 -0.672,1.5 -1.5,1.5 -0.828,0 -1.5,-0.672 -1.5,-1.5 0,-0.829 0.672,-1.5 1.5,-1.5"
         style="fill:#000000;fill-opacity:1;fill-rule:nonzero;stroke:none"
         id="path234"
         inkscape:connector-curvature="0" /></g><g
       id="g236"><path
         d="m 160,432.76 c 0.828,0 1.5,0.672 1.5,1.5 0,0.829 -0.672,1.5 -1.5,1.5 -0.828,0 -1.5,-0.671 -1.5,-1.5 0,-0.828 0.672,-1.5 1.5,-1.5"
         style="fill:#000000;fill-opacity:1;fill-rule:nonzero;stroke:none"
         id="path238"
         inkscape:connector-curvature="0" /></g><g
       id="g240"><path
         d="m 211.566,503.711 c 0.828,0 1.5,0.672 1.5,1.5 0,0.828 -0.672,1.5 -1.5,1.5 -0.829,0 -1.5,-0.672 -1.5,-1.5 0,-0.828 0.671,-1.5 1.5,-1.5"
         style="fill:#000000;fill-opacity:1;fill-rule:nonzero;stroke:none"
         id="path242"
         inkscape:connector-curvature="0" /></g><g
       id="g244"><path
         d="m 295,476.613 c 0.828,0 1.5,0.672 1.5,1.5 0,0.829 -0.672,1.5 -1.5,1.5 -0.828,0 -1.5,-0.671 -1.5,-1.5 0,-0.828 0.672,-1.5 1.5,-1.5"
         style="fill:#000000;fill-opacity:1;fill-rule:nonzero;stroke:none"
         id="path246"
         inkscape:connector-curvature="0" /></g><g
       id="g248"><path
         d="m 243.434,405.642 c 0.829,0 1.5,0.671 1.5,1.5 0,0.828 -0.671,1.5 -1.5,1.5 -0.828,0 -1.5,-0.672 -1.5,-1.5 0,-0.829 0.672,-1.5 1.5,-1.5"
         style="fill:#000000;fill-opacity:1;fill-rule:nonzero;stroke:none"
         id="path250"
         inkscape:connector-curvature="0" /></g><g
       id="g252"><path
         d="m 160,432.76 c 0.828,0 1.5,0.672 1.5,1.5 0,0.829 -0.672,1.5 -1.5,1.5 -0.828,0 -1.5,-0.671 -1.5,-1.5 0,-0.828 0.672,-1.5 1.5,-1.5"
         style="fill:#000000;fill-opacity:1;fill-rule:nonzero;stroke:none"
         id="path254"
         inkscape:connector-curvature="0" /></g><g
       id="g256"><path
         d="m 160,520.477 c 0.828,0 1.5,0.671 1.5,1.5 0,0.828 -0.672,1.5 -1.5,1.5 -0.828,0 -1.5,-0.672 -1.5,-1.5 0,-0.829 0.672,-1.5 1.5,-1.5"
         style="fill:#000000;fill-opacity:1;fill-rule:nonzero;stroke:none"
         id="path258"
         inkscape:connector-curvature="0" /></g><g
       id="g260"><path
         d="m 211.566,591.449 c 0.828,0 1.5,0.671 1.5,1.5 0,0.828 -0.672,1.5 -1.5,1.5 -0.829,0 -1.5,-0.672 -1.5,-1.5 0,-0.829 0.671,-1.5 1.5,-1.5"
         style="fill:#000000;fill-opacity:1;fill-rule:nonzero;stroke:none"
         id="path262"
         inkscape:connector-curvature="0" /></g><g
       id="g264"><path
         d="m 211.566,503.711 c 0.828,0 1.5,0.672 1.5,1.5 0,0.828 -0.672,1.5 -1.5,1.5 -0.829,0 -1.5,-0.672 -1.5,-1.5 0,-0.828 0.671,-1.5 1.5,-1.5"
         style="fill:#000000;fill-opacity:1;fill-rule:nonzero;stroke:none"
         id="path266"
         inkscape:connector-curvature="0" /></g><g
       id="g268"><path
         d="m 76.566,405.642 c 0.828,0 1.5,0.671 1.5,1.5 0,0.828 -0.672,1.5 -1.5,1.5 -0.829,0 -1.5,-0.672 -1.5,-1.5 0,-0.829 0.671,-1.5 1.5,-1.5"
         style="fill:#000000;fill-opacity:1;fill-rule:nonzero;stroke:none"
         id="path270"
         inkscape:connector-curvature="0" /></g><g
       id="g272"><path
         d="m 160,432.76 c 0.828,0 1.5,0.672 1.5,1.5 0,0.829 -0.672,1.5 -1.5,1.5 -0.828,0 -1.5,-0.671 -1.5,-1.5 0,-0.828 0.672,-1.5 1.5,-1.5"
         style="fill:#000000;fill-opacity:1;fill-rule:nonzero;stroke:none"
         id="path274"
         inkscape:connector-curvature="0" /></g><g
       id="g276"><path
         d="m 211.566,361.788 c 0.828,0 1.5,0.672 1.5,1.5 0,0.829 -0.672,1.5 -1.5,1.5 -0.829,0 -1.5,-0.671 -1.5,-1.5 0,-0.828 0.671,-1.5 1.5,-1.5"
         style="fill:#000000;fill-opacity:1;fill-rule:nonzero;stroke:none"
         id="path278"
         inkscape:connector-curvature="0" /></g><g
       id="g280"><path
         d="m 128.131,334.68 c 0.829,0 1.5,0.672 1.5,1.5 0,0.829 -0.671,1.5 -1.5,1.5 -0.828,0 -1.5,-0.671 -1.5,-1.5 0,-0.828 0.672,-1.5 1.5,-1.5"
         style="fill:#000000;fill-opacity:1;fill-rule:nonzero;stroke:none"
         id="path282"
         inkscape:connector-curvature="0" /></g><g
       id="g284"><path
         d="m 128.131,246.953 c 0.829,0 1.5,0.672 1.5,1.5 0,0.829 -0.671,1.5 -1.5,1.5 -0.828,0 -1.5,-0.671 -1.5,-1.5 0,-0.828 0.672,-1.5 1.5,-1.5"
         style="fill:#000000;fill-opacity:1;fill-rule:nonzero;stroke:none"
         id="path286"
         inkscape:connector-curvature="0" /></g><g
       id="g288"><path
         d="m 128.131,334.68 c 0.829,0 1.5,0.672 1.5,1.5 0,0.829 -0.671,1.5 -1.5,1.5 -0.828,0 -1.5,-0.671 -1.5,-1.5 0,-0.828 0.672,-1.5 1.5,-1.5"
         style="fill:#000000;fill-opacity:1;fill-rule:nonzero;stroke:none"
         id="path290"
         inkscape:connector-curvature="0" /></g><g
       id="g292"><path
         d="m 211.566,361.788 c 0.828,0 1.5,0.672 1.5,1.5 0,0.829 -0.672,1.5 -1.5,1.5 -0.829,0 -1.5,-0.671 -1.5,-1.5 0,-0.828 0.671,-1.5 1.5,-1.5"
         style="fill:#000000;fill-opacity:1;fill-rule:nonzero;stroke:none"
         id="path294"
         inkscape:connector-curvature="0" /></g><g
       id="g296"><path
         d="m 211.566,274.061 c 0.828,0 1.5,0.672 1.5,1.5 0,0.829 -0.672,1.5 -1.5,1.5 -0.829,0 -1.5,-0.671 -1.5,-1.5 0,-0.828 0.671,-1.5 1.5,-1.5"
         style="fill:#000000;fill-opacity:1;fill-rule:nonzero;stroke:none"
         id="path298"
         inkscape:connector-curvature="0" /></g><g
       id="g300"><path
         d="m 128.131,246.953 c 0.829,0 1.5,0.672 1.5,1.5 0,0.829 -0.671,1.5 -1.5,1.5 -0.828,0 -1.5,-0.671 -1.5,-1.5 0,-0.828 0.672,-1.5 1.5,-1.5"
         style="fill:#000000;fill-opacity:1;fill-rule:nonzero;stroke:none"
         id="path302"
         inkscape:connector-curvature="0" /></g><g
       id="g304"><path
         d="m 76.566,317.904 c 0.828,0 1.5,0.672 1.5,1.5 0,0.829 -0.672,1.5 -1.5,1.5 -0.829,0 -1.5,-0.671 -1.5,-1.5 0,-0.828 0.671,-1.5 1.5,-1.5"
         style="fill:#000000;fill-opacity:1;fill-rule:nonzero;stroke:none"
         id="path306"
         inkscape:connector-curvature="0" /></g><g
       id="g308"><path
         d="m 76.566,405.642 c 0.828,0 1.5,0.671 1.5,1.5 0,0.828 -0.672,1.5 -1.5,1.5 -0.829,0 -1.5,-0.672 -1.5,-1.5 0,-0.829 0.671,-1.5 1.5,-1.5"
         style="fill:#000000;fill-opacity:1;fill-rule:nonzero;stroke:none"
         id="path310"
         inkscape:connector-curvature="0" /></g><g
       id="g312"><path
         d="m 128.131,334.68 c 0.829,0 1.5,0.672 1.5,1.5 0,0.829 -0.671,1.5 -1.5,1.5 -0.828,0 -1.5,-0.671 -1.5,-1.5 0,-0.828 0.672,-1.5 1.5,-1.5"
         style="fill:#000000;fill-opacity:1;fill-rule:nonzero;stroke:none"
         id="path314"
         inkscape:connector-curvature="0" /></g><g
       id="g316"><path
         d="m 295,246.953 c 0.828,0 1.5,0.672 1.5,1.5 0,0.829 -0.672,1.5 -1.5,1.5 -0.828,0 -1.5,-0.671 -1.5,-1.5 0,-0.828 0.672,-1.5 1.5,-1.5"
         style="fill:#000000;fill-opacity:1;fill-rule:nonzero;stroke:none"
         id="path318"
         inkscape:connector-curvature="0" /></g><g
       id="g320"><path
         d="m 211.566,274.061 c 0.828,0 1.5,0.672 1.5,1.5 0,0.829 -0.672,1.5 -1.5,1.5 -0.829,0 -1.5,-0.671 -1.5,-1.5 0,-0.828 0.671,-1.5 1.5,-1.5"
         style="fill:#000000;fill-opacity:1;fill-rule:nonzero;stroke:none"
         id="path322"
         inkscape:connector-curvature="0" /></g><g
       id="g324"><path
         d="m 211.566,361.788 c 0.828,0 1.5,0.672 1.5,1.5 0,0.829 -0.672,1.5 -1.5,1.5 -0.829,0 -1.5,-0.671 -1.5,-1.5 0,-0.828 0.671,-1.5 1.5,-1.5"
         style="fill:#000000;fill-opacity:1;fill-rule:nonzero;stroke:none"
         id="path326"
         inkscape:connector-curvature="0" /></g><g
       id="g328"><path
         d="m 295,334.66 c 0.828,0 1.5,0.671 1.5,1.5 0,0.828 -0.672,1.5 -1.5,1.5 -0.828,0 -1.5,-0.672 -1.5,-1.5 0,-0.829 0.672,-1.5 1.5,-1.5"
         style="fill:#000000;fill-opacity:1;fill-rule:nonzero;stroke:none"
         id="path330"
         inkscape:connector-curvature="0" /></g><g
       id="g332"><path
         d="m 295,246.953 c 0.828,0 1.5,0.672 1.5,1.5 0,0.829 -0.672,1.5 -1.5,1.5 -0.828,0 -1.5,-0.671 -1.5,-1.5 0,-0.828 0.672,-1.5 1.5,-1.5"
         style="fill:#000000;fill-opacity:1;fill-rule:nonzero;stroke:none"
         id="path334"
         inkscape:connector-curvature="0" /></g><g
       id="g336"><path
         d="m 211.566,219.835 c 0.828,0 1.5,0.671 1.5,1.5 0,0.828 -0.672,1.5 -1.5,1.5 -0.829,0 -1.5,-0.672 -1.5,-1.5 0,-0.829 0.671,-1.5 1.5,-1.5"
         style="fill:#000000;fill-opacity:1;fill-rule:nonzero;stroke:none"
         id="path338"
         inkscape:connector-curvature="0" /></g><g
       id="g340"><path
         d="m 128.131,246.953 c 0.829,0 1.5,0.672 1.5,1.5 0,0.829 -0.671,1.5 -1.5,1.5 -0.828,0 -1.5,-0.671 -1.5,-1.5 0,-0.828 0.672,-1.5 1.5,-1.5"
         style="fill:#000000;fill-opacity:1;fill-rule:nonzero;stroke:none"
         id="path342"
         inkscape:connector-curvature="0" /></g><g
       id="g344"><path
         d="m 211.566,274.061 c 0.828,0 1.5,0.672 1.5,1.5 0,0.829 -0.672,1.5 -1.5,1.5 -0.829,0 -1.5,-0.671 -1.5,-1.5 0,-0.828 0.671,-1.5 1.5,-1.5"
         style="fill:#000000;fill-opacity:1;fill-rule:nonzero;stroke:none"
         id="path346"
         inkscape:connector-curvature="0" /></g><g
       id="g348"><path
         d="m 295,334.66 c 0.828,0 1.5,0.671 1.5,1.5 0,0.828 -0.672,1.5 -1.5,1.5 -0.828,0 -1.5,-0.672 -1.5,-1.5 0,-0.829 0.672,-1.5 1.5,-1.5"
         style="fill:#000000;fill-opacity:1;fill-rule:nonzero;stroke:none"
         id="path350"
         inkscape:connector-curvature="0" /></g><g
       id="g352"><path
         d="m 243.434,405.642 c 0.829,0 1.5,0.671 1.5,1.5 0,0.828 -0.671,1.5 -1.5,1.5 -0.828,0 -1.5,-0.672 -1.5,-1.5 0,-0.829 0.672,-1.5 1.5,-1.5"
         style="fill:#000000;fill-opacity:1;fill-rule:nonzero;stroke:none"
         id="path354"
         inkscape:connector-curvature="0" /></g><g
       id="g356"><path
         d="m 295,476.613 c 0.828,0 1.5,0.672 1.5,1.5 0,0.829 -0.672,1.5 -1.5,1.5 -0.828,0 -1.5,-0.671 -1.5,-1.5 0,-0.828 0.672,-1.5 1.5,-1.5"
         style="fill:#000000;fill-opacity:1;fill-rule:nonzero;stroke:none"
         id="path358"
         inkscape:connector-curvature="0" /></g><g
       id="g360"><path
         d="m 346.576,405.642 c 0.828,0 1.5,0.671 1.5,1.5 0,0.828 -0.672,1.5 -1.5,1.5 -0.828,0 -1.5,-0.672 -1.5,-1.5 0,-0.829 0.672,-1.5 1.5,-1.5"
         style="fill:#000000;fill-opacity:1;fill-rule:nonzero;stroke:none"
         id="path362"
         inkscape:connector-curvature="0" /></g><g
       id="g364"><path
         d="m 295,334.66 c 0.828,0 1.5,0.671 1.5,1.5 0,0.828 -0.672,1.5 -1.5,1.5 -0.828,0 -1.5,-0.672 -1.5,-1.5 0,-0.829 0.672,-1.5 1.5,-1.5"
         style="fill:#000000;fill-opacity:1;fill-rule:nonzero;stroke:none"
         id="path366"
         inkscape:connector-curvature="0" /></g><g
       id="g368"><path
         d="m 211.566,361.788 c 0.828,0 1.5,0.672 1.5,1.5 0,0.829 -0.672,1.5 -1.5,1.5 -0.829,0 -1.5,-0.671 -1.5,-1.5 0,-0.828 0.671,-1.5 1.5,-1.5"
         style="fill:#000000;fill-opacity:1;fill-rule:nonzero;stroke:none"
         id="path370"
         inkscape:connector-curvature="0" /></g><g
       id="g372"><path
         d="m 160,432.76 c 0.828,0 1.5,0.672 1.5,1.5 0,0.829 -0.672,1.5 -1.5,1.5 -0.828,0 -1.5,-0.671 -1.5,-1.5 0,-0.828 0.672,-1.5 1.5,-1.5"
         style="fill:#000000;fill-opacity:1;fill-rule:nonzero;stroke:none"
         id="path374"
         inkscape:connector-curvature="0" /></g><g
       id="g376"><path
         d="m 243.434,405.642 c 0.829,0 1.5,0.671 1.5,1.5 0,0.828 -0.671,1.5 -1.5,1.5 -0.828,0 -1.5,-0.672 -1.5,-1.5 0,-0.829 0.672,-1.5 1.5,-1.5"
         style="fill:#000000;fill-opacity:1;fill-rule:nonzero;stroke:none"
         id="path378"
         inkscape:connector-curvature="0" /></g><g
       id="g380"><path
         d="m 295,246.953 c 0.828,0 1.5,0.672 1.5,1.5 0,0.829 -0.672,1.5 -1.5,1.5 -0.828,0 -1.5,-0.671 -1.5,-1.5 0,-0.828 0.672,-1.5 1.5,-1.5"
         style="fill:#000000;fill-opacity:1;fill-rule:nonzero;stroke:none"
         id="path382"
         inkscape:connector-curvature="0" /></g><g
       id="g384"><path
         d="m 295,334.66 c 0.828,0 1.5,0.671 1.5,1.5 0,0.828 -0.672,1.5 -1.5,1.5 -0.828,0 -1.5,-0.672 -1.5,-1.5 0,-0.829 0.672,-1.5 1.5,-1.5"
         style="fill:#000000;fill-opacity:1;fill-rule:nonzero;stroke:none"
         id="path386"
         inkscape:connector-curvature="0" /></g><g
       id="g388"><path
         d="m 378.424,361.788 c 0.828,0 1.5,0.672 1.5,1.5 0,0.829 -0.672,1.5 -1.5,1.5 -0.828,0 -1.5,-0.671 -1.5,-1.5 0,-0.828 0.672,-1.5 1.5,-1.5"
         style="fill:#000000;fill-opacity:1;fill-rule:nonzero;stroke:none"
         id="path390"
         inkscape:connector-curvature="0" /></g><g
       id="g392"><path
         d="m 378.424,274.061 c 0.828,0 1.5,0.672 1.5,1.5 0,0.829 -0.672,1.5 -1.5,1.5 -0.828,0 -1.5,-0.671 -1.5,-1.5 0,-0.828 0.672,-1.5 1.5,-1.5"
         style="fill:#000000;fill-opacity:1;fill-rule:nonzero;stroke:none"
         id="path394"
         inkscape:connector-curvature="0" /></g><g
       id="g396"><path
         d="m 461.858,246.953 c 0.829,0 1.5,0.672 1.5,1.5 0,0.829 -0.671,1.5 -1.5,1.5 -0.828,0 -1.5,-0.671 -1.5,-1.5 0,-0.828 0.672,-1.5 1.5,-1.5"
         style="fill:#000000;fill-opacity:1;fill-rule:nonzero;stroke:none"
         id="path398"
         inkscape:connector-curvature="0" /></g><g
       id="g400"><path
         d="m 378.424,274.061 c 0.828,0 1.5,0.672 1.5,1.5 0,0.829 -0.672,1.5 -1.5,1.5 -0.828,0 -1.5,-0.671 -1.5,-1.5 0,-0.828 0.672,-1.5 1.5,-1.5"
         style="fill:#000000;fill-opacity:1;fill-rule:nonzero;stroke:none"
         id="path402"
         inkscape:connector-curvature="0" /></g><g
       id="g404"><path
         d="m 378.424,361.788 c 0.828,0 1.5,0.672 1.5,1.5 0,0.829 -0.672,1.5 -1.5,1.5 -0.828,0 -1.5,-0.671 -1.5,-1.5 0,-0.828 0.672,-1.5 1.5,-1.5"
         style="fill:#000000;fill-opacity:1;fill-rule:nonzero;stroke:none"
         id="path406"
         inkscape:connector-curvature="0" /></g><g
       id="g408"><path
         d="m 461.858,334.66 c 0.829,0 1.5,0.671 1.5,1.5 0,0.828 -0.671,1.5 -1.5,1.5 -0.828,0 -1.5,-0.672 -1.5,-1.5 0,-0.829 0.672,-1.5 1.5,-1.5"
         style="fill:#000000;fill-opacity:1;fill-rule:nonzero;stroke:none"
         id="path410"
         inkscape:connector-curvature="0" /></g><g
       id="g412"><path
         d="m 461.858,246.953 c 0.829,0 1.5,0.672 1.5,1.5 0,0.829 -0.671,1.5 -1.5,1.5 -0.828,0 -1.5,-0.671 -1.5,-1.5 0,-0.828 0.672,-1.5 1.5,-1.5"
         style="fill:#000000;fill-opacity:1;fill-rule:nonzero;stroke:none"
         id="path414"
         inkscape:connector-curvature="0" /></g><g
       id="g416"><path
         d="m 378.424,219.835 c 0.828,0 1.5,0.671 1.5,1.5 0,0.828 -0.672,1.5 -1.5,1.5 -0.828,0 -1.5,-0.672 -1.5,-1.5 0,-0.829 0.672,-1.5 1.5,-1.5"
         style="fill:#000000;fill-opacity:1;fill-rule:nonzero;stroke:none"
         id="path418"
         inkscape:connector-curvature="0" /></g><g
       id="g420"><path
         d="m 295,246.953 c 0.828,0 1.5,0.672 1.5,1.5 0,0.829 -0.672,1.5 -1.5,1.5 -0.828,0 -1.5,-0.671 -1.5,-1.5 0,-0.828 0.672,-1.5 1.5,-1.5"
         style="fill:#000000;fill-opacity:1;fill-rule:nonzero;stroke:none"
         id="path422"
         inkscape:connector-curvature="0" /></g><g
       id="g424"><path
         d="m 378.424,274.061 c 0.828,0 1.5,0.672 1.5,1.5 0,0.829 -0.672,1.5 -1.5,1.5 -0.828,0 -1.5,-0.671 -1.5,-1.5 0,-0.828 0.672,-1.5 1.5,-1.5"
         style="fill:#000000;fill-opacity:1;fill-rule:nonzero;stroke:none"
         id="path426"
         inkscape:connector-curvature="0" /></g><g
       id="g428"><path
         d="m 513.434,405.642 c 0.829,0 1.5,0.671 1.5,1.5 0,0.828 -0.671,1.5 -1.5,1.5 -0.828,0 -1.5,-0.672 -1.5,-1.5 0,-0.829 0.672,-1.5 1.5,-1.5"
         style="fill:#000000;fill-opacity:1;fill-rule:nonzero;stroke:none"
         id="path430"
         inkscape:connector-curvature="0" /></g><g
       id="g432"><path
         d="m 461.858,334.66 c 0.829,0 1.5,0.671 1.5,1.5 0,0.828 -0.671,1.5 -1.5,1.5 -0.828,0 -1.5,-0.672 -1.5,-1.5 0,-0.829 0.672,-1.5 1.5,-1.5"
         style="fill:#000000;fill-opacity:1;fill-rule:nonzero;stroke:none"
         id="path434"
         inkscape:connector-curvature="0" /></g><g
       id="g436"><path
         d="m 378.424,361.788 c 0.828,0 1.5,0.672 1.5,1.5 0,0.829 -0.672,1.5 -1.5,1.5 -0.828,0 -1.5,-0.671 -1.5,-1.5 0,-0.828 0.672,-1.5 1.5,-1.5"
         style="fill:#000000;fill-opacity:1;fill-rule:nonzero;stroke:none"
         id="path438"
         inkscape:connector-curvature="0" /></g><g
       id="g440"><path
         d="m 430,432.76 c 0.828,0 1.5,0.672 1.5,1.5 0,0.829 -0.672,1.5 -1.5,1.5 -0.828,0 -1.5,-0.671 -1.5,-1.5 0,-0.828 0.672,-1.5 1.5,-1.5"
         style="fill:#000000;fill-opacity:1;fill-rule:nonzero;stroke:none"
         id="path442"
         inkscape:connector-curvature="0" /></g><g
       id="g444"><path
         d="m 513.434,405.642 c 0.829,0 1.5,0.671 1.5,1.5 0,0.828 -0.671,1.5 -1.5,1.5 -0.828,0 -1.5,-0.672 -1.5,-1.5 0,-0.829 0.672,-1.5 1.5,-1.5"
         style="fill:#000000;fill-opacity:1;fill-rule:nonzero;stroke:none"
         id="path446"
         inkscape:connector-curvature="0" /></g><g
       id="g448"><path
         d="m 513.434,317.904 c 0.829,0 1.5,0.672 1.5,1.5 0,0.829 -0.671,1.5 -1.5,1.5 -0.828,0 -1.5,-0.671 -1.5,-1.5 0,-0.828 0.672,-1.5 1.5,-1.5"
         style="fill:#000000;fill-opacity:1;fill-rule:nonzero;stroke:none"
         id="path450"
         inkscape:connector-curvature="0" /></g><g
       id="g452"><path
         d="m 461.858,246.953 c 0.829,0 1.5,0.672 1.5,1.5 0,0.829 -0.671,1.5 -1.5,1.5 -0.828,0 -1.5,-0.671 -1.5,-1.5 0,-0.828 0.672,-1.5 1.5,-1.5"
         style="fill:#000000;fill-opacity:1;fill-rule:nonzero;stroke:none"
         id="path454"
         inkscape:connector-curvature="0" /></g><g
       id="g456"><path
         d="m 461.858,334.66 c 0.829,0 1.5,0.671 1.5,1.5 0,0.828 -0.671,1.5 -1.5,1.5 -0.828,0 -1.5,-0.672 -1.5,-1.5 0,-0.829 0.672,-1.5 1.5,-1.5"
         style="fill:#000000;fill-opacity:1;fill-rule:nonzero;stroke:none"
         id="path458"
         inkscape:connector-curvature="0" /></g><g
       id="g460"><path
         d="m 430,432.76 c 0.828,0 1.5,0.672 1.5,1.5 0,0.829 -0.672,1.5 -1.5,1.5 -0.828,0 -1.5,-0.671 -1.5,-1.5 0,-0.828 0.672,-1.5 1.5,-1.5"
         style="fill:#000000;fill-opacity:1;fill-rule:nonzero;stroke:none"
         id="path462"
         inkscape:connector-curvature="0" /></g><g
       id="g464"><path
         d="m 346.576,405.642 c 0.828,0 1.5,0.671 1.5,1.5 0,0.828 -0.672,1.5 -1.5,1.5 -0.828,0 -1.5,-0.672 -1.5,-1.5 0,-0.829 0.672,-1.5 1.5,-1.5"
         style="fill:#000000;fill-opacity:1;fill-rule:nonzero;stroke:none"
         id="path466"
         inkscape:connector-curvature="0" /></g><g
       id="g468"><path
         d="m 295,476.613 c 0.828,0 1.5,0.672 1.5,1.5 0,0.829 -0.672,1.5 -1.5,1.5 -0.828,0 -1.5,-0.671 -1.5,-1.5 0,-0.828 0.672,-1.5 1.5,-1.5"
         style="fill:#000000;fill-opacity:1;fill-rule:nonzero;stroke:none"
         id="path470"
         inkscape:connector-curvature="0" /></g><g
       id="g472"><path
         d="m 378.424,503.721 c 0.828,0 1.5,0.672 1.5,1.5 0,0.829 -0.672,1.5 -1.5,1.5 -0.828,0 -1.5,-0.671 -1.5,-1.5 0,-0.828 0.672,-1.5 1.5,-1.5"
         style="fill:#000000;fill-opacity:1;fill-rule:nonzero;stroke:none"
         id="path474"
         inkscape:connector-curvature="0" /></g><g
       id="g476"><path
         d="m 430,432.76 c 0.828,0 1.5,0.672 1.5,1.5 0,0.829 -0.672,1.5 -1.5,1.5 -0.828,0 -1.5,-0.671 -1.5,-1.5 0,-0.828 0.672,-1.5 1.5,-1.5"
         style="fill:#000000;fill-opacity:1;fill-rule:nonzero;stroke:none"
         id="path478"
         inkscape:connector-curvature="0" /></g><g
       id="g480"><path
         d="m 378.424,361.788 c 0.828,0 1.5,0.672 1.5,1.5 0,0.829 -0.672,1.5 -1.5,1.5 -0.828,0 -1.5,-0.671 -1.5,-1.5 0,-0.828 0.672,-1.5 1.5,-1.5"
         style="fill:#000000;fill-opacity:1;fill-rule:nonzero;stroke:none"
         id="path482"
         inkscape:connector-curvature="0" /></g><g
       id="g484"><path
         d="m 295,334.66 c 0.828,0 1.5,0.671 1.5,1.5 0,0.828 -0.672,1.5 -1.5,1.5 -0.828,0 -1.5,-0.672 -1.5,-1.5 0,-0.829 0.672,-1.5 1.5,-1.5"
         style="fill:#000000;fill-opacity:1;fill-rule:nonzero;stroke:none"
         id="path486"
         inkscape:connector-curvature="0" /></g><g
       id="g488"><path
         d="m 346.576,405.642 c 0.828,0 1.5,0.671 1.5,1.5 0,0.828 -0.672,1.5 -1.5,1.5 -0.828,0 -1.5,-0.672 -1.5,-1.5 0,-0.829 0.672,-1.5 1.5,-1.5"
         style="fill:#000000;fill-opacity:1;fill-rule:nonzero;stroke:none"
         id="path490"
         inkscape:connector-curvature="0" /></g><g
       id="g492"><path
         d="m 513.434,405.642 c 0.829,0 1.5,0.671 1.5,1.5 0,0.828 -0.671,1.5 -1.5,1.5 -0.828,0 -1.5,-0.672 -1.5,-1.5 0,-0.829 0.672,-1.5 1.5,-1.5"
         style="fill:#000000;fill-opacity:1;fill-rule:nonzero;stroke:none"
         id="path494"
         inkscape:connector-curvature="0" /></g><g
       id="g496"><path
         d="m 430,432.76 c 0.828,0 1.5,0.672 1.5,1.5 0,0.829 -0.672,1.5 -1.5,1.5 -0.828,0 -1.5,-0.671 -1.5,-1.5 0,-0.828 0.672,-1.5 1.5,-1.5"
         style="fill:#000000;fill-opacity:1;fill-rule:nonzero;stroke:none"
         id="path498"
         inkscape:connector-curvature="0" /></g><g
       id="g500"><path
         d="m 430,520.477 c 0.828,0 1.5,0.671 1.5,1.5 0,0.828 -0.672,1.5 -1.5,1.5 -0.828,0 -1.5,-0.672 -1.5,-1.5 0,-0.829 0.672,-1.5 1.5,-1.5"
         style="fill:#000000;fill-opacity:1;fill-rule:nonzero;stroke:none"
         id="path502"
         inkscape:connector-curvature="0" /></g><g
       id="g504"><path
         d="m 513.434,493.379 c 0.829,0 1.5,0.672 1.5,1.5 0,0.829 -0.671,1.5 -1.5,1.5 -0.828,0 -1.5,-0.671 -1.5,-1.5 0,-0.828 0.672,-1.5 1.5,-1.5"
         style="fill:#000000;fill-opacity:1;fill-rule:nonzero;stroke:none"
         id="path506"
         inkscape:connector-curvature="0" /></g><g
       id="g508"><path
         d="m 564.99,564.34 c 0.828,0 1.5,0.672 1.5,1.5 0,0.829 -0.672,1.5 -1.5,1.5 -0.829,0 -1.5,-0.671 -1.5,-1.5 0,-0.828 0.671,-1.5 1.5,-1.5"
         style="fill:#000000;fill-opacity:1;fill-rule:nonzero;stroke:none"
         id="path510"
         inkscape:connector-curvature="0" /></g><g
       id="g512"><path
         d="m 513.434,493.379 c 0.829,0 1.5,0.672 1.5,1.5 0,0.829 -0.671,1.5 -1.5,1.5 -0.828,0 -1.5,-0.671 -1.5,-1.5 0,-0.828 0.672,-1.5 1.5,-1.5"
         style="fill:#000000;fill-opacity:1;fill-rule:nonzero;stroke:none"
         id="path514"
         inkscape:connector-curvature="0" /></g><g
       id="g516"><path
         d="m 430,520.477 c 0.828,0 1.5,0.671 1.5,1.5 0,0.828 -0.672,1.5 -1.5,1.5 -0.828,0 -1.5,-0.672 -1.5,-1.5 0,-0.829 0.672,-1.5 1.5,-1.5"
         style="fill:#000000;fill-opacity:1;fill-rule:nonzero;stroke:none"
         id="path518"
         inkscape:connector-curvature="0" /></g><g
       id="g520"><path
         d="m 481.555,591.449 c 0.829,0 1.5,0.671 1.5,1.5 0,0.828 -0.671,1.5 -1.5,1.5 -0.828,0 -1.5,-0.672 -1.5,-1.5 0,-0.829 0.672,-1.5 1.5,-1.5"
         style="fill:#000000;fill-opacity:1;fill-rule:nonzero;stroke:none"
         id="path522"
         inkscape:connector-curvature="0" /></g><g
       id="g524"><path
         d="m 564.99,564.34 c 0.828,0 1.5,0.672 1.5,1.5 0,0.829 -0.672,1.5 -1.5,1.5 -0.829,0 -1.5,-0.671 -1.5,-1.5 0,-0.828 0.671,-1.5 1.5,-1.5"
         style="fill:#000000;fill-opacity:1;fill-rule:nonzero;stroke:none"
         id="path526"
         inkscape:connector-curvature="0" /></g><g
       id="g528"><path
         d="m 565,476.624 c 0.828,0 1.5,0.671 1.5,1.5 0,0.828 -0.672,1.5 -1.5,1.5 -0.828,0 -1.5,-0.672 -1.5,-1.5 0,-0.829 0.672,-1.5 1.5,-1.5"
         style="fill:#000000;fill-opacity:1;fill-rule:nonzero;stroke:none"
         id="path530"
         inkscape:connector-curvature="0" /></g><g
       id="g532"><path
         d="m 513.434,405.642 c 0.829,0 1.5,0.671 1.5,1.5 0,0.828 -0.671,1.5 -1.5,1.5 -0.828,0 -1.5,-0.672 -1.5,-1.5 0,-0.829 0.672,-1.5 1.5,-1.5"
         style="fill:#000000;fill-opacity:1;fill-rule:nonzero;stroke:none"
         id="path534"
         inkscape:connector-curvature="0" /></g><g
       id="g536"><path
         d="m 513.434,493.379 c 0.829,0 1.5,0.672 1.5,1.5 0,0.829 -0.671,1.5 -1.5,1.5 -0.828,0 -1.5,-0.671 -1.5,-1.5 0,-0.828 0.672,-1.5 1.5,-1.5"
         style="fill:#000000;fill-opacity:1;fill-rule:nonzero;stroke:none"
         id="path538"
         inkscape:connector-curvature="0" /></g><g
       id="g540"><path
         d="m 429.99,662.42 c 0.828,0 1.5,0.672 1.5,1.5 0,0.829 -0.672,1.5 -1.5,1.5 -0.829,0 -1.5,-0.671 -1.5,-1.5 0,-0.828 0.671,-1.5 1.5,-1.5"
         style="fill:#000000;fill-opacity:1;fill-rule:nonzero;stroke:none"
         id="path542"
         inkscape:connector-curvature="0" /></g><g
       id="g544"><path
         d="m 481.555,591.449 c 0.829,0 1.5,0.671 1.5,1.5 0,0.828 -0.671,1.5 -1.5,1.5 -0.828,0 -1.5,-0.672 -1.5,-1.5 0,-0.829 0.672,-1.5 1.5,-1.5"
         style="fill:#000000;fill-opacity:1;fill-rule:nonzero;stroke:none"
         id="path546"
         inkscape:connector-curvature="0" /></g><g
       id="g548"><path
         d="m 430,520.477 c 0.828,0 1.5,0.671 1.5,1.5 0,0.828 -0.672,1.5 -1.5,1.5 -0.828,0 -1.5,-0.672 -1.5,-1.5 0,-0.829 0.672,-1.5 1.5,-1.5"
         style="fill:#000000;fill-opacity:1;fill-rule:nonzero;stroke:none"
         id="path550"
         inkscape:connector-curvature="0" /></g><g
       id="g552"><path
         d="m 378.424,591.449 c 0.828,0 1.5,0.671 1.5,1.5 0,0.828 -0.672,1.5 -1.5,1.5 -0.828,0 -1.5,-0.672 -1.5,-1.5 0,-0.829 0.672,-1.5 1.5,-1.5"
         style="fill:#000000;fill-opacity:1;fill-rule:nonzero;stroke:none"
         id="path554"
         inkscape:connector-curvature="0" /></g><g
       id="g556"><path
         d="m 429.99,662.42 c 0.828,0 1.5,0.672 1.5,1.5 0,0.829 -0.672,1.5 -1.5,1.5 -0.829,0 -1.5,-0.671 -1.5,-1.5 0,-0.828 0.671,-1.5 1.5,-1.5"
         style="fill:#000000;fill-opacity:1;fill-rule:nonzero;stroke:none"
         id="path558"
         inkscape:connector-curvature="0" /></g><g
       id="g560"><path
         d="m 513.445,635.312 c 0.828,0 1.5,0.672 1.5,1.5 0,0.829 -0.672,1.5 -1.5,1.5 -0.829,0 -1.5,-0.671 -1.5,-1.5 0,-0.828 0.671,-1.5 1.5,-1.5"
         style="fill:#000000;fill-opacity:1;fill-rule:nonzero;stroke:none"
         id="path562"
         inkscape:connector-curvature="0" /></g><g
       id="g564"><path
         d="m 564.99,564.34 c 0.828,0 1.5,0.672 1.5,1.5 0,0.829 -0.672,1.5 -1.5,1.5 -0.829,0 -1.5,-0.671 -1.5,-1.5 0,-0.828 0.671,-1.5 1.5,-1.5"
         style="fill:#000000;fill-opacity:1;fill-rule:nonzero;stroke:none"
         id="path566"
         inkscape:connector-curvature="0" /></g><g
       id="g568"><path
         d="m 481.555,591.449 c 0.829,0 1.5,0.671 1.5,1.5 0,0.828 -0.671,1.5 -1.5,1.5 -0.828,0 -1.5,-0.672 -1.5,-1.5 0,-0.829 0.672,-1.5 1.5,-1.5"
         style="fill:#000000;fill-opacity:1;fill-rule:nonzero;stroke:none"
         id="path570"
         inkscape:connector-curvature="0" /></g><g
       id="g572"><path
         d="m 378.424,591.449 c 0.828,0 1.5,0.671 1.5,1.5 0,0.828 -0.672,1.5 -1.5,1.5 -0.828,0 -1.5,-0.672 -1.5,-1.5 0,-0.829 0.672,-1.5 1.5,-1.5"
         style="fill:#000000;fill-opacity:1;fill-rule:nonzero;stroke:none"
         id="path574"
         inkscape:connector-curvature="0" /></g><g
       id="g576"><path
         d="m 378.424,503.721 c 0.828,0 1.5,0.672 1.5,1.5 0,0.829 -0.672,1.5 -1.5,1.5 -0.828,0 -1.5,-0.671 -1.5,-1.5 0,-0.828 0.672,-1.5 1.5,-1.5"
         style="fill:#000000;fill-opacity:1;fill-rule:nonzero;stroke:none"
         id="path578"
         inkscape:connector-curvature="0" /></g><g
       id="g580"><path
         d="m 295,476.613 c 0.828,0 1.5,0.672 1.5,1.5 0,0.829 -0.672,1.5 -1.5,1.5 -0.828,0 -1.5,-0.671 -1.5,-1.5 0,-0.828 0.672,-1.5 1.5,-1.5"
         style="fill:#000000;fill-opacity:1;fill-rule:nonzero;stroke:none"
         id="path582"
         inkscape:connector-curvature="0" /></g><g
       id="g584"><path
         d="m 295,564.33 c 0.828,0 1.5,0.672 1.5,1.5 0,0.829 -0.672,1.5 -1.5,1.5 -0.828,0 -1.5,-0.671 -1.5,-1.5 0,-0.828 0.672,-1.5 1.5,-1.5"
         style="fill:#000000;fill-opacity:1;fill-rule:nonzero;stroke:none"
         id="path586"
         inkscape:connector-curvature="0" /></g><g
       id="g588"><path
         d="m 378.424,591.449 c 0.828,0 1.5,0.671 1.5,1.5 0,0.828 -0.672,1.5 -1.5,1.5 -0.828,0 -1.5,-0.672 -1.5,-1.5 0,-0.829 0.672,-1.5 1.5,-1.5"
         style="fill:#000000;fill-opacity:1;fill-rule:nonzero;stroke:none"
         id="path590"
         inkscape:connector-curvature="0" /></g><g
       id="g592"><path
         d="m 430,520.477 c 0.828,0 1.5,0.671 1.5,1.5 0,0.828 -0.672,1.5 -1.5,1.5 -0.828,0 -1.5,-0.672 -1.5,-1.5 0,-0.829 0.672,-1.5 1.5,-1.5"
         style="fill:#000000;fill-opacity:1;fill-rule:nonzero;stroke:none"
         id="path594"
         inkscape:connector-curvature="0" /></g><g
       id="g596"><path
         d="m 430,432.76 c 0.828,0 1.5,0.672 1.5,1.5 0,0.829 -0.672,1.5 -1.5,1.5 -0.828,0 -1.5,-0.671 -1.5,-1.5 0,-0.828 0.672,-1.5 1.5,-1.5"
         style="fill:#000000;fill-opacity:1;fill-rule:nonzero;stroke:none"
         id="path598"
         inkscape:connector-curvature="0" /></g><g
       id="g600"><path
         d="m 378.424,503.721 c 0.828,0 1.5,0.672 1.5,1.5 0,0.829 -0.672,1.5 -1.5,1.5 -0.828,0 -1.5,-0.671 -1.5,-1.5 0,-0.828 0.672,-1.5 1.5,-1.5"
         style="fill:#000000;fill-opacity:1;fill-rule:nonzero;stroke:none"
         id="path602"
         inkscape:connector-curvature="0" /></g><g
       id="g604"><path
         d="m 429.99,662.42 c 0.828,0 1.5,0.672 1.5,1.5 0,0.829 -0.672,1.5 -1.5,1.5 -0.829,0 -1.5,-0.671 -1.5,-1.5 0,-0.828 0.671,-1.5 1.5,-1.5"
         style="fill:#000000;fill-opacity:1;fill-rule:nonzero;stroke:none"
         id="path606"
         inkscape:connector-curvature="0" /></g><g
       id="g608"><path
         d="m 378.424,591.449 c 0.828,0 1.5,0.671 1.5,1.5 0,0.828 -0.672,1.5 -1.5,1.5 -0.828,0 -1.5,-0.672 -1.5,-1.5 0,-0.829 0.672,-1.5 1.5,-1.5"
         style="fill:#000000;fill-opacity:1;fill-rule:nonzero;stroke:none"
         id="path610"
         inkscape:connector-curvature="0" /></g><g
       id="g612"><path
         d="m 295,618.567 c 0.828,0 1.5,0.672 1.5,1.5 0,0.828 -0.672,1.5 -1.5,1.5 -0.828,0 -1.5,-0.672 -1.5,-1.5 0,-0.828 0.672,-1.5 1.5,-1.5"
         style="fill:#000000;fill-opacity:1;fill-rule:nonzero;stroke:none"
         id="path614"
         inkscape:connector-curvature="0" /></g><g
       id="g616"><path
         d="m 346.576,689.528 c 0.828,0 1.5,0.672 1.5,1.5 0,0.829 -0.672,1.5 -1.5,1.5 -0.828,0 -1.5,-0.671 -1.5,-1.5 0,-0.828 0.672,-1.5 1.5,-1.5"
         style="fill:#000000;fill-opacity:1;fill-rule:nonzero;stroke:none"
         id="path618"
         inkscape:connector-curvature="0" /></g><g
       id="g620"><path
         d="m 295,762 51.576,-70.972 z"
         style="fill:none;stroke:#000000;stroke-width:0.25;stroke-linecap:round;stroke-linejoin:round;stroke-miterlimit:10;stroke-dasharray:1, 5;stroke-dashoffset:0;stroke-opacity:1"
         id="path622"
         inkscape:connector-curvature="0" /></g><g
       id="g624"><path
         d="M 346.576,691.028 295,620.067 Z"
         style="fill:none;stroke:#000000;stroke-width:0.25;stroke-linecap:round;stroke-linejoin:round;stroke-miterlimit:10;stroke-dasharray:1, 5;stroke-dashoffset:0;stroke-opacity:1"
         id="path626"
         inkscape:connector-curvature="0" /></g><g
       id="g628"><path
         d="m 295,620.067 -51.566,70.961 z"
         style="fill:none;stroke:#000000;stroke-width:0.25;stroke-linecap:round;stroke-linejoin:round;stroke-miterlimit:10;stroke-dasharray:1, 5;stroke-dashoffset:0;stroke-opacity:1"
         id="path630"
         inkscape:connector-curvature="0" /></g><g
       id="g632"><path
         d="M 243.434,691.028 295,762 Z"
         style="fill:none;stroke:#000000;stroke-width:0.25;stroke-linecap:round;stroke-linejoin:round;stroke-miterlimit:10;stroke-dasharray:1, 5;stroke-dashoffset:0;stroke-opacity:1"
         id="path634"
         inkscape:connector-curvature="0" /></g><g
       id="g636"><path
         d="m 295,762 83.424,-27.108 z"
         style="fill:none;stroke:#000000;stroke-width:0.25;stroke-linecap:round;stroke-linejoin:round;stroke-miterlimit:10;stroke-dasharray:1, 5;stroke-dashoffset:0;stroke-opacity:1"
         id="path638"
         inkscape:connector-curvature="0" /></g><g
       id="g640"><path
         d="M 378.424,734.892 429.99,663.92 Z"
         style="fill:none;stroke:#000000;stroke-width:0.25;stroke-linecap:round;stroke-linejoin:round;stroke-miterlimit:10;stroke-dasharray:1, 5;stroke-dashoffset:0;stroke-opacity:1"
         id="path642"
         inkscape:connector-curvature="0" /></g><g
       id="g644"><path
         d="m 429.99,663.92 -83.414,27.108 z"
         style="fill:none;stroke:#000000;stroke-width:0.25;stroke-linecap:round;stroke-linejoin:round;stroke-miterlimit:10;stroke-dasharray:1, 5;stroke-dashoffset:0;stroke-opacity:1"
         id="path646"
         inkscape:connector-curvature="0" /></g><g
       id="g648"><path
         d="m 160,663.931 83.434,27.097 z"
         style="fill:none;stroke:#000000;stroke-width:0.25;stroke-linecap:round;stroke-linejoin:round;stroke-miterlimit:10;stroke-dasharray:1, 5;stroke-dashoffset:0;stroke-opacity:1"
         id="path650"
         inkscape:connector-curvature="0" /></g><g
       id="g652"><path
         d="M 295,620.067 211.566,592.949 Z"
         style="fill:none;stroke:#000000;stroke-width:0.25;stroke-linecap:round;stroke-linejoin:round;stroke-miterlimit:10;stroke-dasharray:1, 5;stroke-dashoffset:0;stroke-opacity:1"
         id="path654"
         inkscape:connector-curvature="0" /></g><g
       id="g656"><path
         d="M 211.566,592.949 160,663.931 Z"
         style="fill:none;stroke:#000000;stroke-width:0.25;stroke-linecap:round;stroke-linejoin:round;stroke-miterlimit:10;stroke-dasharray:1, 5;stroke-dashoffset:0;stroke-opacity:1"
         id="path658"
         inkscape:connector-curvature="0" /></g><g
       id="g660"><path
         d="m 160,663.931 51.566,70.971 z"
         style="fill:none;stroke:#000000;stroke-width:0.25;stroke-linecap:round;stroke-linejoin:round;stroke-miterlimit:10;stroke-dasharray:1, 5;stroke-dashoffset:0;stroke-opacity:1"
         id="path662"
         inkscape:connector-curvature="0" /></g><g
       id="g664"><path
         d="M 211.566,734.902 295,762 Z"
         style="fill:none;stroke:#000000;stroke-width:0.25;stroke-linecap:round;stroke-linejoin:round;stroke-miterlimit:10;stroke-dasharray:1, 5;stroke-dashoffset:0;stroke-opacity:1"
         id="path666"
         inkscape:connector-curvature="0" /></g><g
       id="g668"><path
         d="M 211.566,592.949 295,565.83 Z"
         style="fill:none;stroke:#000000;stroke-width:0.25;stroke-linecap:round;stroke-linejoin:round;stroke-miterlimit:10;stroke-dasharray:1, 5;stroke-dashoffset:0;stroke-opacity:1"
         id="path670"
         inkscape:connector-curvature="0" /></g><g
       id="g672"><path
         d="M 295,565.83 V 478.113 Z"
         style="fill:none;stroke:#000000;stroke-width:0.25;stroke-linecap:round;stroke-linejoin:round;stroke-miterlimit:10;stroke-dasharray:1, 5;stroke-dashoffset:0;stroke-opacity:1"
         id="path674"
         inkscape:connector-curvature="0" /></g><g
       id="g676"
       style="stroke-width:1.5;stroke-miterlimit:4;stroke-dasharray:none"><path
         d="m 295,478.113 -83.434,27.098 z"
         style="fill:none;stroke:#000000;stroke-width:1.5;stroke-linecap:round;stroke-linejoin:round;stroke-miterlimit:4;stroke-dasharray:none;stroke-dashoffset:0;stroke-opacity:1"
         id="path678"
         inkscape:connector-curvature="0" /></g><g
       id="g680"><path
         d="m 211.566,505.211 v 87.738 z"
         style="fill:none;stroke:#000000;stroke-width:0.25;stroke-linecap:round;stroke-linejoin:round;stroke-miterlimit:10;stroke-dasharray:1, 5;stroke-dashoffset:0;stroke-opacity:1"
         id="path682"
         inkscape:connector-curvature="0" /></g><g
       id="g684"><path
         d="m 295,620.067 83.424,-27.118 z"
         style="fill:none;stroke:#000000;stroke-width:0.25;stroke-linecap:round;stroke-linejoin:round;stroke-miterlimit:10;stroke-dasharray:1, 5;stroke-dashoffset:0;stroke-opacity:1"
         id="path686"
         inkscape:connector-curvature="0" /></g><g
       id="g688"><path
         d="M 378.424,592.949 295,565.83 Z"
         style="fill:none;stroke:#000000;stroke-width:0.25;stroke-linecap:round;stroke-linejoin:round;stroke-miterlimit:10;stroke-dasharray:1, 5;stroke-dashoffset:0;stroke-opacity:1"
         id="path690"
         inkscape:connector-curvature="0" /></g><g
       id="g692"><path
         d="M 211.566,592.949 160,521.977 Z"
         style="fill:none;stroke:#000000;stroke-width:0.25;stroke-linecap:round;stroke-linejoin:round;stroke-miterlimit:10;stroke-dasharray:1, 5;stroke-dashoffset:0;stroke-opacity:1"
         id="path694"
         inkscape:connector-curvature="0" /></g><g
       id="g696"><path
         d="m 160,521.977 -51.555,70.972 z"
         style="fill:none;stroke:#000000;stroke-width:0.25;stroke-linecap:round;stroke-linejoin:round;stroke-miterlimit:10;stroke-dasharray:1, 5;stroke-dashoffset:0;stroke-opacity:1"
         id="path698"
         inkscape:connector-curvature="0" /></g><g
       id="g700"><path
         d="M 108.445,592.949 160,663.931 Z"
         style="fill:none;stroke:#000000;stroke-width:0.25;stroke-linecap:round;stroke-linejoin:round;stroke-miterlimit:10;stroke-dasharray:1, 5;stroke-dashoffset:0;stroke-opacity:1"
         id="path702"
         inkscape:connector-curvature="0" /></g><g
       id="g704"><path
         d="m 25.01,565.84 83.435,27.109 z"
         style="fill:none;stroke:#000000;stroke-width:0.25;stroke-linecap:round;stroke-linejoin:round;stroke-miterlimit:10;stroke-dasharray:1, 5;stroke-dashoffset:0;stroke-opacity:1"
         id="path706"
         inkscape:connector-curvature="0" /></g><g
       id="g708"><path
         d="M 160,521.977 76.576,494.89 Z"
         style="fill:none;stroke:#000000;stroke-width:0.25;stroke-linecap:round;stroke-linejoin:round;stroke-miterlimit:10;stroke-dasharray:1, 5;stroke-dashoffset:0;stroke-opacity:1"
         id="path710"
         inkscape:connector-curvature="0" /></g><g
       id="g712"><path
         d="M 76.576,494.89 25.01,565.84 Z"
         style="fill:none;stroke:#000000;stroke-width:0.25;stroke-linecap:round;stroke-linejoin:round;stroke-miterlimit:10;stroke-dasharray:1, 5;stroke-dashoffset:0;stroke-opacity:1"
         id="path714"
         inkscape:connector-curvature="0" /></g><g
       id="g716"><path
         d="m 25.01,565.84 51.556,70.972 z"
         style="fill:none;stroke:#000000;stroke-width:0.25;stroke-linecap:round;stroke-linejoin:round;stroke-miterlimit:10;stroke-dasharray:1, 5;stroke-dashoffset:0;stroke-opacity:1"
         id="path718"
         inkscape:connector-curvature="0" /></g><g
       id="g720"><path
         d="M 76.566,636.812 160,663.931 Z"
         style="fill:none;stroke:#000000;stroke-width:0.25;stroke-linecap:round;stroke-linejoin:round;stroke-miterlimit:10;stroke-dasharray:1, 5;stroke-dashoffset:0;stroke-opacity:1"
         id="path722"
         inkscape:connector-curvature="0" /></g><g
       id="g724"><path
         d="m 76.566,407.142 0.01,87.748 z"
         style="fill:none;stroke:#000000;stroke-width:0.25;stroke-linecap:round;stroke-linejoin:round;stroke-miterlimit:10;stroke-dasharray:1, 5;stroke-dashoffset:0;stroke-opacity:1"
         id="path726"
         inkscape:connector-curvature="0" /></g><g
       id="g728"><path
         d="M 160,521.977 V 434.26 Z"
         style="fill:none;stroke:#000000;stroke-width:0.25;stroke-linecap:round;stroke-linejoin:round;stroke-miterlimit:10;stroke-dasharray:1, 5;stroke-dashoffset:0;stroke-opacity:1"
         id="path730"
         inkscape:connector-curvature="0" /></g><g
       id="g732"><path
         d="M 160,434.26 76.566,407.142 Z"
         style="fill:none;stroke:#000000;stroke-width:0.25;stroke-linecap:round;stroke-linejoin:round;stroke-miterlimit:10;stroke-dasharray:1, 5;stroke-dashoffset:0;stroke-opacity:1"
         id="path734"
         inkscape:connector-curvature="0" /></g><g
       id="g736"><path
         d="M 76.566,407.142 25,478.113 Z"
         style="fill:none;stroke:#000000;stroke-width:0.25;stroke-linecap:round;stroke-linejoin:round;stroke-miterlimit:10;stroke-dasharray:1, 5;stroke-dashoffset:0;stroke-opacity:1"
         id="path738"
         inkscape:connector-curvature="0" /></g><g
       id="g740"><path
         d="m 25,478.113 0.01,87.727 z"
         style="fill:none;stroke:#000000;stroke-width:0.25;stroke-linecap:round;stroke-linejoin:round;stroke-miterlimit:10;stroke-dasharray:1, 5;stroke-dashoffset:0;stroke-opacity:1"
         id="path742"
         inkscape:connector-curvature="0" /></g><g
       id="g744"
       style="stroke-width:1.5;stroke-miterlimit:4;stroke-dasharray:none"><path
         d="m 160,434.26 51.566,70.951 z"
         style="fill:none;stroke:#000000;stroke-width:1.5;stroke-linecap:round;stroke-linejoin:round;stroke-miterlimit:4;stroke-dasharray:none;stroke-dashoffset:0;stroke-opacity:1"
         id="path746"
         inkscape:connector-curvature="0" /></g><g
       id="g748"
       style="stroke-width:1.5;stroke-miterlimit:4;stroke-dasharray:none"><path
         d="M 295,478.113 243.434,407.142 Z"
         style="fill:none;stroke:#000000;stroke-width:1.5;stroke-linecap:round;stroke-linejoin:round;stroke-miterlimit:4;stroke-dasharray:none;stroke-dashoffset:0;stroke-opacity:1"
         id="path750"
         inkscape:connector-curvature="0" /></g><g
       id="g752"><path
         d="M 243.434,407.142 160,434.26 Z"
         style="fill:none;stroke:#000000;stroke-width:0.25;stroke-linecap:round;stroke-linejoin:round;stroke-miterlimit:10;stroke-dasharray:1, 5;stroke-dashoffset:0;stroke-opacity:1"
         id="path754"
         inkscape:connector-curvature="0" /></g><g
       id="g756"><path
         d="m 160,434.26 51.566,-70.972 z"
         style="fill:none;stroke:#000000;stroke-width:0.25;stroke-linecap:round;stroke-linejoin:round;stroke-miterlimit:10;stroke-dasharray:1, 5;stroke-dashoffset:0;stroke-opacity:1"
         id="path758"
         inkscape:connector-curvature="0" /></g><g
       id="g760"><path
         d="M 211.566,363.288 128.131,336.18 Z"
         style="fill:none;stroke:#000000;stroke-width:0.25;stroke-linecap:round;stroke-linejoin:round;stroke-miterlimit:10;stroke-dasharray:1, 5;stroke-dashoffset:0;stroke-opacity:1"
         id="path762"
         inkscape:connector-curvature="0" /></g><g
       id="g764"><path
         d="M 128.131,336.18 76.566,407.142 Z"
         style="fill:none;stroke:#000000;stroke-width:0.25;stroke-linecap:round;stroke-linejoin:round;stroke-miterlimit:10;stroke-dasharray:1, 5;stroke-dashoffset:0;stroke-opacity:1"
         id="path766"
         inkscape:connector-curvature="0" /></g><g
       id="g768"><path
         d="M 128.131,248.453 V 336.18 Z"
         style="fill:none;stroke:#000000;stroke-width:0.25;stroke-linecap:round;stroke-linejoin:round;stroke-miterlimit:10;stroke-dasharray:1, 5;stroke-dashoffset:0;stroke-opacity:1"
         id="path770"
         inkscape:connector-curvature="0" /></g><g
       id="g772"><path
         d="M 211.566,363.288 V 275.561 Z"
         style="fill:none;stroke:#000000;stroke-width:0.25;stroke-linecap:round;stroke-linejoin:round;stroke-miterlimit:10;stroke-dasharray:1, 5;stroke-dashoffset:0;stroke-opacity:1"
         id="path774"
         inkscape:connector-curvature="0" /></g><g
       id="g776"><path
         d="M 211.566,275.561 128.131,248.453 Z"
         style="fill:none;stroke:#000000;stroke-width:0.25;stroke-linecap:round;stroke-linejoin:round;stroke-miterlimit:10;stroke-dasharray:1, 5;stroke-dashoffset:0;stroke-opacity:1"
         id="path778"
         inkscape:connector-curvature="0" /></g><g
       id="g780"><path
         d="M 128.131,248.453 76.566,319.404 Z"
         style="fill:none;stroke:#000000;stroke-width:0.25;stroke-linecap:round;stroke-linejoin:round;stroke-miterlimit:10;stroke-dasharray:1, 5;stroke-dashoffset:0;stroke-opacity:1"
         id="path782"
         inkscape:connector-curvature="0" /></g><g
       id="g784"><path
         d="m 76.566,319.404 v 87.738 z"
         style="fill:none;stroke:#000000;stroke-width:0.25;stroke-linecap:round;stroke-linejoin:round;stroke-miterlimit:10;stroke-dasharray:1, 5;stroke-dashoffset:0;stroke-opacity:1"
         id="path786"
         inkscape:connector-curvature="0" /></g><g
       id="g788"><path
         d="m 295,248.453 -83.434,27.108 z"
         style="fill:none;stroke:#000000;stroke-width:0.25;stroke-linecap:round;stroke-linejoin:round;stroke-miterlimit:10;stroke-dasharray:1, 5;stroke-dashoffset:0;stroke-opacity:1"
         id="path790"
         inkscape:connector-curvature="0" /></g><g
       id="g792"><path
         d="M 211.566,363.288 295,336.16 Z"
         style="fill:none;stroke:#000000;stroke-width:0.25;stroke-linecap:round;stroke-linejoin:round;stroke-miterlimit:10;stroke-dasharray:1, 5;stroke-dashoffset:0;stroke-opacity:1"
         id="path794"
         inkscape:connector-curvature="0" /></g><g
       id="g796"><path
         d="M 295,336.16 V 248.453 Z"
         style="fill:none;stroke:#000000;stroke-width:0.25;stroke-linecap:round;stroke-linejoin:round;stroke-miterlimit:10;stroke-dasharray:1, 5;stroke-dashoffset:0;stroke-opacity:1"
         id="path798"
         inkscape:connector-curvature="0" /></g><g
       id="g800"><path
         d="M 295,248.453 211.566,221.335 Z"
         style="fill:none;stroke:#000000;stroke-width:0.25;stroke-linecap:round;stroke-linejoin:round;stroke-miterlimit:10;stroke-dasharray:1, 5;stroke-dashoffset:0;stroke-opacity:1"
         id="path802"
         inkscape:connector-curvature="0" /></g><g
       id="g804"><path
         d="m 211.566,221.335 -83.435,27.118 z"
         style="fill:none;stroke:#000000;stroke-width:0.25;stroke-linecap:round;stroke-linejoin:round;stroke-miterlimit:10;stroke-dasharray:1, 5;stroke-dashoffset:0;stroke-opacity:1"
         id="path806"
         inkscape:connector-curvature="0" /></g><g
       id="g808"><path
         d="m 295,336.16 -51.566,70.982 z"
         style="fill:none;stroke:#000000;stroke-width:0.25;stroke-linecap:round;stroke-linejoin:round;stroke-miterlimit:10;stroke-dasharray:1, 5;stroke-dashoffset:0;stroke-opacity:1"
         id="path810"
         inkscape:connector-curvature="0" /></g><g
       id="g812"><path
         d="m 295,478.113 51.576,-70.971 z"
         style="fill:none;stroke:#000000;stroke-width:0.25;stroke-linecap:round;stroke-linejoin:round;stroke-miterlimit:10;stroke-dasharray:1, 5;stroke-dashoffset:0;stroke-opacity:1"
         id="path814"
         inkscape:connector-curvature="0" /></g><g
       id="g816"><path
         d="M 346.576,407.142 295,336.16 Z"
         style="fill:none;stroke:#000000;stroke-width:0.25;stroke-linecap:round;stroke-linejoin:round;stroke-miterlimit:10;stroke-dasharray:1, 5;stroke-dashoffset:0;stroke-opacity:1"
         id="path818"
         inkscape:connector-curvature="0" /></g><g
       id="g820"><path
         d="m 295,336.16 83.424,27.128 z"
         style="fill:none;stroke:#000000;stroke-width:0.25;stroke-linecap:round;stroke-linejoin:round;stroke-miterlimit:10;stroke-dasharray:1, 5;stroke-dashoffset:0;stroke-opacity:1"
         id="path822"
         inkscape:connector-curvature="0" /></g><g
       id="g824"><path
         d="M 378.424,363.288 V 275.561 Z"
         style="fill:none;stroke:#000000;stroke-width:0.25;stroke-linecap:round;stroke-linejoin:round;stroke-miterlimit:10;stroke-dasharray:1, 5;stroke-dashoffset:0;stroke-opacity:1"
         id="path826"
         inkscape:connector-curvature="0" /></g><g
       id="g828"><path
         d="M 378.424,275.561 295,248.453 Z"
         style="fill:none;stroke:#000000;stroke-width:0.25;stroke-linecap:round;stroke-linejoin:round;stroke-miterlimit:10;stroke-dasharray:1, 5;stroke-dashoffset:0;stroke-opacity:1"
         id="path830"
         inkscape:connector-curvature="0" /></g><g
       id="g832"><path
         d="m 461.858,248.453 -83.434,27.108 z"
         style="fill:none;stroke:#000000;stroke-width:0.25;stroke-linecap:round;stroke-linejoin:round;stroke-miterlimit:10;stroke-dasharray:1, 5;stroke-dashoffset:0;stroke-opacity:1"
         id="path834"
         inkscape:connector-curvature="0" /></g><g
       id="g836"><path
         d="M 378.424,363.288 461.858,336.16 Z"
         style="fill:none;stroke:#000000;stroke-width:0.25;stroke-linecap:round;stroke-linejoin:round;stroke-miterlimit:10;stroke-dasharray:1, 5;stroke-dashoffset:0;stroke-opacity:1"
         id="path838"
         inkscape:connector-curvature="0" /></g><g
       id="g840"><path
         d="M 461.858,336.16 V 248.453 Z"
         style="fill:none;stroke:#000000;stroke-width:0.25;stroke-linecap:round;stroke-linejoin:round;stroke-miterlimit:10;stroke-dasharray:1, 5;stroke-dashoffset:0;stroke-opacity:1"
         id="path842"
         inkscape:connector-curvature="0" /></g><g
       id="g844"><path
         d="M 461.858,248.453 378.424,221.335 Z"
         style="fill:none;stroke:#000000;stroke-width:0.25;stroke-linecap:round;stroke-linejoin:round;stroke-miterlimit:10;stroke-dasharray:1, 5;stroke-dashoffset:0;stroke-opacity:1"
         id="path846"
         inkscape:connector-curvature="0" /></g><g
       id="g848"><path
         d="M 378.424,221.335 295,248.453 Z"
         style="fill:none;stroke:#000000;stroke-width:0.25;stroke-linecap:round;stroke-linejoin:round;stroke-miterlimit:10;stroke-dasharray:1, 5;stroke-dashoffset:0;stroke-opacity:1"
         id="path850"
         inkscape:connector-curvature="0" /></g><g
       id="g852"><path
         d="M 513.434,407.142 461.858,336.16 Z"
         style="fill:none;stroke:#000000;stroke-width:0.25;stroke-linecap:round;stroke-linejoin:round;stroke-miterlimit:10;stroke-dasharray:1, 5;stroke-dashoffset:0;stroke-opacity:1"
         id="path854"
         inkscape:connector-curvature="0" /></g><g
       id="g856"><path
         d="M 378.424,363.288 430,434.26 Z"
         style="fill:none;stroke:#000000;stroke-width:0.25;stroke-linecap:round;stroke-linejoin:round;stroke-miterlimit:10;stroke-dasharray:1, 5;stroke-dashoffset:0;stroke-opacity:1"
         id="path858"
         inkscape:connector-curvature="0" /></g><g
       id="g860"><path
         d="m 430,434.26 83.434,-27.118 z"
         style="fill:none;stroke:#000000;stroke-width:0.25;stroke-linecap:round;stroke-linejoin:round;stroke-miterlimit:10;stroke-dasharray:1, 5;stroke-dashoffset:0;stroke-opacity:1"
         id="path862"
         inkscape:connector-curvature="0" /></g><g
       id="g864"><path
         d="M 513.434,407.142 V 319.404 Z"
         style="fill:none;stroke:#000000;stroke-width:0.25;stroke-linecap:round;stroke-linejoin:round;stroke-miterlimit:10;stroke-dasharray:1, 5;stroke-dashoffset:0;stroke-opacity:1"
         id="path866"
         inkscape:connector-curvature="0" /></g><g
       id="g868"><path
         d="M 513.434,319.404 461.858,248.453 Z"
         style="fill:none;stroke:#000000;stroke-width:0.25;stroke-linecap:round;stroke-linejoin:round;stroke-miterlimit:10;stroke-dasharray:1, 5;stroke-dashoffset:0;stroke-opacity:1"
         id="path870"
         inkscape:connector-curvature="0" /></g><g
       id="g872"><path
         d="M 430,434.26 346.576,407.142 Z"
         style="fill:none;stroke:#000000;stroke-width:0.25;stroke-linecap:round;stroke-linejoin:round;stroke-miterlimit:10;stroke-dasharray:1, 5;stroke-dashoffset:0;stroke-opacity:1"
         id="path874"
         inkscape:connector-curvature="0" /></g><g
       id="g876"><path
         d="m 295,478.113 83.424,27.108 z"
         style="fill:none;stroke:#000000;stroke-width:0.25;stroke-linecap:round;stroke-linejoin:round;stroke-miterlimit:10;stroke-dasharray:1, 5;stroke-dashoffset:0;stroke-opacity:1"
         id="path878"
         inkscape:connector-curvature="0" /></g><g
       id="g880"><path
         d="M 378.424,505.221 430,434.26 Z"
         style="fill:none;stroke:#000000;stroke-width:0.25;stroke-linecap:round;stroke-linejoin:round;stroke-miterlimit:10;stroke-dasharray:1, 5;stroke-dashoffset:0;stroke-opacity:1"
         id="path882"
         inkscape:connector-curvature="0" /></g><g
       id="g884"><path
         d="m 430,434.26 v 87.717 z"
         style="fill:none;stroke:#000000;stroke-width:0.25;stroke-linecap:round;stroke-linejoin:round;stroke-miterlimit:10;stroke-dasharray:1, 5;stroke-dashoffset:0;stroke-opacity:1"
         id="path886"
         inkscape:connector-curvature="0" /></g><g
       id="g888"><path
         d="m 430,521.977 83.434,-27.098 z"
         style="fill:none;stroke:#000000;stroke-width:0.25;stroke-linecap:round;stroke-linejoin:round;stroke-miterlimit:10;stroke-dasharray:1, 5;stroke-dashoffset:0;stroke-opacity:1"
         id="path890"
         inkscape:connector-curvature="0" /></g><g
       id="g892"><path
         d="M 513.434,494.879 V 407.142 Z"
         style="fill:none;stroke:#000000;stroke-width:0.25;stroke-linecap:round;stroke-linejoin:round;stroke-miterlimit:10;stroke-dasharray:1, 5;stroke-dashoffset:0;stroke-opacity:1"
         id="path894"
         inkscape:connector-curvature="0" /></g><g
       id="g896"><path
         d="M 564.99,565.84 513.434,494.879 Z"
         style="fill:none;stroke:#000000;stroke-width:0.25;stroke-linecap:round;stroke-linejoin:round;stroke-miterlimit:10;stroke-dasharray:1, 5;stroke-dashoffset:0;stroke-opacity:1"
         id="path898"
         inkscape:connector-curvature="0" /></g><g
       id="g900"><path
         d="m 430,521.977 51.555,70.972 z"
         style="fill:none;stroke:#000000;stroke-width:0.25;stroke-linecap:round;stroke-linejoin:round;stroke-miterlimit:10;stroke-dasharray:1, 5;stroke-dashoffset:0;stroke-opacity:1"
         id="path902"
         inkscape:connector-curvature="0" /></g><g
       id="g904"><path
         d="M 481.555,592.949 564.99,565.84 Z"
         style="fill:none;stroke:#000000;stroke-width:0.25;stroke-linecap:round;stroke-linejoin:round;stroke-miterlimit:10;stroke-dasharray:1, 5;stroke-dashoffset:0;stroke-opacity:1"
         id="path906"
         inkscape:connector-curvature="0" /></g><g
       id="g908"><path
         d="M 564.99,565.84 565,478.124 Z"
         style="fill:none;stroke:#000000;stroke-width:0.25;stroke-linecap:round;stroke-linejoin:round;stroke-miterlimit:10;stroke-dasharray:1, 5;stroke-dashoffset:0;stroke-opacity:1"
         id="path910"
         inkscape:connector-curvature="0" /></g><g
       id="g912"><path
         d="M 565,478.124 513.434,407.142 Z"
         style="fill:none;stroke:#000000;stroke-width:0.25;stroke-linecap:round;stroke-linejoin:round;stroke-miterlimit:10;stroke-dasharray:1, 5;stroke-dashoffset:0;stroke-opacity:1"
         id="path914"
         inkscape:connector-curvature="0" /></g><g
       id="g916"><path
         d="m 429.99,663.92 51.565,-70.971 z"
         style="fill:none;stroke:#000000;stroke-width:0.25;stroke-linecap:round;stroke-linejoin:round;stroke-miterlimit:10;stroke-dasharray:1, 5;stroke-dashoffset:0;stroke-opacity:1"
         id="path918"
         inkscape:connector-curvature="0" /></g><g
       id="g920"><path
         d="m 430,521.977 -51.576,70.972 z"
         style="fill:none;stroke:#000000;stroke-width:0.25;stroke-linecap:round;stroke-linejoin:round;stroke-miterlimit:10;stroke-dasharray:1, 5;stroke-dashoffset:0;stroke-opacity:1"
         id="path922"
         inkscape:connector-curvature="0" /></g><g
       id="g924"><path
         d="M 378.424,592.949 429.99,663.92 Z"
         style="fill:none;stroke:#000000;stroke-width:0.25;stroke-linecap:round;stroke-linejoin:round;stroke-miterlimit:10;stroke-dasharray:1, 5;stroke-dashoffset:0;stroke-opacity:1"
         id="path926"
         inkscape:connector-curvature="0" /></g><g
       id="g928"><path
         d="m 429.99,663.92 83.455,-27.108 z"
         style="fill:none;stroke:#000000;stroke-width:0.25;stroke-linecap:round;stroke-linejoin:round;stroke-miterlimit:10;stroke-dasharray:1, 5;stroke-dashoffset:0;stroke-opacity:1"
         id="path930"
         inkscape:connector-curvature="0" /></g><g
       id="g932"><path
         d="M 513.445,636.812 564.99,565.84 Z"
         style="fill:none;stroke:#000000;stroke-width:0.25;stroke-linecap:round;stroke-linejoin:round;stroke-miterlimit:10;stroke-dasharray:1, 5;stroke-dashoffset:0;stroke-opacity:1"
         id="path934"
         inkscape:connector-curvature="0" /></g><g
       id="g936"><path
         d="M 378.424,592.949 V 505.221 Z"
         style="fill:none;stroke:#000000;stroke-width:0.25;stroke-linecap:round;stroke-linejoin:round;stroke-miterlimit:10;stroke-dasharray:1, 5;stroke-dashoffset:0;stroke-opacity:1"
         id="path938"
         inkscape:connector-curvature="0" /></g><text
       transform="matrix(1,0,0,-1,222.496,636.50365)"
       style="font-variant:normal;font-weight:normal;font-size:18px;font-family:Helvetica;-inkscape-font-specification:Helvetica;writing-mode:lr-tb;fill:#000000;fill-opacity:1;fill-rule:nonzero;stroke:none"
       id="text942"><tspan
         x="0"
         y="0"
         id="tspan940">1</tspan></text>
<text
       transform="matrix(1,0,0,-1,289.9934,587.45857)"
       style="font-variant:normal;font-weight:normal;font-size:18px;font-family:Helvetica;-inkscape-font-specification:Helvetica;writing-mode:lr-tb;fill:#000000;fill-opacity:1;fill-rule:nonzero;stroke:none"
       id="text946"><tspan
         x="0"
         y="0"
         id="tspan944">2</tspan></text>
<text
       transform="matrix(1,0,0,-1,154.9986,587.46117)"
       style="font-variant:normal;font-weight:normal;font-size:18px;font-family:Helvetica;-inkscape-font-specification:Helvetica;writing-mode:lr-tb;fill:#000000;fill-opacity:1;fill-rule:nonzero;stroke:none"
       id="text950"><tspan
         x="0"
         y="0"
         id="tspan948">1</tspan></text>
<text
       transform="matrix(1,0,0,-1,222.496,450.69155)"
       style="font-variant:normal;font-weight:normal;font-size:18px;font-family:Helvetica;-inkscape-font-specification:Helvetica;writing-mode:lr-tb;fill:#000000;fill-opacity:1;fill-rule:nonzero;stroke:none"
       id="text954"><tspan
         x="0"
         y="0"
         id="tspan952">3</tspan></text>
<text
       transform="matrix(1,0,0,-1,139.06168,379.72768)"
       style="font-variant:normal;font-weight:normal;font-size:18px;font-family:Helvetica;-inkscape-font-specification:Helvetica;writing-mode:lr-tb;fill:#000000;fill-opacity:1;fill-rule:nonzero;stroke:none"
       id="text958"><tspan
         x="0"
         y="0"
         id="tspan956">2</tspan></text>
<text
       transform="matrix(1,0,0,-1,164.84451,300.38088)"
       style="font-variant:normal;font-weight:normal;font-size:18px;font-family:Helvetica;-inkscape-font-specification:Helvetica;writing-mode:lr-tb;fill:#000000;fill-opacity:1;fill-rule:nonzero;stroke:none"
       id="text962"><tspan
         x="0"
         y="0"
         id="tspan960">3</tspan></text>
<text
       transform="matrix(1,0,0,-1,97.344514,322.30487)"
       style="font-variant:normal;font-weight:normal;font-size:18px;font-family:Helvetica;-inkscape-font-specification:Helvetica;writing-mode:lr-tb;fill:#000000;fill-opacity:1;fill-rule:nonzero;stroke:none"
       id="text966"><tspan
         x="0"
         y="0"
         id="tspan964">3</tspan></text>
<text
       transform="matrix(1,0,0,-1,289.9986,401.64907)"
       style="font-variant:normal;font-weight:normal;font-size:18px;font-family:Helvetica;-inkscape-font-specification:Helvetica;writing-mode:lr-tb;fill:#000000;fill-opacity:1;fill-rule:nonzero;stroke:none"
       id="text970"><tspan
         x="0"
         y="0"
         id="tspan968">3</tspan></text>
<text
       transform="matrix(1,0,0,-1,331.70796,300.37568)"
       style="font-variant:normal;font-weight:normal;font-size:18px;font-family:Helvetica;-inkscape-font-specification:Helvetica;writing-mode:lr-tb;fill:#000000;fill-opacity:1;fill-rule:nonzero;stroke:none"
       id="text974"><tspan
         x="0"
         y="0"
         id="tspan972">1</tspan></text>
<text
       transform="matrix(1,0,0,-1,482.64229,322.29967)"
       style="font-variant:normal;font-weight:normal;font-size:18px;font-family:Helvetica;-inkscape-font-specification:Helvetica;writing-mode:lr-tb;fill:#000000;fill-opacity:1;fill-rule:nonzero;stroke:none"
       id="text978"><tspan
         x="0"
         y="0"
         id="tspan976">1</tspan></text>
<text
       transform="matrix(1,0,0,-1,492.4908,609.39035)"
       style="font-variant:normal;font-weight:normal;font-size:18px;font-family:Helvetica;-inkscape-font-specification:Helvetica;writing-mode:lr-tb;fill:#000000;fill-opacity:1;fill-rule:nonzero;stroke:none"
       id="text982"><tspan
         x="0"
         y="0"
         id="tspan980">3</tspan></text>
<text
       transform="matrix(1,0,0,-1,331.70796,530.03835)"
       style="font-variant:normal;font-weight:normal;font-size:18px;font-family:Helvetica;-inkscape-font-specification:Helvetica;writing-mode:lr-tb;fill:#000000;fill-opacity:1;fill-rule:nonzero;stroke:none"
       id="text986"><tspan
         x="0"
         y="0"
         id="tspan984">2</tspan></text>
<text
       transform="matrix(1,0,0,-1,357.4934,636.50105)"
       style="font-variant:normal;font-weight:normal;font-size:18px;font-family:Helvetica;-inkscape-font-specification:Helvetica;writing-mode:lr-tb;fill:#000000;fill-opacity:1;fill-rule:nonzero;stroke:none"
       id="text990"><tspan
         x="0"
         y="0"
         id="tspan988">2</tspan></text>
<text
       transform="matrix(1,0,0,-1,416.908,222)"
       style="font-variant:normal;font-weight:normal;font-size:8px;font-family:Helvetica;-inkscape-font-specification:Helvetica;writing-mode:lr-tb;fill:#000000;fill-opacity:1;fill-rule:nonzero;stroke:none"
       id="text994"><tspan
         x="0 5.8959999 8.1199999 12.568 17.016001 21.464001 25.912001 28.136 33.472 36.136002 40.584 44.584 48.584 54.360001 58.807999 63.256001 65.480003 69.480003 73.928001"
         y="0"
         sodipodi:role="line"
         id="tspan992">© 2008 KrazyDad.com</tspan></text>
</g></svg>