<?xml version="1.0" encoding="UTF-8" standalone="no"?>
<!-- Created with Inkscape (http://www.inkscape.org/) -->

<svg
   xmlns:dc="http://purl.org/dc/elements/1.1/"
   xmlns:cc="http://creativecommons.org/ns#"
   xmlns:rdf="http://www.w3.org/1999/02/22-rdf-syntax-ns#"
   xmlns:svg="http://www.w3.org/2000/svg"
   xmlns="http://www.w3.org/2000/svg"
   xmlns:sodipodi="http://sodipodi.sourceforge.net/DTD/sodipodi-0.dtd"
   xmlns:inkscape="http://www.inkscape.org/namespaces/inkscape"
   id="svg2"
   version="1.1"
   inkscape:version="0.92.3 (unknown)"
   width="157.03102"
   height="139.66499"
   xml:space="preserve"
   sodipodi:docname="figure1-B16.svg"><metadata
     id="metadata8"><rdf:RDF><cc:Work
         rdf:about=""><dc:format>image/svg+xml</dc:format><dc:type
           rdf:resource="http://purl.org/dc/dcmitype/StillImage" /><dc:title /></cc:Work></rdf:RDF></metadata><defs
     id="defs6"><marker
       inkscape:stockid="Arrow1Lend"
       orient="auto"
       refY="0"
       refX="0"
       id="Arrow1Lend"
       style="overflow:visible"><path
         id="path5225"
         d="M 0,0 5,-5 -12.5,0 5,5 Z"
         style="fill-rule:evenodd;stroke:#000000;stroke-width:1.00000003pt;marker-start:none"
         transform="matrix(-0.8,0,0,-0.8,-10,0)"
         inkscape:connector-curvature="0" /></marker><marker
       inkscape:stockid="Arrow1Mend"
       orient="auto"
       refY="0"
       refX="0"
       id="Arrow1Mend"
       style="overflow:visible"><path
         id="path5038"
         d="M 0,0 5,-5 -12.5,0 5,5 Z"
         style="fill-rule:evenodd;stroke:#000000;stroke-width:1.00000003pt;marker-start:none"
         transform="matrix(-0.4,0,0,-0.4,-4,0)"
         inkscape:connector-curvature="0" /></marker><marker
       inkscape:stockid="Arrow1Mstart"
       orient="auto"
       refY="0"
       refX="0"
       id="Arrow1Mstart"
       style="overflow:visible"><path
         id="path4600"
         d="M 0,0 5,-5 -12.5,0 5,5 Z"
         style="fill-rule:evenodd;stroke:#000000;stroke-width:1.00000003pt;marker-start:none"
         transform="matrix(0.4,0,0,0.4,4,0)"
         inkscape:connector-curvature="0" /></marker></defs><sodipodi:namedview
     pagecolor="#ffffff"
     bordercolor="#666666"
     borderopacity="1"
     objecttolerance="10"
     gridtolerance="10"
     guidetolerance="10"
     inkscape:pageopacity="0"
     inkscape:pageshadow="2"
     inkscape:window-width="1855"
     inkscape:window-height="1056"
     id="namedview4"
     showgrid="false"
     inkscape:zoom="1.6250482"
     inkscape:cx="-152.70019"
     inkscape:cy="15.795071"
     inkscape:window-x="65"
     inkscape:window-y="24"
     inkscape:window-maximized="1"
     inkscape:current-layer="g10"
     fit-margin-top="0"
     fit-margin-left="0"
     fit-margin-right="0"
     fit-margin-bottom="0"
     showguides="true"
     inkscape:guide-bbox="true" /><g
     id="g10"
     inkscape:groupmode="layer"
     inkscape:label="drawing"
     transform="matrix(1.25,0,0,-1.25,-396.70169,-48.872342)">



























































<path
   inkscape:connector-curvature="0"
   id="path4169"
   style="fill:none;stroke:#000000;stroke-width:2.96806502;stroke-linecap:butt;stroke-linejoin:miter;stroke-miterlimit:4;stroke-dasharray:none;stroke-opacity:1"
   d="m 359.89947,-41.10448 v -104" /><g
   id="g4171"
   transform="translate(73.6,-209.6)"><path
     d="m 275.10047,167.69452 v -104"
     style="fill:none;stroke:#000000;stroke-width:0.80000001;stroke-linecap:butt;stroke-linejoin:miter;stroke-miterlimit:4;stroke-dasharray:none;stroke-opacity:1"
     id="path4173"
     inkscape:connector-curvature="0" /><path
     d="m 275.10047,164.49552 1.602,-1.597 -1.602,5.597 -1.597,-5.597 z"
     style="fill:#000000;fill-opacity:1;fill-rule:evenodd;stroke:#000000;stroke-width:0.40000001;stroke-linecap:butt;stroke-linejoin:miter;stroke-miterlimit:4;stroke-dasharray:none;stroke-opacity:1"
     id="path4175"
     inkscape:connector-curvature="0" /><path
     d="m 275.10047,66.89852 -1.597,1.597 1.597,-5.597 1.602,5.597 z"
     style="fill:#000000;fill-opacity:1;fill-rule:evenodd;stroke:#000000;stroke-width:0.40000001;stroke-linecap:butt;stroke-linejoin:miter;stroke-miterlimit:4;stroke-dasharray:none;stroke-opacity:1"
     id="path4177"
     inkscape:connector-curvature="0" /></g><path
   inkscape:connector-curvature="0"
   id="path4195"
   style="fill:none;stroke:#000000;stroke-width:0.80000001;stroke-linecap:butt;stroke-linejoin:miter;stroke-miterlimit:4;stroke-dasharray:none;stroke-opacity:1"
   d="m 360.90047,-49.10448 h 12" /><path
   inkscape:connector-curvature="0"
   id="path4197"
   style="fill:#000000;fill-opacity:1;fill-rule:evenodd;stroke:#000000;stroke-width:0.40000001;stroke-linecap:butt;stroke-linejoin:miter;stroke-miterlimit:4;stroke-dasharray:none;stroke-opacity:1"
   d="m 369.70147,-49.10448 -1.602,1.602 5.602,-1.602 -5.602,-1.597 z" /><path
   inkscape:connector-curvature="0"
   id="path4199"
   style="fill:none;stroke:#000000;stroke-width:0.80000001;stroke-linecap:butt;stroke-linejoin:miter;stroke-miterlimit:4;stroke-dasharray:none;stroke-opacity:1"
   d="m 360.90047,-57.10448 h 12" /><path
   inkscape:connector-curvature="0"
   id="path4201"
   style="fill:#000000;fill-opacity:1;fill-rule:evenodd;stroke:#000000;stroke-width:0.40000001;stroke-linecap:butt;stroke-linejoin:miter;stroke-miterlimit:4;stroke-dasharray:none;stroke-opacity:1"
   d="m 369.70147,-57.10448 -1.602,1.602 5.602,-1.602 -5.602,-1.597 z" /><path
   inkscape:connector-curvature="0"
   id="path4203"
   style="fill:none;stroke:#000000;stroke-width:0.80000001;stroke-linecap:butt;stroke-linejoin:miter;stroke-miterlimit:4;stroke-dasharray:none;stroke-opacity:1"
   d="m 360.90047,-65.10448 h 12" /><path
   inkscape:connector-curvature="0"
   id="path4205"
   style="fill:#000000;fill-opacity:1;fill-rule:evenodd;stroke:#000000;stroke-width:0.40000001;stroke-linecap:butt;stroke-linejoin:miter;stroke-miterlimit:4;stroke-dasharray:none;stroke-opacity:1"
   d="m 369.70147,-65.10448 -1.602,1.602 5.602,-1.602 -5.602,-1.597 z" /><path
   inkscape:connector-curvature="0"
   id="path4207"
   style="fill:none;stroke:#000000;stroke-width:0.80000001;stroke-linecap:butt;stroke-linejoin:miter;stroke-miterlimit:4;stroke-dasharray:none;stroke-opacity:1"
   d="m 360.90047,-73.10448 h 12" /><path
   inkscape:connector-curvature="0"
   id="path4209"
   style="fill:#000000;fill-opacity:1;fill-rule:evenodd;stroke:#000000;stroke-width:0.40000001;stroke-linecap:butt;stroke-linejoin:miter;stroke-miterlimit:4;stroke-dasharray:none;stroke-opacity:1"
   d="m 369.70147,-73.10448 -1.602,1.602 5.602,-1.602 -5.602,-1.597 z" /><path
   inkscape:connector-curvature="0"
   id="path4211"
   style="fill:none;stroke:#000000;stroke-width:0.80000001;stroke-linecap:butt;stroke-linejoin:miter;stroke-miterlimit:4;stroke-dasharray:none;stroke-opacity:1"
   d="m 360.90047,-81.10448 h 12" /><path
   inkscape:connector-curvature="0"
   id="path4213"
   style="fill:#000000;fill-opacity:1;fill-rule:evenodd;stroke:#000000;stroke-width:0.40000001;stroke-linecap:butt;stroke-linejoin:miter;stroke-miterlimit:4;stroke-dasharray:none;stroke-opacity:1"
   d="m 369.70147,-81.10448 -1.602,1.602 5.602,-1.602 -5.602,-1.597 z" /><path
   inkscape:connector-curvature="0"
   id="path4215"
   style="fill:none;stroke:#000000;stroke-width:0.80000001;stroke-linecap:butt;stroke-linejoin:miter;stroke-miterlimit:4;stroke-dasharray:none;stroke-opacity:1"
   d="m 360.90047,-89.90548 h 12" /><path
   inkscape:connector-curvature="0"
   id="path4217"
   style="fill:#000000;fill-opacity:1;fill-rule:evenodd;stroke:#000000;stroke-width:0.40000001;stroke-linecap:butt;stroke-linejoin:miter;stroke-miterlimit:4;stroke-dasharray:none;stroke-opacity:1"
   d="m 369.70147,-89.90548 -1.602,1.602 5.602,-1.602 -5.602,-1.597 z" /><path
   inkscape:connector-curvature="0"
   id="path4219"
   style="fill:none;stroke:#000000;stroke-width:0.80000001;stroke-linecap:butt;stroke-linejoin:miter;stroke-miterlimit:4;stroke-dasharray:none;stroke-opacity:1"
   d="m 360.90047,-97.90548 h 12" /><path
   inkscape:connector-curvature="0"
   id="path4221"
   style="fill:#000000;fill-opacity:1;fill-rule:evenodd;stroke:#000000;stroke-width:0.40000001;stroke-linecap:butt;stroke-linejoin:miter;stroke-miterlimit:4;stroke-dasharray:none;stroke-opacity:1"
   d="m 369.70147,-97.90548 -1.602,1.602 5.602,-1.602 -5.602,-1.597 z" /><path
   inkscape:connector-curvature="0"
   id="path4223"
   style="fill:none;stroke:#000000;stroke-width:0.80000001;stroke-linecap:butt;stroke-linejoin:miter;stroke-miterlimit:4;stroke-dasharray:none;stroke-opacity:1"
   d="m 360.90047,-105.90548 h 12" /><path
   inkscape:connector-curvature="0"
   id="path4225"
   style="fill:#000000;fill-opacity:1;fill-rule:evenodd;stroke:#000000;stroke-width:0.40000001;stroke-linecap:butt;stroke-linejoin:miter;stroke-miterlimit:4;stroke-dasharray:none;stroke-opacity:1"
   d="m 369.70147,-105.90548 -1.602,1.602 5.602,-1.602 -5.602,-1.597 z" /><path
   inkscape:connector-curvature="0"
   id="path4227"
   style="fill:none;stroke:#000000;stroke-width:0.80000001;stroke-linecap:butt;stroke-linejoin:miter;stroke-miterlimit:4;stroke-dasharray:none;stroke-opacity:1"
   d="m 360.90047,-113.90548 h 12" /><path
   inkscape:connector-curvature="0"
   id="path4229"
   style="fill:#000000;fill-opacity:1;fill-rule:evenodd;stroke:#000000;stroke-width:0.40000001;stroke-linecap:butt;stroke-linejoin:miter;stroke-miterlimit:4;stroke-dasharray:none;stroke-opacity:1"
   d="m 369.70147,-113.90548 -1.602,1.602 5.602,-1.602 -5.602,-1.597 z" /><path
   inkscape:connector-curvature="0"
   id="path4231"
   style="fill:none;stroke:#000000;stroke-width:0.80000001;stroke-linecap:butt;stroke-linejoin:miter;stroke-miterlimit:4;stroke-dasharray:none;stroke-opacity:1"
   d="m 360.90047,-121.90548 h 12" /><path
   inkscape:connector-curvature="0"
   id="path4233"
   style="fill:#000000;fill-opacity:1;fill-rule:evenodd;stroke:#000000;stroke-width:0.40000001;stroke-linecap:butt;stroke-linejoin:miter;stroke-miterlimit:4;stroke-dasharray:none;stroke-opacity:1"
   d="m 369.70147,-121.90548 -1.602,1.602 5.602,-1.602 -5.602,-1.597 z" /><path
   inkscape:connector-curvature="0"
   id="path4235"
   style="fill:none;stroke:#000000;stroke-width:0.80000001;stroke-linecap:butt;stroke-linejoin:miter;stroke-miterlimit:4;stroke-dasharray:none;stroke-opacity:1"
   d="m 360.90047,-129.90548 h 12" /><path
   inkscape:connector-curvature="0"
   id="path4237"
   style="fill:#000000;fill-opacity:1;fill-rule:evenodd;stroke:#000000;stroke-width:0.40000001;stroke-linecap:butt;stroke-linejoin:miter;stroke-miterlimit:4;stroke-dasharray:none;stroke-opacity:1"
   d="m 369.70147,-129.90548 -1.602,1.602 5.602,-1.602 -5.602,-1.597 z" /><path
   inkscape:connector-curvature="0"
   id="path4239"
   style="fill:none;stroke:#000000;stroke-width:0.80000001;stroke-linecap:butt;stroke-linejoin:miter;stroke-miterlimit:4;stroke-dasharray:none;stroke-opacity:1"
   d="m 360.90047,-137.90548 h 12" /><path
   inkscape:connector-curvature="0"
   id="path4241"
   style="fill:#000000;fill-opacity:1;fill-rule:evenodd;stroke:#000000;stroke-width:0.40000001;stroke-linecap:butt;stroke-linejoin:miter;stroke-miterlimit:4;stroke-dasharray:none;stroke-opacity:1"
   d="m 369.70147,-137.90548 -1.602,1.602 5.602,-1.602 -5.602,-1.597 z" /><path
   inkscape:connector-curvature="0"
   id="path4243"
   style="fill:none;stroke:#000000;stroke-width:0.80000001;stroke-linecap:butt;stroke-linejoin:miter;stroke-miterlimit:4;stroke-dasharray:none;stroke-opacity:1"
   d="m 360.90047,-41.10448 h 12" /><path
   inkscape:connector-curvature="0"
   id="path4245"
   style="fill:#000000;fill-opacity:1;fill-rule:evenodd;stroke:#000000;stroke-width:0.40000001;stroke-linecap:butt;stroke-linejoin:miter;stroke-miterlimit:4;stroke-dasharray:none;stroke-opacity:1"
   d="m 369.70147,-41.10448 -1.602,1.602 5.602,-1.602 -5.602,-1.597 z" /><path
   inkscape:connector-curvature="0"
   id="path4247"
   style="fill:none;stroke:#000000;stroke-width:0.80000001;stroke-linecap:butt;stroke-linejoin:miter;stroke-miterlimit:4;stroke-dasharray:none;stroke-opacity:1"
   d="m 375.10147,-41.10448 v -104" /><text
   transform="scale(1,-1)"
   id="text4249"
   y="98.402367"
   x="377.48972"
   style="font-style:normal;font-variant:normal;font-weight:normal;font-stretch:normal;line-height:0%;font-family:'Nimbus Sans L';-inkscape-font-specification:'Nimbus Sans L';text-align:start;letter-spacing:0px;word-spacing:0px;writing-mode:lr-tb;text-anchor:start;fill:#000000;fill-opacity:1;stroke:none"
   xml:space="preserve"><tspan
     y="98.402367"
     x="377.48972"
     id="tspan4251"
     sodipodi:role="line"
     style="font-size:9.60000038px;line-height:1.25">$5$~kNm$^{-1}$</tspan></text>



<text
   xml:space="preserve"
   style="font-style:normal;font-variant:normal;font-weight:normal;font-stretch:normal;line-height:0%;font-family:'Nimbus Sans L';-inkscape-font-specification:'Nimbus Sans L';text-align:end;letter-spacing:0px;word-spacing:0px;writing-mode:lr-tb;text-anchor:end;fill:#000000;fill-opacity:1;stroke:none"
   x="346.69257"
   y="98.402367"
   id="text4253"
   transform="scale(1,-1)"><tspan
     sodipodi:role="line"
     id="tspan4255"
     x="346.69257"
     y="98.402367"
     style="font-size:9.60000038px;line-height:1.25">$4$~m</tspan></text>











<g
   transform="rotate(180,328.31588,-93.42525)"
   id="g4798"><path
     d="m 303.10047,-41.10448 h -16"
     style="fill:none;stroke:#000000;stroke-width:1.60000002;stroke-linecap:butt;stroke-linejoin:miter;stroke-miterlimit:4;stroke-dasharray:none;stroke-opacity:1"
     id="path4800"
     inkscape:connector-curvature="0" /><path
     d="m 291.10147,-36.30348 -4,-4"
     style="fill:none;stroke:#000000;stroke-width:0.80000001;stroke-linecap:butt;stroke-linejoin:miter;stroke-miterlimit:4;stroke-dasharray:none;stroke-opacity:1"
     id="path4802"
     inkscape:connector-curvature="0" /><path
     d="m 294.14047,-36.30348 -4,-4"
     style="fill:none;stroke:#000000;stroke-width:0.80000001;stroke-linecap:butt;stroke-linejoin:miter;stroke-miterlimit:4;stroke-dasharray:none;stroke-opacity:1"
     id="path4804"
     inkscape:connector-curvature="0" /><path
     d="m 297.17947,-36.30348 -4,-4"
     style="fill:none;stroke:#000000;stroke-width:0.80000001;stroke-linecap:butt;stroke-linejoin:miter;stroke-miterlimit:4;stroke-dasharray:none;stroke-opacity:1"
     id="path4806"
     inkscape:connector-curvature="0" /><path
     d="m 300.22247,-36.30348 -4,-4"
     style="fill:none;stroke:#000000;stroke-width:0.80000001;stroke-linecap:butt;stroke-linejoin:miter;stroke-miterlimit:4;stroke-dasharray:none;stroke-opacity:1"
     id="path4808"
     inkscape:connector-curvature="0" /><path
     d="m 303.26147,-36.30348 -4,-4"
     style="fill:none;stroke:#000000;stroke-width:0.80000001;stroke-linecap:butt;stroke-linejoin:miter;stroke-miterlimit:4;stroke-dasharray:none;stroke-opacity:1"
     id="path4810"
     inkscape:connector-curvature="0" /><path
     d="m 306.30047,-36.30348 -4,-4"
     style="fill:none;stroke:#000000;stroke-width:0.80000001;stroke-linecap:butt;stroke-linejoin:miter;stroke-miterlimit:4;stroke-dasharray:none;stroke-opacity:1"
     id="path4812"
     inkscape:connector-curvature="0" /></g><path
   inkscape:connector-curvature="0"
   id="path4814"
   style="fill:none;stroke:#000000;stroke-width:0.80000001;stroke-linecap:butt;stroke-linejoin:miter;stroke-miterlimit:4;stroke-dasharray:none;stroke-opacity:1"
   d="m 373.00917,-145.22447 h -12" />











</g></svg>