<?xml version="1.0" encoding="UTF-8" standalone="no"?>
<svg
   inkscape:output_extension="org.inkscape.output.svg.inkscape"
   sodipodi:docname="figure9-A.svg"
   version="1.0"
   inkscape:version="1.2-dev (b463667c24, 2021-05-31)"
   sodipodi:version="0.32"
   id="svg25956"
   height="243.37946"
   width="553.67218"
   xmlns:inkscape="http://www.inkscape.org/namespaces/inkscape"
   xmlns:sodipodi="http://sodipodi.sourceforge.net/DTD/sodipodi-0.dtd"
   xmlns="http://www.w3.org/2000/svg"
   xmlns:svg="http://www.w3.org/2000/svg"
   xmlns:rdf="http://www.w3.org/1999/02/22-rdf-syntax-ns#"
   xmlns:cc="http://creativecommons.org/ns#"
   xmlns:dc="http://purl.org/dc/elements/1.1/">
  <defs
     id="defs25958">
    <marker
       style="overflow:visible"
       id="Arrow1Mend"
       refX="0"
       refY="0"
       orient="auto"
       inkscape:stockid="Arrow1Mend">
      <path
         inkscape:connector-curvature="0"
         transform="matrix(-0.4,0,0,-0.4,-4,0)"
         style="fill-rule:evenodd;stroke:#000000;stroke-width:1pt;marker-start:none"
         d="M 0,0 5,-5 -12.5,0 5,5 Z"
         id="path4351" />
    </marker>
    <marker
       style="overflow:visible"
       id="Arrow1Mstart"
       refX="0"
       refY="0"
       orient="auto"
       inkscape:stockid="Arrow1Mstart">
      <path
         inkscape:connector-curvature="0"
         transform="matrix(0.4,0,0,0.4,4,0)"
         style="fill-rule:evenodd;stroke:#000000;stroke-width:1pt;marker-start:none"
         d="M 0,0 5,-5 -12.5,0 5,5 Z"
         id="path4348" />
    </marker>
    <marker
       style="overflow:visible"
       id="Arrow1Lstart"
       refX="0"
       refY="0"
       orient="auto"
       inkscape:stockid="Arrow1Lstart">
      <path
         inkscape:connector-curvature="0"
         transform="matrix(0.8,0,0,0.8,10,0)"
         style="fill-rule:evenodd;stroke:#000000;stroke-width:1pt;marker-start:none"
         d="M 0,0 5,-5 -12.5,0 5,5 Z"
         id="path4342" />
    </marker>
    <inkscape:perspective
       id="perspective25964"
       inkscape:persp3d-origin="372.04724 : 402.0838 : 1"
       inkscape:vp_z="744.09448 : 577.4775 : 1"
       inkscape:vp_y="0 : 1000 : 0"
       inkscape:vp_x="0 : 577.4775 : 1"
       sodipodi:type="inkscape:persp3d" />
  </defs>
  <sodipodi:namedview
     inkscape:document-rotation="0"
     inkscape:window-maximized="1"
     fit-margin-bottom="0"
     fit-margin-right="0"
     fit-margin-left="0"
     fit-margin-top="0"
     inkscape:window-y="27"
     inkscape:window-x="72"
     inkscape:window-height="1088"
     inkscape:window-width="1656"
     inkscape:snap-global="true"
     showgrid="true"
     inkscape:current-layer="layer1"
     inkscape:document-units="px"
     inkscape:cy="98.75"
     inkscape:cx="370"
     inkscape:zoom="2"
     inkscape:pageshadow="2"
     inkscape:pageopacity="0.0"
     objecttolerance="10"
     guidetolerance="10"
     gridtolerance="10000"
     borderopacity="1.0"
     bordercolor="#666666"
     pagecolor="#ffffff"
     id="base"
     inkscape:pagecheckerboard="0">
    <inkscape:grid
       originy="27.606476"
       originx="-15.854547"
       snapvisiblegridlinesonly="true"
       empspacing="5"
       enabled="true"
       visible="true"
       id="grid25966"
       type="xygrid" />
  </sodipodi:namedview>
  <metadata
     id="metadata25961">
    <rdf:RDF>
      <cc:Work
         rdf:about="">
        <dc:format>image/svg+xml</dc:format>
        <dc:type
           rdf:resource="http://purl.org/dc/dcmitype/StillImage" />
      </cc:Work>
    </rdf:RDF>
  </metadata>
  <g
     transform="translate(32.614203,56.786255)"
     id="layer1"
     inkscape:groupmode="layer"
     inkscape:label="Layer 1">
    <text
       xml:space="preserve"
       style="font-style:normal;font-variant:normal;font-weight:normal;font-stretch:normal;line-height:0%;font-family:sans-serif;-inkscape-font-specification:sans-serif;text-align:center;writing-mode:lr-tb;text-anchor:middle;fill:#000000;fill-opacity:1;stroke:none"
       x="498.21912"
       y="182.47797"
       id="text28145"><tspan
         style="font-size:28px;line-height:1.25;text-align:center;text-anchor:middle"
         sodipodi:role="line"
         id="tspan28149"
         x="498.21912"
         y="182.47797">$z$</tspan></text>
    <path
       inkscape:connector-curvature="0"
       id="path5362"
       d="M 505.53125,106.92468 V -13.075319 h -120 z"
       style="fill:#cccccc;fill-opacity:1;fill-rule:evenodd;stroke:#000000;stroke-width:2;stroke-linecap:butt;stroke-linejoin:miter;stroke-miterlimit:4;stroke-dasharray:none;stroke-opacity:1" />
    <path
       inkscape:connector-curvature="0"
       style="fill:none;stroke:#000000;stroke-width:2.5;stroke-linecap:butt;stroke-linejoin:miter;stroke-miterlimit:4;stroke-dasharray:none;stroke-opacity:1;marker-start:url(#Arrow1Mstart);marker-end:url(#Arrow1Mend)"
       d="m 397.53125,52.924679 h 100 V 152.92468"
       id="path28143" />
    <g
       transform="matrix(-1,0,0,1,173.53125,-10.093746)"
       id="g898">
      <rect
         style="fill:#cccccc;fill-opacity:1;fill-rule:evenodd;stroke:#000000;stroke-width:2;stroke-linecap:round;stroke-miterlimit:4;stroke-dasharray:none;stroke-dashoffset:0;stroke-opacity:1"
         id="rect25970"
         width="40"
         height="40"
         x="-61.53125"
         y="-14.07532"
         transform="scale(-1,1)" />
      <rect
         y="-13.731567"
         x="-140"
         height="40"
         width="40"
         id="rect26481"
         style="fill:#cccccc;fill-opacity:1;fill-rule:evenodd;stroke:#000000;stroke-width:2;stroke-linecap:round;stroke-miterlimit:4;stroke-dasharray:none;stroke-dashoffset:0;stroke-opacity:1"
         transform="scale(-1,1)" />
      <rect
         style="fill:#cccccc;fill-opacity:1;fill-rule:evenodd;stroke:#000000;stroke-width:2;stroke-linecap:round;stroke-miterlimit:4;stroke-dasharray:none;stroke-dashoffset:0;stroke-opacity:1"
         id="rect26483"
         width="40"
         height="40"
         x="-101.09375"
         y="-13.731567"
         transform="scale(-1,1)" />
      <rect
         y="26.362183"
         x="-101.09375"
         height="40"
         width="40"
         id="rect26485"
         style="fill:#cccccc;fill-opacity:1;fill-rule:evenodd;stroke:#000000;stroke-width:2;stroke-linecap:round;stroke-miterlimit:4;stroke-dasharray:none;stroke-dashoffset:0;stroke-opacity:1"
         transform="scale(-1,1)" />
      <rect
         style="fill:#cccccc;fill-opacity:1;fill-rule:evenodd;stroke:#000000;stroke-width:2;stroke-linecap:round;stroke-miterlimit:4;stroke-dasharray:none;stroke-dashoffset:0;stroke-opacity:1"
         id="rect26487"
         width="40"
         height="40"
         x="-101.09375"
         y="66.362183"
         transform="scale(-1,1)" />
      <rect
         y="106.36218"
         x="-101.09375"
         height="40"
         width="40"
         id="rect26489"
         style="fill:#cccccc;fill-opacity:1;fill-rule:evenodd;stroke:#000000;stroke-width:2;stroke-linecap:round;stroke-miterlimit:4;stroke-dasharray:none;stroke-dashoffset:0;stroke-opacity:1"
         transform="scale(-1,1)" />
      <rect
         style="fill:#cccccc;fill-opacity:1;fill-rule:evenodd;stroke:#000000;stroke-width:2;stroke-linecap:round;stroke-miterlimit:4;stroke-dasharray:none;stroke-dashoffset:0;stroke-opacity:1"
         id="rect26491"
         width="40"
         height="40"
         x="-101.09375"
         y="106.36218"
         transform="scale(-1,1)" />
      <flowRoot
         transform="translate(-70.25,-103.38781)"
         style="font-style:normal;font-variant:normal;font-weight:normal;font-stretch:normal;line-height:0.01%;font-family:sans-serif;-inkscape-font-specification:sans-serif;text-align:start;letter-spacing:0px;word-spacing:0px;writing-mode:lr-tb;text-anchor:start;fill:#000000;fill-opacity:1;stroke:none"
         id="flowRoot3027"
         xml:space="preserve"><flowRegion
           id="flowRegion3029"><rect
             y="97.356308"
             x="194.56918"
             height="50.931347"
             width="64.665642"
             id="rect3031" /></flowRegion><flowPara
           style="font-size:12px;line-height:1.25"
           id="flowPara3033"> </flowPara></flowRoot>
    </g>
    <g
       transform="translate(0,-40)"
       id="g56">
      <path
         id="path28127"
         d="m -27.6875,16.143433 h 100 v 99.999997"
         style="fill:none;stroke:#000000;stroke-width:2.5;stroke-linecap:butt;stroke-linejoin:miter;stroke-miterlimit:4;stroke-dasharray:none;stroke-opacity:1;marker-start:url(#Arrow1Mstart);marker-end:url(#Arrow1Mend)"
         inkscape:connector-curvature="0" />
      <text
         id="text28129"
         y="117.36218"
         x="53.728088"
         style="font-style:normal;font-variant:normal;font-weight:normal;font-stretch:normal;line-height:0%;font-family:sans-serif;-inkscape-font-specification:sans-serif;text-align:end;writing-mode:lr-tb;text-anchor:end;fill:#000000;fill-opacity:1;stroke:none"
         xml:space="preserve"><tspan
           y="117.36218"
           x="62.628479"
           id="tspan28133"
           sodipodi:role="line"
           style="font-size:28px;line-height:1.25">$z$ </tspan></text>
      <text
         xml:space="preserve"
         style="font-style:normal;font-variant:normal;font-weight:normal;font-stretch:normal;line-height:0%;font-family:sans-serif;-inkscape-font-specification:sans-serif;text-align:start;writing-mode:lr-tb;text-anchor:start;fill:#000000;fill-opacity:1;stroke:none"
         x="-29.727003"
         y="4.4871826"
         id="text28135"><tspan
           sodipodi:role="line"
           x="-29.727003"
           y="4.4871826"
           id="tspan28139"
           style="font-size:28px;line-height:1.25;text-align:start;text-anchor:start">$y$ </tspan></text>
    </g>
    <g
       transform="rotate(90,307.60937,167.3778)"
       id="g922">
      <rect
         y="254.48718"
         x="-185.21875"
         height="40"
         width="40"
         id="rect892"
         style="fill:#cccccc;fill-opacity:1;fill-rule:evenodd;stroke:#000000;stroke-width:2;stroke-linecap:round;stroke-miterlimit:4;stroke-dasharray:none;stroke-dashoffset:0;stroke-opacity:1"
         transform="scale(-1,1)" />
      <rect
         style="fill:#cccccc;fill-opacity:1;fill-rule:evenodd;stroke:#000000;stroke-width:2;stroke-linecap:round;stroke-miterlimit:4;stroke-dasharray:none;stroke-dashoffset:0;stroke-opacity:1"
         id="rect894"
         width="40"
         height="40"
         x="-264"
         y="134.26843"
         transform="scale(-1,1)" />
      <rect
         y="134.26843"
         x="-225.09375"
         height="40"
         width="40"
         id="rect896"
         style="fill:#cccccc;fill-opacity:1;fill-rule:evenodd;stroke:#000000;stroke-width:2;stroke-linecap:round;stroke-miterlimit:4;stroke-dasharray:none;stroke-dashoffset:0;stroke-opacity:1"
         transform="scale(-1,1)" />
      <rect
         style="fill:#cccccc;fill-opacity:1;fill-rule:evenodd;stroke:#000000;stroke-width:2;stroke-linecap:round;stroke-miterlimit:4;stroke-dasharray:none;stroke-dashoffset:0;stroke-opacity:1"
         id="rect898"
         width="40"
         height="40"
         x="-225.09375"
         y="174.36218"
         transform="scale(-1,1)" />
      <rect
         y="214.36218"
         x="-225.09375"
         height="40"
         width="40"
         id="rect900"
         style="fill:#cccccc;fill-opacity:1;fill-rule:evenodd;stroke:#000000;stroke-width:2;stroke-linecap:round;stroke-miterlimit:4;stroke-dasharray:none;stroke-dashoffset:0;stroke-opacity:1"
         transform="scale(-1,1)" />
      <rect
         style="fill:#cccccc;fill-opacity:1;fill-rule:evenodd;stroke:#000000;stroke-width:2;stroke-linecap:round;stroke-miterlimit:4;stroke-dasharray:none;stroke-dashoffset:0;stroke-opacity:1"
         id="rect902"
         width="40"
         height="40"
         x="-225.09375"
         y="254.36218"
         transform="scale(-1,1)" />
      <rect
         y="254.36218"
         x="-225.09375"
         height="40"
         width="40"
         id="rect904"
         style="fill:#cccccc;fill-opacity:1;fill-rule:evenodd;stroke:#000000;stroke-width:2;stroke-linecap:round;stroke-miterlimit:4;stroke-dasharray:none;stroke-dashoffset:0;stroke-opacity:1"
         transform="scale(-1,1)" />
    </g>
    <path
       style="fill:none;stroke:#000000;stroke-width:2.5;stroke-linecap:butt;stroke-linejoin:miter;stroke-miterlimit:4;stroke-dasharray:none;stroke-opacity:1;marker-start:url(#Arrow1Mstart);marker-end:url(#Arrow1Mend)"
       d="m 161.53125,53.820221 h 100 v 99.999999"
       id="path28111"
       inkscape:connector-curvature="0" />
    <text
       id="text28119"
       y="78.362183"
       x="167.93164"
       style="font-style:normal;font-variant:normal;font-weight:normal;font-stretch:normal;line-height:0%;font-family:sans-serif;-inkscape-font-specification:sans-serif;text-align:end;writing-mode:lr-tb;text-anchor:end;fill:#000000;fill-opacity:1;stroke:none"
       xml:space="preserve"><tspan
         id="tspan28123"
         y="78.362183"
         x="176.83203"
         sodipodi:role="line"
         style="font-size:28px;line-height:1.25;text-align:end;text-anchor:end">$y$ </tspan></text>
    <text
       xml:space="preserve"
       style="font-style:normal;font-variant:normal;font-weight:normal;font-stretch:normal;line-height:0%;font-family:sans-serif;-inkscape-font-specification:sans-serif;text-align:start;writing-mode:lr-tb;text-anchor:start;fill:#000000;fill-opacity:1;stroke:none"
       x="270.79599"
       y="158.25772"
       id="text28113"><tspan
         sodipodi:role="line"
         id="tspan28117"
         x="270.79599"
         y="158.25772"
         style="font-size:28px;line-height:1.25;text-align:start;text-anchor:start">$z$ </tspan></text>
    <text
       xml:space="preserve"
       style="font-style:normal;font-variant:normal;font-weight:normal;font-stretch:normal;line-height:0%;font-family:sans-serif;-inkscape-font-specification:sans-serif;text-align:end;writing-mode:lr-tb;text-anchor:end;fill:#000000;fill-opacity:1;stroke:none"
       x="410.33966"
       y="82.604828"
       id="text933"><tspan
         style="font-size:28px;line-height:1.25;text-align:end;text-anchor:end"
         sodipodi:role="line"
         x="419.24005"
         y="82.604828"
         id="tspan931">$y$ </tspan></text>
  </g>
</svg>
