#FIG 3.2  Produced by xfig version 3.2.5
Landscape
Center
Metric
A4      
100.00
Single
-2
1200 2
2 1 0 3 0 7 50 -1 -1 0.000 0 0 -1 0 0 2
	 1350 1800 3150 3150
2 1 0 1 1 7 50 -1 -1 0.000 0 0 -1 1 0 2
	2 1 1.00 90.00 120.00
	 3153 3145 3548 3429
2 1 0 1 1 7 50 -1 -1 0.000 0 0 -1 1 0 2
	2 1 1.00 90.00 120.00
	 3150 3150 2866 3545
2 1 0 1 1 1 50 -1 -1 0.000 0 0 -1 1 0 2
	2 1 1.00 90.00 120.00
	 1350 1800 1935 1800
2 1 0 1 1 7 50 -1 -1 0.000 0 0 -1 1 0 2
	2 1 1.00 90.00 120.00
	 1350 1800 1350 2340
4 2 0 50 -1 0 18 0.0000 4 195 270 1800 1665 xg\001
4 2 0 50 -1 0 18 0.0000 4 195 255 1260 2340 zg\001
4 2 0 50 -1 0 18 0.0000 4 135 135 3510 3600 x\001
4 2 0 50 -1 0 18 0.0000 4 135 120 2835 3465 z\001
4 0 0 50 -1 0 18 0.0000 4 195 135 3195 3105 b\001
4 2 0 50 -1 0 18 0.0000 4 135 135 1305 1755 a\001
