<?xml version="1.0" encoding="UTF-8" standalone="no"?>
<svg
   version="1.0"
   inkscape:output_extension="org.inkscape.output.svg.inkscape"
   sodipodi:docname="figure5-B.svg"
   inkscape:version="1.2-dev (6dc17b5e9c, 2021-06-05)"
   sodipodi:version="0.32"
   id="svg2552"
   viewBox="12132 -659 3918.3604 4392.9303"
   height="270.44928"
   width="206.23279"
   xmlns:inkscape="http://www.inkscape.org/namespaces/inkscape"
   xmlns:sodipodi="http://sodipodi.sourceforge.net/DTD/sodipodi-0.dtd"
   xmlns:xlink="http://www.w3.org/1999/xlink"
   xmlns="http://www.w3.org/2000/svg"
   xmlns:svg="http://www.w3.org/2000/svg"
   xmlns:rdf="http://www.w3.org/1999/02/22-rdf-syntax-ns#"
   xmlns:cc="http://creativecommons.org/ns#"
   xmlns:dc="http://purl.org/dc/elements/1.1/">
  <metadata
     id="metadata2699">
    <rdf:RDF>
      <cc:Work
         rdf:about="">
        <dc:format>image/svg+xml</dc:format>
        <dc:type
           rdf:resource="http://purl.org/dc/dcmitype/StillImage" />
        <dc:title />
      </cc:Work>
    </rdf:RDF>
  </metadata>
  <defs
     id="defs2697">
    <linearGradient
       id="linearGradient3922"
       inkscape:swatch="solid">
      <stop
         id="stop3924"
         offset="0"
         style="stop-color:#b3b3b3;stop-opacity:1;" />
    </linearGradient>
    <marker
       style="overflow:visible"
       id="Arrow2Mend"
       refX="0"
       refY="0"
       orient="auto"
       inkscape:stockid="Arrow2Mend">
      <path
         inkscape:connector-curvature="0"
         transform="scale(-0.6)"
         d="M 8.7185878,4.0337352 -2.2072895,0.01601326 8.7185884,-4.0017078 c -1.7454984,2.3720609 -1.7354408,5.6174519 -6e-7,8.035443 z"
         style="font-size:12px;fill-rule:evenodd;stroke-width:0.625;stroke-linejoin:round"
         id="path4488" />
    </marker>
    <marker
       style="overflow:visible"
       id="Arrow1Send"
       refX="0"
       refY="0"
       orient="auto"
       inkscape:stockid="Arrow1Send">
      <path
         inkscape:connector-curvature="0"
         transform="matrix(-0.2,0,0,-0.2,-1.2,0)"
         style="fill-rule:evenodd;stroke:#000000;stroke-width:1pt;marker-start:none"
         d="M 0,0 5,-5 -12.5,0 5,5 Z"
         id="path3252" />
    </marker>
    <marker
       style="overflow:visible"
       id="Arrow2Send"
       refX="0"
       refY="0"
       orient="auto"
       inkscape:stockid="Arrow2Send">
      <path
         inkscape:connector-curvature="0"
         transform="matrix(-0.3,0,0,-0.3,0.69,0)"
         d="M 8.7185878,4.0337352 -2.2072895,0.01601326 8.7185884,-4.0017078 c -1.7454984,2.3720609 -1.7354408,5.6174519 -6e-7,8.035443 z"
         style="font-size:12px;fill-rule:evenodd;stroke-width:0.625;stroke-linejoin:round"
         id="path3270" />
    </marker>
    <marker
       style="overflow:visible"
       id="Arrow1Sstart"
       refX="0"
       refY="0"
       orient="auto"
       inkscape:stockid="Arrow1Sstart">
      <path
         inkscape:connector-curvature="0"
         transform="matrix(0.2,0,0,0.2,1.2,0)"
         style="fill-rule:evenodd;stroke:#000000;stroke-width:1pt;marker-start:none"
         d="M 0,0 5,-5 -12.5,0 5,5 Z"
         id="path3249" />
    </marker>
    <marker
       style="overflow:visible"
       id="TriangleInM"
       refX="0"
       refY="0"
       orient="auto"
       inkscape:stockid="TriangleInM">
      <path
         inkscape:connector-curvature="0"
         transform="scale(-0.4)"
         style="fill-rule:evenodd;stroke:#000000;stroke-width:1pt;marker-start:none"
         d="M 5.77,0 -2.88,5 V -5 Z"
         id="path3374" />
    </marker>
    <marker
       style="overflow:visible"
       id="TriangleOutL"
       refX="0"
       refY="0"
       orient="auto"
       inkscape:stockid="TriangleOutL">
      <path
         inkscape:connector-curvature="0"
         transform="scale(0.8)"
         style="fill-rule:evenodd;stroke:#000000;stroke-width:1pt;marker-start:none"
         d="M 5.77,0 -2.88,5 V -5 Z"
         id="path3380" />
    </marker>
    <marker
       style="overflow:visible"
       id="TriangleOutM"
       refX="0"
       refY="0"
       orient="auto"
       inkscape:stockid="TriangleOutM">
      <path
         inkscape:connector-curvature="0"
         transform="scale(0.4)"
         style="fill-rule:evenodd;stroke:#000000;stroke-width:1pt;marker-start:none"
         d="M 5.77,0 -2.88,5 V -5 Z"
         id="path3383" />
    </marker>
    <marker
       style="overflow:visible"
       id="EmptyTriangleOutL"
       refX="0"
       refY="0"
       orient="auto"
       inkscape:stockid="EmptyTriangleOutL">
      <path
         inkscape:connector-curvature="0"
         transform="matrix(0.8,0,0,0.8,-4.8,0)"
         style="fill:#ffffff;fill-rule:evenodd;stroke:#000000;stroke-width:1pt;marker-start:none"
         d="M 5.77,0 -2.88,5 V -5 Z"
         id="path3398" />
    </marker>
    <marker
       style="overflow:visible"
       id="EmptyTriangleInM"
       refX="0"
       refY="0"
       orient="auto"
       inkscape:stockid="EmptyTriangleInM">
      <path
         inkscape:connector-curvature="0"
         transform="matrix(-0.4,0,0,-0.4,1.8,0)"
         style="fill:#ffffff;fill-rule:evenodd;stroke:#000000;stroke-width:1pt;marker-start:none"
         d="M 5.77,0 -2.88,5 V -5 Z"
         id="path3392" />
    </marker>
    <marker
       style="overflow:visible"
       id="Arrow1Mend"
       refX="0"
       refY="0"
       orient="auto"
       inkscape:stockid="Arrow1Mend">
      <path
         inkscape:connector-curvature="0"
         transform="matrix(-0.4,0,0,-0.4,-4,0)"
         style="fill-rule:evenodd;stroke:#000000;stroke-width:1pt;marker-start:none"
         d="M 0,0 5,-5 -12.5,0 5,5 Z"
         id="path3246" />
    </marker>
    <marker
       style="overflow:visible"
       id="Arrow1Mstart"
       refX="0"
       refY="0"
       orient="auto"
       inkscape:stockid="Arrow1Mstart">
      <path
         inkscape:connector-curvature="0"
         transform="matrix(0.4,0,0,0.4,4,0)"
         style="fill-rule:evenodd;stroke:#000000;stroke-width:1pt;marker-start:none"
         d="M 0,0 5,-5 -12.5,0 5,5 Z"
         id="path3560" />
    </marker>
    <marker
       style="overflow:visible"
       id="Arrow1Lstart"
       refX="0"
       refY="0"
       orient="auto"
       inkscape:stockid="Arrow1Lstart">
      <path
         inkscape:connector-curvature="0"
         transform="matrix(0.8,0,0,0.8,10,0)"
         style="fill-rule:evenodd;stroke:#000000;stroke-width:1pt;marker-start:none"
         d="M 0,0 5,-5 -12.5,0 5,5 Z"
         id="path3554" />
    </marker>
    <inkscape:perspective
       id="perspective2701"
       inkscape:persp3d-origin="297 : 69.000495 : 1"
       inkscape:vp_z="594 : 103.5005 : 1"
       inkscape:vp_y="0 : 999.99999 : 0"
       inkscape:vp_x="0 : 103.5005 : 1"
       sodipodi:type="inkscape:persp3d" />
    <linearGradient
       gradientTransform="translate(-2479.4168,931.99234)"
       y2="701.51245"
       x2="14352.903"
       y1="701.51245"
       x1="13743.86"
       gradientUnits="userSpaceOnUse"
       id="linearGradient4888"
       xlink:href="#linearGradient3922"
       inkscape:collect="always" />
    <marker
       style="overflow:visible"
       id="Arrow2Send-5"
       refX="0"
       refY="0"
       orient="auto"
       inkscape:stockid="Arrow2Send">
      <path
         inkscape:connector-curvature="0"
         transform="matrix(-0.3,0,0,-0.3,0.69,0)"
         d="M 8.7185878,4.0337352 -2.2072895,0.01601326 8.7185884,-4.0017078 c -1.7454984,2.3720609 -1.7354408,5.6174519 -6e-7,8.035443 z"
         style="font-size:12px;fill-rule:evenodd;stroke-width:0.625;stroke-linejoin:round"
         id="path3270-8" />
    </marker>
    <marker
       style="overflow:visible"
       id="Arrow1Send-2"
       refX="0"
       refY="0"
       orient="auto"
       inkscape:stockid="Arrow1Send">
      <path
         inkscape:connector-curvature="0"
         transform="matrix(-0.2,0,0,-0.2,-1.2,0)"
         style="fill-rule:evenodd;stroke:#000000;stroke-width:1pt;marker-start:none"
         d="M 0,0 5,-5 -12.5,0 5,5 Z"
         id="path3252-6" />
    </marker>
  </defs>
  <sodipodi:namedview
     inkscape:document-rotation="0"
     inkscape:window-maximized="1"
     fit-margin-bottom="0"
     fit-margin-right="0"
     fit-margin-left="0"
     fit-margin-top="0"
     inkscape:current-layer="svg2552"
     inkscape:window-y="27"
     inkscape:window-x="72"
     inkscape:cy="206.75"
     inkscape:cx="-18"
     inkscape:zoom="2"
     inkscape:snap-global="true"
     showgrid="true"
     id="base"
     pagecolor="#ffffff"
     bordercolor="#666666"
     borderopacity="1.0"
     objecttolerance="10.0"
     gridtolerance="10.0"
     guidetolerance="10.0"
     inkscape:pageopacity="0.0"
     inkscape:pageshadow="2"
     inkscape:window-width="1656"
     inkscape:window-height="1088"
     inkscape:pagecheckerboard="0">
    <inkscape:grid
       originy="-18.290462"
       originx="0.00019720459"
       snapvisiblegridlinesonly="true"
       empspacing="5"
       enabled="true"
       visible="true"
       id="grid2775"
       type="xygrid" />
  </sodipodi:namedview>
  <g
     transform="translate(-9489.3912,-26.243607)"
     style="stroke:#000000;stroke-width:0"
     id="g2558">
    <defs
       id="defs2560">
      <pattern
         id="tile1"
         x="0"
         y="0"
         width="200"
         height="200"
         patternUnits="userSpaceOnUse">
        <path
           d="M 100 0 0 100"
           id="path2563" />
        <path
           d="M 200 0 0 200"
           id="path2565" />
        <path
           d="M 200 100 100 200"
           id="path2567" />
      </pattern>
    </defs>
  </g>
  <g
     transform="translate(-9489.3912,-26.243607)"
     style="stroke:#000000;stroke-width:0"
     id="g2589">
    <defs
       id="defs2591">
      <pattern
         id="tile2"
         x="0"
         y="0"
         width="200"
         height="200"
         patternUnits="userSpaceOnUse">
        <path
           d="M 100 0 0 100"
           id="path2594" />
        <path
           d="M 200 0 0 200"
           id="path2596" />
        <path
           d="M 200 100 100 200"
           id="path2598" />
      </pattern>
    </defs>
  </g>
  <g
     transform="translate(-9489.3912,-26.243607)"
     style="stroke:#000000;stroke-width:0"
     id="g2604">
    <defs
       id="defs2606">
      <pattern
         id="tile3"
         x="0"
         y="0"
         width="200"
         height="200"
         patternUnits="userSpaceOnUse">
        <path
           d="M 50 0 50 200"
           id="path2609" />
        <path
           d="M 150 0 150 200"
           id="path2611" />
      </pattern>
    </defs>
  </g>
  <g
     transform="translate(-9489.3912,-26.243607)"
     style="stroke:#000000;stroke-width:0"
     id="g2617">
    <defs
       id="defs2619">
      <pattern
         id="tile4"
         x="0"
         y="0"
         width="200"
         height="200"
         patternUnits="userSpaceOnUse">
        <path
           d="M 50 0 50 200"
           id="path2622" />
        <path
           d="M 150 0 150 200"
           id="path2624" />
      </pattern>
    </defs>
  </g>
  <text
     xml:space="preserve"
     x="3950.6086"
     y="1201.7563"
     font-style="normal"
     font-weight="normal"
     font-size="328"
     id="text2688"
     style="font-style:normal;font-variant:normal;font-weight:normal;font-stretch:normal;font-size:162.145px;line-height:0%;font-family:sans-serif;-inkscape-font-specification:sans-serif;text-align:end;writing-mode:lr-tb;text-anchor:end;fill:#000000;stroke:#000000;stroke-width:0.025in"><tspan
       id="tspan12357"
       style="font-style:normal;font-variant:normal;font-weight:normal;font-stretch:normal;font-size:20px;line-height:100%;font-family:sans-serif;-inkscape-font-specification:sans-serif;text-align:end;writing-mode:lr-tb;text-anchor:end;stroke:none" /></text>
  <polyline
     id="polyline5260"
     style="stroke:#000000;stroke-width:18.9997;stroke-linecap:butt;stroke-linejoin:miter;stroke-miterlimit:4;stroke-dasharray:none;stroke-dashoffset:0"
     points="13795,519 17716,519 "
     transform="matrix(0,1.0175812,-1,0,13022.139,-14162.49)" />
  <path
     inkscape:connector-curvature="0"
     sodipodi:nodetypes="ccccccc"
     id="path12381"
     d="m 12679.684,3675.6403 -3.406,131.714 1450.69,-8.6613 379.994,-425.1594 v -189.9969 l -379.994,474.9924 z"
     style="fill:url(#linearGradient4888);fill-opacity:1;fill-rule:evenodd;stroke:#cccccc;stroke-width:1px;stroke-linecap:butt;stroke-linejoin:miter;stroke-opacity:1" />
  <polyline
     transform="matrix(0,-1,-1,0,14091.554,17209.383)"
     points="14031,992 17952,992 "
     style="stroke:#000000;stroke-width:28.4995;stroke-linecap:butt;stroke-linejoin:miter;stroke-miterlimit:4;stroke-dasharray:85.4986, 28.4995;stroke-dashoffset:0"
     id="polyline2636" />
  <polyline
     transform="matrix(0,-1,-1,0,14889.533,17209.383)"
     points="13559,755 17480,755 "
     style="stroke:#000000;stroke-width:28.4995;stroke-linecap:butt;stroke-linejoin:miter;stroke-miterlimit:4;stroke-dasharray:none"
     id="polyline2638" />
  <polyline
     transform="matrix(0,-1,-1,0,14836.962,17214.537)"
     points="14031,330 17952,330 "
     style="stroke:#000000;stroke-width:28.4995;stroke-linecap:butt;stroke-linejoin:miter;stroke-miterlimit:4;stroke-dasharray:none"
     id="polyline2640" />
  <polyline
     transform="matrix(0,-1,-1,0,14091.554,17209.383)"
     points="13559,1417 17480,1417 "
     style="stroke:#000000;stroke-width:28.4995;stroke-linecap:butt;stroke-linejoin:miter;stroke-miterlimit:4;stroke-dasharray:none"
     id="polyline2644" />
  <text
     xml:space="preserve"
     x="12730.728"
     y="-847.18665"
     font-style="normal"
     font-weight="normal"
     font-size="328"
     id="text2682"
     style="font-style:normal;font-variant:normal;font-weight:normal;font-stretch:normal;font-size:270.242px;line-height:0%;font-family:sans-serif;-inkscape-font-specification:sans-serif;text-align:start;writing-mode:lr-tb;text-anchor:start;fill:#000000;stroke:none">75 kN</text>
  <polyline
     transform="matrix(0,-1,-1,0,17511.483,16715.391)"
     points="17480,1676 17480,2101 "
     style="stroke:#000000;stroke-width:13.5121;stroke-linecap:butt;stroke-linejoin:miter;stroke-miterlimit:4;stroke-dasharray:none"
     id="polyline2654" />
  <g
     transform="translate(1519.9759,-42.652886)"
     id="g1090">
    <polyline
       id="polyline2646"
       style="stroke:#000000;stroke-width:7.80306;stroke-linecap:butt;stroke-linejoin:miter;stroke-miterlimit:4;stroke-dasharray:none;marker-start:url(#Arrow1Mstart);marker-end:url(#Arrow1Mend)"
       points="15434,2007 13738,2007 "
       transform="matrix(0,-2.2710297,-2.6106008,0,19243.583,34359.944)" />
    <polyline
       id="polyline2652"
       style="stroke:#000000;stroke-width:8;stroke-linecap:butt;stroke-linejoin:miter"
       points="13559,1629 13559,2101 "
       transform="matrix(0,-1,-1,0,15953.524,16758.044)" />
    <text
       style="font-style:normal;font-variant:normal;font-weight:normal;font-stretch:normal;font-size:270.242px;line-height:0%;font-family:sans-serif;-inkscape-font-specification:sans-serif;text-align:center;writing-mode:lr-tb;text-anchor:middle;fill:#000000;stroke:none"
       id="text2692"
       font-size="328"
       font-weight="normal"
       font-style="normal"
       y="1216.1571"
       x="14324.642"
       xml:space="preserve">6 m</text>
  </g>
  <text
     style="font-style:normal;font-variant:normal;font-weight:normal;font-stretch:normal;font-size:270.242px;line-height:0%;font-family:sans-serif;-inkscape-font-specification:sans-serif;text-align:center;writing-mode:lr-tb;text-anchor:middle;fill:#000000;stroke:none"
     id="text12363"
     font-size="328"
     font-weight="normal"
     font-style="normal"
     y="4068.5879"
     x="13409.562"
     xml:space="preserve">0,6 m</text>
  <text
     xml:space="preserve"
     x="14814.466"
     y="3697.0127"
     font-style="normal"
     font-weight="normal"
     font-size="328"
     id="text12365"
     style="font-style:normal;font-variant:normal;font-weight:normal;font-stretch:normal;font-size:270.242px;line-height:0%;font-family:sans-serif;-inkscape-font-specification:sans-serif;text-align:center;writing-mode:lr-tb;text-anchor:middle;fill:#000000;stroke:none">0,3 m</text>
  <polyline
     id="polyline4080"
     style="stroke:#000000;stroke-width:17.5744;stroke-linecap:butt;stroke-linejoin:miter;stroke-miterlimit:4;stroke-dasharray:none;marker-start:url(#Arrow1Mstart)"
     points="15590,531 15590,-44 "
     transform="matrix(-0.9797525,0,0,1.1929297,27938.333,-933.60008)" />
  <text
     transform="rotate(-90)"
     id="text5266"
     y="12325.379"
     x="-2573.1685"
     style="font-style:normal;font-variant:normal;font-weight:normal;font-stretch:normal;line-height:0%;font-family:sans-serif;-inkscape-font-specification:sans-serif;text-align:start;writing-mode:lr-tb;text-anchor:start;fill:#000000;fill-opacity:1;stroke:none"
     xml:space="preserve"><tspan
       style="font-size:265.996px;line-height:1.25"
       id="tspan5272"
       y="12325.379"
       x="-2573.1685"
       sodipodi:role="line">8 kNm$^{-1}$</tspan><tspan
       style="font-size:265.996px;line-height:1.25"
       id="tspan5270"
       y="12657.874"
       x="-2573.1685"
       sodipodi:role="line"> </tspan></text>
  <path
     inkscape:connector-curvature="0"
     id="path3576"
     d="m 12693.136,3675.1489 c -189.997,189.997 -189.997,189.997 -189.997,189.997"
     style="fill:none;stroke:#000000;stroke-width:18.9997;stroke-linecap:butt;stroke-linejoin:miter;stroke-miterlimit:4;stroke-dasharray:none;stroke-opacity:1;marker-end:url(#Arrow2Mend)" />
  <path
     inkscape:connector-curvature="0"
     style="fill:none;stroke:#000000;stroke-width:18.9997;stroke-linecap:butt;stroke-linejoin:miter;stroke-miterlimit:4;stroke-dasharray:none;stroke-opacity:1;marker-end:url(#Arrow2Mend)"
     d="m 12693.136,3485.1539 c -189.997,189.997 -189.997,189.997 -189.997,189.997"
     id="path4740" />
  <path
     inkscape:connector-curvature="0"
     id="path4742"
     d="m 12693.136,3295.1589 c -189.997,189.997 -189.997,189.997 -189.997,189.997"
     style="fill:none;stroke:#000000;stroke-width:18.9997;stroke-linecap:butt;stroke-linejoin:miter;stroke-miterlimit:4;stroke-dasharray:none;stroke-opacity:1;marker-end:url(#Arrow2Mend)" />
  <path
     inkscape:connector-curvature="0"
     style="fill:none;stroke:#000000;stroke-width:18.9997;stroke-linecap:butt;stroke-linejoin:miter;stroke-miterlimit:4;stroke-dasharray:none;stroke-opacity:1;marker-end:url(#Arrow2Mend)"
     d="m 12693.136,3105.1639 c -189.997,189.997 -189.997,189.997 -189.997,189.997"
     id="path4744" />
  <path
     inkscape:connector-curvature="0"
     id="path4746"
     d="m 12693.136,2953.1679 c -189.997,189.997 -189.997,189.997 -189.997,189.997"
     style="fill:none;stroke:#000000;stroke-width:18.9997;stroke-linecap:butt;stroke-linejoin:miter;stroke-miterlimit:4;stroke-dasharray:none;stroke-opacity:1;marker-end:url(#Arrow2Mend)" />
  <path
     inkscape:connector-curvature="0"
     style="fill:none;stroke:#000000;stroke-width:18.9997;stroke-linecap:butt;stroke-linejoin:miter;stroke-miterlimit:4;stroke-dasharray:none;stroke-opacity:1;marker-end:url(#Arrow2Mend)"
     d="m 12693.136,2801.1719 c -189.997,189.997 -189.997,189.997 -189.997,189.997"
     id="path4748" />
  <path
     inkscape:connector-curvature="0"
     id="path4750"
     d="m 12693.136,2649.1759 c -189.997,189.997 -189.997,189.997 -189.997,189.997"
     style="fill:none;stroke:#000000;stroke-width:18.9997;stroke-linecap:butt;stroke-linejoin:miter;stroke-miterlimit:4;stroke-dasharray:none;stroke-opacity:1;marker-end:url(#Arrow2Mend)" />
  <path
     inkscape:connector-curvature="0"
     style="fill:none;stroke:#000000;stroke-width:18.9997;stroke-linecap:butt;stroke-linejoin:miter;stroke-miterlimit:4;stroke-dasharray:none;stroke-opacity:1;marker-end:url(#Arrow2Mend)"
     d="m 12693.136,2497.1799 c -189.997,189.997 -189.997,189.997 -189.997,189.997"
     id="path4752" />
  <path
     inkscape:connector-curvature="0"
     id="path4754"
     d="m 12693.136,2307.1849 c -189.997,189.997 -189.997,189.997 -189.997,189.997"
     style="fill:none;stroke:#000000;stroke-width:18.9997;stroke-linecap:butt;stroke-linejoin:miter;stroke-miterlimit:4;stroke-dasharray:none;stroke-opacity:1;marker-end:url(#Arrow2Mend)" />
  <path
     inkscape:connector-curvature="0"
     style="fill:none;stroke:#000000;stroke-width:18.9997;stroke-linecap:butt;stroke-linejoin:miter;stroke-miterlimit:4;stroke-dasharray:none;stroke-opacity:1;marker-end:url(#Arrow2Mend)"
     d="m 12693.136,2117.1899 c -189.997,189.997 -189.997,189.997 -189.997,189.997"
     id="path4756" />
  <path
     inkscape:connector-curvature="0"
     id="path4758"
     d="m 12693.136,1927.1949 c -189.997,189.997 -189.997,189.997 -189.997,189.997"
     style="fill:none;stroke:#000000;stroke-width:18.9997;stroke-linecap:butt;stroke-linejoin:miter;stroke-miterlimit:4;stroke-dasharray:none;stroke-opacity:1;marker-end:url(#Arrow2Mend)" />
  <path
     inkscape:connector-curvature="0"
     style="fill:none;stroke:#000000;stroke-width:18.9997;stroke-linecap:butt;stroke-linejoin:miter;stroke-miterlimit:4;stroke-dasharray:none;stroke-opacity:1;marker-end:url(#Arrow2Mend)"
     d="m 12693.136,1699.2009 c -189.997,189.997 -189.997,189.997 -189.997,189.997"
     id="path4760" />
  <path
     inkscape:connector-curvature="0"
     id="path4762"
     d="m 12693.136,1509.2059 c -189.997,189.997 -189.997,189.997 -189.997,189.997"
     style="fill:none;stroke:#000000;stroke-width:18.9997;stroke-linecap:butt;stroke-linejoin:miter;stroke-miterlimit:4;stroke-dasharray:none;stroke-opacity:1;marker-end:url(#Arrow2Mend)" />
  <path
     inkscape:connector-curvature="0"
     style="fill:none;stroke:#000000;stroke-width:18.9997;stroke-linecap:butt;stroke-linejoin:miter;stroke-miterlimit:4;stroke-dasharray:none;stroke-opacity:1;marker-end:url(#Arrow2Mend)"
     d="m 12693.136,1319.2109 c -189.997,189.997 -189.997,189.997 -189.997,189.997"
     id="path4764" />
  <path
     inkscape:connector-curvature="0"
     id="path4766"
     d="m 12693.136,1129.2159 c -189.997,189.997 -189.997,189.997 -189.997,189.997"
     style="fill:none;stroke:#000000;stroke-width:18.9997;stroke-linecap:butt;stroke-linejoin:miter;stroke-miterlimit:4;stroke-dasharray:none;stroke-opacity:1;marker-end:url(#Arrow2Mend)" />
  <path
     inkscape:connector-curvature="0"
     style="fill:none;stroke:#000000;stroke-width:18.9997;stroke-linecap:butt;stroke-linejoin:miter;stroke-miterlimit:4;stroke-dasharray:none;stroke-opacity:1;marker-end:url(#Arrow2Mend)"
     d="m 12693.136,901.22195 c -189.997,189.99695 -189.997,189.99695 -189.997,189.99695"
     id="path4768" />
  <path
     inkscape:connector-curvature="0"
     id="path4770"
     d="m 12693.136,711.22695 c -189.997,189.997 -189.997,189.997 -189.997,189.997"
     style="fill:none;stroke:#000000;stroke-width:18.9997;stroke-linecap:butt;stroke-linejoin:miter;stroke-miterlimit:4;stroke-dasharray:none;stroke-opacity:1;marker-end:url(#Arrow2Mend)" />
  <path
     inkscape:connector-curvature="0"
     style="fill:none;stroke:#000000;stroke-width:18.9997;stroke-linecap:butt;stroke-linejoin:miter;stroke-miterlimit:4;stroke-dasharray:none;stroke-opacity:1;marker-end:url(#Arrow2Mend)"
     d="m 12693.136,521.23191 c -189.997,189.99704 -189.997,189.99704 -189.997,189.99704"
     id="path4772" />
  <path
     inkscape:connector-curvature="0"
     id="path4774"
     d="m 12693.136,331.23692 c -189.997,189.99699 -189.997,189.99699 -189.997,189.99699"
     style="fill:none;stroke:#000000;stroke-width:18.9997;stroke-linecap:butt;stroke-linejoin:miter;stroke-miterlimit:4;stroke-dasharray:none;stroke-opacity:1;marker-end:url(#Arrow2Mend)" />
  <path
     inkscape:connector-curvature="0"
     style="fill:none;stroke:#000000;stroke-width:18.9997;stroke-linecap:butt;stroke-linejoin:miter;stroke-miterlimit:4;stroke-dasharray:none;stroke-opacity:1;marker-end:url(#Arrow2Mend)"
     d="m 12693.136,141.24192 c -189.997,189.997 -189.997,189.997 -189.997,189.997"
     id="path4776" />
  <path
     inkscape:connector-curvature="0"
     id="path4778"
     d="M 12693.136,-86.752087 C 12503.139,103.24491 12503.139,103.24491 12503.139,103.24491"
     style="fill:none;stroke:#000000;stroke-width:18.9997;stroke-linecap:butt;stroke-linejoin:miter;stroke-miterlimit:4;stroke-dasharray:none;stroke-opacity:1;marker-end:url(#Arrow2Mend)" />
  <path
     inkscape:connector-curvature="0"
     id="path4782"
     d="m 12693.136,-276.74669 c -189.997,189.996996 -189.997,189.996996 -189.997,189.996996"
     style="fill:none;stroke:#000000;stroke-width:18.9997;stroke-linecap:butt;stroke-linejoin:miter;stroke-miterlimit:4;stroke-dasharray:none;stroke-opacity:1;marker-end:url(#Arrow2Mend)" />
  <polyline
     transform="matrix(0,-0.59397364,-1.0591014,0,15706.747,14026.592)"
     points="19086,472 19874,472 "
     style="stroke:#000000;stroke-width:35.9323;stroke-linecap:butt;stroke-linejoin:miter;stroke-miterlimit:4;stroke-dasharray:none;marker-start:none;marker-end:url(#Arrow1Send)"
     id="polyline2628" />
  <polyline
     transform="matrix(0,-1.0593788,-0.59044046,0,15485.539,22906.52)"
     points="19086,472 19086,1259 "
     style="stroke:#000000;stroke-width:36.035;stroke-linecap:butt;stroke-linejoin:miter;stroke-miterlimit:1;stroke-dasharray:none;marker-end:url(#Arrow2Send)"
     id="polyline2632" />
  <text
     xml:space="preserve"
     x="15197.784"
     y="2130.8403"
     font-style="italic"
     font-weight="normal"
     font-size="328"
     id="text2678"
     style="font-style:normal;font-variant:normal;font-weight:normal;font-stretch:normal;font-size:270.242px;line-height:0%;font-family:sans-serif;-inkscape-font-specification:sans-serif;text-align:center;writing-mode:lr-tb;text-anchor:middle;fill:#000000;stroke:none">$x$</text>
  <text
     xml:space="preserve"
     x="14765.207"
     y="2521.9424"
     font-style="italic"
     font-weight="normal"
     font-size="328"
     id="text2680"
     style="font-style:normal;font-variant:normal;font-weight:normal;font-stretch:normal;font-size:270.242px;line-height:0%;font-family:sans-serif;-inkscape-font-specification:sans-serif;text-align:center;writing-mode:lr-tb;text-anchor:middle;fill:#000000;stroke:none">$y$</text>
  <polyline
     transform="matrix(0,1.4111838,-1.718233,0,15459.375,-22758.445)"
     points="15590,531 15590,-44 "
     style="stroke:#000000;stroke-width:12.2015;stroke-linecap:butt;stroke-linejoin:miter;stroke-miterlimit:4;stroke-dasharray:none;marker-start:url(#Arrow1Mstart)"
     id="polyline4171" />
  <text
     style="font-style:normal;font-variant:normal;font-weight:normal;font-stretch:normal;font-size:270.242px;line-height:0%;font-family:sans-serif;-inkscape-font-specification:sans-serif;text-align:start;writing-mode:lr-tb;text-anchor:start;fill:#000000;stroke:none"
     id="text5025"
     font-size="328"
     font-weight="normal"
     font-style="normal"
     y="-403.42032"
     x="14570.876"
     xml:space="preserve">40 kN</text>
  <g
     transform="translate(1.9720459e-4,-42.652886)"
     id="g1099">
    <path
       sodipodi:nodetypes="cc"
       inkscape:connector-curvature="0"
       id="path1094"
       d="m 13081.985,3226.1896 1044.983,474.9924"
       style="fill:none;fill-rule:evenodd;stroke:#000000;stroke-width:28.4995;stroke-linecap:butt;stroke-linejoin:miter;stroke-miterlimit:4;stroke-dasharray:28.4995, 85.4986;stroke-dashoffset:0;stroke-opacity:1" />
    <path
       style="fill:none;stroke:#000000;stroke-width:28.4995;stroke-linecap:butt;stroke-linejoin:miter;stroke-miterlimit:4;stroke-dasharray:none;stroke-opacity:1"
       d="m 12693.136,3717.8018 406.418,-496.7658 1407.408,5.1536 -379.994,474.9924 z"
       id="path2777"
       sodipodi:nodetypes="ccccc"
       inkscape:connector-curvature="0" />
    <path
       style="fill:none;fill-rule:evenodd;stroke:#000000;stroke-width:28.4995;stroke-linecap:butt;stroke-linejoin:miter;stroke-miterlimit:4;stroke-dasharray:28.4995, 85.4986;stroke-dashoffset:0;stroke-opacity:1"
       d="m 12701.991,3701.182 1804.971,-474.9924"
       id="path1092"
       inkscape:connector-curvature="0"
       sodipodi:nodetypes="cc" />
  </g>
  <g
     transform="translate(1.9718174e-4,-3956.5908)"
     id="g1107">
    <path
       style="fill:none;fill-rule:evenodd;stroke:#000000;stroke-width:28.4995;stroke-linecap:butt;stroke-linejoin:miter;stroke-miterlimit:4;stroke-dasharray:28.4995, 85.4986;stroke-dashoffset:0;stroke-opacity:1"
       d="m 13081.985,3226.1896 1044.983,474.9924"
       id="path1101"
       inkscape:connector-curvature="0"
       sodipodi:nodetypes="cc" />
    <path
       inkscape:connector-curvature="0"
       sodipodi:nodetypes="ccccc"
       id="path1103"
       d="m 12693.136,3717.8018 406.418,-496.7658 1407.408,5.1536 -379.994,474.9924 z"
       style="fill:none;stroke:#000000;stroke-width:28.4995;stroke-linecap:butt;stroke-linejoin:miter;stroke-miterlimit:4;stroke-dasharray:none;stroke-opacity:1" />
    <path
       sodipodi:nodetypes="cc"
       inkscape:connector-curvature="0"
       id="path1105"
       d="m 12701.991,3701.182 1804.971,-474.9924"
       style="fill:none;fill-rule:evenodd;stroke:#000000;stroke-width:28.4995;stroke-linecap:butt;stroke-linejoin:miter;stroke-miterlimit:4;stroke-dasharray:28.4995, 85.4986;stroke-dashoffset:0;stroke-opacity:1" />
  </g>
</svg>
