<?xml version="1.0" encoding="UTF-8" standalone="no"?>
<svg
   version="1.0"
   inkscape:output_extension="org.inkscape.output.svg.inkscape"
   sodipodi:docname="figure5-F.svg"
   inkscape:version="1.2-dev (2933c477aa, 2021-06-11)"
   sodipodi:version="0.32"
   id="svg2552"
   viewBox="12132 -659 6481.8067 1864.5645"
   height="114.7913"
   width="341.15317"
   xmlns:inkscape="http://www.inkscape.org/namespaces/inkscape"
   xmlns:sodipodi="http://sodipodi.sourceforge.net/DTD/sodipodi-0.dtd"
   xmlns="http://www.w3.org/2000/svg"
   xmlns:svg="http://www.w3.org/2000/svg"
   xmlns:rdf="http://www.w3.org/1999/02/22-rdf-syntax-ns#"
   xmlns:cc="http://creativecommons.org/ns#"
   xmlns:dc="http://purl.org/dc/elements/1.1/">
  <metadata
     id="metadata2699">
    <rdf:RDF>
      <cc:Work
         rdf:about="">
        <dc:format>image/svg+xml</dc:format>
        <dc:type
           rdf:resource="http://purl.org/dc/dcmitype/StillImage" />
      </cc:Work>
    </rdf:RDF>
  </metadata>
  <defs
     id="defs2697">
    <linearGradient
       id="linearGradient3922"
       inkscape:swatch="solid">
      <stop
         id="stop3924"
         offset="0"
         style="stop-color:#b3b3b3;stop-opacity:1;" />
    </linearGradient>
    <marker
       style="overflow:visible"
       id="Arrow2Mend"
       refX="0"
       refY="0"
       orient="auto"
       inkscape:stockid="Arrow2Mend">
      <path
         inkscape:connector-curvature="0"
         transform="scale(-0.6)"
         d="M 8.7185878,4.0337352 -2.2072895,0.01601326 8.7185884,-4.0017078 c -1.7454984,2.3720609 -1.7354408,5.6174519 -6e-7,8.035443 z"
         style="font-size:12px;fill-rule:evenodd;stroke-width:0.625;stroke-linejoin:round"
         id="path4488" />
    </marker>
    <marker
       style="overflow:visible"
       id="Arrow1Send"
       refX="0"
       refY="0"
       orient="auto"
       inkscape:stockid="Arrow1Send">
      <path
         inkscape:connector-curvature="0"
         transform="matrix(-0.2,0,0,-0.2,-1.2,0)"
         style="fill-rule:evenodd;stroke:#000000;stroke-width:1pt;marker-start:none"
         d="M 0,0 5,-5 -12.5,0 5,5 Z"
         id="path3252" />
    </marker>
    <marker
       style="overflow:visible"
       id="Arrow2Send"
       refX="0"
       refY="0"
       orient="auto"
       inkscape:stockid="Arrow2Send">
      <path
         inkscape:connector-curvature="0"
         transform="matrix(-0.3,0,0,-0.3,0.69,0)"
         d="M 8.7185878,4.0337352 -2.2072895,0.01601326 8.7185884,-4.0017078 c -1.7454984,2.3720609 -1.7354408,5.6174519 -6e-7,8.035443 z"
         style="font-size:12px;fill-rule:evenodd;stroke-width:0.625;stroke-linejoin:round"
         id="path3270" />
    </marker>
    <marker
       style="overflow:visible"
       id="Arrow1Sstart"
       refX="0"
       refY="0"
       orient="auto"
       inkscape:stockid="Arrow1Sstart">
      <path
         inkscape:connector-curvature="0"
         transform="matrix(0.2,0,0,0.2,1.2,0)"
         style="fill-rule:evenodd;stroke:#000000;stroke-width:1pt;marker-start:none"
         d="M 0,0 5,-5 -12.5,0 5,5 Z"
         id="path3249" />
    </marker>
    <marker
       style="overflow:visible"
       id="TriangleInM"
       refX="0"
       refY="0"
       orient="auto"
       inkscape:stockid="TriangleInM">
      <path
         inkscape:connector-curvature="0"
         transform="scale(-0.4)"
         style="fill-rule:evenodd;stroke:#000000;stroke-width:1pt;marker-start:none"
         d="M 5.77,0 -2.88,5 V -5 Z"
         id="path3374" />
    </marker>
    <marker
       style="overflow:visible"
       id="TriangleOutL"
       refX="0"
       refY="0"
       orient="auto"
       inkscape:stockid="TriangleOutL">
      <path
         inkscape:connector-curvature="0"
         transform="scale(0.8)"
         style="fill-rule:evenodd;stroke:#000000;stroke-width:1pt;marker-start:none"
         d="M 5.77,0 -2.88,5 V -5 Z"
         id="path3380" />
    </marker>
    <marker
       style="overflow:visible"
       id="TriangleOutM"
       refX="0"
       refY="0"
       orient="auto"
       inkscape:stockid="TriangleOutM">
      <path
         inkscape:connector-curvature="0"
         transform="scale(0.4)"
         style="fill-rule:evenodd;stroke:#000000;stroke-width:1pt;marker-start:none"
         d="M 5.77,0 -2.88,5 V -5 Z"
         id="path3383" />
    </marker>
    <marker
       style="overflow:visible"
       id="EmptyTriangleOutL"
       refX="0"
       refY="0"
       orient="auto"
       inkscape:stockid="EmptyTriangleOutL">
      <path
         inkscape:connector-curvature="0"
         transform="matrix(0.8,0,0,0.8,-4.8,0)"
         style="fill:#ffffff;fill-rule:evenodd;stroke:#000000;stroke-width:1pt;marker-start:none"
         d="M 5.77,0 -2.88,5 V -5 Z"
         id="path3398" />
    </marker>
    <marker
       style="overflow:visible"
       id="EmptyTriangleInM"
       refX="0"
       refY="0"
       orient="auto"
       inkscape:stockid="EmptyTriangleInM">
      <path
         inkscape:connector-curvature="0"
         transform="matrix(-0.4,0,0,-0.4,1.8,0)"
         style="fill:#ffffff;fill-rule:evenodd;stroke:#000000;stroke-width:1pt;marker-start:none"
         d="M 5.77,0 -2.88,5 V -5 Z"
         id="path3392" />
    </marker>
    <marker
       style="overflow:visible"
       id="Arrow1Mend"
       refX="0"
       refY="0"
       orient="auto"
       inkscape:stockid="Arrow1Mend">
      <path
         inkscape:connector-curvature="0"
         transform="matrix(-0.4,0,0,-0.4,-4,0)"
         style="fill-rule:evenodd;stroke:#000000;stroke-width:1pt;marker-start:none"
         d="M 0,0 5,-5 -12.5,0 5,5 Z"
         id="path3246" />
    </marker>
    <marker
       style="overflow:visible"
       id="Arrow1Mstart"
       refX="0"
       refY="0"
       orient="auto"
       inkscape:stockid="Arrow1Mstart">
      <path
         inkscape:connector-curvature="0"
         transform="matrix(0.4,0,0,0.4,4,0)"
         style="fill-rule:evenodd;stroke:#000000;stroke-width:1pt;marker-start:none"
         d="M 0,0 5,-5 -12.5,0 5,5 Z"
         id="path3560" />
    </marker>
    <marker
       style="overflow:visible"
       id="Arrow1Lstart"
       refX="0"
       refY="0"
       orient="auto"
       inkscape:stockid="Arrow1Lstart">
      <path
         inkscape:connector-curvature="0"
         transform="matrix(0.8,0,0,0.8,10,0)"
         style="fill-rule:evenodd;stroke:#000000;stroke-width:1pt;marker-start:none"
         d="M 0,0 5,-5 -12.5,0 5,5 Z"
         id="path3554" />
    </marker>
    <inkscape:perspective
       id="perspective2701"
       inkscape:persp3d-origin="297 : 86.504629 : 1"
       inkscape:vp_z="594 : 121.00463 : 1"
       inkscape:vp_y="0 : 999.9999 : 0"
       inkscape:vp_x="0 : 121.00463 : 1"
       sodipodi:type="inkscape:persp3d" />
    <pattern
       id="pattern5475"
       patternTransform="matrix(18.999696,0,0,18.999696,11941.5,-3.2509706)"
       height="4.3800553"
       width="20.052952"
       patternUnits="userSpaceOnUse">
      <rect
         style="fill:#ffffff;fill-opacity:1;fill-rule:nonzero;stroke:#000000;stroke-width:0.053;stroke-linecap:round;stroke-linejoin:round;stroke-miterlimit:4;stroke-opacity:1;stroke-dasharray:none;stroke-dashoffset:0"
         id="rect5452"
         width="20"
         height="2.3270693"
         x="0.026470441"
         y="0.027053526"
         rx="1.1401239e-12"
         ry="1.0886775" />
      <rect
         ry="1.0886775"
         rx="1.1401239e-12"
         y="2.0270541"
         x="0.026470441"
         height="2.3270693"
         width="20"
         id="rect5454"
         style="fill:#000000;fill-opacity:1;fill-rule:nonzero;stroke:#000000;stroke-width:0.053;stroke-linecap:round;stroke-linejoin:round;stroke-miterlimit:4;stroke-opacity:1;stroke-dasharray:none;stroke-dashoffset:0" />
    </pattern>
  </defs>
  <sodipodi:namedview
     inkscape:document-rotation="0"
     inkscape:window-maximized="1"
     fit-margin-bottom="0"
     fit-margin-right="0"
     fit-margin-left="0"
     fit-margin-top="0"
     inkscape:current-layer="svg2552"
     inkscape:window-y="27"
     inkscape:window-x="72"
     inkscape:cy="67.619816"
     inkscape:cx="127.02551"
     inkscape:zoom="3.4087641"
     inkscape:snap-global="true"
     showgrid="true"
     id="base"
     pagecolor="#ffffff"
     bordercolor="#666666"
     borderopacity="1.0"
     objecttolerance="10.0"
     gridtolerance="10.0"
     guidetolerance="10.0"
     inkscape:pageopacity="0.0"
     inkscape:pageshadow="2"
     inkscape:window-width="1656"
     inkscape:window-height="1088"
     inkscape:pagecheckerboard="0">
    <inkscape:grid
       originy="68.847859"
       originx="34.63187"
       snapvisiblegridlinesonly="true"
       empspacing="5"
       enabled="true"
       visible="true"
       id="grid2775"
       type="xygrid" />
  </sodipodi:namedview>
  <g
     transform="translate(-7002.448,-736.3777)"
     style="stroke:#000000;stroke-width:0"
     id="g2558">
    <defs
       id="defs2560">
      <pattern
         id="tile1"
         x="0"
         y="0"
         width="200"
         height="200"
         patternUnits="userSpaceOnUse">
        <path
           d="M 100 0 0 100"
           id="path2563" />
        <path
           d="M 200 0 0 200"
           id="path2565" />
        <path
           d="M 200 100 100 200"
           id="path2567" />
      </pattern>
    </defs>
  </g>
  <polyline
     transform="translate(-580.48586,-659.73376)"
     points="17952,992 17480,755 "
     style="stroke:#000000;stroke-width:18.9997;stroke-linecap:butt;stroke-linejoin:miter;stroke-miterlimit:4;stroke-dasharray:18.9997, 18.9997;stroke-dashoffset:0"
     id="polyline2579" />
  <polyline
     transform="translate(-580.48586,-659.73376)"
     points="17952,353 17480,1417 "
     style="stroke:#000000;stroke-width:18.9997;stroke-linecap:butt;stroke-linejoin:miter;stroke-miterlimit:4;stroke-dasharray:18.9997, 18.9997;stroke-dashoffset:0"
     id="polyline2581" />
  <polyline
     transform="translate(-580.48586,-659.73376)"
     points="17712,869 17712,537 "
     style="stroke:#000000;stroke-width:8;stroke-linecap:butt;stroke-linejoin:miter;stroke-dasharray:10, 10"
     id="polyline2583" />
  <g
     transform="translate(-7002.448,-736.3777)"
     style="stroke:#000000;stroke-width:0"
     id="g2589">
    <defs
       id="defs2591">
      <pattern
         id="tile2"
         x="0"
         y="0"
         width="200"
         height="200"
         patternUnits="userSpaceOnUse">
        <path
           d="M 100 0 0 100"
           id="path2594" />
        <path
           d="M 200 0 0 200"
           id="path2596" />
        <path
           d="M 200 100 100 200"
           id="path2598" />
      </pattern>
    </defs>
  </g>
  <g
     transform="translate(-7002.448,-736.3777)"
     style="stroke:#000000;stroke-width:0"
     id="g2604">
    <defs
       id="defs2606">
      <pattern
         id="tile3"
         x="0"
         y="0"
         width="200"
         height="200"
         patternUnits="userSpaceOnUse">
        <path
           d="M 50 0 50 200"
           id="path2609" />
        <path
           d="M 150 0 150 200"
           id="path2611" />
      </pattern>
    </defs>
  </g>
  <g
     transform="translate(-7002.448,-736.3777)"
     style="stroke:#000000;stroke-width:0"
     id="g2617">
    <defs
       id="defs2619">
      <pattern
         id="tile4"
         x="0"
         y="0"
         width="200"
         height="200"
         patternUnits="userSpaceOnUse">
        <path
           d="M 50 0 50 200"
           id="path2622" />
        <path
           d="M 150 0 150 200"
           id="path2624" />
      </pattern>
    </defs>
  </g>
  <polyline
     transform="matrix(0.5939736,0,0,1.0591015,6516.228,-507.9582)"
     points="19086,472 19874,472 "
     style="stroke:#000000;stroke-width:35.9323;stroke-linecap:butt;stroke-linejoin:miter;stroke-miterlimit:4;stroke-dasharray:none;marker-start:none;marker-end:url(#Arrow1Send)"
     id="polyline2628" />
  <polyline
     transform="matrix(1.0593788,0,0,0.5904404,-2363.7006,-286.75014)"
     points="19086,472 19086,1259 "
     style="stroke:#000000;stroke-width:36.035;stroke-linecap:butt;stroke-linejoin:miter;stroke-miterlimit:1;stroke-dasharray:none;marker-end:url(#Arrow2Send)"
     id="polyline2632" />
  <polyline
     transform="translate(-580.48586,-659.73376)"
     points="14031,992 17952,992 "
     style="stroke:#000000;stroke-width:28.4995;stroke-linecap:butt;stroke-linejoin:miter;stroke-miterlimit:4;stroke-dasharray:85.4986, 28.4995;stroke-dashoffset:0"
     id="polyline2636" />
  <polyline
     transform="matrix(1,0,0,-1,-580.48586,630.30726)"
     points="13559,755 17480,755 "
     style="stroke:#000000;stroke-width:28.4995;stroke-linecap:butt;stroke-linejoin:miter;stroke-miterlimit:4;stroke-dasharray:none"
     id="polyline2638" />
  <polyline
     transform="translate(-580.48586,-659.73376)"
     points="14031,330 17952,330 "
     style="stroke:#000000;stroke-width:28.4995;stroke-linecap:butt;stroke-linejoin:miter;stroke-miterlimit:4;stroke-dasharray:none"
     id="polyline2640" />
  <polyline
     transform="translate(-580.48586,-659.73376)"
     points="13559,1417 17480,1417 "
     style="stroke:#000000;stroke-width:28.4995;stroke-linecap:butt;stroke-linejoin:miter;stroke-miterlimit:4;stroke-dasharray:none"
     id="polyline2644" />
  <polyline
     transform="matrix(2.2710297,0,0,2.6106008,-18182.387,-4025.7912)"
     points="15434,2007 13738,2007 "
     style="stroke:#000000;stroke-width:7.80306;stroke-linecap:butt;stroke-linejoin:miter;stroke-miterlimit:4;stroke-dasharray:none;marker-start:url(#Arrow1Mstart);marker-end:url(#Arrow1Mend)"
     id="polyline2646" />
  <polyline
     transform="translate(-580.48586,-735.73253)"
     points="13559,1629 13559,2101 "
     style="stroke:#000000;stroke-width:8;stroke-linecap:butt;stroke-linejoin:miter"
     id="polyline2652" />
  <polyline
     transform="translate(-580.48586,-735.73253)"
     points="17480,1676 17480,2101 "
     style="stroke:#000000;stroke-width:13.5121;stroke-linecap:butt;stroke-linejoin:miter;stroke-miterlimit:4;stroke-dasharray:none"
     id="polyline2654" />
  <text
     xml:space="preserve"
     x="18384.338"
     y="-102.64686"
     font-style="italic"
     font-weight="normal"
     font-size="328"
     id="text2678"
     style="font-style:normal;font-variant:normal;font-weight:normal;font-stretch:normal;font-size:270.242px;line-height:0%;font-family:sans-serif;-inkscape-font-specification:sans-serif;text-align:center;writing-mode:lr-tb;text-anchor:middle;fill:#000000;stroke:none">$x$</text>
  <text
     xml:space="preserve"
     x="17950.205"
     y="478.37256"
     font-style="italic"
     font-weight="normal"
     font-size="328"
     id="text2680"
     style="font-style:normal;font-variant:normal;font-weight:normal;font-stretch:normal;font-size:270.242px;line-height:0%;font-family:sans-serif;-inkscape-font-specification:sans-serif;text-align:start;writing-mode:lr-tb;text-anchor:start;fill:#000000;stroke:none">$z$</text>
  <text
     xml:space="preserve"
     x="12901.557"
     y="1052.6534"
     font-style="normal"
     font-weight="normal"
     font-size="328"
     id="text2682"
     style="font-style:normal;font-variant:normal;font-weight:normal;font-stretch:normal;font-size:270.242px;line-height:0%;font-family:sans-serif;-inkscape-font-specification:sans-serif;text-align:end;writing-mode:lr-tb;text-anchor:end;fill:#000000;stroke:none">64 kN</text>
  <text
     xml:space="preserve"
     x="6437.5527"
     y="491.62231"
     font-style="normal"
     font-weight="normal"
     font-size="328"
     id="text2688"
     style="font-style:normal;font-variant:normal;font-weight:normal;font-stretch:normal;font-size:162.145px;line-height:0%;font-family:sans-serif;-inkscape-font-specification:sans-serif;text-align:end;writing-mode:lr-tb;text-anchor:end;fill:#000000;stroke:#000000;stroke-width:0.025in"><tspan
       id="tspan12357"
       style="font-style:normal;font-variant:normal;font-weight:normal;font-stretch:normal;font-size:20px;line-height:100%;font-family:sans-serif;-inkscape-font-specification:sans-serif;text-align:end;writing-mode:lr-tb;text-anchor:end;stroke:none" /></text>
  <text
     xml:space="preserve"
     x="15010.463"
     y="1132.2198"
     font-style="normal"
     font-weight="normal"
     font-size="328"
     id="text2692"
     style="font-style:normal;font-variant:normal;font-weight:normal;font-stretch:normal;font-size:270.242px;line-height:0%;font-family:sans-serif;-inkscape-font-specification:sans-serif;text-align:center;writing-mode:lr-tb;text-anchor:middle;fill:#000000;stroke:none">5 m</text>
  <path
     inkscape:connector-curvature="0"
     sodipodi:nodetypes="ccccc"
     id="path2777"
     d="m 12989.332,749.17631 472.073,-430.11064 5.245,-650.41117 -475.395,418.097198 z"
     style="fill:none;stroke:#000000;stroke-width:28.4995;stroke-linecap:butt;stroke-linejoin:miter;stroke-miterlimit:4;stroke-dasharray:none;stroke-opacity:1" />
  <path
     inkscape:connector-curvature="0"
     style="fill:none;stroke:#000000;stroke-width:28.4995;stroke-linecap:butt;stroke-linejoin:miter;stroke-miterlimit:4;stroke-dasharray:none;stroke-opacity:1"
     d="m 16907.792,749.17631 472.073,-430.11064 5.245,-650.41117 -493.054,414.374868 z"
     id="path3549"
     sodipodi:nodetypes="ccccc" />
  <text
     style="font-style:normal;font-variant:normal;font-weight:normal;font-stretch:normal;font-size:270.242px;line-height:0%;font-family:sans-serif;-inkscape-font-specification:sans-serif;text-align:end;writing-mode:lr-tb;text-anchor:end;fill:#000000;stroke:none"
     id="text12363"
     font-size="328"
     font-weight="normal"
     font-style="normal"
     y="-249.30011"
     x="13227.82"
     xml:space="preserve">0,5 m</text>
  <text
     xml:space="preserve"
     x="12923.825"
     y="415.68927"
     font-style="normal"
     font-weight="normal"
     font-size="328"
     id="text12365"
     style="font-style:normal;font-variant:normal;font-weight:normal;font-stretch:normal;font-size:270.242px;line-height:0%;font-family:sans-serif;-inkscape-font-specification:sans-serif;text-align:end;writing-mode:lr-tb;text-anchor:end;fill:#000000;stroke:none">0,2 m</text>
  <polyline
     id="polyline13100"
     style="stroke:#000000;stroke-width:18.9997;stroke-linecap:butt;stroke-linejoin:miter;stroke-miterlimit:4;stroke-dasharray:18.9997, 18.9997;stroke-dashoffset:0"
     points="17952,992 17480,755 "
     transform="translate(-4494.4236,-659.73376)" />
  <polyline
     id="polyline13102"
     style="stroke:#000000;stroke-width:18.9997;stroke-linecap:butt;stroke-linejoin:miter;stroke-miterlimit:4;stroke-dasharray:18.9997, 18.9997;stroke-dashoffset:0"
     points="17952,353 17480,1417 "
     transform="translate(-4494.4236,-659.73376)" />
  <text
     id="text5266"
     y="-391.32358"
     x="15065.478"
     style="font-style:normal;font-variant:normal;font-weight:normal;font-stretch:normal;line-height:0%;font-family:sans-serif;-inkscape-font-specification:sans-serif;text-align:center;writing-mode:lr-tb;text-anchor:middle;fill:#000000;fill-opacity:1;stroke:none"
     xml:space="preserve"><tspan
       style="font-size:265.996px;line-height:1.25"
       id="tspan5270"
       y="-391.32358"
       x="15065.478"
       sodipodi:role="line">12 kNm$^{-1}$</tspan></text>
  <path
     sodipodi:nodetypes="cc"
     inkscape:connector-curvature="0"
     id="path4766"
     d="m 12182.274,767.65791 c 379.994,0 759.988,0 759.988,0"
     style="fill:none;stroke:#000000;stroke-width:28.4995;stroke-linecap:butt;stroke-linejoin:miter;stroke-miterlimit:4;stroke-dasharray:none;stroke-opacity:1;marker-end:url(#Arrow2Mend)" />
  <g
     transform="matrix(1,0,0,-1,-486.46589,-419.82745)"
     id="g6426">
    <path
       sodipodi:nodetypes="cc"
       inkscape:connector-curvature="0"
       style="fill:none;stroke:#000000;stroke-width:18.9997;stroke-linecap:butt;stroke-linejoin:miter;stroke-miterlimit:4;stroke-dasharray:none;stroke-opacity:1;marker-end:url(#Arrow2Mend)"
       d="m 16976.891,-519.84361 v 189.99698"
       id="path3136" />
    <polyline
       transform="matrix(-0.99335299,0,0,1,31060.221,-1038.8435)"
       points="13795,519 17716,519 "
       style="stroke:#000000;stroke-width:19.0632;stroke-linecap:butt;stroke-linejoin:miter;stroke-miterlimit:4;stroke-dasharray:none;stroke-dashoffset:0"
       id="polyline5260" />
    <path
       id="path4760"
       d="m 13480.983,-519.84361 v 189.99698"
       style="fill:none;stroke:#000000;stroke-width:18.9997;stroke-linecap:butt;stroke-linejoin:miter;stroke-miterlimit:4;stroke-dasharray:none;stroke-opacity:1;marker-end:url(#Arrow2Mend)"
       inkscape:connector-curvature="0"
       sodipodi:nodetypes="cc" />
    <path
       sodipodi:nodetypes="cc"
       inkscape:connector-curvature="0"
       style="fill:none;stroke:#000000;stroke-width:18.9997;stroke-linecap:butt;stroke-linejoin:miter;stroke-miterlimit:4;stroke-dasharray:none;stroke-opacity:1;marker-end:url(#Arrow2Mend)"
       d="m 13594.98,-519.84361 v 189.99698"
       id="path3084" />
    <path
       id="path3086"
       d="m 13708.977,-519.84361 v 189.99698"
       style="fill:none;stroke:#000000;stroke-width:18.9997;stroke-linecap:butt;stroke-linejoin:miter;stroke-miterlimit:4;stroke-dasharray:none;stroke-opacity:1;marker-end:url(#Arrow2Mend)"
       inkscape:connector-curvature="0"
       sodipodi:nodetypes="cc" />
    <path
       sodipodi:nodetypes="cc"
       inkscape:connector-curvature="0"
       style="fill:none;stroke:#000000;stroke-width:18.9997;stroke-linecap:butt;stroke-linejoin:miter;stroke-miterlimit:4;stroke-dasharray:none;stroke-opacity:1;marker-end:url(#Arrow2Mend)"
       d="m 13822.974,-519.84361 v 189.99698"
       id="path3088" />
    <path
       id="path3090"
       d="m 13936.971,-519.84361 v 189.99698"
       style="fill:none;stroke:#000000;stroke-width:18.9997;stroke-linecap:butt;stroke-linejoin:miter;stroke-miterlimit:4;stroke-dasharray:none;stroke-opacity:1;marker-end:url(#Arrow2Mend)"
       inkscape:connector-curvature="0"
       sodipodi:nodetypes="cc" />
    <path
       sodipodi:nodetypes="cc"
       inkscape:connector-curvature="0"
       style="fill:none;stroke:#000000;stroke-width:18.9997;stroke-linecap:butt;stroke-linejoin:miter;stroke-miterlimit:4;stroke-dasharray:none;stroke-opacity:1;marker-end:url(#Arrow2Mend)"
       d="m 14050.968,-519.84361 v 189.99698"
       id="path3092" />
    <path
       id="path3094"
       d="m 14164.965,-519.84361 v 189.99698"
       style="fill:none;stroke:#000000;stroke-width:18.9997;stroke-linecap:butt;stroke-linejoin:miter;stroke-miterlimit:4;stroke-dasharray:none;stroke-opacity:1;marker-end:url(#Arrow2Mend)"
       inkscape:connector-curvature="0"
       sodipodi:nodetypes="cc" />
    <path
       sodipodi:nodetypes="cc"
       inkscape:connector-curvature="0"
       style="fill:none;stroke:#000000;stroke-width:18.9997;stroke-linecap:butt;stroke-linejoin:miter;stroke-miterlimit:4;stroke-dasharray:none;stroke-opacity:1;marker-end:url(#Arrow2Mend)"
       d="m 14278.962,-519.84361 v 189.99698"
       id="path3096" />
    <path
       id="path3098"
       d="m 14392.959,-519.84361 v 189.99698"
       style="fill:none;stroke:#000000;stroke-width:18.9997;stroke-linecap:butt;stroke-linejoin:miter;stroke-miterlimit:4;stroke-dasharray:none;stroke-opacity:1;marker-end:url(#Arrow2Mend)"
       inkscape:connector-curvature="0"
       sodipodi:nodetypes="cc" />
    <path
       sodipodi:nodetypes="cc"
       inkscape:connector-curvature="0"
       style="fill:none;stroke:#000000;stroke-width:18.9997;stroke-linecap:butt;stroke-linejoin:miter;stroke-miterlimit:4;stroke-dasharray:none;stroke-opacity:1;marker-end:url(#Arrow2Mend)"
       d="m 14506.956,-519.84361 v 189.99698"
       id="path3100" />
    <path
       id="path3102"
       d="m 14620.953,-519.84361 v 189.99698"
       style="fill:none;stroke:#000000;stroke-width:18.9997;stroke-linecap:butt;stroke-linejoin:miter;stroke-miterlimit:4;stroke-dasharray:none;stroke-opacity:1;marker-end:url(#Arrow2Mend)"
       inkscape:connector-curvature="0"
       sodipodi:nodetypes="cc" />
    <path
       sodipodi:nodetypes="cc"
       inkscape:connector-curvature="0"
       style="fill:none;stroke:#000000;stroke-width:18.9997;stroke-linecap:butt;stroke-linejoin:miter;stroke-miterlimit:4;stroke-dasharray:none;stroke-opacity:1;marker-end:url(#Arrow2Mend)"
       d="m 14734.95,-519.84361 v 189.99698"
       id="path3104" />
    <path
       id="path3106"
       d="m 14848.947,-519.84361 v 189.99698"
       style="fill:none;stroke:#000000;stroke-width:18.9997;stroke-linecap:butt;stroke-linejoin:miter;stroke-miterlimit:4;stroke-dasharray:none;stroke-opacity:1;marker-end:url(#Arrow2Mend)"
       inkscape:connector-curvature="0"
       sodipodi:nodetypes="cc" />
    <path
       sodipodi:nodetypes="cc"
       inkscape:connector-curvature="0"
       style="fill:none;stroke:#000000;stroke-width:18.9997;stroke-linecap:butt;stroke-linejoin:miter;stroke-miterlimit:4;stroke-dasharray:none;stroke-opacity:1;marker-end:url(#Arrow2Mend)"
       d="m 14962.944,-519.84361 v 189.99698"
       id="path3108" />
    <path
       id="path3110"
       d="m 15114.94,-519.84361 v 189.99698"
       style="fill:none;stroke:#000000;stroke-width:18.9997;stroke-linecap:butt;stroke-linejoin:miter;stroke-miterlimit:4;stroke-dasharray:none;stroke-opacity:1;marker-end:url(#Arrow2Mend)"
       inkscape:connector-curvature="0"
       sodipodi:nodetypes="cc" />
    <path
       sodipodi:nodetypes="cc"
       inkscape:connector-curvature="0"
       style="fill:none;stroke:#000000;stroke-width:18.9997;stroke-linecap:butt;stroke-linejoin:miter;stroke-miterlimit:4;stroke-dasharray:none;stroke-opacity:1;marker-end:url(#Arrow2Mend)"
       d="m 15266.936,-519.84361 v 189.99698"
       id="path3112" />
    <path
       id="path3114"
       d="m 15380.933,-519.84361 v 189.99698"
       style="fill:none;stroke:#000000;stroke-width:18.9997;stroke-linecap:butt;stroke-linejoin:miter;stroke-miterlimit:4;stroke-dasharray:none;stroke-opacity:1;marker-end:url(#Arrow2Mend)"
       inkscape:connector-curvature="0"
       sodipodi:nodetypes="cc" />
    <path
       sodipodi:nodetypes="cc"
       inkscape:connector-curvature="0"
       style="fill:none;stroke:#000000;stroke-width:18.9997;stroke-linecap:butt;stroke-linejoin:miter;stroke-miterlimit:4;stroke-dasharray:none;stroke-opacity:1;marker-end:url(#Arrow2Mend)"
       d="m 15532.929,-519.84361 v 189.99698"
       id="path3116" />
    <path
       id="path3118"
       d="m 15646.926,-519.84361 v 189.99698"
       style="fill:none;stroke:#000000;stroke-width:18.9997;stroke-linecap:butt;stroke-linejoin:miter;stroke-miterlimit:4;stroke-dasharray:none;stroke-opacity:1;marker-end:url(#Arrow2Mend)"
       inkscape:connector-curvature="0"
       sodipodi:nodetypes="cc" />
    <path
       sodipodi:nodetypes="cc"
       inkscape:connector-curvature="0"
       style="fill:none;stroke:#000000;stroke-width:18.9997;stroke-linecap:butt;stroke-linejoin:miter;stroke-miterlimit:4;stroke-dasharray:none;stroke-opacity:1;marker-end:url(#Arrow2Mend)"
       d="m 15760.923,-519.84361 v 189.99698"
       id="path3120" />
    <path
       id="path3122"
       d="m 15912.919,-519.84361 v 189.99698"
       style="fill:none;stroke:#000000;stroke-width:18.9997;stroke-linecap:butt;stroke-linejoin:miter;stroke-miterlimit:4;stroke-dasharray:none;stroke-opacity:1;marker-end:url(#Arrow2Mend)"
       inkscape:connector-curvature="0"
       sodipodi:nodetypes="cc" />
    <path
       sodipodi:nodetypes="cc"
       inkscape:connector-curvature="0"
       style="fill:none;stroke:#000000;stroke-width:18.9997;stroke-linecap:butt;stroke-linejoin:miter;stroke-miterlimit:4;stroke-dasharray:none;stroke-opacity:1;marker-end:url(#Arrow2Mend)"
       d="m 16064.915,-519.84361 v 189.99698"
       id="path3124" />
    <path
       id="path3126"
       d="m 16216.911,-519.84361 v 189.99698"
       style="fill:none;stroke:#000000;stroke-width:18.9997;stroke-linecap:butt;stroke-linejoin:miter;stroke-miterlimit:4;stroke-dasharray:none;stroke-opacity:1;marker-end:url(#Arrow2Mend)"
       inkscape:connector-curvature="0"
       sodipodi:nodetypes="cc" />
    <path
       sodipodi:nodetypes="cc"
       inkscape:connector-curvature="0"
       style="fill:none;stroke:#000000;stroke-width:18.9997;stroke-linecap:butt;stroke-linejoin:miter;stroke-miterlimit:4;stroke-dasharray:none;stroke-opacity:1;marker-end:url(#Arrow2Mend)"
       d="m 16368.907,-519.84361 v 189.99698"
       id="path3128" />
    <path
       id="path3130"
       d="m 16520.903,-519.84361 v 189.99698"
       style="fill:none;stroke:#000000;stroke-width:18.9997;stroke-linecap:butt;stroke-linejoin:miter;stroke-miterlimit:4;stroke-dasharray:none;stroke-opacity:1;marker-end:url(#Arrow2Mend)"
       inkscape:connector-curvature="0"
       sodipodi:nodetypes="cc" />
    <path
       sodipodi:nodetypes="cc"
       inkscape:connector-curvature="0"
       style="fill:none;stroke:#000000;stroke-width:18.9997;stroke-linecap:butt;stroke-linejoin:miter;stroke-miterlimit:4;stroke-dasharray:none;stroke-opacity:1;marker-end:url(#Arrow2Mend)"
       d="m 16672.899,-519.84361 v 189.99698"
       id="path3132" />
    <path
       id="path3134"
       d="m 16824.895,-519.84361 v 189.99698"
       style="fill:none;stroke:#000000;stroke-width:18.9997;stroke-linecap:butt;stroke-linejoin:miter;stroke-miterlimit:4;stroke-dasharray:none;stroke-opacity:1;marker-end:url(#Arrow2Mend)"
       inkscape:connector-curvature="0"
       sodipodi:nodetypes="cc" />
    <path
       id="path3138"
       d="m 17128.887,-519.84361 v 189.99698"
       style="fill:none;stroke:#000000;stroke-width:18.9997;stroke-linecap:butt;stroke-linejoin:miter;stroke-miterlimit:4;stroke-dasharray:none;stroke-opacity:1;marker-end:url(#Arrow2Mend)"
       inkscape:connector-curvature="0"
       sodipodi:nodetypes="cc" />
    <path
       sodipodi:nodetypes="cc"
       inkscape:connector-curvature="0"
       style="fill:none;stroke:#000000;stroke-width:18.9997;stroke-linecap:butt;stroke-linejoin:miter;stroke-miterlimit:4;stroke-dasharray:none;stroke-opacity:1;marker-end:url(#Arrow2Mend)"
       d="m 17242.884,-519.84361 v 189.99698"
       id="path3140" />
    <path
       id="path3142"
       d="m 17356.881,-519.84361 v 189.99698"
       style="fill:none;stroke:#000000;stroke-width:18.9997;stroke-linecap:butt;stroke-linejoin:miter;stroke-miterlimit:4;stroke-dasharray:none;stroke-opacity:1;marker-end:url(#Arrow2Mend)"
       inkscape:connector-curvature="0"
       sodipodi:nodetypes="cc" />
  </g>
  <path
     inkscape:connector-curvature="0"
     id="path6483"
     d="m 16889.449,762.87571 189.997,-2.8055"
     style="fill:none;stroke:#000000;stroke-width:18.9997px;stroke-linecap:butt;stroke-linejoin:miter;stroke-opacity:1" />
  <path
     style="fill:none;stroke:#000000;stroke-width:18.9997px;stroke-linecap:butt;stroke-linejoin:miter;stroke-opacity:1"
     d="m 16889.449,724.87632 189.997,-2.8055"
     id="path6535"
     inkscape:connector-curvature="0" />
  <path
     inkscape:connector-curvature="0"
     id="path6537"
     d="m 16889.449,686.87692 189.997,-2.8055"
     style="fill:none;stroke:#000000;stroke-width:18.9997px;stroke-linecap:butt;stroke-linejoin:miter;stroke-opacity:1" />
  <path
     style="fill:none;stroke:#000000;stroke-width:18.9997px;stroke-linecap:butt;stroke-linejoin:miter;stroke-opacity:1"
     d="m 16889.449,648.87759 189.997,-2.80551"
     id="path6539"
     inkscape:connector-curvature="0" />
  <path
     inkscape:connector-curvature="0"
     id="path6541"
     d="m 16889.449,610.8782 189.997,-2.80551"
     style="fill:none;stroke:#000000;stroke-width:18.9997px;stroke-linecap:butt;stroke-linejoin:miter;stroke-opacity:1" />
  <path
     style="fill:none;stroke:#000000;stroke-width:18.9997px;stroke-linecap:butt;stroke-linejoin:miter;stroke-opacity:1"
     d="m 16889.449,572.87881 189.997,-2.80551"
     id="path6543"
     inkscape:connector-curvature="0" />
  <path
     inkscape:connector-curvature="0"
     id="path6545"
     d="m 16889.449,534.87942 189.997,-2.80551"
     style="fill:none;stroke:#000000;stroke-width:18.9997px;stroke-linecap:butt;stroke-linejoin:miter;stroke-opacity:1" />
  <path
     style="fill:none;stroke:#000000;stroke-width:18.9997px;stroke-linecap:butt;stroke-linejoin:miter;stroke-opacity:1"
     d="m 16889.449,496.88003 189.997,-2.80551"
     id="path6547"
     inkscape:connector-curvature="0" />
  <path
     inkscape:connector-curvature="0"
     id="path6549"
     d="m 16889.449,458.88064 189.997,-2.80551"
     style="fill:none;stroke:#000000;stroke-width:18.9997px;stroke-linecap:butt;stroke-linejoin:miter;stroke-opacity:1" />
  <path
     style="fill:none;stroke:#000000;stroke-width:18.9997px;stroke-linecap:butt;stroke-linejoin:miter;stroke-opacity:1"
     d="m 16889.449,420.88125 189.997,-2.80551"
     id="path6551"
     inkscape:connector-curvature="0" />
  <path
     inkscape:connector-curvature="0"
     id="path6553"
     d="m 16889.449,382.88186 189.997,-2.80551"
     style="fill:none;stroke:#000000;stroke-width:18.9997px;stroke-linecap:butt;stroke-linejoin:miter;stroke-opacity:1" />
  <path
     style="fill:none;stroke:#000000;stroke-width:18.9997px;stroke-linecap:butt;stroke-linejoin:miter;stroke-opacity:1"
     d="m 16889.449,344.88246 189.997,-2.80551"
     id="path6555"
     inkscape:connector-curvature="0" />
  <path
     inkscape:connector-curvature="0"
     id="path6557"
     d="m 16889.449,306.88307 189.997,-2.80551"
     style="fill:none;stroke:#000000;stroke-width:18.9997px;stroke-linecap:butt;stroke-linejoin:miter;stroke-opacity:1" />
  <path
     style="fill:none;stroke:#000000;stroke-width:18.9997px;stroke-linecap:butt;stroke-linejoin:miter;stroke-opacity:1"
     d="m 16889.449,268.88368 189.997,-2.80551"
     id="path6559"
     inkscape:connector-curvature="0" />
  <path
     inkscape:connector-curvature="0"
     id="path6561"
     d="m 16889.449,230.88429 189.997,-2.80551"
     style="fill:none;stroke:#000000;stroke-width:18.9997px;stroke-linecap:butt;stroke-linejoin:miter;stroke-opacity:1" />
  <path
     style="fill:none;stroke:#000000;stroke-width:18.9997px;stroke-linecap:butt;stroke-linejoin:miter;stroke-opacity:1"
     d="m 16889.449,192.8849 189.997,-2.80551"
     id="path6563"
     inkscape:connector-curvature="0" />
  <path
     inkscape:connector-curvature="0"
     id="path6565"
     d="m 16889.449,154.88552 189.997,-2.80551"
     style="fill:none;stroke:#000000;stroke-width:18.9997px;stroke-linecap:butt;stroke-linejoin:miter;stroke-opacity:1" />
  <path
     style="fill:none;stroke:#000000;stroke-width:18.9997px;stroke-linecap:butt;stroke-linejoin:miter;stroke-opacity:1"
     d="m 16889.449,116.88613 189.997,-2.80551"
     id="path6567"
     inkscape:connector-curvature="0" />
  <path
     inkscape:connector-curvature="0"
     id="path6569"
     d="m 16889.449,78.886738 189.997,-2.80551"
     style="fill:none;stroke:#000000;stroke-width:18.9997px;stroke-linecap:butt;stroke-linejoin:miter;stroke-opacity:1" />
  <path
     style="fill:none;stroke:#000000;stroke-width:18.9997px;stroke-linecap:butt;stroke-linejoin:miter;stroke-opacity:1"
     d="m 16965.447,40.887338 189.997,-2.80551"
     id="path6571"
     inkscape:connector-curvature="0" />
  <path
     inkscape:connector-curvature="0"
     id="path6573"
     d="m 17003.446,2.8879484 189.997,-2.80551"
     style="fill:none;stroke:#000000;stroke-width:18.9997px;stroke-linecap:butt;stroke-linejoin:miter;stroke-opacity:1" />
  <path
     style="fill:none;stroke:#000000;stroke-width:18.9997px;stroke-linecap:butt;stroke-linejoin:miter;stroke-opacity:1"
     d="m 17041.445,-35.111442 189.997,-2.80551"
     id="path6575"
     inkscape:connector-curvature="0" />
  <path
     inkscape:connector-curvature="0"
     id="path6577"
     d="m 17079.444,-73.110829 189.997,-2.80551"
     style="fill:none;stroke:#000000;stroke-width:18.9997px;stroke-linecap:butt;stroke-linejoin:miter;stroke-opacity:1" />
  <path
     style="fill:none;stroke:#000000;stroke-width:18.9997px;stroke-linecap:butt;stroke-linejoin:miter;stroke-opacity:1"
     d="m 17117.443,-111.11023 189.997,-2.80551"
     id="path6579"
     inkscape:connector-curvature="0" />
  <path
     inkscape:connector-curvature="0"
     id="path6581"
     d="m 17155.442,-149.10962 189.997,-2.80551"
     style="fill:none;stroke:#000000;stroke-width:18.9997px;stroke-linecap:butt;stroke-linejoin:miter;stroke-opacity:1" />
  <path
     style="fill:none;stroke:#000000;stroke-width:18.9997px;stroke-linecap:butt;stroke-linejoin:miter;stroke-opacity:1"
     d="m 17193.441,-187.10901 189.997,-2.80551"
     id="path6583"
     inkscape:connector-curvature="0" />
  <path
     inkscape:connector-curvature="0"
     id="path6585"
     d="m 17231.44,-225.10841 189.997,-2.80551"
     style="fill:none;stroke:#000000;stroke-width:18.9997px;stroke-linecap:butt;stroke-linejoin:miter;stroke-opacity:1" />
  <path
     style="fill:none;stroke:#000000;stroke-width:18.9997px;stroke-linecap:butt;stroke-linejoin:miter;stroke-opacity:1"
     d="m 17307.438,-263.1078 189.997,-2.80551"
     id="path6587"
     inkscape:connector-curvature="0" />
  <path
     inkscape:connector-curvature="0"
     id="path6589"
     d="m 17345.437,-301.10719 189.997,-2.80551"
     style="fill:none;stroke:#000000;stroke-width:18.9997px;stroke-linecap:butt;stroke-linejoin:miter;stroke-opacity:1" />
  <path
     style="fill:none;stroke:#000000;stroke-width:18.9997px;stroke-linecap:butt;stroke-linejoin:miter;stroke-opacity:1"
     d="m 17383.436,-339.10658 189.997,-2.80551"
     id="path6591"
     inkscape:connector-curvature="0" />
  <path
     inkscape:connector-curvature="0"
     id="path6593"
     d="m 17383.436,-301.10719 189.997,-2.80551"
     style="fill:none;stroke:#000000;stroke-width:18.9997px;stroke-linecap:butt;stroke-linejoin:miter;stroke-opacity:1" />
  <path
     style="fill:none;stroke:#000000;stroke-width:18.9997px;stroke-linecap:butt;stroke-linejoin:miter;stroke-opacity:1"
     d="m 17383.436,-263.1078 189.997,-2.80551"
     id="path6595"
     inkscape:connector-curvature="0" />
  <path
     inkscape:connector-curvature="0"
     id="path6597"
     d="m 17383.436,-225.10841 189.997,-2.80551"
     style="fill:none;stroke:#000000;stroke-width:18.9997px;stroke-linecap:butt;stroke-linejoin:miter;stroke-opacity:1" />
  <path
     style="fill:none;stroke:#000000;stroke-width:18.9997px;stroke-linecap:butt;stroke-linejoin:miter;stroke-opacity:1"
     d="m 17383.436,-187.10901 189.997,-2.80551"
     id="path6599"
     inkscape:connector-curvature="0" />
  <path
     inkscape:connector-curvature="0"
     id="path6601"
     d="m 17383.436,-149.10962 189.997,-2.80551"
     style="fill:none;stroke:#000000;stroke-width:18.9997px;stroke-linecap:butt;stroke-linejoin:miter;stroke-opacity:1" />
  <path
     style="fill:none;stroke:#000000;stroke-width:18.9997px;stroke-linecap:butt;stroke-linejoin:miter;stroke-opacity:1"
     d="m 17383.436,-111.11023 189.997,-2.80551"
     id="path6603"
     inkscape:connector-curvature="0" />
  <path
     inkscape:connector-curvature="0"
     id="path6605"
     d="m 17383.436,-73.110839 189.997,-2.80551"
     style="fill:none;stroke:#000000;stroke-width:18.9997px;stroke-linecap:butt;stroke-linejoin:miter;stroke-opacity:1" />
  <path
     style="fill:none;stroke:#000000;stroke-width:18.9997px;stroke-linecap:butt;stroke-linejoin:miter;stroke-opacity:1"
     d="m 17383.436,-35.111442 189.997,-2.80551"
     id="path6607"
     inkscape:connector-curvature="0" />
  <path
     inkscape:connector-curvature="0"
     id="path6609"
     d="m 17383.436,2.8879484 189.997,-2.80551"
     style="fill:none;stroke:#000000;stroke-width:18.9997px;stroke-linecap:butt;stroke-linejoin:miter;stroke-opacity:1" />
  <path
     style="fill:none;stroke:#000000;stroke-width:18.9997px;stroke-linecap:butt;stroke-linejoin:miter;stroke-opacity:1"
     d="m 17383.436,40.887338 189.997,-2.80551"
     id="path6611"
     inkscape:connector-curvature="0" />
  <path
     inkscape:connector-curvature="0"
     id="path6613"
     d="m 17383.436,78.886738 189.997,-2.80551"
     style="fill:none;stroke:#000000;stroke-width:18.9997px;stroke-linecap:butt;stroke-linejoin:miter;stroke-opacity:1" />
  <path
     style="fill:none;stroke:#000000;stroke-width:18.9997px;stroke-linecap:butt;stroke-linejoin:miter;stroke-opacity:1"
     d="m 17383.436,116.88613 189.997,-2.80551"
     id="path6615"
     inkscape:connector-curvature="0" />
  <path
     inkscape:connector-curvature="0"
     id="path6617"
     d="m 17383.436,154.88552 189.997,-2.80551"
     style="fill:none;stroke:#000000;stroke-width:18.9997px;stroke-linecap:butt;stroke-linejoin:miter;stroke-opacity:1" />
  <path
     style="fill:none;stroke:#000000;stroke-width:18.9997px;stroke-linecap:butt;stroke-linejoin:miter;stroke-opacity:1"
     d="m 17383.436,192.8849 189.997,-2.80551"
     id="path6619"
     inkscape:connector-curvature="0" />
  <path
     inkscape:connector-curvature="0"
     id="path6621"
     d="m 17383.436,230.88429 189.997,-2.80551"
     style="fill:none;stroke:#000000;stroke-width:18.9997px;stroke-linecap:butt;stroke-linejoin:miter;stroke-opacity:1" />
  <path
     style="fill:none;stroke:#000000;stroke-width:18.9997px;stroke-linecap:butt;stroke-linejoin:miter;stroke-opacity:1"
     d="m 17383.436,268.88368 189.997,-2.80551"
     id="path6623"
     inkscape:connector-curvature="0" />
  <path
     inkscape:connector-curvature="0"
     id="path6625"
     d="m 17383.436,306.88307 189.997,-2.80551"
     style="fill:none;stroke:#000000;stroke-width:18.9997px;stroke-linecap:butt;stroke-linejoin:miter;stroke-opacity:1" />
  <path
     style="fill:none;stroke:#000000;stroke-width:18.9997px;stroke-linecap:butt;stroke-linejoin:miter;stroke-opacity:1"
     d="m 17345.437,344.88246 189.997,-2.80551"
     id="path6627"
     inkscape:connector-curvature="0" />
  <path
     inkscape:connector-curvature="0"
     id="path6629"
     d="m 17307.438,382.88186 189.997,-2.80551"
     style="fill:none;stroke:#000000;stroke-width:18.9997px;stroke-linecap:butt;stroke-linejoin:miter;stroke-opacity:1" />
  <path
     style="fill:none;stroke:#000000;stroke-width:18.9997px;stroke-linecap:butt;stroke-linejoin:miter;stroke-opacity:1"
     d="m 17269.439,420.88125 189.997,-2.80551"
     id="path6631"
     inkscape:connector-curvature="0" />
  <path
     inkscape:connector-curvature="0"
     id="path6633"
     d="m 17231.44,458.88064 189.997,-2.80551"
     style="fill:none;stroke:#000000;stroke-width:18.9997px;stroke-linecap:butt;stroke-linejoin:miter;stroke-opacity:1" />
  <path
     style="fill:none;stroke:#000000;stroke-width:18.9997px;stroke-linecap:butt;stroke-linejoin:miter;stroke-opacity:1"
     d="m 17193.441,496.88003 189.997,-2.80551"
     id="path6635"
     inkscape:connector-curvature="0" />
  <path
     inkscape:connector-curvature="0"
     id="path6637"
     d="m 17155.442,534.87942 189.997,-2.80551"
     style="fill:none;stroke:#000000;stroke-width:18.9997px;stroke-linecap:butt;stroke-linejoin:miter;stroke-opacity:1" />
  <path
     style="fill:none;stroke:#000000;stroke-width:18.9997px;stroke-linecap:butt;stroke-linejoin:miter;stroke-opacity:1"
     d="m 17117.443,572.87881 189.997,-2.80551"
     id="path6639"
     inkscape:connector-curvature="0" />
  <path
     inkscape:connector-curvature="0"
     id="path6641"
     d="m 17079.444,610.8782 189.997,-2.80551"
     style="fill:none;stroke:#000000;stroke-width:18.9997px;stroke-linecap:butt;stroke-linejoin:miter;stroke-opacity:1" />
  <path
     style="fill:none;stroke:#000000;stroke-width:18.9997px;stroke-linecap:butt;stroke-linejoin:miter;stroke-opacity:1"
     d="m 17041.445,648.87759 189.997,-2.80551"
     id="path6643"
     inkscape:connector-curvature="0" />
  <path
     inkscape:connector-curvature="0"
     id="path6645"
     d="m 17003.446,686.87692 189.997,-2.8055"
     style="fill:none;stroke:#000000;stroke-width:18.9997px;stroke-linecap:butt;stroke-linejoin:miter;stroke-opacity:1" />
  <path
     style="fill:none;stroke:#000000;stroke-width:18.9997px;stroke-linecap:butt;stroke-linejoin:miter;stroke-opacity:1"
     d="m 16965.447,724.87632 189.997,-2.8055"
     id="path6647"
     inkscape:connector-curvature="0" />
  <path
     inkscape:connector-curvature="0"
     id="path6668"
     d="m 16965.447,762.87571 189.997,-2.8055"
     style="fill:none;stroke:#000000;stroke-width:18.9997px;stroke-linecap:butt;stroke-linejoin:miter;stroke-opacity:1" />
  <path
     style="fill:none;stroke:#000000;stroke-width:28.4995;stroke-linecap:butt;stroke-linejoin:miter;stroke-miterlimit:4;stroke-dasharray:none;stroke-opacity:1;marker-end:url(#Arrow2Mend)"
     d="m 13971.602,-735.20049 -511.91,418.438"
     id="path4563"
     inkscape:connector-curvature="0"
     sodipodi:nodetypes="cc" />
  <text
     style="font-style:normal;font-variant:normal;font-weight:normal;font-stretch:normal;font-size:270.242px;line-height:0%;font-family:sans-serif;-inkscape-font-specification:sans-serif;text-align:end;writing-mode:lr-tb;text-anchor:end;fill:#000000;stroke:none"
     id="text4565"
     font-size="328"
     font-weight="normal"
     font-style="normal"
     y="-610.41174"
     x="13689.71"
     xml:space="preserve">36 kN</text>
</svg>
