<?xml version="1.0" encoding="UTF-8" standalone="no"?>
<svg
   xmlns:dc="http://purl.org/dc/elements/1.1/"
   xmlns:cc="http://creativecommons.org/ns#"
   xmlns:rdf="http://www.w3.org/1999/02/22-rdf-syntax-ns#"
   xmlns:svg="http://www.w3.org/2000/svg"
   xmlns="http://www.w3.org/2000/svg"
   xmlns:sodipodi="http://sodipodi.sourceforge.net/DTD/sodipodi-0.dtd"
   xmlns:inkscape="http://www.inkscape.org/namespaces/inkscape"
   version="1.0"
   inkscape:output_extension="org.inkscape.output.svg.inkscape"
   sodipodi:docname="figure4-E.svg"
   inkscape:version="1.0 (d6d20de3af, 2020-06-22)"
   sodipodi:version="0.32"
   id="svg2552"
   viewBox="12132 -659 5138.4131 1220.9203"
   height="75.16555"
   width="270.44711">
  <metadata
     id="metadata2699">
    <rdf:RDF>
      <cc:Work
         rdf:about="">
        <dc:format>image/svg+xml</dc:format>
        <dc:type
           rdf:resource="http://purl.org/dc/dcmitype/StillImage" />
        <dc:title />
      </cc:Work>
    </rdf:RDF>
  </metadata>
  <defs
     id="defs2697">
    <marker
       style="overflow:visible"
       id="Arrow2Mend"
       refX="0"
       refY="0"
       orient="auto"
       inkscape:stockid="Arrow2Mend">
      <path
         inkscape:connector-curvature="0"
         transform="scale(-0.6)"
         d="M 8.7185878,4.0337352 -2.2072895,0.01601326 8.7185884,-4.0017078 c -1.7454984,2.3720609 -1.7354408,5.6174519 -6e-7,8.035443 z"
         style="font-size:12px;fill-rule:evenodd;stroke-width:0.625;stroke-linejoin:round"
         id="path4488" />
    </marker>
    <marker
       style="overflow:visible"
       id="Arrow1Send"
       refX="0"
       refY="0"
       orient="auto"
       inkscape:stockid="Arrow1Send">
      <path
         inkscape:connector-curvature="0"
         transform="matrix(-0.2,0,0,-0.2,-1.2,0)"
         style="fill-rule:evenodd;stroke:#000000;stroke-width:1pt;marker-start:none"
         d="M 0,0 5,-5 -12.5,0 5,5 Z"
         id="path3252" />
    </marker>
    <marker
       style="overflow:visible"
       id="Arrow2Send"
       refX="0"
       refY="0"
       orient="auto"
       inkscape:stockid="Arrow2Send">
      <path
         inkscape:connector-curvature="0"
         transform="matrix(-0.3,0,0,-0.3,0.69,0)"
         d="M 8.7185878,4.0337352 -2.2072895,0.01601326 8.7185884,-4.0017078 c -1.7454984,2.3720609 -1.7354408,5.6174519 -6e-7,8.035443 z"
         style="font-size:12px;fill-rule:evenodd;stroke-width:0.625;stroke-linejoin:round"
         id="path3270" />
    </marker>
    <marker
       style="overflow:visible"
       id="Arrow1Sstart"
       refX="0"
       refY="0"
       orient="auto"
       inkscape:stockid="Arrow1Sstart">
      <path
         inkscape:connector-curvature="0"
         transform="matrix(0.2,0,0,0.2,1.2,0)"
         style="fill-rule:evenodd;stroke:#000000;stroke-width:1pt;marker-start:none"
         d="M 0,0 5,-5 -12.5,0 5,5 Z"
         id="path3249" />
    </marker>
    <marker
       style="overflow:visible"
       id="TriangleInM"
       refX="0"
       refY="0"
       orient="auto"
       inkscape:stockid="TriangleInM">
      <path
         inkscape:connector-curvature="0"
         transform="scale(-0.4)"
         style="fill-rule:evenodd;stroke:#000000;stroke-width:1pt;marker-start:none"
         d="M 5.77,0 -2.88,5 V -5 Z"
         id="path3374" />
    </marker>
    <marker
       style="overflow:visible"
       id="TriangleOutL"
       refX="0"
       refY="0"
       orient="auto"
       inkscape:stockid="TriangleOutL">
      <path
         inkscape:connector-curvature="0"
         transform="scale(0.8)"
         style="fill-rule:evenodd;stroke:#000000;stroke-width:1pt;marker-start:none"
         d="M 5.77,0 -2.88,5 V -5 Z"
         id="path3380" />
    </marker>
    <marker
       style="overflow:visible"
       id="TriangleOutM"
       refX="0"
       refY="0"
       orient="auto"
       inkscape:stockid="TriangleOutM">
      <path
         inkscape:connector-curvature="0"
         transform="scale(0.4)"
         style="fill-rule:evenodd;stroke:#000000;stroke-width:1pt;marker-start:none"
         d="M 5.77,0 -2.88,5 V -5 Z"
         id="path3383" />
    </marker>
    <marker
       style="overflow:visible"
       id="EmptyTriangleOutL"
       refX="0"
       refY="0"
       orient="auto"
       inkscape:stockid="EmptyTriangleOutL">
      <path
         inkscape:connector-curvature="0"
         transform="matrix(0.8,0,0,0.8,-4.8,0)"
         style="fill:#ffffff;fill-rule:evenodd;stroke:#000000;stroke-width:1pt;marker-start:none"
         d="M 5.77,0 -2.88,5 V -5 Z"
         id="path3398" />
    </marker>
    <marker
       style="overflow:visible"
       id="EmptyTriangleInM"
       refX="0"
       refY="0"
       orient="auto"
       inkscape:stockid="EmptyTriangleInM">
      <path
         inkscape:connector-curvature="0"
         transform="matrix(-0.4,0,0,-0.4,1.8,0)"
         style="fill:#ffffff;fill-rule:evenodd;stroke:#000000;stroke-width:1pt;marker-start:none"
         d="M 5.77,0 -2.88,5 V -5 Z"
         id="path3392" />
    </marker>
    <marker
       style="overflow:visible"
       id="Arrow1Mend"
       refX="0"
       refY="0"
       orient="auto"
       inkscape:stockid="Arrow1Mend">
      <path
         inkscape:connector-curvature="0"
         transform="matrix(-0.4,0,0,-0.4,-4,0)"
         style="fill-rule:evenodd;stroke:#000000;stroke-width:1pt;marker-start:none"
         d="M 0,0 5,-5 -12.5,0 5,5 Z"
         id="path3246" />
    </marker>
    <marker
       style="overflow:visible"
       id="Arrow1Mstart"
       refX="0"
       refY="0"
       orient="auto"
       inkscape:stockid="Arrow1Mstart">
      <path
         inkscape:connector-curvature="0"
         transform="matrix(0.4,0,0,0.4,4,0)"
         style="fill-rule:evenodd;stroke:#000000;stroke-width:1pt;marker-start:none"
         d="M 0,0 5,-5 -12.5,0 5,5 Z"
         id="path3560" />
    </marker>
    <marker
       style="overflow:visible"
       id="Arrow1Lstart"
       refX="0"
       refY="0"
       orient="auto"
       inkscape:stockid="Arrow1Lstart">
      <path
         inkscape:connector-curvature="0"
         transform="matrix(0.8,0,0,0.8,10,0)"
         style="fill-rule:evenodd;stroke:#000000;stroke-width:1pt;marker-start:none"
         d="M 0,0 5,-5 -12.5,0 5,5 Z"
         id="path3554" />
    </marker>
    <inkscape:perspective
       id="perspective2701"
       inkscape:persp3d-origin="297 : 69.935631 : 1"
       inkscape:vp_z="594 : 104.43563 : 1"
       inkscape:vp_y="0 : 999.99997 : 0"
       inkscape:vp_x="0 : 104.43563 : 1"
       sodipodi:type="inkscape:persp3d" />
  </defs>
  <sodipodi:namedview
     inkscape:document-rotation="0"
     inkscape:window-maximized="1"
     fit-margin-bottom="0"
     fit-margin-right="0"
     fit-margin-left="0"
     fit-margin-top="0"
     inkscape:current-layer="svg2552"
     inkscape:window-y="27"
     inkscape:window-x="72"
     inkscape:cy="45.762184"
     inkscape:cx="65.138716"
     inkscape:zoom="2.1661337"
     inkscape:snap-global="true"
     showgrid="true"
     id="base"
     pagecolor="#ffffff"
     bordercolor="#666666"
     borderopacity="1.0"
     objecttolerance="10.0"
     gridtolerance="10.0"
     guidetolerance="10.0"
     inkscape:pageopacity="0.0"
     inkscape:pageshadow="2"
     inkscape:window-width="1656"
     inkscape:window-height="1088">
    <inkscape:grid
       originy="-3.315961"
       originx="0.0061075152"
       snapvisiblegridlinesonly="true"
       empspacing="5"
       enabled="true"
       visible="true"
       id="grid2775"
       type="xygrid" />
  </sodipodi:namedview>
  <path
     inkscape:connector-curvature="0"
     sodipodi:nodetypes="ccccssc"
     id="path3294"
     d="m 14211.459,-738.29634 c -949.985,1044.98332 10.126,-21.63475 -939.859,1023.34857 -1044.983,-488.39585 0,-13.40342 -1044.983,-474.99242 l 3895.326,-5.34941 c -10.514,26.98415 1.314,18.01486 0,21.38788 -0.657,1.68651 -1900.358,445.55053 -1900.358,445.55053 0,-1044.98333 0,0 -10.126,-1009.94515 z"
     style="fill:#c8c8c8;fill-opacity:1;fill-rule:evenodd;stroke:#000000;stroke-width:18.9997;stroke-linecap:butt;stroke-linejoin:miter;stroke-miterlimit:4;stroke-dasharray:none;stroke-opacity:1" />
  <g
     transform="translate(-7634.5812,-724.78499)"
     style="stroke:#000000;stroke-width:0"
     id="g2558">
    <defs
       id="defs2560">
      <pattern
         id="tile1"
         x="0"
         y="0"
         width="200"
         height="200"
         patternUnits="userSpaceOnUse">
        <path
           d="M 100 0 0 100"
           id="path2563" />
        <path
           d="M 200 0 0 200"
           id="path2565" />
        <path
           d="M 200 100 100 200"
           id="path2567" />
      </pattern>
    </defs>
  </g>
  <g
     transform="translate(-7634.5812,-724.78499)"
     style="stroke:#000000;stroke-width:0"
     id="g2589">
    <defs
       id="defs2591">
      <pattern
         id="tile2"
         x="0"
         y="0"
         width="200"
         height="200"
         patternUnits="userSpaceOnUse">
        <path
           d="M 100 0 0 100"
           id="path2594" />
        <path
           d="M 200 0 0 200"
           id="path2596" />
        <path
           d="M 200 100 100 200"
           id="path2598" />
      </pattern>
    </defs>
  </g>
  <g
     transform="translate(-7634.5812,-724.78499)"
     style="stroke:#000000;stroke-width:0"
     id="g2604">
    <defs
       id="defs2606">
      <pattern
         id="tile3"
         x="0"
         y="0"
         width="200"
         height="200"
         patternUnits="userSpaceOnUse">
        <path
           d="M 50 0 50 200"
           id="path2609" />
        <path
           d="M 150 0 150 200"
           id="path2611" />
      </pattern>
    </defs>
  </g>
  <g
     transform="translate(-7634.5812,-724.78499)"
     style="stroke:#000000;stroke-width:0"
     id="g2617">
    <defs
       id="defs2619">
      <pattern
         id="tile4"
         x="0"
         y="0"
         width="200"
         height="200"
         patternUnits="userSpaceOnUse">
        <path
           d="M 50 0 50 200"
           id="path2622" />
        <path
           d="M 150 0 150 200"
           id="path2624" />
      </pattern>
    </defs>
  </g>
  <polyline
     transform="matrix(0.9933532,0,0,1,-1242.386,-954.70786)"
     points="13559,755 17480,755 "
     style="stroke:#000000;stroke-width:47.6579;stroke-linecap:butt;stroke-linejoin:miter;stroke-miterlimit:4;stroke-dasharray:none"
     id="polyline2638" />
  <path
     d="m 12236.036,-208.09585 85.578,141.385837 -165.233,3.419392 z"
     inkscape:randomized="0"
     inkscape:rounded="0"
     inkscape:flatsided="true"
     sodipodi:arg2="-0.54429024"
     sodipodi:arg1="-1.5914878"
     sodipodi:r2="47.708725"
     sodipodi:r1="95.41745"
     sodipodi:cy="-112.69883"
     sodipodi:cx="12238.01"
     sodipodi:sides="3"
     id="path3319"
     style="fill:#ffffff;stroke:#000000;stroke-width:28.4995;stroke-miterlimit:4;stroke-dasharray:none;stroke-opacity:1"
     sodipodi:type="star" />
  <text
     xml:space="preserve"
     x="5805.4185"
     y="503.21506"
     font-style="normal"
     font-weight="normal"
     font-size="328"
     id="text2688"
     style="font-style:normal;font-variant:normal;font-weight:normal;font-stretch:normal;font-size:162.145px;line-height:0%;font-family:'Nimbus Roman No9 L';-inkscape-font-specification:'Nimbus Roman No9 L';text-align:end;writing-mode:lr-tb;text-anchor:end;fill:#000000;stroke:#000000;stroke-width:0.025in"><tspan
       id="tspan12357"
       style="font-style:normal;font-variant:normal;font-weight:normal;font-stretch:normal;font-size:20px;line-height:100%;font-family:'Nimbus Roman No9 L';-inkscape-font-specification:'Nimbus Roman No9 L';text-align:end;writing-mode:lr-tb;text-anchor:end;stroke:none" /></text>
  <path
     inkscape:connector-curvature="0"
     style="fill:none;stroke:#000000;stroke-width:18.9997;stroke-linecap:butt;stroke-linejoin:miter;stroke-miterlimit:4;stroke-dasharray:none;stroke-opacity:1;marker-start:url(#Arrow1Mstart);marker-end:url(#Arrow2Mend)"
     d="m 16406.55,-192.61793 c 0,-539.08156 0,-539.08156 0,-539.08156"
     id="path5072" />
  <g
     transform="translate(-55.352134,75.644363)"
     id="g3066">
    <path
       id="path5074"
       d="m 16111.422,541.63459 c -1832.587,0 -1832.587,0 -1832.587,0"
       style="fill:none;stroke:#000000;stroke-width:18.9997;stroke-linecap:butt;stroke-linejoin:miter;stroke-miterlimit:4;stroke-dasharray:none;stroke-opacity:1;marker-start:url(#Arrow1Mstart);marker-end:url(#Arrow2Mend)"
       inkscape:connector-curvature="0" />
    <text
       id="text5076"
       y="484.63553"
       x="15075.273"
       style="font-style:normal;font-variant:normal;font-weight:normal;font-stretch:normal;line-height:0%;font-family:'Nimbus Roman No9 L';-inkscape-font-specification:'Nimbus Roman No9 L';text-align:center;writing-mode:lr-tb;text-anchor:middle;fill:#000000;fill-opacity:1;stroke:none"
       xml:space="preserve"><tspan
         style="font-size:265.996px;line-height:1.25;text-align:center;text-anchor:middle"
         id="tspan5080"
         y="484.63553"
         x="15075.273"
         sodipodi:role="line">2 m</tspan></text>
  </g>
  <text
     id="text5090"
     y="-389.70499"
     x="16539.547"
     style="font-style:normal;font-variant:normal;font-weight:normal;font-stretch:normal;line-height:0%;font-family:'Nimbus Roman No9 L';-inkscape-font-specification:'Nimbus Roman No9 L';text-align:start;writing-mode:lr-tb;text-anchor:start;fill:#000000;fill-opacity:1;stroke:none"
     xml:space="preserve"><tspan
       style="font-size:265.996px;line-height:1.25"
       id="tspan5094"
       y="-389.70499"
       x="16539.547"
       sodipodi:role="line">8 kNm</tspan></text>
  <path
     inkscape:connector-curvature="0"
     id="path3293"
     d="m 13181.079,617.27894 c -954.446,0 -954.446,0 -954.446,0"
     style="fill:none;stroke:#000000;stroke-width:18.9997;stroke-linecap:butt;stroke-linejoin:miter;stroke-miterlimit:4;stroke-dasharray:none;stroke-opacity:1;marker-start:url(#Arrow1Mstart);marker-end:url(#Arrow2Mend)" />
  <path
     inkscape:connector-curvature="0"
     style="fill:none;stroke:#000000;stroke-width:18.9997;stroke-linecap:butt;stroke-linejoin:miter;stroke-miterlimit:4;stroke-dasharray:none;stroke-opacity:1;marker-start:url(#Arrow1Mstart);marker-end:url(#Arrow2Mend)"
     d="m 14188.063,617.27894 c -954.446,0 -954.446,0 -954.446,0"
     id="path3295" />
  <text
     id="text3297"
     y="560.27991"
     x="12699.669"
     style="font-style:normal;font-variant:normal;font-weight:normal;font-stretch:normal;line-height:0%;font-family:'Nimbus Roman No9 L';-inkscape-font-specification:'Nimbus Roman No9 L';text-align:center;writing-mode:lr-tb;text-anchor:middle;fill:#000000;fill-opacity:1;stroke:none"
     xml:space="preserve"><tspan
       style="font-size:265.996px;line-height:1.25;text-align:center;text-anchor:middle"
       id="tspan3301"
       y="560.27991"
       x="12699.669"
       sodipodi:role="line">1 m</tspan></text>
  <text
     xml:space="preserve"
     style="font-style:normal;font-variant:normal;font-weight:normal;font-stretch:normal;line-height:0%;font-family:'Nimbus Roman No9 L';-inkscape-font-specification:'Nimbus Roman No9 L';text-align:center;writing-mode:lr-tb;text-anchor:middle;fill:#000000;fill-opacity:1;stroke:none"
     x="13687.669"
     y="560.27991"
     id="text3303"><tspan
       style="font-size:265.996px;line-height:1.25;text-align:center;text-anchor:middle"
       sodipodi:role="line"
       x="13687.669"
       y="560.27991"
       id="tspan3307">1 m</tspan></text>
  <path
     inkscape:connector-curvature="0"
     sodipodi:nodetypes="cc"
     id="path3296"
     d="m 16406.55,275.2844 c 0,-249.853623 0.01,-455.27511 0.01,-455.27511"
     style="fill:none;stroke:#000000;stroke-width:18.9997;stroke-linecap:butt;stroke-linejoin:miter;stroke-miterlimit:4;stroke-dasharray:none;stroke-opacity:1;marker-start:url(#Arrow1Mstart);marker-end:url(#Arrow2Mend)" />
  <text
     xml:space="preserve"
     style="font-style:normal;font-variant:normal;font-weight:normal;font-stretch:normal;line-height:0%;font-family:'Nimbus Roman No9 L';-inkscape-font-specification:'Nimbus Roman No9 L';text-align:start;writing-mode:lr-tb;text-anchor:start;fill:#000000;fill-opacity:1;stroke:none"
     x="16539.547"
     y="104.28713"
     id="text3298"><tspan
       style="font-size:265.996px;line-height:1.25"
       sodipodi:role="line"
       x="16539.547"
       y="104.28713"
       id="tspan3302">8 kNm</tspan></text>
  <g
     transform="translate(-1889.8377,37.644966)"
     id="g3856">
    <path
       sodipodi:type="star"
       style="fill:#ffffff;fill-opacity:1;fill-rule:evenodd;stroke:#000000;stroke-width:28.4995;stroke-miterlimit:4;stroke-dasharray:none;stroke-opacity:1"
       id="path3858"
       sodipodi:sides="3"
       sodipodi:cx="13746.974"
       sodipodi:cy="-1234.603"
       sodipodi:r1="95.41745"
       sodipodi:r2="47.708725"
       sodipodi:arg1="-1.5914878"
       sodipodi:arg2="-0.54429024"
       inkscape:flatsided="true"
       inkscape:rounded="0"
       inkscape:randomized="0"
       d="m 13744.999,-1330.0001 85.578,141.3859 -165.233,3.4194 z"
       transform="translate(2356.8438,1122.2586)" />
    <path
       inkscape:connector-curvature="0"
       id="path3860"
       d="m 16016.423,-9.3566766 c 189.997,0 189.997,0 189.997,0"
       style="fill:none;stroke:#000000;stroke-width:28.4995;stroke-linecap:butt;stroke-linejoin:miter;stroke-miterlimit:4;stroke-dasharray:none;stroke-opacity:1" />
  </g>
</svg>
