<?xml version="1.0" encoding="UTF-8" standalone="no"?>
<svg
   xmlns:dc="http://purl.org/dc/elements/1.1/"
   xmlns:cc="http://creativecommons.org/ns#"
   xmlns:rdf="http://www.w3.org/1999/02/22-rdf-syntax-ns#"
   xmlns:svg="http://www.w3.org/2000/svg"
   xmlns="http://www.w3.org/2000/svg"
   xmlns:sodipodi="http://sodipodi.sourceforge.net/DTD/sodipodi-0.dtd"
   xmlns:inkscape="http://www.inkscape.org/namespaces/inkscape"
   width="101.33586mm"
   height="70.525604mm"
   viewBox="0 0 101.33586 70.525604"
   version="1.1"
   id="svg5106"
   inkscape:version="1.0 (229008a164, 2020-05-09)"
   sodipodi:docname="11-transformace_souradnic-2.svg">
  <defs
     id="defs5100">
    <marker
       inkscape:isstock="true"
       style="overflow:visible"
       id="marker1877"
       refX="0"
       refY="0"
       orient="auto"
       inkscape:stockid="TriangleOutM">
      <path
         transform="scale(0.4)"
         style="fill:#0000ff;fill-opacity:1;fill-rule:evenodd;stroke:#000000;stroke-width:1pt;stroke-opacity:1"
         d="M 5.77,0 -2.88,5 V -5 Z"
         id="path1875" />
    </marker>
    <marker
       inkscape:stockid="DotM"
       orient="auto"
       refY="0"
       refX="0"
       id="marker1753"
       style="overflow:visible"
       inkscape:isstock="true">
      <path
         id="path1751"
         d="m -2.5,-1 c 0,2.76 -2.24,5 -5,5 -2.76,0 -5,-2.24 -5,-5 0,-2.76 2.24,-5 5,-5 2.76,0 5,2.24 5,5 z"
         style="fill:#000000;fill-opacity:1;fill-rule:evenodd;stroke:#000000;stroke-width:1pt;stroke-opacity:1"
         transform="matrix(0.4,0,0,0.4,2.96,0.4)" />
    </marker>
    <marker
       inkscape:stockid="DotM"
       orient="auto"
       refY="0"
       refX="0"
       id="DotM"
       style="overflow:visible"
       inkscape:isstock="true">
      <path
         id="path1133"
         d="m -2.5,-1 c 0,2.76 -2.24,5 -5,5 -2.76,0 -5,-2.24 -5,-5 0,-2.76 2.24,-5 5,-5 2.76,0 5,2.24 5,5 z"
         style="fill:#000000;fill-opacity:1;fill-rule:evenodd;stroke:#000000;stroke-width:1pt;stroke-opacity:1"
         transform="matrix(0.4,0,0,0.4,2.96,0.4)" />
    </marker>
    <marker
       inkscape:isstock="true"
       style="overflow:visible"
       id="marker927"
       refX="0"
       refY="0"
       orient="auto"
       inkscape:stockid="TriangleOutM">
      <path
         transform="scale(0.4)"
         style="fill:#000000;fill-opacity:1;fill-rule:evenodd;stroke:#000000;stroke-width:1pt;stroke-opacity:1"
         d="M 5.77,0 -2.88,5 V -5 Z"
         id="path925" />
    </marker>
    <marker
       inkscape:isstock="true"
       style="overflow:visible"
       id="marker6286"
       refX="0"
       refY="0"
       orient="auto"
       inkscape:stockid="TriangleOutM">
      <path
         transform="scale(0.4)"
         style="fill:#0000ff;fill-opacity:1;fill-rule:evenodd;stroke:#000000;stroke-width:1pt;stroke-opacity:1"
         d="M 5.77,0 -2.88,5 V -5 Z"
         id="path6284" />
    </marker>
    <marker
       inkscape:stockid="TriangleOutM"
       orient="auto"
       refY="0"
       refX="0"
       id="marker1955"
       style="overflow:visible"
       inkscape:isstock="true"
       inkscape:collect="always">
      <path
         id="path1953"
         d="M 5.77,0 -2.88,5 V -5 Z"
         style="fill:#000000;fill-opacity:1;fill-rule:evenodd;stroke:#000000;stroke-width:1pt;stroke-opacity:1"
         transform="scale(0.4)" />
    </marker>
    <marker
       inkscape:isstock="true"
       style="overflow:visible"
       id="marker2701"
       refX="0"
       refY="0"
       orient="auto"
       inkscape:stockid="TriangleOutM"
       inkscape:collect="always">
      <path
         transform="scale(0.4)"
         style="fill:#000000;fill-opacity:1;fill-rule:evenodd;stroke:#000000;stroke-width:1pt;stroke-opacity:1"
         d="M 5.77,0 -2.88,5 V -5 Z"
         id="path2699" />
    </marker>
    <marker
       inkscape:isstock="true"
       style="overflow:visible"
       id="marker3065"
       refX="0"
       refY="0"
       orient="auto"
       inkscape:stockid="TriangleOutM">
      <path
         transform="scale(0.4)"
         style="fill:#0000ff;fill-opacity:1;fill-rule:evenodd;stroke:#0000ff;stroke-width:1pt;stroke-opacity:1"
         d="M 5.77,0 -2.88,5 V -5 Z"
         id="path3063" />
    </marker>
    <marker
       inkscape:stockid="TriangleOutM"
       orient="auto"
       refY="0"
       refX="0"
       id="marker3075"
       style="overflow:visible"
       inkscape:isstock="true"
       inkscape:collect="always">
      <path
         id="path3073"
         d="M 5.77,0 -2.88,5 V -5 Z"
         style="fill:#0000ff;fill-opacity:1;fill-rule:evenodd;stroke:#0000ff;stroke-width:1pt;stroke-opacity:1"
         transform="scale(0.4)" />
    </marker>
    <marker
       inkscape:stockid="Arrow1Mstart"
       orient="auto"
       refY="0"
       refX="0"
       id="Arrow1Mstart"
       style="overflow:visible"
       inkscape:isstock="true">
      <path
         id="path1637"
         d="M 0,0 5,-5 -12.5,0 5,5 Z"
         style="fill:#000000;fill-opacity:1;fill-rule:evenodd;stroke:#000000;stroke-width:1pt;stroke-opacity:1"
         transform="matrix(0.4,0,0,0.4,4,0)" />
    </marker>
  </defs>
  <sodipodi:namedview
     inkscape:window-maximized="1"
     inkscape:window-y="27"
     inkscape:window-x="72"
     inkscape:window-height="1088"
     inkscape:window-width="1656"
     showgrid="false"
     inkscape:document-rotation="0"
     inkscape:current-layer="layer1"
     inkscape:document-units="mm"
     inkscape:cy="107.8151"
     inkscape:cx="339.12096"
     inkscape:zoom="1.4"
     inkscape:pageshadow="2"
     inkscape:pageopacity="0.0"
     borderopacity="1.0"
     bordercolor="#666666"
     pagecolor="#ffffff"
     id="base"
     fit-margin-top="0"
     fit-margin-left="0"
     fit-margin-right="0"
     fit-margin-bottom="0" />
  <metadata
     id="metadata5103">
    <rdf:RDF>
      <cc:Work
         rdf:about="">
        <dc:format>image/svg+xml</dc:format>
        <dc:type
           rdf:resource="http://purl.org/dc/dcmitype/StillImage" />
        <dc:title></dc:title>
      </cc:Work>
    </rdf:RDF>
  </metadata>
  <g
     id="layer1"
     inkscape:groupmode="layer"
     inkscape:label="Layer 1"
     transform="translate(-47.661972,-6.6374973)">
    <path
       style="opacity:0.25;fill:#999999;fill-opacity:1"
       id="path2"
       d="m 97.42515,45.705521 c -1.03245,0.210887 -2.342575,0.232875 -3.322277,0.270863 -1.155595,0.0449 -1.851329,0.112204 -2.266393,0.370265 -0.41517,0.257958 -0.549772,0.706878 -0.381519,1.256548 0.16836,0.54967 0.639579,1.200499 1.054644,1.682972 0.415067,0.48247 0.774079,0.79658 1.065897,1.256549 0.291712,0.459969 0.516018,1.065791 0.740427,1.503359 0.224307,0.437571 0.448716,0.706779 0.931185,0.908787 0.482367,0.201909 1.222901,0.336617 1.907276,0.415068 0.684378,0.07855 1.312707,0.101057 1.761525,0.123352 0.448818,0.02251 0.71803,0.045 0.807833,-0.100954 0.0897,-0.145856 0,-0.459966 -0.224409,-0.875136 -0.224307,-0.415064 -0.583322,-0.931189 -0.908787,-1.245299 -0.325364,-0.314215 -0.617076,-0.42642 -0.886284,-0.370265 -0.269314,0.05605 -0.516121,0.280356 -0.71803,0.426315 -0.202007,0.145753 -0.359015,0.213056 -0.561022,0.168257 -0.201909,-0.0449 -0.448822,-0.201909 -0.695629,-0.370163 -0.24681,-0.168359 -0.49362,-0.347867 -0.768505,-0.718029 -0.274888,-0.370265 -0.57785,-0.931186 -0.774185,-1.323954 -0.196331,-0.392667 -0.286138,-0.617076 -0.213159,-0.729178 0.07288,-0.112204 0.30854,-0.112204 0.919935,-0.02251 0.611502,0.08981 1.598846,0.269208 2.490805,0.555346 0.891964,0.286036 1.688441,0.678805 2.361671,0.875242 0.673231,0.196434 1.222901,0.196331 1.795081,0.05048 0.31979,-0.08155 0.6467,-0.208615 0.96979,-0.420535 0.11272,0.03397 0.22669,0.06606 0.34158,0.09651 0.97794,0.259302 2.02185,0.405362 3.20367,0.560923 1.18182,0.155558 2.50133,0.32051 3.9505,0.273336 1.44927,-0.04717 3.02798,-0.30637 4.57139,-0.577331 1.54342,-0.270965 3.05163,-0.553696 4.08831,-0.54193 1.03689,0.01178 1.60235,0.318036 2.06201,0.683344 0.45945,0.36521 0.81289,0.789358 1.40199,1.213506 0.5891,0.424149 1.41376,0.8483 2.5802,1.272449 1.16643,0.424148 2.67454,0.848296 3.68779,1.225274 1.01325,0.377077 1.53175,0.706981 1.94413,1.142898 0.41238,0.435917 0.71865,0.977949 1.03679,1.649423 0.31813,0.671682 0.64804,1.472805 1.06031,2.085439 0.41249,0.61274 0.90724,1.036785 1.51998,1.437502 0.61274,0.400615 1.34316,0.777589 1.9558,1.154564 0.61274,0.377081 1.10749,0.754158 1.70836,1.048657 0.60087,0.294601 1.30785,0.506624 1.63775,0.376975 0.32981,-0.129547 0.28274,-0.600763 0.17672,-1.119262 -0.106,-0.518495 -0.27096,-1.083959 -0.42414,-1.543512 -0.15308,-0.459451 -0.2946,-0.812892 -0.76582,-0.966078 -0.47122,-0.153081 -1.27245,-0.10601 -1.63766,-0.23566 -0.36521,-0.129547 -0.2946,-0.435916 -0.50663,-0.636171 -0.21202,-0.200254 -0.70687,-0.294499 -1.28421,-0.530161 -0.57733,-0.235659 -1.23704,-0.61274 -1.68483,-1.1782 -0.44768,-0.565567 -0.68324,-1.31952 -0.73041,-2.073674 -0.0472,-0.754055 0.0942,-1.508107 0.16495,-1.991201 0.0708,-0.48309 0.0708,-0.695008 -0.30637,-0.718647 -0.37698,-0.02364 -1.13103,0.141315 -1.96766,0.07071 -0.83653,-0.07071 -1.75543,-0.376975 -2.20322,-0.812892 -0.089,-0.0867 -0.15938,-0.178474 -0.2143,-0.281079 0.5218,0.14689 0.90518,0.209857 1.2965,0.204488 0.43014,-0.0059 0.86987,-0.09435 1.34305,-0.173934 0.47318,-0.07958 0.97981,-0.150294 1.56303,0.100129 0.58321,0.250321 1.24313,0.821665 1.84111,1.440187 0.59798,0.618522 1.13392,1.284213 1.79971,1.852775 0.66559,0.568455 1.46094,1.039777 2.17081,1.281324 0.70987,0.241543 1.33428,0.253312 2.02351,0.194472 0.68933,-0.05884 1.44328,-0.188485 1.93814,-0.276948 0.49485,-0.08826 0.73041,-0.135534 0.76582,-0.282734 0.0604,-0.251661 -1.14166,-1.702583 -1.34605,-1.843793 -0.32402,-0.223894 -0.63028,-0.341774 -0.98971,-0.259298 -0.35943,0.08248 -0.72763,0.683344 -1.15167,0.748171 -0.42415,0.06482 -0.86017,-0.08836 -1.07219,-0.324023 -0.21213,-0.235659 -0.20026,-0.553695 -0.35355,-0.724637 -0.15308,-0.170837 -0.47122,-0.194473 -0.85418,-0.300486 -0.38286,-0.105907 -0.83054,-0.294601 -1.1781,-0.55958 -0.34756,-0.265077 -0.59509,-0.606855 -0.9603,-1.213608 -0.3652,-0.606753 -0.84829,-1.478583 -1.1782,-2.11486 -0.3298,-0.636274 -0.50662,-1.036786 -0.82476,-1.013146 -0.31804,0.02353 -0.77749,0.471117 -1.508,0.67746 -0.73053,0.206138 -1.7319,0.170836 -2.3977,-0.424148 -0.41372,-0.36975 -0.6978,-0.955651 -0.89021,-1.57964 0.0464,-0.95751 0.0723,-1.945263 0.036,-2.762078 -0.0372,-0.836531 -0.13956,-1.493759 -0.37915,-2.049003 0.861,0.130474 1.48551,0.06699 2.07357,-0.200773 0.63762,-0.290368 1.2325,-0.82084 2.12498,-1.133299 0.89248,-0.312462 2.08245,-0.406499 3.17817,-0.106115 1.09563,0.300485 2.09711,0.995598 2.79481,1.853804 0.69758,0.85821 1.09139,1.879512 1.56859,2.645435 0.47721,0.765821 1.03782,1.276368 1.77463,1.764312 0.73682,0.487941 1.64994,0.953174 1.69402,0.855934 0.0443,-0.09724 -0.78058,-0.757047 -1.2741,-1.565603 -0.49362,-0.808453 -0.6562,-1.765755 -0.88443,-2.524248 -0.22833,-0.758388 -0.52252,-1.317967 -0.92571,-1.821498 -0.4033,-0.503629 -0.91581,-0.951314 -0.89227,-0.995598 0.0236,-0.04418 0.58311,0.315249 1.00303,0.72319 0.41971,0.408048 0.69965,0.864712 0.92221,1.305169 0.22234,0.440457 0.38729,0.864503 0.83652,1.655307 0.44924,0.790801 1.18244,1.948254 2.24297,2.513821 1.06032,0.565566 2.44786,0.539245 3.40062,0.384616 0.95286,-0.154425 1.47136,-0.437156 1.60101,-0.602213 0.12955,-0.164952 -0.12965,-0.212126 -0.61274,-0.247428 -0.48309,-0.0353 -1.18997,-0.05884 -1.81448,-0.270965 -0.6244,-0.212125 -1.16643,-0.612638 -1.55074,-1.179749 -0.38451,-0.567013 -0.61139,-1.300628 -0.83673,-1.979637 -0.22534,-0.679009 -0.44913,-1.303415 -0.7555,-1.751203 -0.30627,-0.447682 -0.69501,-0.718647 -0.59055,-0.708223 0.10467,0.01041 0.70265,0.30214 1.13413,0.930879 0.43147,0.628946 0.69655,1.594816 1.06465,2.298703 0.3682,0.703887 0.83953,1.145791 0.90435,1.051546 0.0648,-0.09425 -0.27695,-0.724634 -0.47721,-1.729112 -0.20025,-1.004267 -0.2593,-2.38283 -0.63338,-3.428594 -0.37408,-1.045768 -1.06331,-1.758633 -2.22686,-2.480275 -1.16344,-0.721642 -2.8012,-1.45216 -5.04849,-1.587489 -2.2474,-0.135326 -5.10445,0.324435 -6.50944,0.872454 -1.40488,0.548016 -1.35781,1.184293 -1.68781,1.855767 -0.32981,0.671576 -1.03679,1.37856 -1.77887,1.623511 -0.71999,0.237624 -1.47311,0.04057 -2.34877,-0.21264 -0.95142,-0.428071 -2.12704,-0.772015 -3.4415,-0.96804 -0.10147,-0.01506 -0.20386,-0.02932 -0.30688,-0.04274 0.60066,-0.376975 1.23095,-0.814437 1.90335,-1.318691 2.07367,-1.555178 4.54796,-3.746733 6.18562,-5.502165 1.63765,-1.755539 2.43888,-3.075157 2.75701,-4.076538 0.31804,-1.001585 0.15309,-1.68493 -0.42414,-2.061905 -0.57734,-0.377081 -1.56705,-0.447685 -1.55518,-0.624406 0.0118,-0.176823 1.02512,-0.459553 2.30789,-0.946669 1.28297,-0.487115 2.83567,-1.178514 3.73114,-1.755845 0.89547,-0.577335 1.13361,-1.040504 0.94647,-1.295672 -0.18715,-0.255171 -0.79989,-0.302242 -2.21375,-0.101988 -1.41376,0.200258 -3.62875,0.648042 -3.59355,0.483091 0.0354,-0.164952 2.321,-0.942541 4.0531,-1.779073 1.7319,-0.836528 2.91011,-1.732001 3.28718,-2.25039 0.37698,-0.518393 -0.0471,-0.659811 -1.36669,-0.47122 -1.31952,0.188486 -3.5346,0.706879 -4.43008,0.860065 -0.89536,0.153081 -0.47122,-0.05894 0.71586,-0.656819 1.18698,-0.597976 3.13699,-1.581704 4.15024,-2.288586 1.01325,-0.706984 1.08985,-1.137017 0.73919,-1.328497 -0.35055,-0.191481 -1.12814,-0.144308 -2.61271,0.315143 -1.48447,0.459557 -3.67592,1.331391 -4.26502,1.555281 -0.5891,0.223792 0.42415,-0.200254 1.84978,-0.977946 1.42573,-0.777589 3.26364,-1.908619 4.2739,-2.824735 1.01036,-0.9161177 1.19307,-1.6171114 0.74528,-1.7938314 -0.44769,-0.1767214 -1.52566,0.170836 -3.08982,0.8041177 -1.56416,0.6332817 -3.61419,1.5522857 -4.29764,1.8467847 -0.68324,0.294605 0,-0.0353 1.02512,-0.565566 1.02512,-0.530265 2.39181,-1.2606767 3.31072,-2.0854394 0.919,-0.8247624 1.39033,-1.7437704 1.18997,-2.0854424 -0.20036,-0.341672 -1.0722,-0.106013 -2.8395,0.577437 -1.7673,0.683345 -4.42997,1.8143754 -7.63478,3.8526408 -3.2047,2.038269 -6.95133,4.983777 -9.66118,7.198766 -2.70985,2.214986 -4.38291,3.699559 -5.1605,5.030946 -0.77769,1.331387 -0.65991,2.509591 -0.27107,3.26354 0.38885,0.754056 1.04866,1.083959 1.86155,1.449271 0.81299,0.365206 1.77908,0.765718 2.26217,1.178204 0.48309,0.412379 0.48309,0.836528 0.40061,1.578712 -0.0825,0.742287 -0.24743,1.802606 -0.54193,2.74525 -0.2946,0.942544 -0.71875,1.767303 -1.30775,2.344638 -0.5891,0.577335 -1.34316,0.907137 -2.12074,0.907137 -0.256,0 -0.51447,-0.03572 -0.75994,-0.07566 -0.17755,-0.117263 -0.35241,-0.247223 -0.52149,-0.386782 0.11024,-0.0099 0.22203,-0.03136 0.35045,-0.06751 0.22977,-0.06483 0.5125,-0.17672 0.74517,-0.309365 0.23277,-0.132436 0.41538,-0.285619 0.54193,-0.527064 0.12676,-0.241543 0.19747,-0.571447 0.20624,-0.874927 0.009,-0.303379 -0.0442,-0.580225 -0.0855,-0.833537 -0.0412,-0.253312 -0.0706,-0.48309 -0.10601,-0.527272 -0.0353,-0.04418 -0.0765,0.09724 -0.14131,0.247326 -0.0648,0.150297 -0.15319,0.309365 -0.23567,0.412383 -0.0825,0.10312 -0.15906,0.150294 -0.35343,0.232667 -0.19438,0.08248 -0.50663,0.20036 -0.80422,0.259299 -0.2975,0.05894 -0.58023,0.05894 -0.82177,0.04119 -0.24155,-0.01774 -0.44191,-0.05306 -0.59705,-0.111171 -0.15525,-0.05812 -0.26539,-0.139044 -0.23009,-0.168568 0.0354,-0.02942 0.21636,-0.0074 0.47173,-0.03768 0.25548,-0.03023 0.58529,-0.112719 0.82095,-0.19819 0.23566,-0.08537 0.37697,-0.173726 0.54192,-0.362215 0.16496,-0.188485 0.35345,-0.477206 0.45368,-0.71586 0.10012,-0.238552 0.11189,-0.427037 0.28572,-0.597874 0.17383,-0.170836 0.50962,-0.324022 0.76283,-0.374085 0.25342,-0.05007 0.42415,0.0028 0.54203,0.08825 0.11778,0.08547 0.18261,0.20325 0.18849,0.153187 0.006,-0.05006 -0.0472,-0.268072 -0.10612,-0.441801 -0.0588,-0.173828 -0.12366,-0.303375 -0.2562,-0.42714 -0.13254,-0.123769 -0.33279,-0.241547 -0.52717,-0.300489 -0.19437,-0.05884 -0.38286,-0.05884 -0.58022,0 -0.19737,0.05894 -0.40361,0.176826 -0.61563,0.297596 -0.21202,0.120774 -0.43003,0.244436 -0.62151,0.332797 -0.19148,0.08836 -0.35644,0.141418 -0.57434,0.138423 -0.21801,-0.0028 -0.48898,-0.06183 -0.69574,-0.12965 -0.20665,-0.06782 -0.3491,-0.144618 -0.28438,-0.177031 0.0648,-0.03231 0.33692,-0.02043 0.56133,-0.04098 0.22441,-0.02053 0.40113,-0.0736 0.57197,-0.185494 0.17084,-0.111895 0.33569,-0.282731 0.44469,-0.465438 0.109,-0.182605 0.16206,-0.376975 0.20335,-0.524277 0.0412,-0.1472 0.0707,-0.247325 -0.0265,-0.232565 -0.0971,0.01475 -0.32103,0.144409 -0.56845,0.221004 -0.24733,0.07659 -0.5184,0.100126 -0.75271,0.09951 -0.23432,-7.05e-4 -0.4319,-0.0254 -0.37894,-0.119637 0.0531,-0.09425 0.35674,-0.25806 0.538,-0.434164 0.18127,-0.176099 0.24021,-0.364585 0.49342,-0.476585 0.25331,-0.111792 0.7011,-0.147196 1.03688,-0.07071 0.33579,0.07659 0.55969,0.265077 0.69512,0.483087 0.13553,0.217907 0.1827,0.465441 0.20624,0.471325 0.0235,0.0059 0.0235,-0.229778 0.0294,-0.477206 0.006,-0.247325 0.0176,-0.506628 -0.12965,-0.777695 -0.1472,-0.270962 -0.45357,-0.553695 -0.78347,-0.742181 -0.32991,-0.188489 -0.68335,-0.282734 -1.11338,-0.359325 -0.43003,-0.07659 -0.93666,-0.135534 -1.25242,-0.228332 -0.31566,-0.0928 -0.44046,-0.219558 -0.3521,-0.260745 0.0884,-0.04119 0.38988,0.0028 0.66435,-0.04552 0.27448,-0.04851 0.5219,-0.189932 0.7458,-0.372537 0.22379,-0.182601 0.42415,-0.406393 0.5538,-0.665589 0.12965,-0.259196 0.18848,-0.553798 0.20614,-0.889586 0.0176,-0.335791 -0.006,-0.712766 -0.0531,-0.824762 -0.0472,-0.111898 -0.11778,0.04129 -0.26498,0.218009 -0.1472,0.176721 -0.37119,0.376975 -0.60686,0.541927 -0.23555,0.165054 -0.48309,0.294601 -0.84241,0.377183 -0.35922,0.08258 -0.83044,0.118089 -1.1012,0.07834 -0.27065,-0.03974 -0.34074,-0.154834 -0.24072,-0.237416 0.10013,-0.08258 0.37048,-0.132641 0.59994,-0.293155 0.22947,-0.160514 0.41796,-0.431581 0.60056,-0.702546 0.18261,-0.270965 0.35943,-0.541927 0.58322,-0.706984 0.22379,-0.164952 0.49486,-0.223789 0.701,-0.188486 0.20624,0.0353 0.34766,0.164952 0.2946,0.0353 -0.053,-0.129547 -0.30049,-0.518392 -0.60087,-0.748171 -0.30049,-0.229778 -0.65382,-0.300485 -1.04866,-0.247428 -0.39462,0.05306 -0.83054,0.229779 -1.2904,0.477207 -0.44563,0.23979 -0.91375,0.545951 -1.28948,0.66053 0.11901,-0.225132 0.20572,-0.485771 0.2562,-0.745381 0.0855,-0.438806 0.0677,-0.874825 -0.003,-1.349039 -0.0707,-0.474211 -0.19437,-0.986723 -0.27984,-1.139907 -0.0854,-0.153186 -0.13254,0.05306 -0.25621,0.315144 -0.12366,0.262191 -0.32401,0.580326 -0.62151,0.865949 -0.28056,0.269417 -0.64763,0.510237 -0.94574,0.751886 0.0559,-0.261881 0.0819,-0.556792 0.0592,-0.857899 -0.0353,-0.468326 -0.18849,-0.951417 -0.24144,-1.293089 -0.0531,-0.341672 -0.006,-0.541927 -0.11489,-0.474215 -0.1089,0.06772 -0.37409,0.403504 -0.71276,0.706882 -0.33869,0.303375 -0.75107,0.574443 -0.94555,0.868941 -0.0945,0.143175 -0.13749,0.292023 -0.13646,0.443763 -0.47545,-0.277156 -0.9476,-0.459348 -1.36288,-0.40846 -0.433022,0.05306 -0.804218,0.359325 -1.13402,0.665695 -0.329801,0.30637 -0.618518,0.612637 -0.960194,0.72154 -0.341672,0.109107 -0.736402,0.02074 -1.022124,-0.188489 -0.285725,-0.209134 -0.462446,-0.539038 -0.45357,-0.818879 0.0087,-0.279841 0.20325,-0.509619 0.150294,-0.49785 -0.05306,0.01175 -0.353437,0.265081 -0.471322,0.559682 -0.11788,0.294601 -0.05306,0.630389 0.05884,0.930772 0.111894,0.300486 0.270962,0.565566 0.509616,0.798132 0.238658,0.232667 0.556793,0.433027 1.042772,0.536148 0.266732,0.05657 0.584045,0.08392 0.929538,0.08433 -0.06462,0.120463 -0.159999,0.245053 -0.352305,0.392769 -0.356433,0.273956 -1.045559,0.627397 -1.578712,0.936656 -0.533259,0.309362 -0.910132,0.574442 -1.204733,0.771807 -0.294601,0.197366 -0.506624,0.326913 -0.742287,0.39762 -0.235662,0.07071 -0.494855,0.08248 -0.612637,0.244436 -0.117881,0.162063 -0.09435,0.474214 -0.02064,0.7011 0.0736,0.226889 0.197365,0.368099 0.21801,0.7011 0.02064,0.332796 -0.06193,0.857074 0.02653,1.137017 0.08836,0.279841 0.347557,0.315143 0.539037,0.400508 0.191379,0.08547 0.31525,0.221005 0.615633,0.338783 0.300485,0.117885 0.777589,0.21801 1.101608,0.153187 0.324023,-0.06472 0.494859,-0.294499 0.692224,-0.503632 0.197365,-0.209134 0.421256,-0.39762 0.815884,-0.556691 0.394627,-0.159067 0.960296,-0.288717 1.449168,-0.30637 0.48897,-0.01764 0.90136,0.0767 1.24912,0.120671 0.2946,0.03726 0.54276,0.0385 0.90539,-0.08196 0.0265,0.279428 0.009,0.535527 -0.0455,0.815678 -0.10023,0.518393 -0.32413,1.119262 -0.74229,1.944025 -0.41817,0.824762 -1.03091,1.873419 -1.50223,2.704066 -0.47122,0.830541 -0.801127,1.443281 -1.04267,2.173799 -0.241547,0.730518 -0.39473,1.578818 -0.636277,2.179687 -0.241544,0.600868 -0.571447,0.954309 -0.736403,1.319516 -0.164849,0.365311 -0.164849,0.742286 -0.294086,0.99302 -0.340021,0.659807 -1.337063,0.139558 -1.835122,-0.06307 -0.661827,-0.269208 -1.323803,-0.605821 -1.834248,-0.925611 -0.510445,-0.319789 -0.86946,-0.622649 -1.189249,-0.746104 -0.31979,-0.123458 -0.600248,-0.0673 -0.908788,0.235557 -0.308535,0.30286 -0.645149,0.852632 -0.914361,1.396728 -0.269208,0.544097 -0.471219,1.082721 -0.734853,1.520289 -0.263635,0.437568 -0.588998,0.774079 -0.911575,1.078385 -0.322576,0.304303 -0.642366,0.576404 -0.768505,0.88071 -0.126347,0.304306 -0.05894,0.64092 0.01683,0.97609 0.07577,0.335167 0.15979,0.668997 0.196331,1.099443 0.03654,0.43065 0.02519,0.957918 0.16268,1.467023 0.137495,0.509104 0.423633,0.999934 0.639477,1.279052 0.215946,0.279118 0.361801,0.346421 0.634005,0.01693 0.271995,-0.329597 0.670338,-1.055984 0.747444,-1.584907 0.07711,-0.528613 -0.167015,-0.859652 -0.340847,-1.089635 -0.173827,-0.230089 -0.277671,-0.359117 -0.357568,-0.502084 -0.07989,-0.142967 -0.135947,-0.300175 -0.06307,-0.457285 0.07298,-0.157003 0.274888,-0.314109 0.403917,-0.516018 0.129032,-0.201906 0.185187,-0.448818 0.207585,-0.712453 0.0224,-0.263638 0.01125,-0.544096 0.297286,-1.009741 0.286035,-0.465646 0.869561,-1.116267 1.262228,-1.44163 0.392666,-0.325364 0.594674,-0.325364 1.116372,0.05047 0.521695,0.375839 1.363179,1.12752 2.367347,1.879096 0.6852,0.513542 1.447102,1.027186 2.154499,1.442353 z"
       stroke-miterlimit="22.9256"
       stroke-linejoin="round"
       stroke-linecap="round"
       stroke-width="0.309673"
       stroke="#000000"
       clip-rule="evenodd"
       fill-rule="evenodd" />
    <path
       style="fill:none;stroke:#000000;stroke-width:0.45;stroke-linecap:square;stroke-linejoin:miter;stroke-miterlimit:4;stroke-dasharray:none;stroke-opacity:1;marker-end:url(#marker1955)"
       d="M 118.64786,36.287208 H 61.347697"
       id="path1629"
       sodipodi:nodetypes="cc" />
    <path
       sodipodi:nodetypes="cc"
       id="path2697"
       d="M 118.64786,36.287208 V 68.718351"
       style="fill:none;stroke:#000000;stroke-width:0.45;stroke-linecap:butt;stroke-linejoin:miter;stroke-miterlimit:4;stroke-dasharray:none;stroke-opacity:1;marker-end:url(#marker2701)" />
    <text
       xml:space="preserve"
       style="font-style:normal;font-weight:normal;font-size:6.35px;line-height:1.25;font-family:sans-serif;text-align:end;text-anchor:end;fill:#000000;fill-opacity:1;stroke:none;stroke-width:0.264583"
       x="58.979111"
       y="38.121964"
       id="text2963"><tspan
         sodipodi:role="line"
         id="tspan2961"
         x="58.979111"
         y="38.121964"
         style="font-size:6.35px;text-align:end;text-anchor:end;stroke-width:0.264583">$y$</tspan></text>
    <text
       id="text2967"
       y="76.229828"
       x="118.55179"
       style="font-style:normal;font-weight:normal;font-size:6.35px;line-height:1.25;font-family:sans-serif;text-align:center;text-anchor:middle;fill:#000000;fill-opacity:1;stroke:none;stroke-width:0.264583"
       xml:space="preserve"><tspan
         style="font-size:6.35px;text-align:center;text-anchor:middle;stroke-width:0.264583"
         y="76.229828"
         x="118.55179"
         id="tspan2965"
         sodipodi:role="line">$z$</tspan></text>
    <text
       id="text3533"
       y="43.936035"
       x="98.523964"
       style="font-style:normal;font-weight:normal;font-size:6.35px;line-height:1.25;font-family:sans-serif;text-align:end;text-anchor:end;fill:#000000;fill-opacity:1;stroke:none;stroke-width:0.264583"
       xml:space="preserve"><tspan
         style="font-size:6.35px;text-align:end;text-anchor:end;stroke-width:0.264583"
         y="43.936035"
         x="98.523964"
         id="tspan3531"
         sodipodi:role="line">$\beta$</tspan></text>
    <path
       sodipodi:nodetypes="cc"
       id="path3049"
       d="M 118.64786,36.287206 69.024464,64.937286"
       style="fill:#0000ff;stroke:#0000ff;stroke-width:0.45;stroke-linecap:square;stroke-linejoin:miter;stroke-miterlimit:4;stroke-dasharray:none;stroke-opacity:1;marker-end:url(#marker3065)" />
    <path
       style="fill:#0000ff;stroke:#0000ff;stroke-width:0.45;stroke-linecap:butt;stroke-linejoin:miter;stroke-miterlimit:4;stroke-dasharray:none;stroke-opacity:1;marker-end:url(#marker3075)"
       d="m 118.64786,36.287206 16.21557,28.086193"
       id="path3051"
       sodipodi:nodetypes="cc" />
    <text
       transform="rotate(-29.999999)"
       id="text3055"
       y="92.584328"
       x="24.939713"
       style="font-style:normal;font-weight:normal;font-size:6.35px;line-height:1.25;font-family:sans-serif;text-align:end;text-anchor:end;fill:#0000ff;fill-opacity:1;stroke:#0000ff;stroke-width:0.264583"
       xml:space="preserve"><tspan
         style="font-weight:normal;font-size:6.35px;text-align:end;text-anchor:end;fill:#0000ff;stroke:none;stroke-width:0.264583"
         y="92.584328"
         x="24.939713"
         id="tspan3053"
         sodipodi:role="line">$y'$</tspan></text>
    <text
       xml:space="preserve"
       style="font-style:normal;font-weight:normal;font-size:6.35px;line-height:1.25;font-family:sans-serif;text-align:center;text-anchor:middle;fill:#0000ff;fill-opacity:1;stroke:#0000ff;stroke-width:0.264583"
       x="84.51239"
       y="130.69218"
       id="text3059"
       transform="rotate(-29.999999)"><tspan
         sodipodi:role="line"
         id="tspan3057"
         x="84.51239"
         y="130.69218"
         style="font-size:6.35px;text-align:center;text-anchor:middle;fill:#0000ff;stroke:none;stroke-width:0.264583">$z'$</tspan></text>
    <path
       sodipodi:cx="116.20387"
       sodipodi:cy="37.093746"
       sodipodi:rx="15.875"
       sodipodi:ry="15.875"
       sodipodi:end="3.1908489"
       sodipodi:start="2.6179939"
       sodipodi:open="true"
       sodipodi:arc-type="arc"
       sodipodi:type="arc"
       d="m 102.45572,45.031246 a 15.875,15.875 0 0 1 -2.10759,-8.719127"
       style="fill:none;stroke:#000000;stroke-width:0.45;stroke-linecap:square;stroke-miterlimit:4;stroke-dasharray:none;marker-start:url(#Arrow1Mstart)"
       id="path3243" />
  </g>
</svg>
