#FIG 3.2
Landscape
Center
Metric
A4      
100.00
Single
-2
1200 2
6 1665 1890 9135 4770
6 2205 2205 4545 4545
2 1 0 2 0 7 50 0 -1 0.000 0 0 -1 0 0 2
	 2250 2250 4500 4500
2 1 0 2 0 7 50 0 -1 0.000 0 0 -1 0 0 2
	 2250 4500 4500 2250
2 1 0 2 0 7 50 0 -1 0.000 0 0 -1 0 0 2
	 4500 2250 4500 4500
-6
6 4455 2205 6795 4545
2 1 0 2 0 7 50 0 -1 0.000 0 0 -1 0 0 2
	 4500 2250 6750 4500
2 1 0 2 0 7 50 0 -1 0.000 0 0 -1 0 0 2
	 4500 4500 6750 2250
2 1 0 2 0 7 50 0 -1 0.000 0 0 -1 0 0 2
	 6750 2250 6750 4500
-6
6 6705 2205 9045 4545
2 1 0 2 0 7 50 0 -1 0.000 0 0 -1 0 0 2
	 6750 2250 9000 4500
2 1 0 2 0 7 50 0 -1 0.000 0 0 -1 0 0 2
	 6750 4500 9000 2250
-6
2 2 0 2 0 7 50 0 -1 0.000 0 0 -1 0 0 5
	 2250 4500 9000 4500 9000 2250 2250 2250 2250 4500
2 3 0 1 0 7 50 0 -1 0.000 0 0 -1 0 0 4
	 2115 4725 2250 4500 2385 4725 2115 4725
2 3 0 1 0 7 50 0 -1 0.000 0 0 -1 0 0 4
	 8865 4725 9000 4500 9135 4725 8865 4725
2 1 0 1 0 7 50 0 -1 0.000 0 0 -1 0 0 2
	 8865 4770 9135 4770
2 1 0 2 0 7 50 0 -1 0.000 0 0 -1 1 0 2
	1 1 2.00 120.00 240.00
	 1710 2250 2160 2250
4 0 0 50 0 1 24 0.0000 4 255 225 1800 2160 F\001
-6
6 10350 2160 12690 4500
2 1 0 2 0 7 50 0 -1 0.000 0 0 -1 0 0 2
	 10395 2205 12645 4455
2 1 0 2 0 7 50 0 -1 0.000 0 0 -1 0 0 2
	 10395 4455 12645 2205
2 1 0 2 0 7 50 0 -1 0.000 0 0 -1 0 0 2
	 12645 2205 12645 4455
-6
6 12600 2160 14940 4500
2 1 0 2 0 7 50 0 -1 0.000 0 0 -1 0 0 2
	 12645 2205 14895 4455
2 1 0 2 0 7 50 0 -1 0.000 0 0 -1 0 0 2
	 12645 4455 14895 2205
2 1 0 2 0 7 50 0 -1 0.000 0 0 -1 0 0 2
	 14895 2205 14895 4455
-6
6 14850 2160 17190 4500
2 1 0 2 0 7 50 0 -1 0.000 0 0 -1 0 0 2
	 14895 2205 17145 4455
2 1 0 2 0 7 50 0 -1 0.000 0 0 -1 0 0 2
	 14895 4455 17145 2205
-6
6 10260 4455 10530 4725
2 3 0 1 0 7 50 0 -1 0.000 0 0 -1 0 0 4
	 10260 4680 10395 4455 10530 4680 10260 4680
2 1 0 1 0 7 50 0 -1 0.000 0 0 -1 0 0 2
	 10260 4725 10530 4725
-6
6 3645 5580 13185 9630
6 7605 7515 7875 7785
2 3 0 1 0 7 50 0 -1 0.000 0 0 -1 0 0 4
	 7830 7785 7605 7650 7830 7515 7830 7785
2 1 0 1 0 7 50 0 -1 0.000 0 0 -1 0 0 2
	 7875 7785 7875 7515
-6
6 7605 8640 7875 8910
2 3 0 1 0 7 50 0 -1 0.000 0 0 -1 0 0 4
	 7830 8910 7605 8775 7830 8640 7830 8910
2 1 0 1 0 7 50 0 -1 0.000 0 0 -1 0 0 2
	 7875 8910 7875 8640
-6
6 7605 6390 7875 6660
2 3 0 1 0 7 50 0 -1 0.000 0 0 -1 0 0 4
	 7830 6660 7605 6525 7830 6390 7830 6660
2 1 0 1 0 7 50 0 -1 0.000 0 0 -1 0 0 2
	 7875 6660 7875 6390
-6
6 12915 6525 13185 6795
2 3 0 1 0 7 50 0 -1 0.000 0 0 -1 0 0 4
	 12915 6750 13050 6525 13185 6750 12915 6750
2 1 0 1 0 7 50 0 -1 0.000 0 0 -1 0 0 2
	 12915 6795 13185 6795
-6
6 12915 7650 13185 7920
2 3 0 1 0 7 50 0 -1 0.000 0 0 -1 0 0 4
	 12915 7875 13050 7650 13185 7875 12915 7875
2 1 0 1 0 7 50 0 -1 0.000 0 0 -1 0 0 2
	 12915 7920 13185 7920
-6
6 12915 8730 13185 9000
2 3 0 1 0 7 50 0 -1 0.000 0 0 -1 0 0 4
	 12915 8955 13050 8730 13185 8955 12915 8955
2 1 0 1 0 7 50 0 -1 0.000 0 0 -1 0 0 2
	 12915 9000 13185 9000
-6
6 4185 6480 6525 8820
2 1 0 2 0 7 50 0 -1 0.000 0 0 -1 0 0 2
	 4230 6525 6480 8775
2 1 0 2 0 7 50 0 -1 0.000 0 0 -1 0 0 2
	 4230 8775 6480 6525
2 1 0 2 0 7 50 0 -1 0.000 0 0 -1 0 0 2
	 6480 6525 6480 8775
-6
6 9630 6480 11970 8820
2 1 0 2 0 7 50 0 -1 0.000 0 0 -1 0 0 2
	 9675 6525 11925 8775
2 1 0 2 0 7 50 0 -1 0.000 0 0 -1 0 0 2
	 9675 8775 11925 6525
2 1 0 2 0 7 50 0 -1 0.000 0 0 -1 0 0 2
	 11925 6525 11925 8775
-6
2 1 3 2 0 7 50 0 -1 6.000 0 0 -1 0 0 2
	 7605 5625 7605 9585
2 1 3 2 0 7 50 0 -1 6.000 0 0 -1 0 0 2
	 13050 5625 13050 9585
2 1 0 2 0 7 50 0 -1 0.000 0 0 -1 0 0 4
	 7605 6525 4230 6525 4230 8775 7605 8775
2 1 0 2 0 7 50 0 -1 6.000 0 0 -1 0 0 3
	 6480 6525 7605 7650 6480 8775
2 3 0 1 0 7 50 0 -1 0.000 0 0 -1 0 0 4
	 4095 9000 4230 8775 4365 9000 4095 9000
2 1 0 2 0 7 50 0 -1 0.000 0 0 -1 1 0 2
	1 1 2.00 120.00 240.00
	 3690 6525 4140 6525
2 1 0 2 0 7 50 0 -1 0.000 0 0 -1 1 0 2
	1 1 2.00 120.00 240.00
	 4140 8775 3690 8775
2 1 0 2 0 7 50 0 -1 0.000 0 0 -1 0 0 4
	 13050 6525 9675 6525 9675 8775 13050 8775
2 1 0 2 0 7 50 0 -1 6.000 0 0 -1 0 0 3
	 11925 6525 13050 7650 11925 8775
2 3 0 1 0 7 50 0 -1 0.000 0 0 -1 0 0 4
	 9540 9000 9675 8775 9810 9000 9540 9000
2 1 0 2 0 7 50 0 -1 0.000 0 0 -1 1 0 2
	1 1 2.00 120.00 240.00
	 9135 6525 9585 6525
2 1 0 2 0 7 50 0 -1 0.000 0 0 -1 1 0 2
	1 1 2.00 120.00 240.00
	 9585 8775 9135 8775
4 0 0 50 0 0 24 0.0000 4 255 2880 4545 6165 SYMMETRIC L.C.\001
4 0 0 50 0 1 24 0.0000 4 255 510 3780 6435 F/2\001
4 0 0 50 0 1 24 0.0000 4 255 510 3690 8640 F/2\001
4 0 0 50 0 1 24 0.0000 4 255 510 9225 6435 F/2\001
4 0 0 50 0 1 24 0.0000 4 255 510 9135 8640 F/2\001
4 0 0 50 0 0 24 0.0000 4 255 3765 9135 6075 ANTISYMMETRIC L.C.\001
4 0 0 50 0 0 24 0.0000 4 255 180 4455 9090 1\001
4 0 0 50 0 0 24 0.0000 4 255 180 6345 9090 2\001
4 0 0 50 0 0 24 0.0000 4 255 180 7380 9090 3\001
4 0 0 50 0 0 24 0.0000 4 255 180 4590 6840 4\001
4 0 0 50 0 0 24 0.0000 4 255 180 7380 6885 6\001
4 0 0 50 0 0 24 0.0000 4 255 180 7245 7830 7\001
4 0 0 50 0 0 24 0.0000 4 255 180 5985 6840 5\001
-6
2 1 0 1 0 7 50 0 -1 0.000 0 0 -1 0 0 2
	 2250 4815 2250 5355
2 1 0 1 0 7 50 0 -1 0.000 0 0 -1 0 0 2
	 4500 4815 4500 5355
2 1 0 1 0 7 50 0 -1 0.000 0 0 -1 0 0 2
	 6750 4770 6750 5310
2 1 0 1 0 7 50 0 -1 0.000 0 0 -1 1 1 2
	1 1 1.00 60.00 120.00
	1 1 1.00 60.00 120.00
	 2250 5220 4500 5220
2 1 0 1 0 7 50 0 -1 0.000 0 0 -1 1 1 2
	1 1 1.00 60.00 120.00
	1 1 1.00 60.00 120.00
	 4500 5220 6750 5220
2 1 0 1 0 7 50 0 -1 0.000 0 0 -1 1 1 2
	1 1 1.00 60.00 120.00
	1 1 1.00 60.00 120.00
	 6750 5220 9000 5220
2 1 0 1 0 7 50 0 -1 0.000 0 0 -1 0 0 2
	 9000 4815 9000 5355
2 1 0 1 0 7 50 0 -1 0.000 0 0 -1 0 0 2
	 9090 2250 9540 2250
2 1 0 1 0 7 50 0 -1 0.000 0 0 -1 0 0 2
	 9090 4500 9540 4500
2 1 0 1 0 7 50 0 -1 0.000 0 0 -1 1 1 2
	1 1 1.00 60.00 120.00
	1 1 1.00 60.00 120.00
	 9450 2250 9450 4500
2 2 0 2 0 7 50 0 -1 0.000 0 0 -1 0 0 5
	 10395 4455 17145 4455 17145 2205 10395 2205 10395 4455
2 3 0 1 0 7 50 0 -1 0.000 0 0 -1 0 0 4
	 17010 4680 17145 4455 17280 4680 17010 4680
2 1 0 1 0 7 50 0 -1 0.000 0 0 -1 0 0 2
	 17010 4725 17280 4725
2 1 0 2 0 7 50 0 -1 0.000 0 0 -1 1 0 2
	1 1 2.00 120.00 240.00
	 9855 2205 10305 2205
2 1 0 2 0 7 50 0 -1 0.000 0 0 -1 1 0 2
	1 1 2.00 120.00 240.00
	 10305 4455 9855 4455
2 1 3 2 0 7 50 0 -1 6.000 0 0 -1 0 0 2
	 13770 1395 13770 5355
2 3 0 1 0 7 50 0 -1 0.000 0 0 -1 0 0 5
	 13455 5085 14085 4725 14085 5085 13455 4725 13455 5085
2 3 0 1 0 7 50 0 -1 0.000 0 0 -1 0 0 5
	 13455 2025 14085 1665 14085 2025 13455 1665 13455 2025
4 0 0 50 0 1 24 0.0000 4 255 180 3330 5130 2\001
4 0 0 50 0 1 24 0.0000 4 255 180 5490 5130 2\001
4 0 0 50 0 1 24 0.0000 4 255 180 7875 5130 2\001
4 0 0 50 0 1 24 1.5708 4 255 180 9405 3555 2\001
4 0 0 50 0 1 24 0.0000 4 255 225 9945 2115 F\001
4 0 0 50 0 1 24 0.0000 4 255 225 9990 4320 F\001
4 0 0 50 0 1 24 0.0000 4 270 225 1890 4725 A\001
4 0 0 50 0 1 24 0.0000 4 255 225 9270 4860 B\001
