#FIG 3.2  Produced by xfig version 3.2.5b
Landscape
Center
Inches
Letter  
100.00
Single
-2
1200 2
5 1 0 1 0 7 50 0 -1 4.000 0 1 1 0 4912.500 2812.500 3975 2625 4050 3225 4275 3525
	1 1 1.00 60.00 120.00
5 1 0 2 0 7 50 0 -1 6.000 0 1 1 0 11446.500 6772.500 11850 6525 11475 6300 11100 6450
	1 1 2.00 120.00 240.00
6 600 2550 5700 2925
2 1 0 3 0 7 50 0 -1 8.000 0 0 -1 0 0 2
	 750 2625 5550 2625
2 3 0 1 0 7 50 0 -1 4.000 0 0 -1 0 0 4
	 600 2850 750 2625 900 2850 600 2850
2 3 0 1 0 7 50 0 -1 4.000 0 0 -1 0 0 4
	 5400 2850 5550 2625 5700 2850 5400 2850
2 1 0 1 0 7 50 0 -1 4.000 0 0 -1 0 0 2
	 5400 2925 5700 2925
-6
6 6525 6600 11625 6975
2 1 0 3 0 7 50 0 -1 8.000 0 0 -1 0 0 2
	 6675 6675 11475 6675
2 3 0 1 0 7 50 0 -1 4.000 0 0 -1 0 0 4
	 6525 6900 6675 6675 6825 6900 6525 6900
2 3 0 1 0 7 50 0 -1 4.000 0 0 -1 0 0 4
	 11325 6900 11475 6675 11625 6900 11325 6900
2 1 0 1 0 7 50 0 -1 4.000 0 0 -1 0 0 2
	 11325 6975 11625 6975
-6
2 1 1 2 0 7 50 0 -1 6.000 0 0 -1 0 0 1
	 9075 2625
2 1 0 2 0 7 50 0 -1 6.000 0 0 -1 1 0 2
	1 1 2.00 120.00 240.00
	 9075 1575 9075 2550
2 1 0 3 0 7 50 0 -1 8.000 0 0 -1 0 0 2
	 6675 2625 11475 2625
2 3 0 1 0 7 50 0 -1 4.000 0 0 -1 0 0 4
	 6525 2850 6675 2625 6825 2850 6525 2850
2 3 0 1 0 7 50 0 -1 4.000 0 0 -1 0 0 4
	 11325 2850 11475 2625 11625 2850 11325 2850
2 1 0 1 0 7 50 0 -1 4.000 0 0 -1 0 0 2
	 11325 2925 11625 2925
2 1 0 1 0 7 50 0 -1 4.000 0 0 -1 0 0 2
	 6675 3000 6675 6450
2 1 0 1 0 7 50 0 -1 4.000 0 0 -1 0 0 2
	 11475 3000 11475 6450
2 1 0 1 0 7 50 0 -1 4.000 0 0 -1 0 0 2
	 6675 4350 11475 4350
2 1 0 2 0 7 50 0 -1 6.000 0 0 -1 0 0 3
	 6675 4350 9075 5025 11475 4350
2 1 0 1 0 7 50 0 -1 4.000 0 0 -1 0 0 2
	 6675 7050 6675 8700
2 1 0 1 0 7 50 0 -1 4.000 0 0 -1 0 0 2
	 11475 7050 11475 8700
2 1 0 1 0 7 50 0 -1 4.000 0 0 -1 0 0 2
	 6675 7950 11475 7950
2 1 0 2 0 7 50 0 -1 6.000 0 0 -1 0 0 2
	 6675 7950 11475 8550
2 1 0 1 0 7 50 0 -1 4.000 0 0 -1 0 0 2
	 5550 2625 4200 3525
2 1 0 1 0 7 50 0 -1 4.000 0 0 -1 1 0 2
	1 1 1.00 60.00 120.00
	 3225 2625 3225 3375
2 1 0 1 0 7 50 0 -1 4.000 0 0 -1 1 1 4
	1 1 1.00 60.00 120.00
	1 1 1.00 60.00 120.00
	 750 2625 750 2175 5550 2175 5550 2625
2 1 0 1 0 7 50 0 -1 4.000 0 0 -1 0 0 2
	 1125 2175 1125 2625
2 1 0 1 0 7 50 0 -1 4.000 0 0 -1 0 0 2
	 1500 2175 1500 2625
2 1 0 1 0 7 50 0 -1 4.000 0 0 -1 0 0 2
	 1875 2175 1875 2625
2 1 0 1 0 7 50 0 -1 4.000 0 0 -1 0 0 2
	 2250 2175 2250 2625
2 1 0 1 0 7 50 0 -1 4.000 0 0 -1 0 0 2
	 2625 2175 2625 2625
2 1 0 1 0 7 50 0 -1 4.000 0 0 -1 0 0 2
	 3300 2175 3300 2625
2 1 0 1 0 7 50 0 -1 4.000 0 0 -1 0 0 2
	 3675 2175 3675 2625
2 1 0 1 0 7 50 0 -1 4.000 0 0 -1 0 0 2
	 4050 2175 4050 2625
2 1 0 1 0 7 50 0 -1 4.000 0 0 -1 0 0 2
	 4425 2175 4425 2625
2 1 0 1 0 7 50 0 -1 4.000 0 0 -1 0 0 2
	 4800 2175 4800 2625
2 1 0 1 0 7 50 0 -1 4.000 0 0 -1 0 0 2
	 5175 2175 5175 2625
2 1 0 1 0 7 50 0 -1 4.000 0 0 -1 0 0 2
	 2925 2175 2925 2625
2 1 0 1 0 7 50 0 -1 4.000 0 0 -1 0 0 2
	 750 3075 750 7875
2 1 0 1 0 7 50 0 -1 4.000 0 0 -1 0 0 2
	 5550 3000 5550 7725
2 1 0 1 0 7 50 0 -1 4.000 0 0 -1 0 0 2
	 750 4425 5550 4425
2 1 0 2 0 7 50 0 -1 6.000 0 0 -1 0 0 3
	 2475 2175 2775 1725 3150 1725
2 1 0 1 0 7 50 0 -1 4.000 0 0 -1 0 0 2
	 750 6450 5550 6450
2 1 0 2 0 7 50 0 -1 6.000 0 0 -1 0 0 2
	 750 5700 5550 7200
3 2 1 3 0 7 50 0 -1 8.000 0 0 0 3
	 6675 2625 9225 3375 11475 2625
	 0.000 -1.000 0.000
3 2 1 3 0 7 50 0 -1 8.000 0 0 0 3
	 750 2625 3300 3375 5550 2625
	 0.000 -1.000 0.000
3 0 0 2 0 7 50 0 -1 6.000 0 0 0 3
	 750 4425 3225 5325 5550 4425
	 0.000 1.000 0.000
3 2 1 3 0 7 50 0 -1 8.000 0 0 0 3
	 6675 6675 9225 7425 11475 6675
	 0.000 -1.000 0.000
4 0 0 50 0 0 32 0.0000 4 360 270 9600 2100 1\001
4 0 0 50 0 32 32 0.0000 4 420 270 9375 2100 d\001
4 0 0 50 0 0 32 0.0000 4 375 570 9525 5325 l/2\001
4 0 0 50 0 0 32 0.0000 4 360 270 11550 8475 1\001
4 0 0 50 0 32 32 0.0000 4 495 285 4125 3150 f\001
4 0 0 50 0 0 32 0.0000 4 240 270 3300 3150 v\001
4 0 0 50 0 0 32 0.0000 4 465 2235 7275 4200 M(x)= x/2\001
4 0 0 50 0 32 32 0.0000 4 420 270 7050 4200 d\001
4 0 0 50 0 0 32 0.0000 4 465 3495 975 4275 M(x)=f/2(2x-x )\001
4 0 0 50 0 0 32 0.0000 4 360 180 2925 1725 f\001
4 0 0 50 0 0 24 0.0000 4 270 210 3825 4125 2\001
4 0 0 50 0 0 32 0.0000 4 480 2115 7350 8625 M(x)= x/l\001
4 0 0 50 0 32 32 0.0000 4 420 270 7125 8625 d\001
4 0 0 50 0 0 32 0.0000 4 480 3015 1125 5775 V(x)= f(l/2-x)\001
4 0 0 50 0 0 32 0.0000 4 360 270 11700 6225 1\001
4 0 0 50 0 32 32 0.0000 4 420 270 11475 6225 d\001
