#FIG 3.2
Landscape
Center
Metric
A4      
100.00
Single
-2
1200 2
5 1 0 1 0 7 50 0 -1 4.000 0 1 1 0 2115.000 6345.000 2250 5085 1980 5085 1755 5130
	1 1 1.00 60.00 120.00
5 1 0 1 0 7 50 0 -1 4.000 0 1 1 0 6592.500 5760.000 6750 5040 6435 5040 6210 5130
	1 1 1.00 60.00 120.00
5 1 0 1 0 7 50 0 -1 4.000 0 1 1 0 5085.000 4590.000 4050 4500 4050 4680 4095 4905
	1 1 1.00 60.00 120.00
5 1 0 1 0 7 50 0 -1 4.000 0 1 1 0 4612.500 2362.500 3780 2250 3780 2475 3825 2655
	1 1 1.00 60.00 120.00
5 1 0 1 0 7 50 0 -1 4.000 0 0 1 0 2655.000 4590.000 3150 4500 3150 4680 3105 4815
	1 1 1.00 60.00 120.00
6 2025 6750 2475 6840
2 1 0 1 0 7 50 0 -1 0.000 0 0 -1 0 0 2
	 2025 6750 2475 6750
2 1 0 1 0 7 50 0 -1 0.000 0 0 -1 0 0 2
	 2115 6750 2025 6840
2 1 0 1 0 7 50 0 -1 0.000 0 0 -1 0 0 2
	 2205 6750 2115 6840
2 1 0 1 0 7 50 0 -1 0.000 0 0 -1 0 0 2
	 2295 6750 2205 6840
2 1 0 1 0 7 50 0 -1 0.000 0 0 -1 0 0 2
	 2385 6750 2295 6840
2 1 0 1 0 7 50 0 -1 0.000 0 0 -1 0 0 2
	 2475 6750 2385 6840
-6
6 6525 6750 6975 6840
2 1 0 1 0 7 50 0 -1 0.000 0 0 -1 0 0 2
	 6525 6750 6975 6750
2 1 0 1 0 7 50 0 -1 0.000 0 0 -1 0 0 2
	 6615 6750 6525 6840
2 1 0 1 0 7 50 0 -1 0.000 0 0 -1 0 0 2
	 6705 6750 6615 6840
2 1 0 1 0 7 50 0 -1 0.000 0 0 -1 0 0 2
	 6795 6750 6705 6840
2 1 0 1 0 7 50 0 -1 0.000 0 0 -1 0 0 2
	 6885 6750 6795 6840
2 1 0 1 0 7 50 0 -1 0.000 0 0 -1 0 0 2
	 6975 6750 6885 6840
-6
2 1 0 2 0 7 50 0 -1 0.000 0 0 -1 0 0 4
	 2250 6750 2250 2250 6750 2250 6750 6750
2 1 0 2 0 7 50 0 -1 0.000 0 0 -1 0 0 2
	 2250 4500 6750 4500
2 1 0 2 0 7 50 0 -1 0.000 0 0 -1 0 0 2
	 4500 2250 4500 4500
2 1 1 2 0 7 50 0 -1 6.000 0 0 -1 0 0 3
	 2250 6750 1575 4500 1350 2250
2 1 1 2 0 7 50 0 -1 6.000 0 0 -1 0 0 3
	 6722 6745 6047 4495 5822 2245
2 1 1 2 0 7 50 0 -1 6.000 0 0 -1 0 0 3
	 1350 2205 3555 2700 5805 2250
2 1 1 2 0 7 50 0 -1 6.000 0 0 -1 0 0 3
	 1575 4455 3780 4950 6030 4500
2 1 1 2 0 7 50 0 -1 6.000 0 0 -1 0 0 2
	 3555 2700 3780 4950
2 1 0 1 0 7 50 0 -1 4.000 0 0 -1 0 0 2
	 1575 4455 1575 2430
2 1 0 1 0 7 50 0 -1 4.000 0 0 -1 0 0 2
	 6030 4500 6030 2610
2 1 0 1 0 7 50 0 -1 4.000 0 0 -1 0 0 2
	 4500 5040 4500 6165
2 1 0 1 0 7 50 0 -1 4.000 0 0 -1 1 1 2
	1 1 1.00 60.00 120.00
	1 1 1.00 60.00 120.00
	 2250 6030 4500 6030
2 1 0 1 0 7 50 0 -1 4.000 0 0 -1 1 1 2
	1 1 1.00 60.00 120.00
	1 1 1.00 60.00 120.00
	 4500 6030 6750 6030
2 1 0 1 0 7 50 0 -1 4.000 0 0 -1 1 0 2
	1 1 1.00 60.00 120.00
	 6030 2700 5850 2700
2 1 0 1 0 7 50 0 -1 4.000 0 0 -1 1 0 2
	1 1 1.00 60.00 120.00
	 1575 2700 1395 2700
4 0 0 50 0 32 24 0.0000 4 270 270 1890 5535 y\001
4 0 0 50 0 32 24 0.0000 4 270 270 990 2745 y\001
4 0 0 50 0 32 24 0.0000 4 270 270 5445 2925 y\001
4 0 0 50 0 32 24 0.0000 4 270 270 6300 5490 y\001
4 0 0 50 0 32 24 0.0000 4 270 270 4095 5130 y\001
4 0 0 50 0 32 24 0.0000 4 270 270 3825 2880 y\001
4 0 0 50 0 0 18 0.0000 4 195 135 2115 5670 1\001
4 0 0 50 0 0 18 0.0000 4 195 135 6525 5670 1\001
4 0 0 50 0 0 18 0.0000 4 195 135 1215 2880 2\001
4 0 0 50 0 0 18 0.0000 4 195 135 5670 3060 2\001
4 0 0 50 0 0 18 0.0000 4 195 135 4050 3015 3\001
4 0 0 50 0 0 18 0.0000 4 195 135 4365 5265 3\001
4 0 0 50 0 0 18 0.0000 4 195 135 2880 5130 4\001
4 0 0 50 0 1 24 0.0000 4 165 195 3285 5985 a\001
4 0 0 50 0 1 24 0.0000 4 255 180 5490 5985 b\001
4 0 0 50 0 32 24 0.0000 4 270 465 2475 4995 -y\001
