#FIG 3.2
Landscape
Center
Inches
Letter  
100.00
Single
-2
1200 2
6 825 3525 1650 3750
2 1 0 2 0 7 50 0 -1 0.000 0 0 -1 0 0 2
	 900 3600 1575 3600
2 1 0 1 0 7 50 0 -1 0.000 0 0 -1 0 0 2
	 1050 3600 900 3750
2 1 0 1 0 7 50 0 -1 0.000 0 0 -1 0 0 2
	 1200 3600 1050 3750
2 1 0 1 0 7 50 0 -1 0.000 0 0 -1 0 0 2
	 1350 3600 1200 3750
2 1 0 1 0 7 50 0 -1 0.000 0 0 -1 0 0 2
	 1500 3600 1350 3750
-6
6 4350 3525 5175 3750
2 1 0 2 0 7 50 0 -1 0.000 0 0 -1 0 0 2
	 4425 3600 5100 3600
2 1 0 1 0 7 50 0 -1 0.000 0 0 -1 0 0 2
	 4575 3600 4425 3750
2 1 0 1 0 7 50 0 -1 0.000 0 0 -1 0 0 2
	 4725 3600 4575 3750
2 1 0 1 0 7 50 0 -1 0.000 0 0 -1 0 0 2
	 4875 3600 4725 3750
2 1 0 1 0 7 50 0 -1 0.000 0 0 -1 0 0 2
	 5025 3600 4875 3750
-6
2 1 0 2 0 7 50 0 -1 0.000 0 0 -1 0 0 4
	 1200 3600 1200 1200 4800 1200 4800 3600
2 1 0 1 0 7 50 0 -1 0.000 0 0 -1 0 0 2
	 4875 1200 5475 1200
2 1 0 1 0 7 50 0 -1 0.000 0 0 -1 0 0 2
	 1200 3825 1200 4500
2 1 0 1 0 7 50 0 -1 0.000 0 0 -1 0 0 2
	 4800 3825 4800 4500
2 1 0 1 0 7 50 0 -1 0.000 0 0 -1 0 0 2
	 4875 3600 5475 3600
2 1 0 1 0 7 50 0 -1 0.000 0 0 -1 1 1 2
	1 1 1.00 60.00 120.00
	1 1 1.00 60.00 120.00
	 5400 3600 5400 1200
2 1 0 1 0 7 50 0 -1 0.000 0 0 -1 1 1 2
	1 1 1.00 60.00 120.00
	1 1 1.00 60.00 120.00
	 1200 4350 4800 4350
2 1 0 1 0 7 50 0 -1 0.000 0 0 -1 0 0 2
	 4425 3975 5100 3975
2 1 0 1 0 7 50 0 -1 0.000 0 0 -1 1 0 2
	1 1 1.00 60.00 120.00
	 4950 3600 4950 3975
2 1 1 1 0 7 50 0 -1 4.000 0 0 -1 0 0 2
	 4725 1200 4725 3675
2 1 1 1 0 7 50 0 -1 4.000 0 0 -1 0 0 2
	 4875 1200 4875 3600
4 0 0 50 0 1 32 0.0000 4 345 135 2850 4275 l\001
4 0 0 50 0 1 32 1.5708 4 345 240 5325 2550 h\001
4 0 0 50 0 0 32 0.0000 4 345 240 1425 3450 1\001
4 0 0 50 0 0 32 0.0000 4 345 240 4425 3525 2\001
4 0 0 50 0 0 32 0.0000 4 345 240 1425 1725 3\001
4 0 0 50 0 0 32 0.0000 4 345 240 4425 1725 4\001
4 0 0 50 0 1 32 0.0000 4 225 195 5100 3975 s\001
4 0 0 50 0 1 32 1.5708 4 285 135 4650 2475 t\001
