#FIG 3.2
Landscape
Center
Metric
Letter  
100.00
Single
-2
1200 2
6 2835 2205 4320 3510
2 1 0 2 0 7 100 0 -1 6.000 0 0 -1 0 0 4
	 3181 3466 2883 3071 3996 2231 4294 2627
4 0 0 100 0 0 32 0.6458 4 330 1290 3163 3367 -0.833\001
-6
6 4860 3060 5400 3510
2 1 0 2 0 7 100 0 -1 6.000 0 0 -1 0 0 4
	 5355 3465 4905 3465 4905 3105 5355 3105
4 0 0 100 0 0 32 1.5708 4 330 225 5310 3375 1\001
-6
6 8730 1890 13095 3240
1 3 0 2 0 7 100 0 -1 6.000 1 0.0000 11970 2385 452 452 11970 2385 12420 2430
2 1 0 1 0 7 100 0 -1 4.000 0 0 -1 0 0 2
	 12420 1935 13095 1935
2 1 0 1 0 7 100 0 -1 4.000 0 0 -1 0 0 2
	 12420 2835 13095 2835
2 1 0 1 0 7 100 0 -1 4.000 0 0 -1 1 1 2
	1 1 1.00 60.00 120.00
	1 1 1.00 60.00 120.00
	 13050 2835 13050 1935
2 1 0 1 0 7 100 0 -1 4.000 0 0 -1 0 1 2
	1 1 1.00 60.00 120.00
	 11655 2700 11115 3240
2 1 0 1 0 7 100 0 -1 4.000 0 0 -1 0 1 2
	1 1 1.00 60.00 120.00
	 11655 2700 11925 2430
4 0 0 100 0 0 24 0.0000 4 255 2115 8730 2475 cross-section:\001
4 0 0 100 0 0 32 1.5708 4 330 570 12960 2610 0.2\001
4 0 0 100 0 0 32 0.7854 4 330 795 10980 3240 0.01\001
-6
2 3 0 2 0 7 100 0 -1 6.000 0 0 -1 0 0 4
	 1800 4500 9000 4500 5400 1800 1800 4500
2 1 0 2 0 7 100 0 -1 0.000 0 0 -1 0 0 2
	 5400 1800 5400 4500
2 3 0 1 0 7 100 0 -1 4.000 0 0 -1 0 0 4
	 1620 4770 1800 4500 1980 4770 1620 4770
2 3 0 1 0 7 100 0 -1 4.000 0 0 -1 0 0 4
	 8820 4770 9000 4500 9180 4770 8820 4770
2 1 0 1 0 7 100 0 -1 4.000 0 0 -1 0 0 2
	 8820 4860 9180 4860
2 1 0 1 0 7 100 0 -1 4.000 0 0 -1 0 0 2
	 1800 4860 1800 5355
2 1 0 1 0 7 100 0 -1 4.000 0 0 -1 0 0 2
	 9000 4905 9000 5400
2 1 0 1 0 7 100 0 -1 4.000 0 0 -1 0 0 2
	 5715 1800 8640 1800
2 1 0 1 0 7 100 0 -1 4.000 0 0 -1 1 1 2
	1 1 1.00 60.00 120.00
	1 1 1.00 60.00 120.00
	 1800 5265 5400 5265
2 1 0 1 0 7 100 0 -1 4.000 0 0 -1 1 1 2
	1 1 1.00 60.00 120.00
	1 1 1.00 60.00 120.00
	 5400 5265 9000 5265
2 1 0 2 0 7 100 0 -1 6.000 0 0 -1 1 0 2
	1 1 1.00 60.00 120.00
	 5400 4590 5400 5625
2 1 0 2 0 7 100 0 -1 6.000 0 0 -1 0 0 4
	 3105 4500 3105 4050 4320 4050 4320 4500
2 1 0 1 0 7 100 0 -1 4.000 0 0 -1 0 0 2
	 5400 2430 5985 2430
2 1 0 1 0 7 100 0 -1 4.000 0 0 -1 0 0 2
	 5400 5085 6075 5085
2 1 0 1 0 7 100 0 -1 4.000 0 0 -1 1 0 2
	1 1 1.00 60.00 120.00
	 5850 1800 5850 2430
2 1 0 1 0 7 100 0 -1 4.000 0 0 -1 1 0 2
	1 1 1.00 60.00 120.00
	 5940 4500 5940 5085
2 1 0 1 0 7 100 0 -1 4.000 0 0 -1 1 1 2
	1 1 1.00 60.00 120.00
	1 1 1.00 60.00 120.00
	 8460 4500 8460 1800
4 0 0 100 0 0 32 0.0000 4 330 225 1620 4365 1\001
4 0 0 100 0 0 32 0.0000 4 330 225 8910 4365 2\001
4 0 0 100 0 0 32 0.0000 4 330 225 5130 4365 3\001
4 0 0 100 0 0 32 0.0000 4 330 225 4815 2025 4\001
4 0 0 100 0 0 32 0.0000 4 330 225 3555 5175 4\001
4 0 0 100 0 0 32 0.0000 4 330 225 7110 5175 4\001
4 0 0 100 0 0 32 0.0000 4 330 765 5535 5715 F=1\001
4 0 0 100 0 0 32 0.0000 4 330 1020 3195 4455 0.666\001
4 0 0 100 0 1 32 0.0000 4 210 225 5940 2205 v\001
4 0 0 100 0 1 32 0.0000 4 210 225 5985 4905 v\001
4 0 0 100 0 0 24 0.0000 4 255 180 6165 2295 4\001
4 0 0 100 0 0 24 0.0000 4 255 180 6210 5085 3\001
4 0 0 100 0 0 32 1.5708 4 330 225 8415 3240 3\001
