#FIG 3.2
Landscape
Center
Metric
A4      
100.00
Single
-2
1200 2
6 2100 4500 2400 4800
2 3 0 1 0 7 50 0 -1 4.000 0 0 -1 0 0 4
	 2115 4725 2250 4500 2385 4725 2115 4725
2 1 0 1 0 7 50 0 -1 4.000 0 0 -1 0 0 2
	 2115 4770 2385 4770
-6
6 3750 2925 4275 3375
4 0 0 50 0 1 24 0.7854 4 255 225 3941 3311 X\001
4 0 0 50 0 1 18 0.7854 4 195 135 4164 3216 1\001
-6
6 2175 2175 5700 4575
2 1 0 2 0 7 50 0 -1 6.000 0 0 -1 0 0 4
	 5625 2250 2250 2250 2250 4500 5625 4500
2 1 0 2 0 7 50 0 -1 6.000 0 0 -1 0 0 2
	 4500 2250 4500 4500
2 1 0 2 0 7 50 0 -1 6.000 0 0 -1 0 0 2
	 2250 2250 4500 4500
2 1 0 2 0 7 50 0 -1 6.000 0 0 -1 0 0 3
	 4500 2250 5625 3375 4500 4455
-6
6 7125 2175 10650 4575
2 1 0 2 0 7 50 0 -1 6.000 0 0 -1 0 0 4
	 10575 2250 7200 2250 7200 4500 10575 4500
2 1 0 2 0 7 50 0 -1 6.000 0 0 -1 0 0 2
	 9450 2250 9450 4500
2 1 0 2 0 7 50 0 -1 6.000 0 0 -1 0 0 2
	 7200 2250 9450 4500
2 1 0 2 0 7 50 0 -1 6.000 0 0 -1 0 0 3
	 9450 2250 10575 3375 9450 4455
-6
6 1875 5175 5775 8025
6 2325 5700 5775 8025
2 1 0 2 0 7 50 0 -1 6.000 0 0 -1 0 0 4
	 5715 5715 2340 5715 2340 7965 5715 7965
2 1 0 2 0 7 50 0 -1 6.000 0 0 -1 0 0 2
	 4590 5715 4590 7965
2 1 0 2 0 7 50 0 -1 6.000 0 0 -1 0 0 2
	 2340 5715 4590 7965
2 1 0 2 0 7 50 0 -1 6.000 0 0 -1 0 0 3
	 4590 5715 5715 6840 4590 7920
-6
6 2775 5850 3375 6450
2 1 0 1 0 7 50 0 -1 4.000 0 0 -1 0 0 4
	 2835 6210 3121 5924 3344 6146 3058 6433
4 0 0 50 0 0 24 5.4978 4 255 180 2899 6210 1\001
-6
6 2550 6900 3150 7425
2 1 0 1 0 7 50 0 -1 4.000 0 0 -1 0 0 4
	 2880 7425 2594 7139 2816 6916 3103 7202
4 0 0 50 0 0 24 0.7854 4 255 180 2880 7361 1\001
-6
6 2850 7500 4050 8025
2 1 0 1 0 7 50 0 -1 4.000 0 0 -1 0 0 4
	 2880 7965 2880 7560 4005 7560 4005 7920
4 0 0 50 0 0 24 0.0000 4 255 945 2925 7920 -0.707\001
-6
6 2925 5250 4125 5775
2 1 0 1 0 7 50 0 -1 4.000 0 0 -1 0 0 4
	 2970 5715 2970 5310 4095 5310 4095 5715
4 0 0 50 0 0 24 0.0000 4 255 945 3015 5670 -0.707\001
-6
6 1875 6225 2400 7425
2 1 0 1 0 7 50 0 -1 4.000 0 0 -1 0 0 4
	 2340 7380 1935 7380 1935 6255 2340 6255
4 0 0 50 0 0 24 1.5708 4 255 945 2295 7335 -0.707\001
-6
6 4125 6225 4650 7425
2 1 0 1 0 7 50 0 -1 4.000 0 0 -1 0 0 4
	 4590 7380 4185 7380 4185 6255 4590 6255
4 0 0 50 0 0 24 1.5708 4 255 945 4545 7335 -0.707\001
-6
6 5025 5250 5400 5775
2 1 0 1 0 7 50 0 -1 4.000 0 0 -1 0 0 4
	 5040 5715 5040 5310 5400 5310 5400 5715
4 0 0 50 0 0 24 0.0000 4 255 180 5130 5670 0\001
-6
6 5025 7500 5475 8025
2 1 0 1 0 7 50 0 -1 4.000 0 0 -1 0 0 4
	 5085 7965 5085 7560 5445 7560 5445 7965
4 0 0 50 0 0 24 0.0000 4 255 180 5175 7920 0\001
-6
6 5025 5850 5700 6450
2 1 0 1 0 7 50 0 -1 4.000 0 0 -1 0 0 4
	 5085 6165 5371 5879 5626 6133 5340 6420
4 0 0 50 0 0 24 5.4978 4 255 180 5180 6197 0\001
-6
6 4875 6750 5475 7425
2 1 0 1 0 7 50 0 -1 4.000 0 0 -1 0 0 4
	 5190 7365 4904 7078 5159 6824 5445 7110
4 0 0 50 0 0 24 0.7854 4 255 180 5222 7269 0\001
-6
2 1 0 2 0 7 50 0 -1 0.000 0 0 -1 1 0 2
	1 1 2.00 120.00 240.00
	 4573 5696 3988 6326
2 1 0 2 0 7 50 0 -1 0.000 0 0 -1 1 0 2
	1 1 2.00 120.00 240.00
	 2295 7965 3735 6570
4 0 0 50 0 0 24 0.7854 4 255 180 3915 6750 1\001
4 0 0 50 0 0 32 0.0000 4 345 615 2205 5535 N :\001
4 0 0 50 0 0 24 0.0000 4 255 180 2520 5625 1\001
-6
6 5475 3375 5775 3675
2 3 0 1 0 7 50 0 -1 4.000 0 0 -1 0 0 4
	 5490 3600 5625 3375 5760 3600 5490 3600
2 1 0 1 0 7 50 0 -1 4.000 0 0 -1 0 0 2
	 5490 3645 5760 3645
-6
6 5475 2250 5775 2550
2 3 0 1 0 7 50 0 -1 4.000 0 0 -1 0 0 4
	 5490 2475 5625 2250 5760 2475 5490 2475
2 1 0 1 0 7 50 0 -1 4.000 0 0 -1 0 0 2
	 5490 2520 5760 2520
-6
6 5475 4500 5775 4800
2 3 0 1 0 7 50 0 -1 4.000 0 0 -1 0 0 4
	 5490 4725 5625 4500 5760 4725 5490 4725
2 1 0 1 0 7 50 0 -1 4.000 0 0 -1 0 0 2
	 5490 4770 5760 4770
-6
6 7725 2250 9000 2625
2 1 0 1 0 7 50 0 -1 0.000 0 0 -1 0 0 4
	 7785 2250 7785 2610 8955 2610 8955 2250
4 0 0 50 0 0 24 0.0000 4 255 945 7830 2565 -0.166\001
-6
6 9075 2775 9525 3750
2 1 0 1 0 7 50 0 -1 0.000 0 0 -1 0 0 4
	 9495 3690 9090 3690 9090 2790 9495 2790
4 0 0 50 0 0 24 1.5708 4 255 810 9450 3645 0.166\001
-6
6 6825 3000 7200 3825
2 1 0 1 0 7 50 0 -1 0.000 0 0 -1 0 0 4
	 7200 3780 6840 3780 6840 3015 7200 3015
4 0 0 50 0 0 24 1.5708 4 255 630 7155 3690 0.33\001
-6
6 7950 2700 9000 3825
2 1 0 1 0 7 50 0 -1 0.000 0 0 -1 0 0 4
	 7997 3028 8251 2774 8951 3474 8665 3760
4 0 0 50 0 0 24 5.4978 4 255 765 8092 3060 -0.47\001
-6
6 9600 2175 10725 3300
2 1 0 1 0 7 50 0 -1 0.000 0 0 -1 0 0 4
	 9645 2445 9899 2190 10695 2985 10440 3240
4 0 0 50 0 0 24 5.4978 4 255 945 9708 2445 -0.235\001
-6
6 9750 3600 10725 4500
2 1 0 1 0 7 50 0 -1 0.000 0 0 -1 0 0 4
	 9765 4185 10051 4471 10656 3867 10401 3612
4 0 0 50 0 0 24 0.7854 4 255 810 10020 4376 0.235\001
-6
6 7125 5700 10650 8025
2 1 0 2 0 7 50 0 -1 6.000 0 0 -1 0 0 4
	 10575 5760 7200 5760 7200 8010 10575 8010
2 1 0 2 0 7 50 0 -1 6.000 0 0 -1 0 0 2
	 9450 5760 9450 8010
2 1 0 2 0 7 50 0 -1 6.000 0 0 -1 0 0 2
	 7200 5760 9450 8010
2 1 0 2 0 7 50 0 -1 6.000 0 0 -1 0 0 3
	 9450 5760 10575 6885 9450 7965
-6
6 7725 5700 8775 6075
2 1 0 1 0 7 50 0 -1 0.000 0 0 -1 0 0 4
	 7785 5760 7785 6075 8730 6075 8730 5760
4 0 0 50 0 0 24 0.0000 4 255 765 7830 6030 -0.33\001
-6
6 7350 6750 8175 7650
2 1 0 1 0 7 50 0 -1 0.000 0 0 -1 0 0 4
	 7605 7605 7350 7350 7891 6810 8146 7064
4 0 0 50 0 0 24 0.7854 4 255 630 7637 7510 0.24\001
-6
6 9450 6675 9825 7050
2 1 0 1 0 7 50 0 -1 0.000 0 0 -1 0 0 4
	 9450 6705 9810 6705 9810 7020 9450 7020
4 0 0 50 0 0 24 4.7124 4 255 180 9495 6750 0\001
-6
6 9525 6825 10425 7650
2 1 0 1 0 7 50 0 -1 0.000 0 0 -1 0 0 4
	 9795 7605 9571 7381 10112 6842 10368 7096
4 0 0 50 0 0 24 0.7854 4 255 630 9858 7542 0.23\001
-6
6 9675 5775 10650 6750
2 1 0 1 0 7 50 0 -1 0.000 0 0 -1 0 0 4
	 9720 6030 9975 5775 10643 6444 10388 6698
4 0 0 50 0 0 24 5.4978 4 255 765 9784 6030 -0.23\001
-6
2 1 0 2 0 7 50 0 -1 0.000 0 0 -1 1 0 2
	1 1 2.00 120.00 240.00
	 2250 4500 3690 3105
2 1 0 2 0 7 50 0 -1 0.000 0 0 -1 1 0 2
	1 1 2.00 120.00 240.00
	 4500 2250 3915 2880
2 1 0 2 0 7 50 0 -1 6.000 0 0 -1 1 0 2
	1 1 2.00 120.00 240.00
	 6615 2250 7065 2250
2 1 0 2 0 7 50 0 -1 6.000 0 0 -1 1 0 2
	1 1 2.00 120.00 240.00
	 7110 4500 6660 4500
2 1 0 1 0 7 50 0 -1 0.000 0 0 -1 0 0 4
	 7650 4500 7650 4140 8460 4140 8460 4500
2 1 0 1 0 7 50 0 -1 0.000 0 0 -1 0 0 4
	 8505 7065 8775 6795 9405 7425 9180 7740
2 1 0 2 0 7 50 0 -1 0.000 0 0 -1 0 0 2
	 7200 8010 9450 5760
2 1 0 1 0 7 50 0 -1 0.000 0 0 -1 0 0 4
	 7785 8010 7785 7650 8505 7650 8505 8010
2 1 0 1 0 7 50 0 -1 0.000 0 0 -1 0 0 4
	 7200 7335 6840 7335 6840 6165 7200 6165
4 0 0 50 0 1 24 0.0000 4 255 465 6525 2655 1/2\001
4 0 0 50 0 1 24 0.0000 4 255 465 6525 4320 1/2\001
4 0 0 50 0 0 24 0.0000 4 255 3900 1845 2025 PRIMARY STRUCTURE\001
4 0 0 50 0 0 24 0.0000 4 180 180 7470 2160 o\001
4 0 0 50 0 0 24 0.0000 4 255 585 7695 4455 -0.5\001
4 0 0 50 0 0 24 0.0000 4 255 630 7830 7965 0.33\001
4 0 0 50 0 0 24 5.4978 4 255 765 8595 7065 -0.22\001
4 0 0 50 0 0 24 0.0000 4 255 2625 7200 5535 FINAL FORCES:\001
4 0 0 50 0 0 24 1.5708 4 255 630 7155 7245 0.14\001
4 0 0 50 0 0 32 0.0000 4 345 735 7155 2070 N  :\001
4 0 0 50 0 0 24 0.0000 4 255 180 1980 4590 1\001
4 0 0 50 0 0 24 0.0000 4 255 180 4410 4860 2\001
4 0 0 50 0 0 24 0.0000 4 255 180 5265 4860 3\001
4 0 0 50 0 0 24 0.0000 4 255 180 1980 2475 4\001
4 0 0 50 0 0 24 0.0000 4 255 180 5265 2565 6\001
4 0 0 50 0 0 24 0.0000 4 255 180 5760 3420 7\001
4 0 0 50 0 0 24 0.0000 4 255 180 4005 2565 5\001
