#FIG 3.2
Landscape
Center
Metric
A4      
100.00
Single
-2
1200 2
6 2115 1980 2250 2565
2 1 0 1 0 7 50 0 -1 4.000 0 0 -1 0 0 2
	 2250 1980 2250 2520
2 1 0 1 0 7 50 0 -1 4.000 0 0 -1 0 0 2
	 2250 1980 2115 2160
2 1 0 1 0 7 50 0 -1 4.000 0 0 -1 0 0 2
	 2250 1980 2115 2160
2 1 0 1 0 7 50 0 -1 4.000 0 0 -1 0 0 2
	 2250 2115 2115 2295
2 1 0 1 0 7 50 0 -1 4.000 0 0 -1 0 0 2
	 2250 2250 2115 2430
2 1 0 1 0 7 50 0 -1 4.000 0 0 -1 0 0 2
	 2250 2385 2115 2565
-6
6 4230 4500 4815 4635
2 1 0 1 0 7 50 0 -1 4.000 0 0 -1 0 0 2
	 4230 4500 4770 4500
2 1 0 1 0 7 50 0 -1 4.000 0 0 -1 0 0 2
	 4230 4500 4410 4635
2 1 0 1 0 7 50 0 -1 4.000 0 0 -1 0 0 2
	 4230 4500 4410 4635
2 1 0 1 0 7 50 0 -1 4.000 0 0 -1 0 0 2
	 4365 4500 4545 4635
2 1 0 1 0 7 50 0 -1 4.000 0 0 -1 0 0 2
	 4500 4500 4680 4635
2 1 0 1 0 7 50 0 -1 4.000 0 0 -1 0 0 2
	 4635 4500 4815 4635
-6
6 2475 1980 2700 2250
2 1 0 1 0 7 50 0 -1 4.000 0 0 -1 0 0 2
	 2475 1980 2475 2250
2 1 0 1 0 7 50 0 -1 4.000 0 0 -1 0 0 2
	 2700 1980 2700 2250
-6
6 2925 1980 3150 2250
2 1 0 1 0 7 50 0 -1 4.000 0 0 -1 0 0 2
	 2925 1980 2925 2250
2 1 0 1 0 7 50 0 -1 4.000 0 0 -1 0 0 2
	 3150 1980 3150 2250
-6
6 2925 1980 3150 2250
2 1 0 1 0 7 50 0 -1 4.000 0 0 -1 0 0 2
	 2925 1980 2925 2250
2 1 0 1 0 7 50 0 -1 4.000 0 0 -1 0 0 2
	 3150 1980 3150 2250
-6
6 3375 1980 3600 2250
2 1 0 1 0 7 50 0 -1 4.000 0 0 -1 0 0 2
	 3375 1980 3375 2250
2 1 0 1 0 7 50 0 -1 4.000 0 0 -1 0 0 2
	 3600 1980 3600 2250
-6
6 3375 1980 3600 2250
2 1 0 1 0 7 50 0 -1 4.000 0 0 -1 0 0 2
	 3375 1980 3375 2250
2 1 0 1 0 7 50 0 -1 4.000 0 0 -1 0 0 2
	 3600 1980 3600 2250
-6
6 3870 1980 4095 2250
2 1 0 1 0 7 50 0 -1 4.000 0 0 -1 0 0 2
	 3870 1980 3870 2250
2 1 0 1 0 7 50 0 -1 4.000 0 0 -1 0 0 2
	 4095 1980 4095 2250
-6
2 1 0 2 0 7 50 0 -1 6.000 0 0 -1 0 0 3
	 2250 2250 4500 2250 4500 4500
2 1 0 1 0 7 50 0 -1 4.000 0 0 -1 0 0 3
	 2250 1980 4500 1980 4500 2250
2 1 0 1 0 7 50 0 -1 4.000 0 0 -1 0 0 2
	 4320 1980 4320 2250
2 1 0 1 0 7 50 0 -1 4.000 0 0 -1 0 0 4
	 3465 1980 3645 1800 3690 1800 4005 1800
4 0 0 50 0 0 24 0.0000 4 255 180 2385 2700 1\001
4 0 0 50 0 0 24 0.0000 4 255 180 4185 2655 2\001
4 0 0 50 0 0 24 0.0000 4 255 180 4230 4455 3\001
4 0 0 50 0 1 24 0.0000 4 330 105 3780 1845 f\001
