#FIG 3.2
Landscape
Center
Inches
Letter  
100.00
Single
-2
1200 2
6 975 600 6000 2700
6 3750 2400 4200 2700
2 3 0 1 0 7 50 0 -1 0.000 0 0 -1 0 0 4
	 3825 2625 3975 2400 4125 2625 3825 2625
2 1 0 1 0 7 50 0 -1 0.000 0 0 -1 0 0 2
	 3750 2700 4200 2700
-6
6 975 2400 1425 2700
2 3 0 1 0 7 50 0 -1 0.000 0 0 -1 0 0 4
	 1050 2625 1200 2400 1350 2625 1050 2625
2 1 0 1 0 7 50 0 -1 0.000 0 0 -1 0 0 2
	 975 2700 1425 2700
-6
6 3900 1125 5850 2475
6 3900 1125 5250 2475
6 3900 1125 5250 2475
2 1 0 2 0 7 50 0 -1 0.000 0 0 -1 0 0 4
	 3975 2400 3975 1200 5175 2400 3975 2400
2 1 0 2 0 7 50 0 -1 0.000 0 0 -1 0 0 3
	 3975 1200 5175 1200 5175 2400
-6
2 1 0 2 0 7 50 0 -1 0.000 0 0 -1 0 0 2
	 5175 1200 3975 2400
-6
2 1 0 2 0 7 50 0 -1 0.000 0 0 -1 0 0 3
	 5175 1200 5775 1800 5175 2400
-6
6 1125 1125 3075 2475
6 1125 1125 2475 2475
6 1125 1125 2475 2475
2 1 0 2 0 7 50 0 -1 0.000 0 0 -1 0 0 4
	 1200 2400 1200 1200 2400 2400 1200 2400
2 1 0 2 0 7 50 0 -1 0.000 0 0 -1 0 0 3
	 1200 1200 2400 1200 2400 2400
-6
2 1 0 2 0 7 50 0 -1 0.000 0 0 -1 0 0 2
	 2400 1200 1200 2400
-6
2 1 0 2 0 7 50 0 -1 0.000 0 0 -1 0 0 3
	 2400 1200 3000 1800 2400 2400
-6
6 2775 1800 3225 2100
2 3 0 1 0 7 50 0 -1 0.000 0 0 -1 0 0 4
	 2850 2025 3000 1800 3150 2025 2850 2025
2 1 0 1 0 7 50 0 -1 0.000 0 0 -1 0 0 2
	 2775 2100 3225 2100
-6
6 5550 2400 6000 2700
2 3 0 1 0 7 50 0 -1 0.000 0 0 -1 0 0 4
	 5625 2625 5775 2400 5925 2625 5625 2625
2 1 0 1 0 7 50 0 -1 0.000 0 0 -1 0 0 2
	 5550 2700 6000 2700
-6
6 5550 1800 6000 2100
2 3 0 1 0 7 50 0 -1 0.000 0 0 -1 0 0 4
	 5625 2025 5775 1800 5925 2025 5625 2025
2 1 0 1 0 7 50 0 -1 0.000 0 0 -1 0 0 2
	 5550 2100 6000 2100
-6
6 5550 1200 6000 1500
2 3 0 1 0 7 50 0 -1 0.000 0 0 -1 0 0 4
	 5625 1425 5775 1200 5925 1425 5625 1425
2 1 0 1 0 7 50 0 -1 0.000 0 0 -1 0 0 2
	 5550 1500 6000 1500
-6
2 1 0 2 0 7 50 0 -1 0.000 0 0 -1 0 0 2
	 5175 1200 5775 1200
2 1 0 2 0 7 50 0 -1 0.000 0 0 -1 0 0 2
	 5175 2400 5775 2400
4 0 0 50 0 0 32 0.0000 4 345 1155 1500 975 5 SI 1\001
4 0 0 50 0 0 32 0.0000 4 345 1155 4350 1050 6 SI 1\001
-6
