#FIG 3.2
Landscape
Center
Metric
A4      
100.00
Single
-2
1200 2
6 2205 2205 9045 4545
2 1 0 3 0 7 50 0 -1 0.000 0 0 -1 0 0 2
	 2250 2250 9000 2250
2 1 0 3 0 7 50 0 -1 0.000 0 0 -1 0 0 2
	 4500 2250 4500 4500
-6
6 10080 2205 16920 4545
2 1 0 3 0 7 50 0 -1 0.000 0 0 -1 0 0 2
	 10125 2250 16875 2250
2 1 0 3 0 7 50 0 -1 0.000 0 0 -1 0 0 2
	 12375 2250 12375 4500
-6
2 1 0 2 0 7 50 0 -1 6.000 0 0 -1 0 0 3
	 5850 2250 3105 4500 4500 4500
2 1 0 2 0 7 50 0 -1 6.000 0 0 -1 0 0 3
	 2250 2250 4500 1305 4500 2250
2 1 0 2 0 7 50 0 -1 6.000 0 0 -1 0 0 2
	 4500 2835 9000 2250
2 1 0 1 0 7 50 0 -1 4.000 0 0 -1 0 0 3
	 10125 2250 10125 2700 12375 2700
2 1 0 1 0 7 50 0 -1 4.000 0 0 -1 0 0 3
	 12375 4500 11700 4500 11700 2205
2 1 0 1 0 7 50 0 -1 4.000 0 0 -1 0 0 3
	 12420 2340 16875 2340 16875 2250
4 0 0 50 0 0 24 0.0000 4 300 1125 1800 4500 2.56F/2\001
4 0 0 50 0 0 24 0.0000 4 300 1125 5310 2205 2.43F/2\001
4 0 0 50 0 0 24 0.0000 4 300 1305 3105 2925 0.743F/2\001
4 0 0 50 0 0 24 0.0000 4 300 1125 4680 1620 1.69F/2\001
4 0 0 50 0 0 24 0.0000 4 300 1335 9675 3105 -0.84F/2\001
4 0 0 50 0 0 24 0.0000 4 300 1335 14985 2835 -0.07F/2\001
4 0 0 50 0 0 24 1.5708 4 300 945 11610 4500 1.0F/2\001
4 0 0 50 0 0 32 0.0000 4 330 450 10800 1890 V:\001
4 0 0 50 0 0 32 0.0000 4 330 540 2295 1800 M:\001
