#FIG 3.2  Produced by xfig version 3.2.5b
Landscape
Center
Metric
A4      
100.00
Single
-2
1200 2
6 1665 6420 2190 6930
2 1 0 2 0 7 50 0 -1 6.000 0 0 -1 1 0 2
	1 1 2.00 120.00 240.00
	 1710 6480 2160 6480
4 0 0 50 0 0 24 0.0000 4 285 525 1665 6930 2.5\001
-6
6 5940 6420 6465 6930
2 1 0 2 0 7 50 0 -1 6.000 0 0 -1 1 0 2
	1 1 2.00 120.00 240.00
	 5985 6480 6435 6480
4 0 0 50 0 0 24 0.0000 4 285 525 5940 6930 2.5\001
-6
6 6840 6420 7365 6930
2 1 0 2 0 7 50 0 -1 6.000 0 0 -1 1 0 2
	1 1 2.00 120.00 240.00
	 6885 6480 7335 6480
4 0 0 50 0 0 24 0.0000 4 285 525 6840 6930 2.5\001
-6
6 7200 8730 7830 8865
2 1 0 1 0 7 50 0 -1 4.000 0 0 -1 0 0 2
	 7200 8730 7830 8730
2 1 0 1 0 7 50 0 -1 4.000 0 0 -1 0 0 2
	 7470 8730 7335 8865
2 1 0 1 0 7 50 0 -1 4.000 0 0 -1 0 0 2
	 7650 8730 7515 8865
2 1 0 1 0 7 50 0 -1 4.000 0 0 -1 0 0 2
	 7830 8730 7695 8865
2 1 0 1 0 7 50 0 -1 4.000 0 0 -1 0 0 2
	 7335 8730 7200 8865
-6
6 7470 6435 9270 8775
2 1 0 2 0 7 50 0 -1 6.000 0 0 -1 0 0 2
	 7515 8730 7515 6525
2 1 0 2 0 7 50 0 -1 0.000 0 0 -1 0 0 2
	 7560 6480 9225 6480
-6
6 10215 6435 12015 8775
2 1 0 2 0 7 50 0 -1 6.000 0 0 -1 0 0 2
	 10260 8730 10260 6525
2 1 0 2 0 7 50 0 -1 0.000 0 0 -1 0 0 2
	 10305 6480 11970 6480
-6
6 7020 1305 11745 4950
5 1 0 1 0 7 50 0 -1 4.000 0 1 1 0 7387.500 2482.000 7425 2250 7245 2295 7155 2520
	1 1 1.00 60.00 120.00
5 1 0 1 0 7 50 0 -1 4.000 0 0 1 0 7747.500 2032.500 7515 2070 7560 1890 7785 1800
	1 1 1.00 60.00 120.00
5 1 0 1 0 7 50 0 -1 4.000 0 0 1 0 11377.500 2527.000 11340 2295 11520 2340 11610 2565
	1 1 1.00 60.00 120.00
5 1 0 1 0 7 50 0 -1 4.000 0 1 1 0 10927.500 1987.500 11160 2025 11115 1845 10890 1755
	1 1 1.00 60.00 120.00
6 7290 2115 11520 4590
6 10890 4455 11520 4590
2 1 0 1 0 7 50 0 -1 4.000 0 0 -1 0 0 2
	 10890 4455 11520 4455
2 1 0 1 0 7 50 0 -1 4.000 0 0 -1 0 0 2
	 11160 4455 11025 4590
2 1 0 1 0 7 50 0 -1 4.000 0 0 -1 0 0 2
	 11340 4455 11205 4590
2 1 0 1 0 7 50 0 -1 4.000 0 0 -1 0 0 2
	 11520 4455 11385 4590
2 1 0 1 0 7 50 0 -1 4.000 0 0 -1 0 0 2
	 11025 4455 10890 4590
-6
6 7290 4455 7920 4590
2 1 0 1 0 7 50 0 -1 4.000 0 0 -1 0 0 2
	 7290 4455 7920 4455
2 1 0 1 0 7 50 0 -1 4.000 0 0 -1 0 0 2
	 7560 4455 7425 4590
2 1 0 1 0 7 50 0 -1 4.000 0 0 -1 0 0 2
	 7740 4455 7605 4590
2 1 0 1 0 7 50 0 -1 4.000 0 0 -1 0 0 2
	 7920 4455 7785 4590
2 1 0 1 0 7 50 0 -1 4.000 0 0 -1 0 0 2
	 7425 4455 7290 4590
-6
1 4 0 1 0 7 50 0 -1 4.000 1 0.0000 11182 2205 68 68 11115 2205 11250 2205
1 4 0 1 0 7 50 0 -1 4.000 1 0.0000 7605 2205 68 68 7538 2205 7673 2205
2 1 0 2 0 7 50 0 -1 6.000 0 0 -1 0 0 2
	 11205 4455 11205 2250
2 1 0 2 0 7 50 0 -1 0.000 0 0 -1 0 0 2
	 11115 2205 9495 2205
2 1 0 2 0 7 50 0 -1 6.000 0 0 -1 0 0 2
	 7605 4455 7605 2250
2 1 0 2 0 7 50 0 -1 0.000 0 0 -1 0 0 2
	 7650 2205 9315 2205
-6
2 1 3 2 0 7 50 0 -1 6.000 0 0 -1 0 0 2
	 9405 1620 9405 4905
2 1 0 1 0 7 50 0 -1 4.000 0 0 -1 0 0 2
	 9180 2115 9630 2115
2 1 0 1 0 7 50 0 -1 4.000 0 0 -1 0 0 2
	 9180 2295 9630 2295
2 1 0 1 0 7 50 0 -1 4.000 0 0 -1 1 0 2
	1 1 1.00 60.00 120.00
	 9495 2250 9900 2250
2 1 0 1 0 7 50 0 -1 4.000 0 0 -1 1 0 2
	1 1 1.00 60.00 120.00
	 9315 2160 8955 2160
4 0 0 50 0 0 18 0.0000 4 195 3285 7380 1530 PRIMARY STRUCTURE:\001
4 0 0 50 0 0 24 0.0000 4 270 300 11295 2070 X\001
4 0 0 50 0 0 24 0.0000 4 270 300 9675 2610 X\001
4 0 0 50 0 0 24 0.0000 4 270 300 8730 2025 X\001
4 0 0 50 0 0 24 0.0000 4 270 300 7020 2070 X\001
4 0 0 50 0 0 18 0.0000 4 195 150 7290 2160 1\001
4 0 0 50 0 0 18 0.0000 4 195 150 11610 2205 2\001
4 0 0 50 0 0 18 0.0000 4 195 150 9990 2745 3\001
4 0 0 50 0 0 18 0.0000 4 195 150 9045 2115 3\001
-6
6 2025 4455 2655 4590
2 1 0 1 0 7 50 0 -1 4.000 0 0 -1 0 0 2
	 2025 4455 2655 4455
2 1 0 1 0 7 50 0 -1 4.000 0 0 -1 0 0 2
	 2295 4455 2160 4590
2 1 0 1 0 7 50 0 -1 4.000 0 0 -1 0 0 2
	 2475 4455 2340 4590
2 1 0 1 0 7 50 0 -1 4.000 0 0 -1 0 0 2
	 2655 4455 2520 4590
2 1 0 1 0 7 50 0 -1 4.000 0 0 -1 0 0 2
	 2160 4455 2025 4590
-6
6 5625 4455 6255 4590
2 1 0 1 0 7 50 0 -1 4.000 0 0 -1 0 0 2
	 5625 4455 6255 4455
2 1 0 1 0 7 50 0 -1 4.000 0 0 -1 0 0 2
	 5895 4455 5760 4590
2 1 0 1 0 7 50 0 -1 4.000 0 0 -1 0 0 2
	 6075 4455 5940 4590
2 1 0 1 0 7 50 0 -1 4.000 0 0 -1 0 0 2
	 6255 4455 6120 4590
2 1 0 1 0 7 50 0 -1 4.000 0 0 -1 0 0 2
	 5760 4455 5625 4590
-6
6 3960 1575 4320 4950
2 3 0 1 0 7 50 0 -1 4.000 0 0 -1 0 0 5
	 3960 1935 4320 1755 4320 1935 3960 1755 3960 1935
2 3 0 1 0 7 50 0 -1 4.000 0 0 -1 0 0 5
	 3960 4725 4320 4545 4320 4725 3960 4545 3960 4725
2 1 3 2 0 7 50 0 -1 6.000 0 0 -1 0 0 2
	 4140 1620 4140 4905
-6
6 9045 5715 9405 9090
2 3 0 1 0 7 50 0 -1 4.000 0 0 -1 0 0 5
	 9045 6075 9405 5895 9405 6075 9045 5895 9045 6075
2 3 0 1 0 7 50 0 -1 4.000 0 0 -1 0 0 5
	 9045 8865 9405 8685 9405 8865 9045 8685 9045 8865
2 1 3 2 0 7 50 0 -1 6.000 0 0 -1 0 0 2
	 9225 5760 9225 9045
-6
6 11790 5670 12150 9045
2 3 0 1 0 7 50 0 -1 4.000 0 0 -1 0 0 5
	 11790 6030 12150 5850 12150 6030 11790 5850 11790 6030
2 3 0 1 0 7 50 0 -1 4.000 0 0 -1 0 0 5
	 11790 8820 12150 8640 12150 8820 11790 8640 11790 8820
2 1 3 2 0 7 50 0 -1 6.000 0 0 -1 0 0 2
	 11970 5715 11970 9000
-6
6 1980 6390 6210 8865
6 5580 8730 6210 8865
2 1 0 1 0 7 50 0 -1 4.000 0 0 -1 0 0 2
	 5580 8730 6210 8730
2 1 0 1 0 7 50 0 -1 4.000 0 0 -1 0 0 2
	 5850 8730 5715 8865
2 1 0 1 0 7 50 0 -1 4.000 0 0 -1 0 0 2
	 6030 8730 5895 8865
2 1 0 1 0 7 50 0 -1 4.000 0 0 -1 0 0 2
	 6210 8730 6075 8865
2 1 0 1 0 7 50 0 -1 4.000 0 0 -1 0 0 2
	 5715 8730 5580 8865
-6
6 1980 8730 2610 8865
2 1 0 1 0 7 50 0 -1 4.000 0 0 -1 0 0 2
	 1980 8730 2610 8730
2 1 0 1 0 7 50 0 -1 4.000 0 0 -1 0 0 2
	 2250 8730 2115 8865
2 1 0 1 0 7 50 0 -1 4.000 0 0 -1 0 0 2
	 2430 8730 2295 8865
2 1 0 1 0 7 50 0 -1 4.000 0 0 -1 0 0 2
	 2610 8730 2475 8865
2 1 0 1 0 7 50 0 -1 4.000 0 0 -1 0 0 2
	 2115 8730 1980 8865
-6
1 4 0 1 0 7 50 0 -1 4.000 1 0.0000 5872 6480 68 68 5805 6480 5940 6480
1 4 0 1 0 7 50 0 -1 4.000 1 0.0000 2295 6480 68 68 2228 6480 2363 6480
2 1 0 2 0 7 50 0 -1 6.000 0 0 -1 0 0 2
	 5895 8730 5895 6525
2 1 0 2 0 7 50 0 -1 0.000 0 0 -1 0 0 2
	 5805 6480 4185 6480
2 1 0 2 0 7 50 0 -1 6.000 0 0 -1 0 0 2
	 2295 8730 2295 6525
2 1 0 2 0 7 50 0 -1 0.000 0 0 -1 0 0 2
	 2340 6480 4005 6480
-6
1 4 0 1 0 7 50 0 -1 4.000 1 0.0000 7515 6480 68 68 7448 6480 7583 6480
2 1 0 1 0 7 50 0 -1 4.000 0 0 -1 0 0 2
	 3870 6570 4320 6570
2 1 0 1 0 7 50 0 -1 4.000 0 0 -1 0 0 2
	 3870 6390 4320 6390
2 1 0 1 0 7 50 0 -1 0.000 0 0 -1 0 0 3
	 7470 6525 6975 8730 7515 8730
2 1 0 1 0 7 50 0 -1 4.000 0 0 -1 0 0 2
	 10260 7155 11970 6480
2 1 0 1 0 7 50 0 -1 4.000 0 0 -1 0 0 2
	 2340 4680 2340 5175
2 1 0 1 0 7 50 0 -1 4.000 0 0 -1 0 0 2
	 5940 4680 5940 5175
2 1 0 1 0 7 50 0 -1 4.000 0 0 -1 0 0 2
	 6075 2205 6570 2205
2 1 0 1 0 7 50 0 -1 4.000 0 0 -1 0 0 2
	 6345 4410 6570 4410
2 1 0 1 0 7 50 0 -1 4.000 0 0 -1 1 1 2
	1 1 1.00 60.00 120.00
	1 1 1.00 60.00 120.00
	 2340 5040 5940 5040
2 1 0 1 0 7 50 0 -1 4.000 0 0 -1 1 1 2
	1 1 1.00 60.00 120.00
	1 1 1.00 60.00 120.00
	 6435 4410 6435 2205
2 1 0 2 0 7 50 0 -1 6.000 0 0 -1 1 0 2
	1 1 2.00 120.00 240.00
	 1575 2205 2295 2205
2 1 0 2 0 7 50 0 -1 0.000 0 0 -1 0 0 4
	 2340 4455 2340 2205 5940 2205 5940 4455
2 1 0 1 0 7 50 -1 -1 0.000 0 0 -1 0 0 3
	 10935 6480 10935 8730 10260 8730
2 1 0 2 0 7 50 0 -1 0.000 0 0 -1 0 0 4
	 4680 12150 4680 9900 8280 9900 8280 12150
2 1 0 1 0 7 50 0 -1 4.000 0 0 -1 0 0 3
	 4680 12150 3870 12150 5400 9900
2 1 0 1 0 7 50 0 -1 4.000 0 0 -1 0 0 3
	 4680 10530 8280 9270 8280 9900
2 1 0 1 0 7 50 0 -1 4.000 0 0 -1 0 0 3
	 8235 12150 7425 12150 8955 9900
2 1 0 1 0 7 50 0 -1 4.000 0 0 -1 0 0 2
	 8955 9900 8280 9900
4 0 0 50 0 0 18 0.0000 4 195 4380 1710 6075 ANTISYMMETRIC LOAD CASE:\001
4 0 0 50 0 0 24 0.0000 4 270 210 10530 6435 1\001
4 0 0 50 0 0 24 0.0000 4 270 210 10035 7020 1\001
4 0 0 50 0 0 24 0.0000 4 270 585 8010 6210 M :\001
4 0 0 50 0 0 24 0.0000 4 270 585 11070 6120 M :\001
4 0 0 50 0 0 18 0.0000 4 135 150 8325 6300 o\001
4 0 0 50 0 0 18 0.0000 4 195 150 11385 6210 1\001
4 0 0 50 0 0 24 0.0000 4 270 210 4680 4950 6\001
4 0 0 50 0 0 24 1.5708 4 270 210 6345 3600 4\001
4 0 0 50 0 0 24 0.0000 4 285 210 1800 2655 5\001
4 0 0 50 0 0 24 0.0000 4 270 420 6570 8640 10\001
4 0 0 50 0 0 18 0.0000 4 210 150 4860 12150 6\001
4 0 0 50 0 0 18 0.0000 4 195 150 4680 9765 4\001
4 0 0 50 0 0 18 0.0000 4 195 3870 3960 9360 FINAL BENDING MOMENT:\001
4 0 0 50 0 0 18 0.0000 4 195 150 8370 9720 4\001
4 0 0 50 0 0 18 0.0000 4 210 150 7155 12105 6\001
