#FIG 3.2
Landscape
Center
Metric
A4      
100.00
Single
-2
1200 2
6 1980 2205 5895 4590
6 1980 4500 2565 4590
2 1 0 1 0 7 50 0 -1 0.000 0 0 -1 0 0 2
	 1980 4500 2565 4500
2 1 0 1 0 7 50 0 -1 0.000 0 0 -1 0 0 2
	 2115 4500 2025 4590
2 1 0 1 0 7 50 0 -1 0.000 0 0 -1 0 0 2
	 2115 4500 2025 4590
2 1 0 1 0 7 50 0 -1 0.000 0 0 -1 0 0 2
	 2250 4500 2160 4590
2 1 0 1 0 7 50 0 -1 0.000 0 0 -1 0 0 2
	 2385 4500 2295 4590
2 1 0 1 0 7 50 0 -1 0.000 0 0 -1 0 0 2
	 2520 4500 2430 4590
-6
6 5310 4500 5895 4590
2 1 0 1 0 7 50 0 -1 0.000 0 0 -1 0 0 2
	 5310 4500 5895 4500
2 1 0 1 0 7 50 0 -1 0.000 0 0 -1 0 0 2
	 5445 4500 5355 4590
2 1 0 1 0 7 50 0 -1 0.000 0 0 -1 0 0 2
	 5445 4500 5355 4590
2 1 0 1 0 7 50 0 -1 0.000 0 0 -1 0 0 2
	 5580 4500 5490 4590
2 1 0 1 0 7 50 0 -1 0.000 0 0 -1 0 0 2
	 5715 4500 5625 4590
2 1 0 1 0 7 50 0 -1 0.000 0 0 -1 0 0 2
	 5850 4500 5760 4590
-6
2 1 0 2 0 7 50 0 -1 0.000 0 0 -1 0 0 4
	 2250 4500 2250 2250 5625 2250 5625 4500
-6
6 2565 1890 2880 2250
2 1 0 1 0 7 50 0 -1 0.000 0 0 -1 0 0 2
	 2565 1890 2565 2250
2 1 0 1 0 7 50 0 -1 0.000 0 0 -1 0 0 2
	 2880 1890 2880 2250
-6
6 3195 1890 3510 2250
2 1 0 1 0 7 50 0 -1 0.000 0 0 -1 0 0 2
	 3195 1890 3195 2250
2 1 0 1 0 7 50 0 -1 0.000 0 0 -1 0 0 2
	 3510 1890 3510 2250
-6
6 3825 1890 4140 2250
2 1 0 1 0 7 50 0 -1 0.000 0 0 -1 0 0 2
	 3825 1890 3825 2250
2 1 0 1 0 7 50 0 -1 0.000 0 0 -1 0 0 2
	 4140 1890 4140 2250
-6
6 4455 1890 4770 2250
2 1 0 1 0 7 50 0 -1 0.000 0 0 -1 0 0 2
	 4455 1890 4455 2250
2 1 0 1 0 7 50 0 -1 0.000 0 0 -1 0 0 2
	 4770 1890 4770 2250
-6
6 6930 945 10845 4545
6 6930 2160 10845 4545
6 6930 4455 7515 4545
2 1 0 1 0 7 50 0 -1 0.000 0 0 -1 0 0 2
	 6930 4455 7515 4455
2 1 0 1 0 7 50 0 -1 0.000 0 0 -1 0 0 2
	 7065 4455 6975 4545
2 1 0 1 0 7 50 0 -1 0.000 0 0 -1 0 0 2
	 7065 4455 6975 4545
2 1 0 1 0 7 50 0 -1 0.000 0 0 -1 0 0 2
	 7200 4455 7110 4545
2 1 0 1 0 7 50 0 -1 0.000 0 0 -1 0 0 2
	 7335 4455 7245 4545
2 1 0 1 0 7 50 0 -1 0.000 0 0 -1 0 0 2
	 7470 4455 7380 4545
-6
6 10260 4455 10845 4545
2 1 0 1 0 7 50 0 -1 0.000 0 0 -1 0 0 2
	 10260 4455 10845 4455
2 1 0 1 0 7 50 0 -1 0.000 0 0 -1 0 0 2
	 10395 4455 10305 4545
2 1 0 1 0 7 50 0 -1 0.000 0 0 -1 0 0 2
	 10395 4455 10305 4545
2 1 0 1 0 7 50 0 -1 0.000 0 0 -1 0 0 2
	 10530 4455 10440 4545
2 1 0 1 0 7 50 0 -1 0.000 0 0 -1 0 0 2
	 10665 4455 10575 4545
2 1 0 1 0 7 50 0 -1 0.000 0 0 -1 0 0 2
	 10800 4455 10710 4545
-6
2 1 0 2 0 7 50 0 -1 0.000 0 0 -1 0 0 4
	 7200 4455 7200 2205 10575 2205 10575 4455
-6
2 1 1 1 0 7 50 0 -1 4.000 0 0 -1 0 0 2
	 8595 2205 9495 945
2 1 1 1 0 7 50 0 -1 4.000 0 0 -1 0 0 2
	 8595 2205 7785 3285
2 1 0 2 0 7 50 0 -1 6.000 0 0 -1 1 0 2
	1 1 2.00 120.00 240.00
	 9090 1530 8640 2160
4 0 0 50 0 0 32 0.0000 4 330 225 9135 2025 1\001
4 0 0 50 0 1 32 0.0000 4 330 390 8640 3690 M\001
4 0 0 50 0 32 32 0.0000 4 345 225 8415 3690 d\001
-6
6 1935 8415 2520 8505
2 1 0 1 0 7 50 0 -1 0.000 0 0 -1 0 0 2
	 1935 8415 2520 8415
2 1 0 1 0 7 50 0 -1 0.000 0 0 -1 0 0 2
	 2070 8415 1980 8505
2 1 0 1 0 7 50 0 -1 0.000 0 0 -1 0 0 2
	 2070 8415 1980 8505
2 1 0 1 0 7 50 0 -1 0.000 0 0 -1 0 0 2
	 2205 8415 2115 8505
2 1 0 1 0 7 50 0 -1 0.000 0 0 -1 0 0 2
	 2340 8415 2250 8505
2 1 0 1 0 7 50 0 -1 0.000 0 0 -1 0 0 2
	 2475 8415 2385 8505
-6
6 10260 8415 10845 8505
2 1 0 1 0 7 50 0 -1 0.000 0 0 -1 0 0 2
	 10260 8415 10845 8415
2 1 0 1 0 7 50 0 -1 0.000 0 0 -1 0 0 2
	 10395 8415 10305 8505
2 1 0 1 0 7 50 0 -1 0.000 0 0 -1 0 0 2
	 10395 8415 10305 8505
2 1 0 1 0 7 50 0 -1 0.000 0 0 -1 0 0 2
	 10530 8415 10440 8505
2 1 0 1 0 7 50 0 -1 0.000 0 0 -1 0 0 2
	 10665 8415 10575 8505
2 1 0 1 0 7 50 0 -1 0.000 0 0 -1 0 0 2
	 10800 8415 10710 8505
-6
6 5175 8145 6120 8865
5 1 0 1 0 7 100 0 -1 0.000 0 1 1 0 5473.010 8397.092 5445 8145 5220 8415 5400 8640
	1 1 1.00 60.00 120.00
2 1 0 1 0 7 100 0 -1 0.000 0 0 -1 1 0 2
	1 1 1.00 60.00 120.00
	 5625 8415 6120 8415
2 1 0 1 0 7 100 0 -1 0.000 0 0 -1 1 0 2
	1 1 1.00 60.00 120.00
	 5580 8865 5580 8460
-6
6 6795 8190 7740 8910
5 1 0 1 0 7 100 0 -1 0.000 0 1 1 0 7093.010 8442.092 7065 8190 6840 8460 7020 8685
	1 1 1.00 60.00 120.00
2 1 0 1 0 7 100 0 -1 0.000 0 0 -1 1 0 2
	1 1 1.00 60.00 120.00
	 7245 8460 7740 8460
2 1 0 1 0 7 100 0 -1 0.000 0 0 -1 1 0 2
	1 1 1.00 60.00 120.00
	 7200 8910 7200 8505
-6
1 4 0 3 0 7 50 0 -1 8.000 1 0.0000 3600 2250 23 23 3578 2250 3623 2250
1 4 0 3 0 7 50 0 -1 8.000 1 0.0000 8640 2205 23 23 8618 2205 8663 2205
1 4 0 3 0 7 50 0 -1 8.000 1 0.0000 8640 2205 23 23 8618 2205 8663 2205
1 4 0 3 0 7 50 0 -1 8.000 1 0.0000 3600 2250 23 23 3578 2250 3623 2250
1 4 0 3 0 7 50 0 -1 8.000 1 0.0000 3622 6165 23 23 3600 6165 3645 6165
1 4 0 3 0 7 50 0 -1 8.000 1 0.0000 8640 6165 23 23 8618 6165 8663 6165
2 1 0 1 0 7 50 0 -1 0.000 0 0 -1 0 0 4
	 2250 2250 2250 1890 4950 1890 4950 2250
2 1 1 1 0 7 50 0 -1 4.000 0 0 -1 0 0 2
	 3600 2250 4500 990
2 1 1 2 0 7 50 0 -1 4.000 0 0 -1 1 0 2
	1 1 1.00 60.00 120.00
	 3600 2250 2790 3285
2 1 1 1 0 7 50 0 -1 4.000 0 0 -1 0 0 2
	 3600 6165 4500 4905
2 1 1 1 0 7 50 0 -1 4.000 0 0 -1 0 0 2
	 3600 6165 2790 7245
2 1 0 2 0 7 50 0 -1 6.000 0 0 -1 1 0 2
	1 1 2.00 120.00 240.00
	 4095 5490 3645 6120
2 1 0 2 0 7 50 0 -1 0.000 0 0 -1 0 0 4
	 2205 8415 2205 6165 5580 6165 5580 8415
2 1 1 1 0 7 50 0 -1 4.000 0 0 -1 0 0 2
	 8595 6165 9495 4905
2 1 1 1 0 7 50 0 -1 4.000 0 0 -1 0 0 2
	 8595 6165 7785 7245
2 1 0 2 0 7 50 0 -1 6.000 0 0 -1 1 0 2
	1 1 2.00 120.00 240.00
	 9090 5490 8640 6120
2 1 0 2 0 7 50 0 -1 0.000 0 0 -1 0 0 4
	 7200 8415 7200 6165 10575 6165 10575 8415
2 1 0 2 0 7 50 0 -1 6.000 0 0 -1 1 0 2
	1 1 2.00 120.00 240.00
	 3600 2250 3645 2700
2 1 0 1 0 7 50 0 -1 0.000 0 0 -1 0 0 2
	 3645 2700 2385 1620
2 1 0 1 0 7 50 0 -1 4.000 0 0 -1 1 0 2
	1 1 1.00 60.00 120.00
	 2700 1485 2520 1755
2 1 0 1 0 7 50 0 -1 4.000 0 0 -1 0 0 2
	 3600 2250 2610 1395
2 1 0 1 0 7 50 0 -1 4.000 0 0 -1 1 0 2
	1 1 1.00 60.00 120.00
	 3825 2340 4140 2340
3 0 1 2 0 7 50 0 -1 6.000 0 0 0 4
	 2250 4500 2160 3690 2115 2925 2340 2205
	 0.000 1.000 1.000 0.000
3 0 1 2 0 7 50 0 -1 6.000 0 0 0 6
	 2340 2250 2745 2475 3600 2745 4365 2700 5220 2475 5715 2250
	 0.000 1.000 1.000 1.000 1.000 0.000
3 0 1 2 0 7 50 0 -1 6.000 0 0 0 5
	 5715 2205 5850 2880 5805 3510 5670 4050 5625 4545
	 0.000 1.000 1.000 1.000 0.000
4 0 0 50 0 1 32 0.0000 4 330 390 3285 3780 M\001
4 0 0 50 0 0 32 0.0000 4 330 225 4140 5985 1\001
4 0 0 50 0 1 32 0.0000 4 330 390 3645 7650 M\001
4 0 0 50 0 32 32 0.0000 4 345 225 3420 7650 d\001
4 0 0 50 0 0 32 0.0000 4 330 225 9135 5985 1\001
4 0 0 50 0 1 32 0.0000 4 330 390 8640 7650 M\001
4 0 0 50 0 32 32 0.0000 4 345 225 8415 7650 d\001
4 0 0 50 0 1 24 0.0000 4 165 195 2925 3375 n\001
4 0 0 50 0 1 24 0.0000 4 255 225 8685 2565 P\001
4 0 0 50 0 1 24 0.0000 4 165 195 7920 3330 n\001
4 0 0 50 0 1 24 0.0000 4 165 195 2970 7245 n\001
4 0 0 50 0 1 24 0.0000 4 165 195 8010 7245 n\001
4 0 0 50 0 1 24 0.0000 4 255 225 8640 6525 P\001
4 0 0 50 0 1 24 0.0000 4 255 225 3645 6525 P\001
4 0 0 50 0 1 24 0.0000 4 255 225 3510 2160 P\001
4 0 0 50 0 1 24 0.0000 4 165 195 2430 1665 n\001
4 0 0 50 0 1 32 0.0000 4 210 330 2205 1575 w\001
4 0 0 50 0 1 32 0.0000 4 210 330 3780 2655 w\001
