#FIG 3.2
Landscape
Center
Inches
Letter  
100.00
Single
-2
1200 2
2 1 0 3 0 7 50 0 -1 0.000 0 0 -1 0 0 4
	 1200 2400 3600 2400 7200 6000 9600 6000
2 1 0 3 0 7 50 0 -1 0.000 0 0 -1 0 0 2
	 7200 6000 7200 8400
2 1 0 3 0 7 50 0 -1 0.000 0 0 -1 0 0 2
	 1200 2175 1200 2700
2 1 0 3 0 7 50 0 -1 0.000 0 0 -1 0 0 2
	 9600 5700 9600 6225
2 1 0 3 0 7 50 0 -1 0.000 0 0 -1 0 0 2
	 6900 8400 7500 8400
2 1 0 1 0 7 50 0 -1 0.000 0 0 -1 0 0 2
	 975 2250 1200 2175
2 1 0 1 0 7 50 0 -1 0.000 0 0 -1 0 0 2
	 960 2430 1185 2355
2 1 0 1 0 7 50 0 -1 0.000 0 0 -1 0 0 2
	 960 2580 1185 2505
2 1 0 1 0 7 50 0 -1 0.000 0 0 -1 0 0 2
	 960 2730 1185 2655
2 1 0 1 0 7 50 0 -1 0.000 0 0 -1 0 0 2
	 9592 5752 9817 5677
2 1 0 1 0 7 50 0 -1 0.000 0 0 -1 0 0 2
	 9592 5903 9817 5828
2 1 0 1 0 7 50 0 -1 0.000 0 0 -1 0 0 2
	 9592 6053 9817 5978
2 1 0 1 0 7 50 0 -1 0.000 0 0 -1 0 0 2
	 9592 6053 9817 5978
2 1 0 1 0 7 50 0 -1 0.000 0 0 -1 0 0 2
	 6975 8400 6825 8550
2 1 0 1 0 7 50 0 -1 0.000 0 0 -1 0 0 2
	 7125 8400 6975 8550
2 1 0 1 0 7 50 0 -1 0.000 0 0 -1 0 0 2
	 7275 8400 7125 8550
2 1 0 1 0 7 50 0 -1 0.000 0 0 -1 0 0 2
	 7425 8400 7275 8550
2 1 0 1 0 7 50 0 -1 0.000 0 0 -1 0 0 2
	 9584 6180 9809 6105
2 1 0 1 0 7 50 0 -1 0.000 0 0 -1 0 0 2
	 1200 7800 1200 9075
2 1 0 1 0 7 50 0 -1 0.000 0 0 -1 0 0 2
	 3600 7725 3600 9150
2 1 0 1 0 7 50 0 -1 0.000 0 0 -1 0 0 2
	 7200 8625 7200 9150
2 1 0 1 0 7 50 0 -1 0.000 0 0 -1 0 0 2
	 9600 8400 9600 9150
2 1 0 1 0 7 50 0 -1 0.000 0 0 -1 0 0 2
	 9150 8400 10425 8400
2 1 0 1 0 7 50 0 -1 0.000 0 0 -1 0 0 2
	 9825 6000 10350 6000
2 1 0 1 0 7 50 0 -1 0.000 0 0 -1 0 0 2
	 6225 2400 10350 2400
2 1 0 1 0 7 50 0 -1 0.000 0 0 -1 1 1 2
	1 1 1.00 60.00 120.00
	1 1 1.00 60.00 120.00
	 1200 9000 3600 9000
2 1 0 1 0 7 50 0 -1 0.000 0 0 -1 1 1 2
	1 1 1.00 60.00 120.00
	1 1 1.00 60.00 120.00
	 3600 9000 7200 9000
2 1 0 1 0 7 50 0 -1 0.000 0 0 -1 1 1 2
	1 1 1.00 60.00 120.00
	1 1 1.00 60.00 120.00
	 7200 9000 9600 9000
2 1 0 1 0 7 50 0 -1 0.000 0 0 -1 1 1 2
	1 1 1.00 60.00 120.00
	1 1 1.00 60.00 120.00
	 10275 8400 10275 6000
2 1 0 1 0 7 50 0 -1 0.000 0 0 -1 1 1 2
	1 1 1.00 60.00 120.00
	1 1 1.00 60.00 120.00
	 10275 5925 10275 2400
2 2 0 1 0 7 50 0 50 0.000 0 0 -1 0 0 5
	 3600 2250 7200 2250 7200 1950 3600 1950 3600 2250
2 1 0 1 0 7 50 0 -1 0.000 0 0 -1 0 0 3
	 4875 1950 5175 1800 5775 1800
4 0 0 50 0 0 32 0.0000 4 330 225 2100 8925 2\001
4 0 0 50 0 0 32 0.0000 4 330 225 5100 8850 3\001
4 0 0 50 0 0 32 0.0000 4 330 225 8400 8925 2\001
4 0 0 50 0 0 32 1.5708 4 330 225 10200 7575 2\001
4 0 0 50 0 0 32 1.5708 4 330 225 10275 4425 3\001
4 0 0 50 0 0 32 0.0000 4 330 225 1350 2925 1\001
4 0 0 50 0 0 32 0.0000 4 330 225 3375 2925 2\001
4 0 0 50 0 0 32 0.0000 4 330 225 6825 6450 3\001
4 0 0 50 0 0 32 0.0000 4 330 225 6750 8250 4\001
4 0 0 50 0 0 32 0.0000 4 330 225 9225 6525 5\001
4 0 0 50 0 0 32 0.0000 4 330 225 5475 1800 1\001
4 0 0 50 0 0 32 0.0000 4 330 990 2400 5400 EJ=1\001
