#FIG 3.2  Produced by xfig version 3.2.6a
Landscape
Center
Inches
Letter
100.00
Single
-2
1200 2
6 975 900 1200 1575
2 1 0 1 0 7 50 -1 -1 0.000 0 0 -1 0 0 2
	 1200 900 1200 1500
2 1 0 1 0 7 50 -1 -1 0.000 0 0 -1 0 0 2
	 1200 975 975 1125
2 1 0 1 0 7 50 -1 -1 0.000 0 0 -1 0 0 2
	 1200 1125 975 1275
2 1 0 1 0 7 50 -1 -1 0.000 0 0 -1 0 0 2
	 1200 1275 975 1425
2 1 0 1 0 7 50 -1 -1 0.000 0 0 -1 0 0 2
	 1200 1425 975 1575
-6
6 975 3300 1200 3975
2 1 0 1 0 7 50 -1 -1 0.000 0 0 -1 0 0 2
	 1200 3300 1200 3900
2 1 0 1 0 7 50 -1 -1 0.000 0 0 -1 0 0 2
	 1200 3375 975 3525
2 1 0 1 0 7 50 -1 -1 0.000 0 0 -1 0 0 2
	 1200 3525 975 3675
2 1 0 1 0 7 50 -1 -1 0.000 0 0 -1 0 0 2
	 1200 3675 975 3825
2 1 0 1 0 7 50 -1 -1 0.000 0 0 -1 0 0 2
	 1200 3825 975 3975
-6
1 3 0 1 0 7 50 -1 -1 0.000 1 0.0000 3600 1200 75 75 3600 1200 3675 1200
1 3 0 1 0 7 50 -1 -1 0.000 1 0.0000 2400 3600 75 75 2400 3600 2475 3600
2 1 0 3 0 7 50 -1 -1 0.000 0 0 -1 0 0 2
	 1200 1200 3525 1200
2 1 0 3 0 7 50 -1 -1 0.000 0 0 -1 0 0 3
	 3600 1275 3600 3600 2475 3600
2 1 0 3 0 7 50 -1 -1 0.000 0 0 -1 0 0 2
	 2325 3600 1200 3600
2 1 0 1 0 7 50 -1 -1 0.000 0 0 -1 0 0 2
	 1200 4050 1200 4575
2 1 0 1 0 7 50 -1 -1 0.000 0 0 -1 0 0 2
	 2400 4050 2400 4575
2 1 0 1 0 7 50 -1 -1 0.000 0 0 -1 0 0 2
	 3600 4050 3600 4575
2 1 0 1 0 7 50 -1 -1 0.000 0 0 -1 0 0 2
	 3900 1200 4575 1200
2 1 0 1 0 7 50 -1 -1 0.000 0 0 -1 0 0 2
	 3900 3600 4575 3600
2 1 0 1 0 7 50 -1 -1 0.000 0 0 -1 1 1 2
	1 1 1.00 60.00 120.00
	1 1 1.00 60.00 120.00
	 1200 4425 2400 4425
2 1 0 1 0 7 50 -1 -1 0.000 0 0 -1 1 1 2
	1 1 1.00 60.00 120.00
	1 1 1.00 60.00 120.00
	 2400 4425 3600 4425
2 1 0 1 0 7 50 -1 -1 0.000 0 0 -1 1 1 2
	1 1 1.00 60.00 120.00
	1 1 1.00 60.00 120.00
	 4500 3600 4500 1200
2 1 0 2 0 7 50 -1 -1 0.000 0 0 -1 1 0 2
	1 1 2.00 120.00 240.00
	 3600 600 3600 1050
4 0 0 50 -1 0 24 0.0000 4 285 210 1650 4350 5\001
4 0 0 50 -1 0 24 0.0000 4 270 420 4950 2775 10\001
4 0 0 50 -1 0 24 0.0000 4 270 210 1275 3525 1\001
4 0 0 50 -1 0 24 0.0000 4 270 210 2400 3450 2\001
4 0 0 50 -1 0 24 0.0000 4 270 210 3300 3525 3\001
4 0 0 50 -1 0 24 0.0000 4 270 210 1350 1575 4\001
4 0 0 50 -1 0 24 0.0000 4 285 210 3150 1725 5\001
4 0 0 50 -1 0 24 0.0000 4 270 660 3675 900 F=1\001
4 0 0 50 -1 0 24 0.0000 4 285 855 1650 825 EJ=5\001
4 0 0 50 -1 0 24 0.0000 4 285 210 2925 4350 5\001
