#FIG 3.2  Produced by xfig version 3.2.5c
Landscape
Center
Metric
Letter  
100.00
Single
-2
1200 2
6 1530 4455 2115 4590
2 1 0 1 0 7 50 -1 -1 0.000 0 0 -1 0 0 2
	 1530 4455 2115 4455
2 1 0 1 0 7 50 -1 -1 4.000 0 0 -1 0 0 2
	 1800 4455 1665 4590
2 1 0 1 0 7 50 -1 -1 4.000 0 0 -1 0 0 2
	 1665 4455 1530 4590
2 1 0 1 0 7 50 -1 -1 4.000 0 0 -1 0 0 2
	 1935 4455 1800 4590
2 1 0 1 0 7 50 -1 -1 4.000 0 0 -1 0 0 2
	 2115 4455 1980 4590
-6
6 3285 4455 3870 4590
2 1 0 1 0 7 50 -1 -1 0.000 0 0 -1 0 0 2
	 3285 4455 3870 4455
2 1 0 1 0 7 50 -1 -1 4.000 0 0 -1 0 0 2
	 3555 4455 3420 4590
2 1 0 1 0 7 50 -1 -1 4.000 0 0 -1 0 0 2
	 3420 4455 3285 4590
2 1 0 1 0 7 50 -1 -1 4.000 0 0 -1 0 0 2
	 3690 4455 3555 4590
2 1 0 1 0 7 50 -1 -1 4.000 0 0 -1 0 0 2
	 3870 4455 3735 4590
-6
6 -180 2385 0 3015
2 1 0 1 0 7 50 -1 -1 0.000 0 0 -1 0 0 2
	 -24 2398 -25 2983
2 1 0 1 0 7 50 -1 -1 4.000 0 0 -1 0 0 2
	 -24 2669 -159 2533
2 1 0 1 0 7 50 -1 -1 4.000 0 0 -1 0 0 2
	 -24 2533 -159 2398
2 1 0 1 0 7 50 -1 -1 4.000 0 0 -1 0 0 2
	 -24 2803 -159 2668
2 1 0 1 0 7 50 -1 -1 4.000 0 0 -1 0 0 2
	 -25 2983 -159 2849
-6
2 1 0 3 0 7 50 -1 -1 8.000 0 0 -1 0 0 3
	 0 2700 3600 2700 3600 4500
2 1 0 3 0 7 50 -1 -1 8.000 0 0 -1 0 0 2
	 1800 2700 1800 4455
2 1 0 1 0 7 50 -1 -1 4.000 0 0 -1 0 0 2
	 0 4725 0 5310
2 1 0 1 0 7 50 -1 -1 4.000 0 0 -1 0 0 2
	 1800 4725 1800 5310
2 1 0 1 0 7 50 -1 -1 4.000 0 0 -1 0 0 2
	 3600 4725 3600 5310
2 1 0 1 0 7 50 -1 -1 4.000 0 0 -1 0 0 2
	 3870 2700 4500 2700
2 1 0 1 0 7 50 -1 -1 4.000 0 0 -1 0 0 2
	 3825 4455 4455 4455
2 1 0 1 0 7 50 -1 -1 4.000 0 0 -1 1 1 2
	1 1 1.00 60.00 120.00
	1 1 1.00 60.00 120.00
	 0 5085 1800 5085
2 1 0 1 0 7 50 -1 -1 4.000 0 0 -1 1 1 2
	1 1 1.00 60.00 120.00
	1 1 1.00 60.00 120.00
	 1800 5085 3600 5085
2 1 0 1 0 7 50 -1 -1 4.000 0 0 -1 1 1 2
	1 1 1.00 60.00 120.00
	1 1 1.00 60.00 120.00
	 4365 4455 4365 2700
2 2 0 1 0 7 50 -1 50 4.000 0 0 -1 0 0 5
	 0 2610 3600 2610 3600 2250 0 2250 0 2610
2 1 0 1 0 7 50 -1 -1 4.000 0 0 -1 0 0 4
	 1755 2160 1845 2250 1935 1980 2565 1980
2 1 0 3 0 7 50 -1 -1 8.000 0 0 -1 0 0 3
	 5220 2655 8820 2655 8820 4455
2 1 0 1 0 7 50 -1 -1 4.000 0 0 -1 0 0 2
	 5220 2655 5220 2160
2 1 0 1 0 7 50 -1 -1 4.000 0 0 -1 0 0 2
	 8820 2340 8820 2655
2 1 0 1 0 7 50 -1 -1 4.000 0 0 -1 0 0 4
	 8820 2655 9135 2655 8640 4455 8865 4455
2 1 0 1 0 7 50 -1 -1 4.000 0 0 -1 0 0 2
	 6570 2700 6885 4320
2 1 0 1 0 7 50 -1 -1 4.000 0 0 -1 0 0 2
	 6930 2655 6930 1935
2 1 0 3 0 7 50 -1 -1 8.000 0 0 -1 0 0 2
	 6930 2655 6930 4410
2 1 0 1 0 7 50 -1 -1 4.000 0 0 -1 0 0 2
	 6120 2655 6120 2880
2 1 0 1 0 7 50 -1 -1 4.000 0 0 -1 0 0 2
	 7920 2655 7920 2880
2 1 0 3 0 7 50 -1 -1 8.000 0 0 -1 0 0 2
	 0 6570 1800 6570
2 1 0 1 0 7 50 -1 -1 4.000 0 0 -1 1 0 2
	1 1 1.00 60.00 120.00
	 0 7155 0 6705
2 2 0 1 0 7 50 -1 50 4.000 0 0 -1 0 0 5
	 0 6525 1755 6525 1755 6255 0 6255 0 6525
3 0 0 1 0 7 50 -1 -1 4.000 0 0 0 3
	 6930 1980 8100 3240 8820 2340
	 0.000 1.000 0.000
3 0 0 1 0 7 50 -1 -1 4.000 0 0 0 3
	 5175 2160 6075 3195 6930 2115
	 0.000 1.000 0.000
3 0 0 1 0 7 50 -1 -1 4.000 0 1 0 3
	1 1 1.00 60.00 120.00
	 45 6075 -315 6210 -270 6570
	 0.000 1.000 0.000
3 0 0 1 0 7 50 -1 -1 0.000 0 0 1 3
	1 1 1.00 60.00 120.00
	 2250 6660 2205 6300 1755 6210
	 0.000 1.000 0.000
4 0 0 50 -1 0 24 0.0000 4 270 210 1350 4545 1\001
4 0 0 50 -1 0 24 0.0000 4 270 210 3060 4590 2\001
4 0 0 50 -1 0 24 0.0000 4 270 210 90 3150 3\001
4 0 0 50 -1 0 24 0.0000 4 270 210 1485 3150 4\001
4 0 0 50 -1 0 24 0.0000 4 285 210 3195 3060 5\001
4 0 0 50 -1 0 24 0.0000 4 270 210 720 5085 4\001
4 0 0 50 -1 0 24 0.0000 4 270 210 2475 5085 4\001
4 0 0 50 -1 0 24 1.5708 4 270 210 3510 3735 4\001
4 0 0 50 -1 0 24 0.0000 4 270 210 2115 1980 1\001
4 0 0 50 -1 0 24 0.0000 4 285 735 7065 2115 1.56\001
4 0 0 50 -1 0 24 0.0000 4 270 735 5310 3240 0.64\001
4 0 0 50 -1 0 24 0.0000 4 270 945 6435 3195 0.116\001
4 0 0 50 -1 0 24 0.0000 4 270 735 7785 3195 0.87\001
4 0 0 50 -1 0 24 0.0000 4 270 735 8910 2520 0.70\001
4 0 0 50 -1 0 24 0.0000 4 270 735 4905 2160 1.27\001
4 0 0 50 -1 0 24 0.0000 4 285 735 6075 2295 1.45\001
4 0 0 50 -1 0 24 0.0000 4 285 735 7830 4365 0.35\001
4 0 0 50 -1 0 24 0.0000 4 270 210 135 6930 3\001
4 0 0 50 -1 0 24 0.0000 4 270 210 1530 6930 4\001
4 0 0 50 -1 0 24 0.0000 4 270 300 90 7335 V\001
4 0 0 50 -1 0 20 0.0000 4 225 165 2835 6840 3\001
4 0 0 50 -1 0 20 0.0000 4 225 165 3375 6885 4\001
4 0 0 50 -1 0 20 0.0000 4 225 165 315 7425 3\001
4 0 0 50 -1 0 20 0.0000 4 75 90 4365 6975 ,\001
4 0 0 50 -1 0 20 0.0000 4 75 90 495 7380 ,\001
4 0 0 50 -1 0 20 0.0000 4 225 165 585 7380 4\001
4 0 0 50 -1 0 24 0.0000 4 360 3255 45 5670 free body diag. 3,4:\001
4 0 0 50 -1 0 24 0.0000 4 270 735 -360 6120 1.27\001
4 0 0 50 -1 0 24 0.0000 4 285 735 2025 6300 1.45\001
