#FIG 3.2  Produced by xfig version 3.2.5b
Landscape
Center
Metric
A4      
100.00
Single
-2
1200 2
2 1 0 2 0 7 50 -1 -1 0.000 0 0 -1 0 0 4
	 0 4500 0 2700 2700 2700 2700 4500
2 1 0 2 0 7 50 -1 -1 0.000 0 0 -1 0 0 2
	 -135 4500 180 4500
2 1 0 2 0 7 50 -1 -1 0.000 0 0 -1 0 0 2
	 2565 4500 2835 4500
2 1 0 1 0 7 50 -1 -1 0.000 0 0 -1 0 0 2
	 -180 4635 -45 4500
2 1 0 1 0 7 50 -1 -1 0.000 0 0 -1 0 0 2
	 -90 4635 45 4500
2 1 0 1 0 7 50 -1 -1 0.000 0 0 -1 0 0 2
	 0 4635 135 4500
2 1 0 1 0 7 50 -1 -1 0.000 0 0 -1 0 0 2
	 2475 4635 2610 4500
2 1 0 1 0 7 50 -1 -1 0.000 0 0 -1 0 0 2
	 2565 4635 2700 4500
2 1 0 1 0 7 50 -1 -1 0.000 0 0 -1 0 0 2
	 2655 4635 2790 4500
2 1 0 1 0 7 50 -1 -1 0.000 0 0 -1 0 0 2
	 0 4860 0 5175
2 1 0 1 0 7 50 -1 -1 0.000 0 0 -1 0 0 2
	 2700 4815 2700 5130
2 1 0 1 0 7 50 -1 -1 0.000 0 0 -1 0 0 2
	 2925 2700 3240 2700
2 1 0 1 0 7 50 -1 -1 0.000 0 0 -1 0 0 2
	 2880 4500 3195 4500
2 1 0 1 0 7 50 -1 -1 0.000 0 0 -1 1 1 2
	1 1 1.00 60.00 120.00
	1 1 1.00 60.00 120.00
	 0 4995 2700 4995
2 1 0 1 0 7 50 -1 -1 0.000 0 0 -1 1 1 2
	1 1 1.00 60.00 120.00
	1 1 1.00 60.00 120.00
	 3150 4500 3150 2700
2 1 0 2 0 7 50 -1 -1 6.000 0 0 -1 1 0 2
	1 1 2.00 120.00 240.00
	 -360 2700 -90 2700
2 1 0 2 0 7 50 -1 -1 0.000 0 0 -1 0 0 4
	 4140 4500 4140 2700 6840 2700 6840 4500
2 1 0 2 0 7 50 -1 -1 6.000 0 0 -1 1 0 2
	1 1 2.00 120.00 240.00
	 3780 2700 4095 2700
2 1 0 2 0 7 50 -1 -1 6.000 0 0 -1 1 0 2
	1 1 2.00 120.00 240.00
	 7245 2700 6840 2700
2 1 0 2 0 7 50 -1 -1 0.000 0 0 -1 0 0 4
	 8145 4500 8145 2700 10845 2700 10845 4500
2 1 0 2 0 7 50 -1 -1 6.000 0 0 -1 1 0 2
	1 1 2.00 120.00 240.00
	 7695 2700 8100 2700
2 1 0 2 0 7 50 -1 -1 6.000 0 0 -1 1 0 2
	1 1 2.00 120.00 240.00
	 10890 2700 11340 2700
2 1 0 2 0 7 50 -1 -1 6.000 0 0 -1 0 0 2
	 3420 3555 3645 3555
2 1 0 2 0 7 50 -1 -1 6.000 0 0 -1 0 0 2
	 3420 3645 3645 3645
2 1 0 2 0 7 50 -1 -1 6.000 0 0 -1 0 0 2
	 7245 3645 7605 3645
2 1 0 2 0 7 50 -1 -1 6.000 0 0 -1 0 0 2
	 7425 3510 7425 3825
2 1 0 1 0 7 50 -1 -1 4.000 0 0 -1 0 0 2
	 4140 3015 6840 3015
4 0 0 50 -1 0 16 0.0000 4 195 135 990 4950 6\001
4 0 0 50 -1 0 16 1.5708 4 180 135 3060 3690 4\001
4 0 0 50 -1 0 16 0.0000 4 180 135 -315 2610 5\001
4 0 0 50 -1 0 16 0.0000 4 180 345 3690 2610 2.5\001
4 0 0 50 -1 0 16 0.0000 4 180 345 6930 2565 2.5\001
4 0 0 50 -1 0 16 0.0000 4 180 345 7695 2565 2.5\001
4 0 0 50 -1 0 16 0.0000 4 180 345 10890 2565 2.5\001
4 0 0 50 -1 0 16 0.0000 4 240 1545 8730 2385 antisymmetric\001
4 0 0 50 -1 0 16 0.0000 4 240 1140 4680 2340 symmetric\001
4 0 0 50 -1 0 16 0.0000 4 180 780 4590 3330 N=-2.5\001
