#FIG 3.2
Landscape
Center
Metric
A4      
100.00
Single
-2
1200 2
6 6525 3154 6930 3240
2 1 0 1 0 7 50 0 -1 4.000 0 0 -1 0 0 2
	 6525 3154 6930 3154
2 1 0 1 0 7 50 0 -1 4.000 0 0 -1 0 0 2
	 6713 3154 6626 3240
2 1 0 1 0 7 50 0 -1 4.000 0 0 -1 0 0 2
	 6814 3154 6728 3240
2 1 0 1 0 7 50 0 -1 4.000 0 0 -1 0 0 2
	 6916 3154 6829 3240
2 1 0 1 0 7 50 0 -1 4.000 0 0 -1 0 0 2
	 6626 3154 6539 3240
-6
6 2925 3154 3330 3240
2 1 0 1 0 7 50 0 -1 4.000 0 0 -1 0 0 2
	 2925 3154 3330 3154
2 1 0 1 0 7 50 0 -1 4.000 0 0 -1 0 0 2
	 3113 3154 3026 3240
2 1 0 1 0 7 50 0 -1 4.000 0 0 -1 0 0 2
	 3214 3154 3128 3240
2 1 0 1 0 7 50 0 -1 4.000 0 0 -1 0 0 2
	 3316 3154 3229 3240
2 1 0 1 0 7 50 0 -1 4.000 0 0 -1 0 0 2
	 3026 3154 2939 3240
-6
6 7515 2250 7740 2475
2 3 0 1 0 7 50 0 -1 4.000 0 0 -1 0 0 4
	 7515 2419 7628 2250 7740 2419 7515 2419
2 1 0 1 0 7 50 0 -1 4.000 0 0 -1 0 0 2
	 7515 2475 7740 2475
-6
6 2115 2250 2340 2475
2 3 0 1 0 7 50 0 -1 4.000 0 0 -1 0 0 4
	 2115 2419 2228 2250 2340 2419 2115 2419
2 1 0 1 0 7 50 0 -1 4.000 0 0 -1 0 0 2
	 2115 2475 2340 2475
-6
6 4725 1600 5130 1755
2 3 0 1 0 7 50 0 -1 4.000 0 0 -1 0 0 5
	 4725 1755 5130 1600 5130 1755 4725 1600 4725 1755
-6
6 4725 3760 5130 3915
2 3 0 1 0 7 50 0 -1 4.000 0 0 -1 0 0 5
	 4725 3915 5130 3760 5130 3915 4725 3760 4725 3915
-6
6 8955 2475 9810 2925
2 1 0 1 0 7 50 0 -1 4.000 0 0 -1 0 0 2
	 9180 2520 9180 2925
2 1 0 1 0 7 50 0 -1 4.000 0 0 -1 0 0 2
	 9360 2520 9360 2925
2 1 0 1 0 7 50 0 -1 4.000 0 0 -1 0 1 2
	1 1 1.00 60.00 120.00
	 9180 2790 8955 2790
2 1 0 1 0 7 50 0 -1 4.000 0 0 -1 0 1 2
	1 1 1.00 60.00 120.00
	 9360 2790 9585 2790
4 0 0 50 0 0 18 0.0000 4 195 330 9450 2700 0.5\001
-6
6 6435 4455 7290 4905
2 1 0 1 0 7 50 0 -1 4.000 0 0 -1 0 0 2
	 6660 4500 6660 4905
2 1 0 1 0 7 50 0 -1 4.000 0 0 -1 0 0 2
	 6840 4500 6840 4905
2 1 0 1 0 7 50 0 -1 4.000 0 0 -1 0 1 2
	1 1 1.00 60.00 120.00
	 6660 4770 6435 4770
2 1 0 1 0 7 50 0 -1 4.000 0 0 -1 0 1 2
	1 1 1.00 60.00 120.00
	 6840 4770 7065 4770
4 0 0 50 0 0 18 0.0000 4 195 330 6930 4680 0.5\001
-6
6 6975 3780 7425 4635
2 1 0 1 0 7 50 0 -1 4.000 0 0 -1 0 0 2
	 7020 4410 7425 4410
2 1 0 1 0 7 50 0 -1 4.000 0 0 -1 0 0 2
	 7020 4230 7425 4230
2 1 0 1 0 7 50 0 -1 4.000 0 0 -1 0 1 2
	1 1 1.00 60.00 120.00
	 7290 4410 7290 4635
2 1 0 1 0 7 50 0 -1 4.000 0 0 -1 0 1 2
	1 1 1.00 60.00 120.00
	 7290 4230 7290 4005
4 0 0 50 0 0 18 1.5708 4 195 330 7200 4140 0.5\001
-6
2 1 0 2 0 7 50 0 -1 6.000 0 0 -1 0 0 2
	 2250 2250 7650 2250
2 1 0 2 0 7 50 0 -1 6.000 0 0 -1 0 0 2
	 3150 2250 3150 3150
2 1 0 2 0 7 50 0 -1 6.000 0 0 -1 0 0 2
	 6750 2250 6750 3150
2 1 0 1 0 7 50 0 -1 4.000 0 0 -1 0 0 2
	 3150 3420 3150 3780
2 1 0 1 0 7 50 0 -1 4.000 0 0 -1 0 0 2
	 6750 3420 6750 3735
2 1 3 2 0 7 50 0 -1 6.000 0 0 -1 0 0 2
	 4950 1530 4950 4140
2 1 0 1 0 7 50 0 -1 4.000 0 0 -1 0 0 2
	 7965 2250 8415 2250
2 1 0 1 0 7 50 0 -1 4.000 0 0 -1 0 0 2
	 7785 3150 8460 3150
2 1 0 1 0 7 50 0 -1 4.000 0 0 -1 1 1 2
	1 1 1.00 60.00 120.00
	1 1 1.00 60.00 120.00
	 8325 2250 8325 3150
2 1 0 1 0 7 50 0 -1 4.000 0 0 -1 1 1 2
	1 1 1.00 60.00 120.00
	1 1 1.00 60.00 120.00
	 2250 3690 3150 3690
2 1 0 1 0 7 50 0 -1 4.000 0 0 -1 1 1 2
	1 1 1.00 60.00 120.00
	1 1 1.00 60.00 120.00
	 3150 3690 4950 3690
2 1 0 1 0 7 50 0 -1 4.000 0 0 -1 1 1 2
	1 1 1.00 60.00 120.00
	1 1 1.00 60.00 120.00
	 4950 3690 6750 3690
2 1 0 1 0 7 50 0 -1 4.000 0 0 -1 1 1 2
	1 1 1.00 60.00 120.00
	1 1 1.00 60.00 120.00
	 6750 3690 7650 3690
2 2 0 1 0 7 50 0 -1 4.000 0 0 -1 0 0 5
	 9180 2070 9360 2070 9360 2430 9180 2430 9180 2070
2 1 0 1 0 7 50 0 -1 4.000 0 0 -1 0 0 2
	 9450 2070 9810 2070
2 1 0 1 0 7 50 0 -1 4.000 0 0 -1 0 0 2
	 9450 2430 9810 2430
2 1 0 1 0 7 50 0 -1 4.000 0 0 -1 1 1 2
	1 1 1.00 60.00 120.00
	1 1 1.00 60.00 120.00
	 9765 2430 9765 2070
2 2 0 1 0 7 50 0 -1 4.000 0 0 -1 0 0 5
	 6660 4230 6840 4230 6840 4410 6660 4410 6660 4230
2 1 0 2 0 7 50 0 -1 6.000 0 0 -1 1 0 2
	1 1 2.00 120.00 240.00
	 3330 2115 4095 2115
3 0 0 1 0 7 50 0 -1 4.000 0 0 0 2
	 2250 3105 2250 3780
	 0.000 0.000
3 0 0 1 0 7 50 0 -1 4.000 0 0 0 2
	 7650 3060 7650 3735
	 0.000 0.000
4 0 0 50 0 0 18 0.0000 4 195 135 2610 3600 5\001
4 0 0 50 0 0 18 0.0000 4 195 270 4005 3645 10\001
4 0 0 50 0 0 18 0.0000 4 195 270 5715 3645 10\001
4 0 0 50 0 0 18 0.0000 4 195 135 7155 3645 5\001
4 0 0 50 0 0 18 1.5708 4 195 135 8235 2790 5\001
4 0 0 50 0 0 24 0.0000 4 255 165 3330 2835 J\001
4 0 0 50 0 0 24 0.0000 4 255 165 6255 2835 J\001
4 0 0 50 0 0 24 0.0000 4 255 165 5490 2070 J\001
4 0 0 50 0 0 18 0.0000 4 195 135 6390 2970 2\001
4 0 0 50 0 0 18 0.0000 4 195 135 3465 2925 2\001
4 0 0 50 0 0 18 0.0000 4 195 135 5625 2160 1\001
4 0 0 50 0 0 18 1.5708 4 195 135 9675 2340 1\001
4 0 0 50 0 0 18 0.0000 4 195 165 3555 2070 F\001
