#FIG 3.2
Landscape
Center
Inches
Letter  
100.00
Single
-2
1200 2
5 1 0 2 0 7 50 0 -1 6.000 0 1 1 0 9510.000 2422.500 9900 2325 9750 2100 9450 2025
	1 1 2.00 120.00 240.00
5 1 0 2 0 7 50 0 -1 6.000 0 0 1 0 10440.000 2422.500 10050 2325 10200 2100 10500 2025
	1 1 2.00 120.00 240.00
6 3525 2400 3825 2700
2 3 0 1 0 7 50 0 -1 4.000 0 0 -1 0 0 4
	 3525 2625 3675 2400 3825 2625 3525 2625
2 1 0 1 0 7 50 0 -1 4.000 0 0 -1 0 0 2
	 3525 2700 3825 2700
-6
6 1050 2325 6150 2700
6 5850 2400 6150 2700
2 3 0 1 0 7 50 0 -1 4.000 0 0 -1 0 0 4
	 5850 2625 6000 2400 6150 2625 5850 2625
2 1 0 1 0 7 50 0 -1 4.000 0 0 -1 0 0 2
	 5850 2700 6150 2700
-6
2 1 0 3 0 7 50 0 -1 8.000 0 0 -1 0 0 2
	 1200 2400 6000 2400
2 3 0 1 0 7 50 0 -1 4.000 0 0 -1 0 0 4
	 1050 2625 1200 2400 1350 2625 1050 2625
-6
6 12225 2400 12525 2700
2 3 0 1 0 7 50 0 -1 4.000 0 0 -1 0 0 4
	 12225 2625 12375 2400 12525 2625 12225 2625
2 1 0 1 0 7 50 0 -1 4.000 0 0 -1 0 0 2
	 12225 2700 12525 2700
-6
2 1 0 1 0 7 50 0 -1 4.000 0 0 -1 0 0 2
	 3675 2775 3675 3450
2 1 0 1 0 7 50 0 -1 4.000 0 0 -1 0 0 2
	 6000 2775 6000 3450
2 1 0 1 0 7 50 0 -1 4.000 0 0 -1 0 0 2
	 1200 2775 1200 3450
2 1 0 1 0 7 50 0 -1 4.000 0 0 -1 0 0 2
	 4800 2775 4800 3450
2 1 0 1 0 7 50 0 -1 4.000 0 0 -1 1 1 2
	1 1 1.00 60.00 120.00
	1 1 1.00 60.00 120.00
	 1200 3300 3675 3300
2 1 0 1 0 7 50 0 -1 4.000 0 0 -1 1 1 2
	1 1 1.00 60.00 120.00
	1 1 1.00 60.00 120.00
	 3675 3300 4800 3300
2 1 0 1 0 7 50 0 -1 4.000 0 0 -1 1 1 2
	1 1 1.00 60.00 120.00
	1 1 1.00 60.00 120.00
	 4800 3300 6000 3300
2 1 0 2 0 7 50 0 -1 6.000 0 0 -1 1 0 2
	1 1 2.00 120.00 240.00
	 4800 1725 4800 2325
2 1 0 1 0 7 50 0 -1 4.000 0 0 -1 0 0 2
	 1200 975 1200 1650
2 1 0 1 0 7 50 0 -1 4.000 0 0 -1 0 0 2
	 3675 975 3675 1650
2 1 0 1 0 7 50 0 -1 4.000 0 0 -1 0 0 2
	 6000 975 6000 1650
2 1 0 1 0 7 50 0 -1 4.000 0 0 -1 1 0 2
	1 1 1.00 60.00 120.00
	 1200 1350 2025 1350
2 1 0 1 0 7 50 0 -1 4.000 0 0 -1 1 0 2
	1 1 1.00 60.00 120.00
	 3675 1350 2850 1350
2 1 0 1 0 7 50 0 -1 4.000 0 0 -1 1 0 2
	1 1 1.00 60.00 120.00
	 3675 1350 3975 1350
2 1 0 1 0 7 50 0 -1 4.000 0 0 -1 1 0 2
	1 1 1.00 60.00 120.00
	 6000 1350 5700 1350
2 3 0 1 0 7 50 0 -1 4.000 0 0 -1 0 0 4
	 7425 2625 7575 2400 7725 2625 7425 2625
2 1 0 3 0 7 50 0 -1 8.000 0 0 -1 0 0 2
	 1200 5400 6000 5400
2 1 0 3 0 7 50 0 -1 8.000 0 0 -1 0 0 2
	 7575 5325 12375 5325
2 1 0 3 0 7 50 0 -1 8.000 0 0 -1 0 0 2
	 7575 2400 9825 2400
2 1 0 3 0 7 50 0 -1 8.000 0 0 -1 0 0 2
	 10125 2400 12375 2400
2 3 0 1 0 7 50 0 -1 4.000 0 0 -1 0 0 4
	 9825 2625 9975 2400 10125 2625 9825 2625
2 1 0 1 0 7 50 0 -1 4.000 0 0 -1 0 0 2
	 9825 2700 10125 2700
2 1 0 2 0 7 50 0 -1 6.000 0 0 -1 0 0 3
	 3600 5400 4800 6075 6000 5400
2 1 0 2 0 7 50 0 -1 6.000 0 0 -1 0 0 3
	 7587 5351 9975 6150 12387 5351
2 1 0 1 0 7 50 0 -1 4.000 0 0 -1 0 0 2
	 4800 5400 4800 6075
2 1 0 1 0 7 50 0 -1 4.000 0 0 -1 0 0 2
	 9975 5325 9975 6150
2 1 0 1 0 7 50 0 -1 4.000 0 0 -1 0 0 2
	 11175 5325 11175 5775
4 0 0 50 0 0 24 0.0000 4 255 360 2325 3225 10\001
4 0 0 50 0 0 24 0.0000 4 255 180 4200 3225 5\001
4 0 0 50 0 0 24 0.0000 4 255 180 5400 3225 5\001
4 0 0 50 0 1 24 0.0000 4 255 225 4950 2175 F\001
4 0 0 50 0 0 16 0.0000 4 165 120 2550 1575 1\001
4 0 0 50 0 1 24 0.0000 4 255 390 2175 1500 EJ\001
4 0 0 50 0 1 24 0.0000 4 255 1680 3975 1500 EJ  = EJ /2\001
4 0 0 50 0 0 16 0.0000 4 165 120 4350 1575 2\001
4 0 0 50 0 0 16 0.0000 4 165 120 5175 1575 1\001
4 0 0 50 0 1 24 0.0000 4 270 225 1425 2850 A\001
4 0 0 50 0 1 24 0.0000 4 255 225 3975 2850 B\001
4 0 0 50 0 1 24 0.0000 4 255 240 5550 2850 C\001
4 0 0 50 0 0 24 0.0000 4 255 3990 8100 1650 PRIMARY STRUCTURE:\001
4 0 0 50 0 1 32 0.0000 4 330 660 3225 4725 M :\001
4 0 0 50 0 1 32 0.0000 4 330 540 7725 4500 M:\001
4 0 0 50 0 32 32 0.0000 4 345 225 7425 4500 d\001
4 0 0 50 0 0 24 0.0000 4 180 180 3600 4875 o\001
4 0 0 50 0 1 24 0.0000 4 255 225 9900 2100 X\001
4 0 0 50 0 0 24 0.0000 4 255 750 5025 6225 2.5 F\001
4 0 0 50 0 0 24 0.0000 4 255 180 10125 5850 1\001
4 0 0 50 0 0 24 0.0000 4 255 450 10725 5700 0.5\001
