#FIG 3.2  Produced by xfig version 3.2.6a
Landscape
Center
Inches
A4
100.00
Single
-2
1200 2
6 2280 1215 8535 2640
1 3 0 1 0 7 50 -1 -1 4.000 1 0.0000 5985 1335 67 67 5985 1335 6045 1305
1 3 0 1 0 7 50 -1 -1 4.000 1 0.0000 5985 2325 67 67 5985 2325 6045 2295
1 3 0 1 0 7 50 -1 -1 4.000 1 0.0000 7155 1305 67 67 7155 1305 7215 1275
1 3 0 1 0 7 50 -1 -1 4.000 1 0.0000 7170 2310 67 67 7170 2310 7230 2280
2 1 0 3 0 7 50 -1 -1 0.000 0 0 -1 0 0 2
	 2430 1230 7200 1230
2 1 0 3 0 7 50 -1 -1 8.000 0 0 -1 0 0 2
	 6000 2415 8400 2415
2 1 0 3 0 7 50 -1 -1 8.000 0 0 -1 0 0 2
	 5985 1365 5985 2235
2 1 0 3 0 7 50 -1 -1 8.000 0 0 -1 0 0 2
	 7170 1395 7170 2265
2 3 0 1 0 7 50 -1 -1 4.000 0 0 -1 0 0 4
	 2280 1455 2460 1230 2640 1455 2280 1455
2 3 0 1 0 7 50 -1 -1 4.000 0 0 -1 0 0 4
	 8175 2640 8355 2415 8535 2640 8175 2640
-6
6 10005 330 16260 2640
1 3 0 1 0 7 50 -1 -1 4.000 1 0.0000 13710 1335 67 67 13710 1335 13770 1305
1 3 0 1 0 7 50 -1 -1 4.000 1 0.0000 13710 2325 67 67 13710 2325 13770 2295
1 3 0 1 0 7 50 -1 -1 4.000 1 0.0000 14880 1305 67 67 14880 1305 14940 1275
1 3 0 1 0 7 50 -1 -1 4.000 1 0.0000 14895 2310 67 67 14895 2310 14955 2280
2 1 1 1 0 7 50 -1 -1 4.000 0 0 -1 0 0 2
	 10200 960 14880 960
2 1 0 1 0 7 50 -1 -1 4.000 0 0 -1 0 0 4
	 12240 840 12300 960 12510 735 14340 735
2 1 0 3 0 7 50 -1 -1 0.000 0 0 -1 0 0 2
	 10155 1230 14925 1230
2 1 0 3 0 7 50 -1 -1 8.000 0 0 -1 0 0 2
	 13725 2415 16125 2415
2 1 0 3 0 7 50 -1 -1 8.000 0 0 -1 0 0 2
	 13710 1365 13710 2235
2 1 0 3 0 7 50 -1 -1 8.000 0 0 -1 0 0 2
	 14895 1395 14895 2265
2 3 0 1 0 7 50 -1 -1 4.000 0 0 -1 0 0 4
	 10005 1455 10185 1230 10365 1455 10005 1455
2 3 0 1 0 7 50 -1 -1 4.000 0 0 -1 0 0 4
	 15900 2640 16080 2415 16260 2640 15900 2640
4 0 0 50 -1 0 24 0.0000 4 270 960 10695 600 LC 2:\001
4 0 0 50 -1 32 24 0.0000 4 285 1485 12585 660 Dt=20 K\001
-6
6 2280 4770 8535 6195
1 3 0 1 0 7 50 -1 -1 4.000 1 0.0000 5985 4890 67 67 5985 4890 6045 4860
1 3 0 1 0 7 50 -1 -1 4.000 1 0.0000 5985 5880 67 67 5985 5880 6045 5850
1 3 0 1 0 7 50 -1 -1 4.000 1 0.0000 7155 4860 67 67 7155 4860 7215 4830
1 3 0 1 0 7 50 -1 -1 4.000 1 0.0000 7170 5865 67 67 7170 5865 7230 5835
2 1 0 3 0 7 50 -1 -1 0.000 0 0 -1 0 0 2
	 2430 4785 7200 4785
2 1 0 3 0 7 50 -1 -1 8.000 0 0 -1 0 0 2
	 6000 5970 8400 5970
2 1 0 3 0 7 50 -1 -1 8.000 0 0 -1 0 0 2
	 5985 4920 5985 5790
2 1 0 3 0 7 50 -1 -1 8.000 0 0 -1 0 0 2
	 7170 4950 7170 5820
2 3 0 1 0 7 50 -1 -1 4.000 0 0 -1 0 0 4
	 2280 5010 2460 4785 2640 5010 2280 5010
2 3 0 1 0 7 50 -1 -1 4.000 0 0 -1 0 0 4
	 8175 6195 8355 5970 8535 6195 8175 6195
-6
6 10095 4680 16350 6105
1 3 0 1 0 7 50 -1 -1 4.000 1 0.0000 13800 4800 67 67 13800 4800 13860 4770
1 3 0 1 0 7 50 -1 -1 4.000 1 0.0000 13800 5790 67 67 13800 5790 13860 5760
1 3 0 1 0 7 50 -1 -1 4.000 1 0.0000 14970 4770 67 67 14970 4770 15030 4740
1 3 0 1 0 7 50 -1 -1 4.000 1 0.0000 14985 5775 67 67 14985 5775 15045 5745
2 1 0 3 0 7 50 -1 -1 0.000 0 0 -1 0 0 2
	 10245 4695 15015 4695
2 1 0 3 0 7 50 -1 -1 8.000 0 0 -1 0 0 2
	 13815 5880 16215 5880
2 1 0 3 0 7 50 -1 -1 8.000 0 0 -1 0 0 2
	 13800 4830 13800 5700
2 1 0 3 0 7 50 -1 -1 8.000 0 0 -1 0 0 2
	 14985 4860 14985 5730
2 3 0 1 0 7 50 -1 -1 4.000 0 0 -1 0 0 4
	 10095 4920 10275 4695 10455 4920 10095 4920
2 3 0 1 0 7 50 -1 -1 4.000 0 0 -1 0 0 4
	 15990 6105 16170 5880 16350 6105 15990 6105
-6
2 1 0 1 0 7 50 -1 -1 4.000 0 0 -1 0 0 2
	 2415 2835 2415 3510
2 1 0 1 0 7 50 -1 -1 4.000 0 0 -1 0 0 2
	 6000 2790 6000 3465
2 1 0 1 0 7 50 -1 -1 4.000 0 0 -1 0 0 2
	 7185 2790 7185 3465
2 1 0 1 0 7 50 -1 -1 4.000 0 0 -1 0 0 2
	 8385 2760 8385 3435
2 1 0 1 0 7 50 -1 -1 4.000 0 0 -1 0 0 2
	 8700 1230 9375 1230
2 1 0 1 0 7 50 -1 -1 4.000 0 0 -1 0 0 2
	 8745 2385 9420 2385
2 1 0 1 0 7 50 -1 -1 4.000 0 0 -1 1 1 2
	1 1 1.00 60.00 120.00
	1 1 1.00 60.00 120.00
	 2430 3225 6015 3225
2 1 0 1 0 7 50 -1 -1 4.000 0 0 -1 1 1 2
	1 1 1.00 60.00 120.00
	1 1 1.00 60.00 120.00
	 6015 3225 7170 3225
2 1 0 1 0 7 50 -1 -1 4.000 0 0 -1 1 1 2
	1 1 1.00 60.00 120.00
	1 1 1.00 60.00 120.00
	 7170 3225 8370 3225
2 1 0 1 0 7 50 -1 -1 4.000 0 0 -1 1 1 2
	1 1 1.00 60.00 120.00
	1 1 1.00 60.00 120.00
	 9165 2385 9165 1215
2 1 0 1 0 7 50 -1 -1 4.000 0 0 -1 1 0 2
	1 1 1.00 60.00 120.00
	 6015 2430 6015 3060
2 1 0 1 0 7 50 -1 -1 4.000 0 0 -1 0 0 4
	 7290 1995 7155 1905 7425 1620 8400 1620
2 1 0 1 0 7 50 -1 -1 4.000 0 0 -1 1 0 2
	1 1 1.00 60.00 120.00
	 5985 5985 5985 6615
2 1 0 1 0 7 50 -1 -1 4.000 0 0 -1 1 0 2
	1 1 1.00 60.00 120.00
	 8385 6720 8385 6240
2 1 0 1 0 7 50 -1 -1 4.000 0 0 -1 1 0 4
	1 1 1.00 60.00 120.00
	 7245 4920 7530 4920 7530 5835 7170 5835
2 1 0 1 0 7 50 -1 -1 4.000 0 0 -1 1 0 3
	1 1 1.00 60.00 120.00
	 10275 4680 13800 4215 14970 4665
2 1 0 1 0 7 50 -1 -1 4.000 0 0 -1 1 0 3
	1 1 1.00 60.00 120.00
	 13800 5865 14970 6135 16170 5880
2 1 0 1 0 7 50 -1 -1 4.000 0 0 -1 1 0 2
	1 1 1.00 60.00 120.00
	 13725 2460 13725 3090
2 1 0 1 0 7 50 -1 -1 4.000 0 0 -1 1 0 2
	1 1 1.00 60.00 120.00
	 13815 5910 13815 6540
2 1 0 1 0 7 50 -1 -1 4.000 0 0 -1 1 0 2
	1 1 1.00 60.00 120.00
	 10500 1770 10500 1245
2 1 0 1 0 7 50 -1 -1 4.000 0 0 -1 1 0 2
	1 1 1.00 60.00 120.00
	 10500 795 10500 1245
4 0 0 50 -1 0 24 0.0000 4 270 210 7785 3180 1\001
4 0 0 50 -1 0 24 1.5708 4 270 210 9030 1890 1\001
4 0 0 50 -1 0 24 0.0000 4 270 210 6450 3165 1\001
4 0 0 50 -1 0 24 0.0000 4 270 210 4035 3165 4\001
4 0 0 50 -1 0 24 0.0000 4 270 615 5340 2775 v=?\001
4 0 0 50 -1 0 24 0.0000 4 270 960 2820 765 LC 1:\001
4 0 0 50 -1 0 24 0.0000 4 270 765 7425 1485 t=20\001
4 0 0 50 -1 0 24 0.0000 4 270 300 8205 1500 K\001
4 0 0 50 -1 32 24 0.0000 4 300 195 6120 6525 d\001
4 0 0 50 -1 0 24 0.0000 4 270 210 6330 6525 1\001
4 0 0 50 -1 32 24 0.0000 4 300 195 4380 4395 d\001
4 0 0 50 -1 0 24 0.0000 4 270 300 4590 4380 N\001
4 0 0 50 -1 0 24 0.0000 4 270 735 7530 6780 0.66\001
4 0 0 50 -1 0 24 0.0000 4 270 870 7545 5565 -1.33\001
4 0 0 50 -1 32 24 0.0000 4 300 195 12240 4230 d\001
4 0 0 50 -1 0 24 0.0000 4 270 360 12510 4200 M\001
4 0 0 50 -1 0 24 0.0000 4 270 735 14025 4275 1.33\001
4 0 0 50 -1 0 24 0.0000 4 270 735 14160 6390 0.66\001
4 0 0 50 -1 0 24 0.0000 4 270 615 13035 2850 v=?\001
4 0 0 50 -1 32 24 0.0000 4 300 195 13290 6360 d\001
4 0 0 50 -1 0 24 0.0000 4 270 210 13470 6360 1\001
4 0 0 50 -1 0 24 0.0000 4 270 525 10545 1695 0.1\001
