#FIG 3.2  Produced by xfig version 3.2.5c
Landscape
Center
Inches
Letter  
100.00
Single
-2
1200 2
6 -75 750 3675 5475
2 1 0 1 0 7 50 -1 -1 0.000 0 0 -1 0 0 2
	 0 750 0 5475
2 1 0 3 0 7 50 -1 -1 0.000 0 0 -1 0 0 2
	 0 1200 3600 1200
2 1 0 3 0 7 50 -1 -1 0.000 0 0 -1 0 0 1
	 3600 1200
2 1 0 3 0 7 50 -1 -1 0.000 0 0 -1 0 0 2
	 0 4800 3600 4800
2 1 0 3 0 7 50 -1 -1 0.000 0 0 -1 0 0 2
	 3600 1200 3600 4800
2 1 0 3 0 7 50 -1 -1 0.000 0 0 -1 0 0 2
	 0 4800 3600 1200
-6
6 5775 675 9525 5400
2 1 0 1 0 7 50 -1 -1 0.000 0 0 -1 0 0 2
	 5850 675 5850 5400
2 1 0 3 0 7 50 -1 -1 0.000 0 0 -1 0 0 2
	 5850 1125 9450 1125
2 1 0 3 0 7 50 -1 -1 0.000 0 0 -1 0 0 1
	 9450 1125
2 1 0 3 0 7 50 -1 -1 0.000 0 0 -1 0 0 2
	 5850 4725 9450 4725
2 1 0 3 0 7 50 -1 -1 0.000 0 0 -1 0 0 2
	 9450 1125 9450 4725
2 1 0 3 0 7 50 -1 -1 0.000 0 0 -1 0 0 2
	 5850 4725 9450 1125
-6
2 1 0 1 0 7 50 -1 -1 0.000 0 0 -1 0 0 1
	 2925 0
2 1 0 1 0 7 50 -1 -1 0.000 0 0 -1 0 0 2
	 0 900 -150 1125
2 1 0 1 0 7 50 -1 -1 0.000 0 0 -1 0 0 2
	 0 1050 -150 1275
2 1 0 1 0 7 50 -1 -1 0.000 0 0 -1 0 0 2
	 0 1200 -150 1425
2 1 0 1 0 7 50 -1 -1 0.000 0 0 -1 0 0 2
	 0 1350 -150 1575
2 1 0 1 0 7 50 -1 -1 0.000 0 0 -1 0 0 2
	 0 4425 -150 4650
2 1 0 1 0 7 50 -1 -1 0.000 0 0 -1 0 0 2
	 0 4575 -150 4800
2 1 0 1 0 7 50 -1 -1 0.000 0 0 -1 0 0 2
	 0 4725 -150 4950
2 1 0 1 0 7 50 -1 -1 0.000 0 0 -1 0 0 2
	 0 4875 -150 5100
2 1 0 1 0 7 50 -1 -1 0.000 0 0 -1 0 0 2
	 3600 5025 3600 5475
2 1 0 1 0 7 50 -1 -1 0.000 0 0 -1 0 0 2
	 3750 1200 4425 1200
2 1 0 1 0 7 50 -1 -1 0.000 0 0 -1 0 0 2
	 3750 4800 4425 4800
2 1 0 1 0 7 50 -1 -1 0.000 0 0 -1 1 1 2
	1 1 1.00 60.00 120.00
	1 1 1.00 60.00 120.00
	 0 5400 3600 5400
2 1 0 1 0 7 50 -1 -1 0.000 0 0 -1 1 1 2
	1 1 1.00 60.00 120.00
	1 1 1.00 60.00 120.00
	 4275 4800 4275 1200
2 1 0 2 0 7 50 -1 -1 0.000 0 0 -1 1 0 2
	1 1 2.00 120.00 240.00
	 3600 525 3600 1125
4 0 0 50 -1 0 24 0.0000 4 270 210 75 5175 1\001
4 0 0 50 -1 0 24 0.0000 4 270 210 3600 5100 2\001
4 0 0 50 -1 0 24 0.0000 4 270 210 75 1125 3\001
4 0 0 50 -1 0 24 0.0000 4 270 210 1725 5325 2\001
4 0 0 50 -1 0 24 1.5708 4 270 210 4200 3225 2\001
4 0 0 50 -1 0 24 0.0000 4 270 210 3750 1200 4\001
4 0 0 50 -1 1 24 0.0000 4 285 735 2850 900 F=1\001
4 0 0 50 -1 0 24 0.0000 4 270 210 7500 4575 0\001
4 0 0 50 -1 0 24 1.5708 4 270 210 9375 3225 0\001
4 0 0 50 -1 0 24 0.0000 4 270 210 7500 1050 1\001
4 0 0 50 -1 0 24 0.7854 4 270 870 7125 3300 -1.41\001
