#FIG 3.2  Produced by xfig version 3.2.5c
Landscape
Center
Inches
Letter  
100.00
Single
-2
1200 2
6 -150 825 0 1575
2 1 0 1 0 7 50 -1 -1 4.000 0 0 -1 0 0 2
	 0 825 0 1575
2 1 0 1 0 7 50 -1 -1 4.000 0 0 -1 0 0 2
	 0 900 -150 1050
2 1 0 1 0 7 50 -1 -1 4.000 0 0 -1 0 0 2
	 0 1050 -150 1200
2 1 0 1 0 7 50 -1 -1 4.000 0 0 -1 0 0 2
	 0 1200 -150 1350
2 1 0 1 0 7 50 -1 -1 4.000 0 0 -1 0 0 2
	 0 1350 -150 1500
-6
6 9600 3525 9750 4275
2 1 0 1 0 7 50 -1 -1 4.000 0 0 -1 0 0 2
	 9600 3525 9600 4275
2 1 0 1 0 7 50 -1 -1 4.000 0 0 -1 0 0 2
	 9600 3600 9750 3750
2 1 0 1 0 7 50 -1 -1 4.000 0 0 -1 0 0 2
	 9600 3750 9750 3900
2 1 0 1 0 7 50 -1 -1 4.000 0 0 -1 0 0 2
	 9600 3900 9750 4050
2 1 0 1 0 7 50 -1 -1 4.000 0 0 -1 0 0 2
	 9600 4050 9750 4200
-6
1 4 0 1 0 7 50 -1 -1 4.000 1 0.0000 2400 1200 84 84 2363 1275 2438 1125
1 4 0 1 0 7 50 -1 -1 4.000 1 0.0000 4800 1200 84 84 4763 1275 4838 1125
1 4 0 1 0 7 50 -1 -1 4.000 1 0.0000 5962 3900 84 84 5925 3975 6000 3825
1 4 0 1 0 7 50 -1 -1 4.000 1 0.0000 8400 3900 84 84 8363 3975 8438 3825
2 1 0 3 0 7 50 -1 -1 8.000 0 0 -1 0 0 2
	 0 1200 2325 1200
2 1 0 3 0 7 50 -1 -1 8.000 0 0 -1 0 0 2
	 2475 1200 4725 1200
2 1 1 1 0 7 50 -1 -1 4.000 0 0 -1 0 0 2
	 0 1500 0 7725
2 1 1 1 0 7 50 -1 -1 4.000 0 0 -1 0 0 2
	 2400 1500 2400 7725
2 1 1 1 0 7 50 -1 -1 4.000 0 0 -1 0 0 2
	 4800 1500 4800 7725
2 1 1 1 0 7 50 -1 -1 4.000 0 0 -1 0 0 2
	 9600 1425 9600 7650
2 1 0 1 0 7 50 -1 -1 4.000 0 0 -1 1 1 2
	1 1 1.00 60.00 120.00
	1 1 1.00 60.00 120.00
	 0 1875 2400 1875
2 1 0 1 0 7 50 -1 -1 4.000 0 0 -1 1 1 2
	1 1 1.00 60.00 120.00
	1 1 1.00 60.00 120.00
	 2400 1875 4800 1875
2 1 0 2 0 7 50 -1 -1 6.000 0 0 -1 1 0 2
	1 1 2.00 120.00 240.00
	 9600 300 9600 1125
2 1 0 1 0 7 50 -1 -1 4.000 0 0 -1 0 0 2
	 0 2850 9600 2850
2 1 0 3 0 7 50 -1 -1 8.000 0 0 -1 0 0 2
	 0 3900 5925 3900
2 1 0 3 0 7 50 -1 -1 8.000 0 0 -1 0 0 2
	 6075 3900 8325 3900
2 1 0 3 0 7 50 -1 -1 8.000 0 0 -1 0 0 2
	 8475 3900 9600 3900
2 1 0 3 0 7 50 -1 -1 8.000 0 0 -1 0 0 2
	 4875 1200 9600 1200
2 1 0 1 0 7 50 -1 -1 4.000 0 0 -1 1 1 2
	1 1 1.00 60.00 120.00
	1 1 1.00 60.00 120.00
	 4800 1875 6000 1875
2 1 0 1 0 7 50 -1 -1 4.000 0 0 -1 1 1 2
	1 1 1.00 60.00 120.00
	1 1 1.00 60.00 120.00
	 6000 1875 8400 1875
2 1 0 1 0 7 50 -1 -1 4.000 0 0 -1 1 1 2
	1 1 1.00 60.00 120.00
	1 1 1.00 60.00 120.00
	 8400 1875 9600 1875
2 3 0 1 0 7 50 -1 -1 4.000 0 0 -1 0 0 4
	 5850 1425 6000 1200 6150 1425 5850 1425
2 3 0 1 0 7 50 -1 -1 4.000 0 0 -1 0 0 4
	 8250 1425 8400 1200 8550 1425 8250 1425
2 1 0 1 0 7 50 -1 -1 4.000 0 0 -1 0 0 2
	 5775 1500 6150 1500
2 1 0 1 0 7 50 -1 -1 4.000 0 0 -1 0 0 2
	 8175 1500 8550 1500
2 3 0 1 0 7 50 -1 -1 4.000 0 0 -1 0 0 4
	 2250 4125 2400 3900 2550 4125 2250 4125
2 3 0 1 0 7 50 -1 -1 4.000 0 0 -1 0 0 4
	 4650 4125 4800 3900 4950 4125 4650 4125
2 1 0 1 0 7 50 -1 -1 4.000 0 0 -1 0 0 2
	 2250 4200 2550 4200
2 1 0 1 0 7 50 -1 -1 4.000 0 0 -1 0 0 2
	 4650 4200 4950 4200
2 1 1 1 0 7 50 -1 -1 4.000 0 0 -1 0 0 2
	 8400 1650 8400 7875
2 1 0 1 0 7 50 -1 -1 4.000 0 0 -1 0 0 3
	 5977 2848 8377 2248 9577 2848
2 1 0 1 0 7 50 -1 -1 4.000 0 0 -1 0 0 3
	 5968 3878 8368 3278 9568 3878
2 1 0 3 0 7 50 -1 -1 8.000 0 0 -1 0 0 2
	 0 5310 5925 5310
2 1 0 3 0 7 50 -1 -1 8.000 0 0 -1 0 0 2
	 6075 5325 8325 5325
2 1 0 3 0 7 50 -1 -1 8.000 0 0 -1 0 0 2
	 8490 5310 9615 5310
2 1 0 2 0 7 50 -1 -1 6.000 0 0 -1 1 0 2
	1 1 2.00 120.00 240.00
	 6075 4545 6075 4005
2 1 0 2 0 7 50 -1 -1 6.000 0 0 -1 1 0 2
	1 1 2.00 120.00 240.00
	 8235 4575 8235 4035
2 1 1 1 0 7 50 -1 -1 4.000 0 0 -1 0 0 2
	 6000 1500 6000 7725
2 1 0 2 0 7 50 -1 -1 6.000 0 0 -1 1 0 2
	1 1 2.00 120.00 240.00
	 5835 4005 5835 4545
2 1 0 2 0 7 50 -1 -1 6.000 0 0 -1 1 0 2
	1 1 2.00 120.00 240.00
	 8520 4035 8520 4575
2 1 0 1 0 7 50 -1 -1 4.000 0 0 -1 0 0 2
	 7230 5340 7230 4980
2 1 0 1 0 7 50 -1 -1 4.000 0 0 -1 0 0 2
	 2400 5310 4800 5745
3 0 0 1 0 7 50 -1 -1 4.000 0 0 0 7
	 4830 5730 5355 5535 6945 4980 7620 4980 8160 5100 8730 5565
	 9600 6270
	 0.000 1.000 1.000 1.000 1.000 1.000 0.000
4 0 0 50 -1 0 24 0.0000 4 270 210 1125 1800 4\001
4 0 0 50 -1 0 24 0.0000 4 270 210 3675 1800 4\001
4 0 0 50 -1 0 24 0.0000 4 270 210 7050 1800 4\001
4 0 0 50 -1 0 24 0.0000 4 270 210 5100 1800 2\001
4 0 0 50 -1 0 24 0.0000 4 270 210 8850 1800 2\001
4 0 0 50 -1 0 24 0.0000 4 270 210 9225 750 1\001
4 0 0 50 -1 0 24 0.0000 4 270 480 75 2325 M:\001
4 0 0 50 -1 0 24 0.0000 4 360 2730 3150 3375 conjugate beam:\001
4 0 0 50 -1 0 24 0.0000 4 270 210 8700 2325 2\001
4 0 0 50 -1 0 24 0.0000 4 270 210 8580 3360 2\001
4 0 0 50 -1 0 24 0.0000 4 270 300 45 1545 A\001
4 0 0 50 -1 0 24 0.0000 4 270 270 2520 1515 B\001
4 0 0 50 -1 0 24 0.0000 4 270 270 4470 1560 C\001
4 0 0 50 -1 0 24 0.0000 4 270 300 6165 1575 D\001
4 0 0 50 -1 0 24 0.0000 4 270 225 9345 1560 F\001
4 0 0 50 -1 0 24 0.0000 4 270 255 7965 1590 E\001
4 0 0 50 -1 0 24 0.0000 4 270 735 6225 4515 1.33\001
4 0 0 50 -1 0 24 0.0000 4 270 735 7470 4545 2.66\001
4 0 0 50 -1 1 24 0.0000 4 360 2910 1950 5055 M-conjug=v-orig\001
4 0 0 50 -1 0 24 0.0000 4 270 735 4905 5895 2.66\001
4 0 0 50 -1 0 24 0.0000 4 270 210 7305 4950 2\001
4 0 0 50 -1 0 24 0.0000 4 270 210 9135 6360 8\001
