#FIG 3.2  Produced by xfig version 3.2.5c
Landscape
Center
Metric
A4      
100.00
Single
-2
1200 2
6 330 1485 7080 1890
6 330 1485 7035 1800
1 4 0 1 0 7 50 -1 -1 0.000 1 0.0000 3705 1575 71 71 3634 1575 3776 1575
2 1 0 3 0 7 50 -1 -1 0.000 0 0 -1 0 0 2
	 510 1575 3615 1575
2 1 0 3 0 7 50 -1 -1 0.000 0 0 -1 0 0 2
	 3750 1575 6855 1575
2 3 0 1 0 7 50 -1 -1 0.000 0 0 -1 0 0 4
	 330 1800 510 1575 690 1800 330 1800
2 3 0 1 0 7 50 -1 -1 0.000 0 0 -1 0 0 4
	 2760 1800 2940 1575 3120 1800 2760 1800
2 3 0 1 0 7 50 -1 -1 0.000 0 0 -1 0 0 4
	 4245 1800 4425 1575 4605 1800 4245 1800
2 3 0 1 0 7 50 -1 -1 0.000 0 0 -1 0 0 4
	 6675 1800 6855 1575 7035 1800 6675 1800
-6
2 1 0 1 0 7 50 -1 -1 0.000 0 0 -1 0 0 2
	 2760 1890 3165 1890
2 1 0 1 0 7 50 -1 -1 0.000 0 0 -1 0 0 2
	 4200 1890 4605 1890
2 1 0 1 0 7 50 -1 -1 0.000 0 0 -1 0 0 2
	 6675 1890 7080 1890
-6
1 4 0 1 0 7 50 -1 -1 0.000 1 0.0000 3720 4305 71 71 3649 4305 3791 4305
1 4 0 1 0 7 50 -1 -1 0.000 1 0.0000 3720 6180 71 71 3649 6180 3791 6180
2 1 0 1 0 7 50 -1 -1 0.000 0 0 -1 0 0 2
	 510 2070 510 3285
2 1 0 1 0 7 50 -1 -1 0.000 0 0 -1 0 0 2
	 2940 2025 2940 2700
2 1 0 1 0 7 50 -1 -1 0.000 0 0 -1 0 0 2
	 3705 2025 3705 2700
2 1 0 1 0 7 50 -1 -1 0.000 0 0 -1 0 0 2
	 4425 2025 4425 2700
2 1 0 1 0 7 50 -1 -1 0.000 0 0 -1 0 0 2
	 6900 1980 6900 2655
2 1 0 1 0 7 50 -1 -1 0.000 0 0 -1 1 1 2
	1 1 1.00 60.00 120.00
	1 1 1.00 60.00 120.00
	 510 2475 2940 2475
2 1 0 1 0 7 50 -1 -1 0.000 0 0 -1 1 1 2
	1 1 1.00 60.00 120.00
	1 1 1.00 60.00 120.00
	 2940 2475 3705 2475
2 1 0 1 0 7 50 -1 -1 0.000 0 0 -1 1 1 2
	1 1 1.00 60.00 120.00
	1 1 1.00 60.00 120.00
	 3705 2475 4425 2475
2 1 0 1 0 7 50 -1 -1 0.000 0 0 -1 1 1 2
	1 1 1.00 60.00 120.00
	1 1 1.00 60.00 120.00
	 4425 2475 6900 2475
2 2 0 1 0 7 50 -1 50 0.000 0 0 -1 0 0 5
	 510 1485 3705 1485 3705 1080 510 1080 510 1485
2 1 0 1 0 7 50 -1 -1 0.000 0 0 -1 0 0 4
	 1635 990 1680 1080 1860 855 2400 855
2 1 1 1 0 7 50 -1 -1 4.000 0 0 -1 0 0 2
	 1800 1710 1815 7335
2 1 0 1 0 7 50 -1 -1 4.000 0 0 -1 1 1 2
	1 1 1.00 60.00 120.00
	1 1 1.00 60.00 120.00
	 510 2940 1785 2940
2 1 0 1 0 7 50 -1 -1 4.000 0 0 -1 1 1 2
	1 1 1.00 60.00 120.00
	1 1 1.00 60.00 120.00
	 510 3345 2190 3345
2 1 1 1 0 7 50 -1 -1 4.000 0 0 -1 0 0 2
	 2175 1725 2175 7125
2 1 0 1 0 7 50 -1 -1 0.000 0 0 -1 0 0 3
	 3765 4320 4440 4410 6885 4305
2 1 0 1 0 7 50 -1 -1 0.000 0 0 -1 0 0 2
	 2880 3885 2880 4275
2 1 0 1 0 7 50 -1 -1 0.000 0 0 -1 0 0 2
	 4215 4620 4620 4620
2 1 0 1 0 7 50 -1 -1 0.000 0 0 -1 0 0 2
	 6690 4620 7095 4620
2 1 0 3 0 7 50 -1 -1 0.000 0 0 -1 0 0 2
	 525 4305 3630 4305
2 1 0 3 0 7 50 -1 -1 0.000 0 0 -1 0 0 2
	 3765 4305 6870 4305
2 3 0 1 0 7 50 -1 -1 0.000 0 0 -1 0 0 4
	 345 4530 525 4305 705 4530 345 4530
2 3 0 1 0 7 50 -1 -1 0.000 0 0 -1 0 0 4
	 4260 4530 4440 4305 4620 4530 4260 4530
2 3 0 1 0 7 50 -1 -1 0.000 0 0 -1 0 0 4
	 6690 4530 6870 4305 7050 4530 6690 4530
2 3 0 1 0 7 50 -1 -1 0.000 0 0 -1 0 0 4
	 2700 4545 2880 4320 3060 4545 2700 4545
2 1 0 1 0 7 50 -1 -1 0.000 0 0 -1 0 0 2
	 2670 4635 3075 4635
2 1 1 1 0 7 50 -1 -1 4.000 0 0 -1 0 0 2
	 525 4320 2880 3915
2 1 1 1 0 7 50 -1 -1 4.000 0 0 -1 0 0 2
	 2880 3915 3645 4275
2 1 0 1 0 7 50 -1 -1 0.000 0 0 -1 0 0 4
	 525 6180 1785 7080 4455 5820 6870 6165
2 1 0 1 0 7 50 -1 -1 0.000 0 0 -1 0 0 2
	 4215 6495 4620 6495
2 1 0 1 0 7 50 -1 -1 0.000 0 0 -1 0 0 2
	 6690 6495 7095 6495
2 1 0 3 0 7 50 -1 -1 0.000 0 0 -1 0 0 2
	 525 6180 3630 6180
2 1 0 3 0 7 50 -1 -1 0.000 0 0 -1 0 0 2
	 3765 6180 6870 6180
2 3 0 1 0 7 50 -1 -1 0.000 0 0 -1 0 0 4
	 345 6405 525 6180 705 6405 345 6405
2 3 0 1 0 7 50 -1 -1 0.000 0 0 -1 0 0 4
	 4260 6405 4440 6180 4620 6405 4260 6405
2 3 0 1 0 7 50 -1 -1 0.000 0 0 -1 0 0 4
	 6690 6405 6870 6180 7050 6405 6690 6405
2 1 1 1 0 7 50 -1 -1 4.000 0 0 -1 0 0 2
	 2910 4965 2910 6855
2 1 1 1 0 7 50 -1 -1 4.000 0 0 -1 0 0 2
	 555 6210 2895 6540
2 3 0 1 0 7 50 -1 -1 0.000 0 0 -1 0 0 4
	 7995 4020 10395 4020 10395 3615 7995 4020
2 1 0 1 0 7 50 -1 -1 4.000 0 0 -1 0 0 2
	 8025 4740 10410 4740
2 3 0 1 0 7 50 -1 -1 4.000 0 0 -1 0 0 4
	 11085 3615 11085 4035 11880 4035 11085 3615
2 1 0 1 0 7 50 -1 -1 4.000 0 0 -1 0 0 2
	 11115 4755 11910 4755
2 3 0 1 0 7 50 -1 -1 4.000 0 0 -1 0 0 4
	 8055 6180 10365 6180 10350 6435 8055 6180
2 3 0 1 0 7 50 -1 -1 4.000 0 0 -1 0 0 4
	 8175 7065 10425 7065 9390 7410 8175 7065
2 1 0 1 0 7 50 -1 -1 4.000 0 0 -1 0 0 3
	 11115 6210 11115 6495 11775 6195
2 1 0 1 0 7 50 -1 -1 4.000 0 0 -1 0 0 2
	 11145 6225 11805 6225
2 1 0 1 0 7 50 -1 -1 4.000 0 0 -1 1 0 2
	1 1 1.00 60.00 120.00
	 1800 1725 1800 2415
2 1 0 1 0 7 50 -1 -1 4.000 0 0 -1 1 0 2
	1 1 1.00 60.00 120.00
	 1815 5475 1815 6135
2 1 1 1 0 7 50 -1 -1 4.000 0 0 -1 0 0 3
	 10410 3810 9255 3810 9255 4035
3 0 0 1 0 7 50 -1 -1 0.000 0 0 0 3
	 2910 3900 3255 4245 3675 4290
	 0.000 1.000 0.000
3 0 0 1 0 7 50 -1 -1 4.000 0 0 0 3
	 540 4305 1890 5010 2880 3915
	 0.000 1.000 0.000
3 0 0 1 0 7 50 -1 -1 4.000 0 0 0 3
	 8025 4740 9390 5415 10395 4710
	 0.000 1.000 0.000
3 0 0 1 0 7 50 -1 -1 4.000 0 0 0 3
	 11130 4740 11580 4890 11970 4755
	 0.000 1.000 0.000
4 0 0 50 -1 0 24 0.0000 4 285 210 1320 2430 5\001
4 0 0 50 -1 0 24 0.0000 4 270 210 3120 2430 2\001
4 0 0 50 -1 0 24 0.0000 4 285 210 5595 2430 5\001
4 0 0 50 -1 0 24 0.0000 4 270 210 3975 2430 2\001
4 0 0 50 -1 0 24 0.0000 4 270 210 1995 855 1\001
4 0 0 50 -1 0 24 0.0000 4 270 1050 15 855 b: lc 1\001
4 0 0 50 -1 0 24 0.0000 4 270 735 7920 855 lc 2:\001
4 0 0 50 -1 0 24 0.0000 4 270 300 735 2040 A\001
4 0 0 50 -1 0 24 0.0000 4 270 270 2400 2070 B\001
4 0 0 50 -1 0 24 0.0000 4 270 270 4725 2040 C\001
4 0 0 50 -1 0 24 0.0000 4 270 300 6465 2055 D\001
4 0 0 50 -1 0 24 0.0000 4 270 855 4740 1290 EJ=1\001
4 0 0 50 -1 0 24 0.0000 4 285 525 825 2910 2.5\001
4 0 0 50 -1 0 24 0.0000 4 285 525 1140 3315 3.5\001
4 0 0 50 -1 0 24 0.0000 4 285 735 3060 4035 2.15\001
4 0 0 50 -1 0 24 0.0000 4 270 735 4680 4695 0.14\001
4 0 0 50 -1 0 24 0.0000 4 270 735 885 4920 2.07\001
4 0 0 50 -1 0 24 0.0000 4 270 735 2190 4815 1.12\001
4 0 0 50 -1 0 24 0.0000 4 270 480 540 3840 M:\001
4 0 0 50 -1 32 24 0.0000 4 300 195 615 5460 d\001
4 0 0 50 -1 0 24 0.0000 4 270 480 825 5445 M:\001
4 0 0 50 -1 32 24 0.0000 4 300 735 1035 7155 1.61\001
4 0 0 50 -1 32 24 0.0000 4 300 945 2955 6840 0.715\001
4 0 0 50 -1 32 24 0.0000 4 300 945 4695 5775 0.715\001
4 0 0 50 -1 32 24 0.0000 4 300 945 8340 5400 3.125\001
4 0 0 50 -1 0 24 0.0000 4 285 735 9465 3600 2.15\001
4 0 0 50 -1 0 24 0.0000 4 285 735 11175 3615 2.15\001
4 0 0 50 -1 32 24 0.0000 4 300 735 11355 5295 0.25\001
4 0 0 50 -1 32 24 0.0000 4 300 945 9195 6720 0.715\001
4 0 0 50 -1 32 24 0.0000 4 300 735 9660 7680 1.25\001
4 0 0 50 -1 32 24 0.0000 4 300 945 11025 6825 0.715\001
4 0 0 50 -1 0 24 0.0000 4 270 615 1890 2355 v=?\001
4 0 0 50 -1 32 24 0.0000 4 300 195 1860 5790 d\001
4 0 0 50 -1 0 24 0.0000 4 270 210 2085 5805 1\001
4 0 0 50 -1 0 24 0.0000 4 270 735 8340 3855 1.07\001
