#FIG 3.2
Landscape
Center
Metric
A4      
100.00
Single
-2
1200 2
6 4410 2250 4680 2475
2 3 0 1 0 7 50 0 -1 0.000 0 0 -1 0 0 4
	 4410 2430 4545 2250 4680 2430 4410 2430
2 1 0 1 0 7 50 0 -1 0.000 0 0 -1 0 0 2
	 4410 2475 4680 2475
-6
6 6615 2250 6885 2475
2 3 0 1 0 7 50 0 -1 0.000 0 0 -1 0 0 4
	 6615 2430 6750 2250 6885 2430 6615 2430
2 1 0 1 0 7 50 0 -1 0.000 0 0 -1 0 0 2
	 6615 2475 6885 2475
-6
6 2160 4815 6795 5940
2 1 0 1 0 7 50 0 -1 0.000 0 0 -1 0 0 2
	 2205 5445 6750 5445
2 1 0 2 0 7 50 0 -1 0.000 0 0 -1 0 0 2
	 2205 5445 4500 4860
3 0 0 2 0 7 50 0 -1 0.000 0 0 0 5
	 4500 4860 5175 5670 5760 5895 6210 5850 6750 5445
	 0.000 1.000 1.000 1.000 0.000
-6
2 1 0 2 0 7 50 0 -1 0.000 0 0 -1 0 0 2
	 2250 2250 6750 2250
2 3 0 1 0 7 50 0 -1 0.000 0 0 -1 0 0 4
	 2115 2430 2250 2250 2385 2430 2115 2430
2 1 0 1 0 7 50 0 -1 0.000 0 0 -1 0 0 3
	 2250 2520 2250 2565 2250 3240
2 1 0 1 0 7 50 0 -1 0.000 0 0 -1 0 0 2
	 4545 2520 4545 3195
2 1 0 1 0 7 50 0 -1 0.000 0 0 -1 0 0 2
	 6750 2520 6750 3195
2 1 0 1 0 7 50 0 -1 0.000 0 0 -1 1 1 2
	1 1 1.00 60.00 120.00
	1 1 1.00 60.00 120.00
	 2250 3015 4545 3015
2 1 0 1 0 7 50 0 -1 0.000 0 0 -1 1 1 2
	1 1 1.00 60.00 120.00
	1 1 1.00 60.00 120.00
	 4545 3015 6750 3015
2 1 0 1 0 7 50 0 -1 0.000 0 0 -1 0 0 4
	 4545 2250 4545 1980 6750 1980 6750 2250
2 1 0 1 0 7 50 0 -1 0.000 0 0 -1 0 0 2
	 4860 1980 4860 2250
2 1 0 1 0 7 50 0 -1 0.000 0 0 -1 0 0 2
	 5175 1980 5175 2250
2 1 0 1 0 7 50 0 -1 0.000 0 0 -1 0 0 2
	 5490 1980 5490 2250
2 1 0 1 0 7 50 0 -1 0.000 0 0 -1 0 0 2
	 5805 1980 5805 2250
2 1 0 1 0 7 50 0 -1 0.000 0 0 -1 0 0 2
	 6435 1980 6435 2250
2 1 0 1 0 7 50 0 -1 0.000 0 0 -1 0 0 2
	 6120 1980 6120 2250
2 1 0 1 0 7 50 0 -1 0.000 0 0 -1 0 0 3
	 5850 1980 5940 1755 6435 1755
2 1 0 1 0 7 50 0 -1 0.000 0 0 -1 0 0 2
	 4500 4050 6750 4050
2 1 0 1 0 7 50 0 -1 0.000 0 0 -1 0 0 2
	 4500 5535 4500 6345
2 1 0 1 0 7 50 0 -1 0.000 0 0 -1 0 0 2
	 5895 5940 5895 6345
2 1 0 1 0 7 50 0 -1 0.000 0 0 -1 1 1 2
	1 1 1.00 60.00 120.00
	1 1 1.00 60.00 120.00
	 4500 6255 5895 6255
3 0 0 2 0 7 50 0 -1 0.000 0 0 0 3
	 4500 4050 5625 5085 6750 4050
	 0.000 1.000 0.000
4 0 0 50 0 1 24 0.0000 4 330 105 6075 1755 f\001
4 0 0 50 0 1 24 0.0000 4 255 90 3330 2970 l\001
4 0 0 50 0 1 24 0.0000 4 255 90 5580 2970 l\001
4 0 0 50 0 1 24 0.0000 4 270 225 2475 2610 A\001
4 0 0 50 0 1 24 0.0000 4 255 225 4770 2610 B\001
4 0 0 50 0 1 24 0.0000 4 255 240 6345 2565 C\001
4 0 0 50 0 1 24 0.0000 4 330 570 6120 4860 fl /8\001
4 0 0 50 0 1 24 0.0000 4 330 750 4770 5085 fl /16\001
4 0 0 50 0 1 24 0.0000 4 255 735 4770 6210 9l/16\001
4 0 0 50 0 1 24 0.0000 4 255 300 5040 3960 M\001
4 0 0 50 0 0 18 0.0000 4 135 135 5355 4005 o\001
4 0 0 50 0 0 18 0.0000 4 195 900 2205 4905 FINAL \001
4 0 0 50 0 0 24 0.0000 4 255 420 3285 4905 M:\001
