#FIG 3.2  Produced by xfig version 3.2.5c
Landscape
Center
Metric
A4      
100.00
Single
-2
1200 2
6 1590 1620 3630 3300
2 1 0 3 0 7 50 -1 -1 0.000 0 0 -1 0 0 2
	 1815 1800 3600 1800
2 1 0 3 0 7 50 -1 -1 0.000 0 0 -1 0 0 2
	 3615 1800 1800 3135
2 3 0 1 0 7 50 -1 -1 0.000 0 0 -1 0 0 4
	 1590 1620 1815 1785 1590 1950 1590 1620
2 3 0 1 0 7 50 -1 -1 0.000 0 0 -1 0 0 4
	 1590 2970 1815 3135 1590 3300 1590 2970
-6
6 5385 1725 7397 3525
1 3 0 1 0 7 50 -1 -1 0.000 1 0.0000 7335 1935 62 62 7335 1935 7320 1875
2 1 0 3 0 7 50 -1 -1 0.000 0 0 -1 0 0 2
	 5610 1905 7350 1890
2 1 0 3 0 7 50 -1 -1 0.000 0 0 -1 0 0 2
	 7335 1965 5595 3240
2 3 0 1 0 7 50 -1 -1 0.000 0 0 -1 0 0 4
	 5385 1725 5610 1890 5385 2055 5385 1725
2 3 0 1 0 7 50 -1 -1 0.000 0 0 -1 0 0 4
	 5385 3075 5610 3240 5385 3405 5385 3075
4 0 0 50 -1 0 24 0.0000 4 270 360 6120 3435 M\001
4 0 0 50 -1 0 24 0.0000 4 180 210 6480 3525 o\001
4 0 0 50 -1 0 24 0.0000 4 270 435 6735 3435 =0\001
-6
1 3 0 1 0 7 50 -1 -1 0.000 1 0.0000 10935 2040 62 62 10935 2040 10920 1980
1 3 0 1 0 7 50 -1 -1 0.000 1 0.0000 14475 1980 62 62 14475 1980 14460 1920
2 1 0 1 0 7 50 -1 -1 0.000 0 0 -1 0 0 2
	 1815 3570 1815 4155
2 1 0 1 0 7 50 -1 -1 0.000 0 0 -1 0 0 2
	 3615 3525 3615 4110
2 1 0 1 0 7 50 -1 -1 0.000 0 0 -1 0 0 2
	 3870 1800 4485 1800
2 1 0 1 0 7 50 -1 -1 0.000 0 0 -1 0 0 2
	 3855 3135 4470 3135
2 1 0 1 0 7 50 -1 -1 0.000 0 0 -1 1 1 2
	0 0 1.00 60.00 120.00
	0 0 1.00 60.00 120.00
	 1815 3915 3630 3915
2 1 0 1 0 7 50 -1 -1 0.000 0 0 -1 1 1 2
	0 0 1.00 60.00 120.00
	0 0 1.00 60.00 120.00
	 4290 3135 4290 1800
2 1 0 1 0 7 50 -1 -1 0.000 0 0 -1 1 0 2
	1 1 1.00 60.00 120.00
	 3615 1185 3615 1695
2 1 0 3 0 7 50 -1 -1 0.000 0 0 -1 0 0 2
	 9210 2010 10950 1995
2 1 0 3 0 7 50 -1 -1 0.000 0 0 -1 0 0 2
	 10935 2070 9195 3345
2 3 0 1 0 7 50 -1 -1 0.000 0 0 -1 0 0 4
	 8985 1830 9210 1995 8985 2160 8985 1830
2 3 0 1 0 7 50 -1 -1 0.000 0 0 -1 0 0 4
	 8985 3180 9210 3345 8985 3510 8985 3180
2 1 0 1 0 7 50 -1 -1 0.000 0 0 -1 0 0 3
	 9210 2010 10935 1575 10935 2025
2 1 0 1 0 7 50 -1 -1 0.000 0 0 -1 0 0 3
	 9225 3345 11265 2385 10950 2055
2 1 0 3 0 7 50 -1 -1 0.000 0 0 -1 0 0 2
	 12750 1950 14490 1935
2 1 0 3 0 7 50 -1 -1 0.000 0 0 -1 0 0 2
	 14475 2010 12735 3285
2 3 0 1 0 7 50 -1 -1 0.000 0 0 -1 0 0 4
	 12525 1770 12750 1935 12525 2100 12525 1770
2 3 0 1 0 7 50 -1 -1 0.000 0 0 -1 0 0 4
	 12525 3120 12750 3285 12525 3450 12525 3120
2 1 0 1 0 7 50 -1 -1 0.000 0 0 -1 0 0 4
	 12720 3285 12990 3630 14775 2325 14475 2010
2 1 0 1 0 7 50 -1 -1 0.000 0 0 -1 1 0 2
	1 1 1.00 60.00 120.00
	 7335 1275 7335 1785
3 0 0 1 0 7 50 -1 -1 0.000 0 1 0 3
	1 1 1.00 60.00 120.00
	 7185 2385 7590 2235 7665 1860
	 0.000 1.000 0.000
3 0 0 1 0 7 50 -1 -1 0.000 0 1 0 3
	1 1 1.00 60.00 120.00
	 7020 1770 7290 1515 7650 1605
	 0.000 1.000 0.000
4 0 0 50 -1 0 24 0.0000 4 270 210 2295 3870 4\001
4 0 0 50 -1 0 24 1.5708 4 270 210 4215 2610 3\001
4 0 0 50 -1 0 24 0.0000 4 270 210 3705 1575 1\001
4 0 0 50 -1 0 24 0.0000 4 270 300 7740 1920 X\001
4 0 0 50 -1 0 24 0.0000 4 270 360 9135 1380 M\001
4 0 0 50 -1 0 20 0.0000 4 225 165 9465 1500 1\001
4 0 0 50 -1 0 24 0.0000 4 270 210 11070 2100 1\001
4 0 0 50 -1 0 24 0.0000 4 270 300 12915 1560 N\001
4 0 0 50 -1 0 20 0.0000 4 225 165 13170 1680 1\001
4 0 0 50 -1 0 24 0.5236 4 285 870 13332 3268 -0.15\001
4 0 0 50 -1 0 24 0.0000 4 270 210 13545 1890 0\001
4 0 0 50 -1 0 24 0.0000 4 270 210 1845 3420 1\001
4 0 0 50 -1 0 24 0.0000 4 270 210 1710 2160 2\001
4 0 0 50 -1 0 24 0.0000 4 270 210 3420 2205 3\001
4 0 0 50 -1 0 24 0.0000 4 270 210 7335 1530 1\001
4 0 0 50 -1 0 24 0.0000 4 360 3930 4275 1215 Primary structure, LC 0\001
