#FIG 3.2
Landscape
Center
Inches
Letter  
100.00
Single
-2
1200 2
5 1 0 2 0 7 50 0 -1 0.000 0 0 1 1 2837.500 5237.500 2100 5400 2175 4875 2475 4575
	1 1 2.00 120.00 240.00
	1 1 2.00 120.00 240.00
6 1050 3525 6150 7425
1 4 0 1 0 7 50 0 -1 0.000 1 0.0000 3450 5400 75 75 3375 5400 3525 5400
2 1 0 3 0 7 50 0 -1 0.000 0 0 -1 0 0 3
	 1200 7200 1200 5400 3375 5400
2 1 0 3 0 7 50 0 -1 0.000 0 0 -1 0 0 2
	 1200 3600 6000 7200
2 3 0 1 0 7 50 0 -1 0.000 0 0 -1 0 0 4
	 1050 7425 1200 7200 1350 7425 1050 7425
2 3 0 1 0 7 50 0 -1 0.000 0 0 -1 0 0 4
	 5850 7425 6000 7200 6150 7425 5850 7425
-6
6 7425 3525 12525 7425
1 4 0 1 0 7 50 0 -1 0.000 1 0.0000 9825 5400 75 75 9750 5400 9900 5400
2 1 0 3 0 7 50 0 -1 0.000 0 0 -1 0 0 3
	 7575 7200 7575 5400 9750 5400
2 1 0 3 0 7 50 0 -1 0.000 0 0 -1 0 0 2
	 7575 3600 12375 7200
2 3 0 1 0 7 50 0 -1 0.000 0 0 -1 0 0 4
	 7425 7425 7575 7200 7725 7425 7425 7425
2 3 0 1 0 7 50 0 -1 0.000 0 0 -1 0 0 4
	 12225 7425 12375 7200 12525 7425 12225 7425
-6
6 12825 3525 17925 7425
1 4 0 1 0 7 50 0 -1 0.000 1 0.0000 15225 5400 75 75 15150 5400 15300 5400
2 1 0 3 0 7 50 0 -1 0.000 0 0 -1 0 0 3
	 12975 7200 12975 5400 15150 5400
2 1 0 3 0 7 50 0 -1 0.000 0 0 -1 0 0 2
	 12975 3600 17775 7200
2 3 0 1 0 7 50 0 -1 0.000 0 0 -1 0 0 4
	 12825 7425 12975 7200 13125 7425 12825 7425
2 3 0 1 0 7 50 0 -1 0.000 0 0 -1 0 0 4
	 17625 7425 17775 7200 17925 7425 17625 7425
-6
6 1050 9450 6150 13350
1 4 0 1 0 7 50 0 -1 0.000 1 0.0000 3450 11325 75 75 3375 11325 3525 11325
2 1 0 3 0 7 50 0 -1 0.000 0 0 -1 0 0 3
	 1200 13125 1200 11325 3375 11325
2 1 0 3 0 7 50 0 -1 0.000 0 0 -1 0 0 2
	 1200 9525 6000 13125
2 3 0 1 0 7 50 0 -1 0.000 0 0 -1 0 0 4
	 1050 13350 1200 13125 1350 13350 1050 13350
2 3 0 1 0 7 50 0 -1 0.000 0 0 -1 0 0 4
	 5850 13350 6000 13125 6150 13350 5850 13350
-6
6 7425 9450 12525 13350
1 4 0 1 0 7 50 0 -1 0.000 1 0.0000 9825 11325 75 75 9750 11325 9900 11325
2 1 0 3 0 7 50 0 -1 0.000 0 0 -1 0 0 3
	 7575 13125 7575 11325 9750 11325
2 1 0 3 0 7 50 0 -1 0.000 0 0 -1 0 0 2
	 7575 9525 12375 13125
2 3 0 1 0 7 50 0 -1 0.000 0 0 -1 0 0 4
	 7425 13350 7575 13125 7725 13350 7425 13350
2 3 0 1 0 7 50 0 -1 0.000 0 0 -1 0 0 4
	 12225 13350 12375 13125 12525 13350 12225 13350
-6
6 13350 9450 18450 13350
1 4 0 1 0 7 50 0 -1 0.000 1 0.0000 15750 11325 75 75 15675 11325 15825 11325
2 1 0 3 0 7 50 0 -1 0.000 0 0 -1 0 0 3
	 13500 13125 13500 11325 15675 11325
2 1 0 3 0 7 50 0 -1 0.000 0 0 -1 0 0 2
	 13500 9525 18300 13125
2 3 0 1 0 7 50 0 -1 0.000 0 0 -1 0 0 4
	 13350 13350 13500 13125 13650 13350 13350 13350
2 3 0 1 0 7 50 0 -1 0.000 0 0 -1 0 0 4
	 18150 13350 18300 13125 18450 13350 18150 13350
-6
6 7425 14025 12525 17925
1 4 0 1 0 7 50 0 -1 0.000 1 0.0000 9825 15900 75 75 9750 15900 9900 15900
2 1 0 3 0 7 50 0 -1 0.000 0 0 -1 0 0 3
	 7575 17700 7575 15900 9750 15900
2 1 0 3 0 7 50 0 -1 0.000 0 0 -1 0 0 2
	 7575 14100 12375 17700
2 3 0 1 0 7 50 0 -1 0.000 0 0 -1 0 0 4
	 7425 17925 7575 17700 7725 17925 7425 17925
2 3 0 1 0 7 50 0 -1 0.000 0 0 -1 0 0 4
	 12225 17925 12375 17700 12525 17925 12225 17925
-6
6 13575 14025 18675 17925
1 4 0 1 0 7 50 0 -1 0.000 1 0.0000 15975 15900 75 75 15900 15900 16050 15900
2 1 0 3 0 7 50 0 -1 0.000 0 0 -1 0 0 3
	 13725 17700 13725 15900 15900 15900
2 1 0 3 0 7 50 0 -1 0.000 0 0 -1 0 0 2
	 13725 14100 18525 17700
2 3 0 1 0 7 50 0 -1 0.000 0 0 -1 0 0 4
	 13575 17925 13725 17700 13875 17925 13575 17925
2 3 0 1 0 7 50 0 -1 0.000 0 0 -1 0 0 4
	 18375 17925 18525 17700 18675 17925 18375 17925
-6
6 1125 14025 6225 17925
1 4 0 1 0 7 50 0 -1 0.000 1 0.0000 3525 15900 75 75 3450 15900 3600 15900
2 1 0 3 0 7 50 0 -1 0.000 0 0 -1 0 0 3
	 1275 17700 1275 15900 3450 15900
2 1 0 3 0 7 50 0 -1 0.000 0 0 -1 0 0 2
	 1275 14100 6075 17700
2 3 0 1 0 7 50 0 -1 0.000 0 0 -1 0 0 4
	 1125 17925 1275 17700 1425 17925 1125 17925
2 3 0 1 0 7 50 0 -1 0.000 0 0 -1 0 0 4
	 5925 17925 6075 17700 6225 17925 5925 17925
-6
6 9900 14175 10500 14475
4 0 0 50 0 0 24 0.0000 4 255 360 10125 14475 N:\001
4 0 0 50 0 32 24 0.0000 4 270 180 9900 14475 d\001
-6
6 15000 14100 15600 14400
4 0 0 50 0 0 24 0.0000 4 255 360 15225 14400 N:\001
4 0 0 50 0 32 24 0.0000 4 270 180 15000 14400 d\001
-6
2 1 0 1 0 7 50 0 -1 0.000 0 0 -1 0 0 2
	 1200 7500 1200 7950
2 1 0 1 0 7 50 0 -1 0.000 0 0 -1 0 0 2
	 3600 7500 3600 7950
2 1 0 1 0 7 50 0 -1 0.000 0 0 -1 0 0 2
	 6000 7500 6000 7950
2 1 0 1 0 7 50 0 -1 0.000 0 0 -1 0 0 2
	 5025 3600 6675 3600
2 1 0 1 0 7 50 0 -1 0.000 0 0 -1 0 0 2
	 6150 7200 6750 7200
2 1 0 1 0 7 50 0 -1 0.000 0 0 -1 1 1 2
	1 1 1.00 60.00 120.00
	1 1 1.00 60.00 120.00
	 1200 7875 3600 7875
2 1 0 1 0 7 50 0 -1 0.000 0 0 -1 1 1 2
	1 1 1.00 60.00 120.00
	1 1 1.00 60.00 120.00
	 3600 7875 6000 7875
2 1 0 1 0 7 50 0 -1 0.000 0 0 -1 0 0 2
	 5250 5400 6750 5400
2 1 0 1 0 7 50 0 -1 0.000 0 0 -1 1 1 2
	1 1 1.00 60.00 120.00
	1 1 1.00 60.00 120.00
	 6600 7200 6600 5400
2 1 0 1 0 7 50 0 -1 0.000 0 0 -1 1 1 2
	1 1 1.00 60.00 120.00
	1 1 1.00 60.00 120.00
	 6600 5400 6600 3600
2 2 0 1 0 7 50 0 50 0.000 0 0 -1 0 0 5
	 1200 3525 6000 3525 6000 3225 1200 3225 1200 3525
2 1 0 2 0 7 50 0 50 0.000 0 0 -1 1 0 2
	1 1 2.00 120.00 240.00
	 1200 3825 1200 4575
2 1 0 1 0 7 50 0 -1 0.000 0 0 -1 0 0 3
	 3150 3225 3525 3075 4200 3075
2 1 0 2 0 7 50 0 -1 0.000 0 0 -1 0 1 2
	1 1 2.00 120.00 240.00
	 10938 5991 11163 5691
2 1 0 2 0 7 50 0 -1 0.000 0 0 -1 0 1 2
	1 1 2.00 120.00 240.00
	 10812 6159 10587 6459
2 1 0 1 0 7 50 0 -1 0.000 0 0 -1 0 0 2
	 7650 3525 12450 7125
2 1 0 1 0 7 50 0 -1 0.000 0 0 -1 0 0 2
	 7500 3675 9600 5250
2 1 0 1 0 7 50 0 -1 0.000 0 0 -1 0 0 2
	 9900 5475 12300 7275
2 1 0 2 0 7 50 0 -1 0.000 0 0 -1 0 0 2
	 13125 7200 13650 7200
2 1 0 2 0 7 50 0 -1 0.000 0 0 -1 0 0 2
	 13125 7650 13650 7650
2 1 0 2 0 7 50 0 -1 0.000 0 0 -1 1 0 2
	1 1 2.00 120.00 240.00
	 13500 7200 13500 7650
2 1 0 2 0 7 50 0 -1 0.000 0 0 -1 0 0 3
	 1200 11325 1200 10425 3375 11250
2 1 0 2 0 7 50 0 -1 0.000 0 0 -1 0 0 1
	 1800 11625
2 1 0 2 0 7 50 0 -1 0.000 0 0 -1 0 0 3
	 1200 11325 375 11325 1200 13125
2 1 0 2 0 7 50 0 -1 0.000 0 0 -1 0 0 2
	 3525 11250 3825 10875
2 1 0 2 0 7 50 0 -1 0.000 0 0 -1 0 0 3
	 7575 9525 10050 11025 12375 13125
2 1 0 2 0 7 50 0 -1 0.000 0 0 -1 0 0 3
	 7575 11325 7575 11025 9825 11325
2 1 0 2 0 7 50 0 -1 0.000 0 0 -1 0 0 3
	 7575 11325 7275 11325 7575 13125
2 1 0 2 0 7 50 0 -1 0.000 0 0 -1 0 0 3
	 15675 11400 15600 11475 18300 13125
2 1 0 2 0 7 50 0 -1 0.000 0 0 -1 0 0 3
	 15750 11400 15750 11550 13500 11550
2 1 0 2 0 7 50 0 -1 0.000 0 0 -1 0 0 2
	 13800 11325 13500 13125
2 1 0 2 0 7 50 0 -1 0.000 0 0 -1 0 0 3
	 1275 17700 1800 17700 1800 15900
2 1 0 2 0 7 50 0 -1 0.000 0 0 -1 0 0 3
	 1275 16500 3525 16500 3525 15975
2 1 0 2 0 7 50 0 -1 0.000 0 0 -1 0 0 3
	 7575 14100 7500 14250 9750 15900
2 1 0 2 0 7 50 0 -1 0.000 0 0 -1 0 0 3
	 9750 15975 9750 16050 12300 17925
2 1 0 2 0 7 50 0 -1 0.000 0 0 -1 0 0 3
	 7575 16125 9825 16125 9825 15975
2 1 0 2 0 7 50 0 -1 0.000 0 0 -1 0 0 3
	 7800 15900 7800 17700 7575 17700
2 1 0 2 0 7 50 0 -1 0.000 0 0 -1 0 0 3
	 13725 16125 15975 16125 15975 15975
2 1 0 2 0 7 50 0 -1 0.000 0 0 -1 0 0 2
	 15900 15975 18450 17850
2 1 0 2 0 7 50 0 -1 0.000 0 0 -1 0 0 4
	 6075 17700 6525 17025 3900 15375 3600 15825
2 1 0 2 0 7 50 0 -1 0.000 0 0 -1 0 0 2
	 3750 15525 1275 14100
3 0 0 2 0 7 50 0 -1 0.000 0 0 0 3
	 1200 9525 2475 10275 3825 10875
	 0.000 1.000 0.000
3 0 0 2 0 7 50 0 -1 0.000 0 0 0 3
	 6000 13125 4650 11925 3825 10875
	 0.000 1.000 0.000
4 0 0 50 0 0 24 0.0000 4 255 180 2100 7800 4\001
4 0 0 50 0 0 24 0.0000 4 255 180 4575 7800 4\001
4 0 0 50 0 0 24 1.5708 4 255 180 6525 6525 3\001
4 0 0 50 0 0 24 1.5708 4 255 180 6525 4575 3\001
4 0 0 50 0 0 24 0.0000 4 255 540 1350 4575 v=?\001
4 0 0 50 0 32 24 0.0000 4 195 240 2325 5250 a\001
4 0 0 50 0 0 24 0.0000 4 255 375 2625 5250 =?\001
4 0 0 50 0 0 24 0.0000 4 255 495 3600 3075 f=1\001
4 0 0 50 0 0 32 0.0000 4 330 930 1350 3150 LC1:\001
4 0 0 50 0 0 32 0.0000 4 330 930 8250 3225 LC2:\001
4 0 0 50 0 0 32 0.0000 4 330 1290 11025 5550 t=40 C\001
4 0 0 50 0 32 32 0.0000 4 330 285 10725 5550 D\001
4 0 0 50 0 32 24 0.0000 4 195 195 11850 5325 o\001
4 0 0 50 0 0 32 0.0000 4 330 930 13425 3300 LC3:\001
4 0 0 50 0 0 24 0.0000 4 255 990 13725 7575 s=0.01\001
4 0 0 50 0 0 24 0.0000 4 255 2280 1200 8850 ACTUAL LC 1\001
4 0 0 50 0 0 24 0.0000 4 330 2715 7575 8850 VIRTUAL LC (v):\001
4 0 0 50 0 0 24 0.0000 4 255 420 3525 10125 M:\001
4 0 0 50 0 0 24 0.0000 4 255 180 4050 11025 8\001
4 0 0 50 0 0 24 0.0000 4 255 360 675 11025 16\001
4 0 0 50 0 0 24 0.0000 4 255 180 10200 11100 4\001
4 0 0 50 0 0 24 0.0000 4 255 180 7275 11250 4\001
4 0 0 50 0 0 24 0.0000 4 255 180 15525 11850 1\001
4 0 0 50 0 0 24 0.0000 4 255 180 13575 11250 1\001
4 0 0 50 0 0 24 0.0000 4 255 180 13200 11700 1\001
4 0 0 50 0 0 24 0.0000 4 330 2340 12975 8925 VIRTUAL LC (\001
4 0 0 50 0 32 24 0.0000 4 195 240 15300 8925 a\001
4 0 0 50 0 0 24 0.0000 4 330 210 15525 8925 ):\001
4 0 0 50 0 0 24 0.0000 4 255 420 9375 9975 M:\001
4 0 0 50 0 0 24 0.0000 4 255 420 15300 9975 M:\001
4 0 0 50 0 32 24 0.0000 4 270 180 15075 9975 d\001
4 0 0 50 0 32 24 0.0000 4 270 180 9150 9975 d\001
4 0 0 50 0 0 24 0.0000 4 255 360 3300 14625 N:\001
4 0 0 50 0 0 24 0.0000 4 255 390 1875 17775 -4\001
4 0 0 50 0 0 24 0.0000 4 255 390 1575 15825 -4\001
4 0 0 50 0 0 24 0.0000 4 255 840 375 16650 -5.33\001
4 0 0 50 0 0 24 0.0000 4 255 840 3150 16800 -5.33\001
4 0 0 50 0 0 24 0.0000 4 255 390 7950 17775 -1\001
4 0 0 50 0 0 24 0.0000 4 255 390 7200 16200 -1\001
4 0 0 50 0 0 24 0.0000 4 255 660 6825 14550 -0.6\001
4 0 0 50 0 0 24 0.0000 4 255 840 10950 17925 -1.07\001
4 0 0 50 0 0 24 0.0000 4 255 840 9150 16425 -1.07\001
4 0 0 50 0 0 24 0.0000 4 255 390 10275 16125 -1\001
4 0 0 50 0 0 24 0.0000 4 255 390 7500 15750 -1\001
4 0 0 50 0 0 24 0.0000 4 255 840 14250 16500 -0.33\001
4 0 0 50 0 0 24 0.0000 4 255 1020 17175 17700 -0.267\001
4 0 0 50 0 0 24 0.0000 4 255 660 3750 15900 -2.4\001
4 0 0 50 0 0 24 0.0000 4 255 840 6075 16800 -6.67\001
4 0 0 50 0 0 24 0.0000 4 255 840 3750 15375 -4.26\001
