#FIG 3.2
Landscape
Center
Metric
A4      
100.00
Single
-2
1200 2
6 4320 2250 4680 2610
2 3 0 1 0 7 50 0 -1 4.000 0 0 -1 0 0 4
	 4320 2520 4500 2250 4680 2520 4320 2520
2 1 0 1 0 7 50 0 -1 4.000 0 0 -1 0 0 2
	 4320 2610 4680 2610
-6
6 8820 2250 9180 2610
2 3 0 1 0 7 50 0 -1 4.000 0 0 -1 0 0 4
	 8820 2520 9000 2250 9180 2520 8820 2520
2 1 0 1 0 7 50 0 -1 4.000 0 0 -1 0 0 2
	 8820 2610 9180 2610
-6
6 6570 2250 6930 2610
6 6570 2250 6930 2610
6 6570 2250 6930 2610
2 3 0 1 0 7 50 0 -1 4.000 0 0 -1 0 0 4
	 6570 2520 6750 2250 6930 2520 6570 2520
2 1 0 1 0 7 50 0 -1 4.000 0 0 -1 0 0 2
	 6570 2610 6930 2610
-6
-6
-6
6 7020 1890 7425 2250
2 1 0 1 0 7 50 0 -1 4.000 0 0 -1 1 0 2
	1 1 1.00 60.00 120.00
	 7065 1890 7065 2250
2 1 0 1 0 7 50 0 -1 4.000 0 0 -1 1 0 2
	1 1 1.00 60.00 120.00
	 7380 1890 7380 2250
-6
6 8325 1890 8730 2250
2 1 0 1 0 7 50 0 -1 4.000 0 0 -1 1 0 2
	1 1 1.00 60.00 120.00
	 8370 1890 8370 2250
2 1 0 1 0 7 50 0 -1 4.000 0 0 -1 1 0 2
	1 1 1.00 60.00 120.00
	 8685 1890 8685 2250
-6
6 7695 1890 8100 2250
2 1 0 1 0 7 50 0 -1 4.000 0 0 -1 1 0 2
	1 1 1.00 60.00 120.00
	 7740 1890 7740 2250
2 1 0 1 0 7 50 0 -1 4.000 0 0 -1 1 0 2
	1 1 1.00 60.00 120.00
	 8055 1890 8055 2250
-6
6 6570 2700 6930 3060
6 6570 2700 6930 3060
6 6570 2700 6930 3060
2 3 0 1 0 7 50 0 -1 4.000 0 0 -1 0 0 4
	 6570 2970 6750 2700 6930 2970 6570 2970
2 1 0 1 0 7 50 0 -1 4.000 0 0 -1 0 0 2
	 6570 3060 6930 3060
-6
-6
-6
2 1 0 3 0 7 50 0 -1 8.000 0 0 -1 0 0 2
	 2250 2250 9000 2250
2 3 0 1 0 7 50 0 -1 4.000 0 0 -1 0 0 4
	 2070 2520 2250 2250 2430 2520 2070 2520
2 1 0 1 0 7 50 0 -1 4.000 0 0 -1 0 0 2
	 2250 2610 2250 3285
2 1 0 1 0 7 50 0 -1 4.000 0 0 -1 0 0 2
	 4500 2655 4500 3330
2 1 0 1 0 7 50 0 -1 4.000 0 0 -1 0 0 2
	 6750 2655 6750 3330
2 1 0 1 0 7 50 0 -1 4.000 0 0 -1 0 0 2
	 9000 2655 9000 3330
2 1 0 1 0 7 50 0 -1 4.000 0 0 -1 1 1 2
	1 1 1.00 60.00 120.00
	1 1 1.00 60.00 120.00
	 2250 3150 4500 3150
2 1 0 1 0 7 50 0 -1 4.000 0 0 -1 1 1 2
	1 1 1.00 60.00 120.00
	1 1 1.00 60.00 120.00
	 4500 3150 6750 3150
2 1 0 1 0 7 50 0 -1 4.000 0 0 -1 1 1 2
	1 1 1.00 60.00 120.00
	1 1 1.00 60.00 120.00
	 6750 3150 9000 3150
2 1 0 1 0 7 50 0 -1 4.000 0 0 -1 1 1 4
	1 1 1.00 60.00 120.00
	1 1 1.00 60.00 120.00
	 6750 2250 6750 1890 9000 1890 9000 2250
2 1 0 1 0 7 50 0 -1 4.000 0 0 -1 0 0 3
	 7470 1890 7695 1620 8235 1620
2 1 0 1 0 7 50 0 -1 4.000 0 0 -1 0 0 2
	 6750 2700 7650 2700
2 1 0 1 0 7 50 0 -1 4.000 0 0 -1 1 0 2
	1 1 1.00 60.00 120.00
	 7470 2250 7470 2700
4 0 0 50 0 0 26 0.0000 4 270 390 7785 1575 15\001
4 0 0 50 0 0 26 0.0000 4 270 390 3195 3105 10\001
4 0 0 50 0 0 26 0.0000 4 270 390 5355 3105 10\001
4 0 0 50 0 0 26 0.0000 4 270 390 7650 3105 10\001
4 0 0 50 0 0 26 0.0000 4 270 270 2520 2700 A\001
4 0 0 50 0 0 26 0.0000 4 270 255 4860 2745 B\001
4 0 0 50 0 0 26 0.0000 4 270 255 7020 2700 C\001
4 0 0 50 0 0 26 0.0000 4 270 270 8550 2700 D\001
4 0 0 50 0 1 24 0.0000 4 255 1020 7560 2610 s=0.01\001
