#FIG 3.2  Produced by xfig version 3.2.5c
Landscape
Center
Metric
A4      
100.00
Single
-2
1200 2
6 -270 3555 270 3735
2 1 0 3 0 7 50 -1 -1 8.000 0 0 -1 0 0 2
	 -225 3600 225 3600
2 1 0 1 0 7 50 -1 -1 4.000 0 0 -1 0 0 2
	 -180 3735 -90 3600
2 1 0 1 0 7 50 -1 -1 4.000 0 0 -1 0 0 2
	 -90 3735 0 3600
2 1 0 1 0 7 50 -1 -1 4.000 0 0 -1 0 0 2
	 45 3735 135 3600
-6
6 6030 1575 6390 1890
4 0 0 50 -1 0 20 0.0000 4 225 240 6030 1800 X\001
4 0 0 50 -1 0 16 0.0000 4 180 135 6255 1890 1\001
-6
6 5805 945 6165 1260
4 0 0 50 -1 0 20 0.0000 4 225 240 5805 1170 X\001
4 0 0 50 -1 0 16 0.0000 4 180 135 6030 1260 2\001
-6
6 4995 1350 5355 1620
4 0 0 50 -1 0 20 0.0000 4 225 240 4995 1575 X\001
4 0 0 50 -1 0 16 0.0000 4 180 135 5220 1620 3\001
-6
6 6165 1260 6525 1530
4 0 0 50 -1 0 20 0.0000 4 225 240 6165 1485 X\001
4 0 0 50 -1 0 16 0.0000 4 180 135 6390 1530 3\001
-6
6 4005 1755 7335 3735
6 4005 3555 4545 3735
2 1 0 3 0 7 50 -1 -1 8.000 0 0 -1 0 0 2
	 4050 3600 4500 3600
2 1 0 1 0 7 50 -1 -1 4.000 0 0 -1 0 0 2
	 4095 3735 4185 3600
2 1 0 1 0 7 50 -1 -1 4.000 0 0 -1 0 0 2
	 4185 3735 4275 3600
2 1 0 1 0 7 50 -1 -1 4.000 0 0 -1 0 0 2
	 4320 3735 4410 3600
-6
6 6795 3555 7335 3735
2 1 0 3 0 7 50 -1 -1 8.000 0 0 -1 0 0 2
	 6840 3600 7290 3600
2 1 0 1 0 7 50 -1 -1 4.000 0 0 -1 0 0 2
	 6885 3735 6975 3600
2 1 0 1 0 7 50 -1 -1 4.000 0 0 -1 0 0 2
	 6975 3735 7065 3600
2 1 0 1 0 7 50 -1 -1 4.000 0 0 -1 0 0 2
	 7110 3735 7200 3600
-6
6 5040 1890 5400 2205
4 0 0 50 -1 0 20 0.0000 4 225 240 5040 2115 X\001
4 0 0 50 -1 0 16 0.0000 4 180 135 5265 2205 1\001
-6
6 5265 2295 5625 2610
4 0 0 50 -1 0 20 0.0000 4 225 240 5265 2520 X\001
4 0 0 50 -1 0 16 0.0000 4 180 135 5490 2610 2\001
-6
2 1 0 3 0 7 50 -1 -1 8.000 0 0 -1 0 0 3
	 4275 3600 4275 1800 5625 1800
2 1 0 3 0 7 50 -1 -1 8.000 0 0 -1 0 0 3
	 4275 3600 4275 1800 5625 1800
2 1 0 3 0 7 50 -1 -1 8.000 0 0 -1 0 0 2
	 4275 3600 4275 1800
2 1 0 3 0 7 50 -1 -1 8.000 0 0 -1 0 0 3
	 7065 3600 7065 1800 5715 1800
2 1 0 1 0 7 50 -1 -1 0.000 0 0 -1 1 0 2
	1 1 1.00 60.00 120.00
	 5805 1935 5310 1935
2 1 0 1 0 7 50 -1 -1 0.000 0 0 -1 1 0 2
	1 1 1.00 60.00 120.00
	 5580 1845 5580 2340
-6
6 7965 3555 8505 3735
2 1 0 3 0 7 50 -1 -1 8.000 0 0 -1 0 0 2
	 8010 3600 8460 3600
2 1 0 1 0 7 50 -1 -1 4.000 0 0 -1 0 0 2
	 8055 3735 8145 3600
2 1 0 1 0 7 50 -1 -1 4.000 0 0 -1 0 0 2
	 8145 3735 8235 3600
2 1 0 1 0 7 50 -1 -1 4.000 0 0 -1 0 0 2
	 8280 3735 8370 3600
-6
6 10755 3555 11295 3735
2 1 0 3 0 7 50 -1 -1 8.000 0 0 -1 0 0 2
	 10800 3600 11250 3600
2 1 0 1 0 7 50 -1 -1 4.000 0 0 -1 0 0 2
	 10845 3735 10935 3600
2 1 0 1 0 7 50 -1 -1 4.000 0 0 -1 0 0 2
	 10935 3735 11025 3600
2 1 0 1 0 7 50 -1 -1 4.000 0 0 -1 0 0 2
	 11070 3735 11160 3600
-6
6 -360 5085 2970 7065
6 -360 6885 180 7065
2 1 0 3 0 7 50 -1 -1 8.000 0 0 -1 0 0 2
	 -315 6930 135 6930
2 1 0 1 0 7 50 -1 -1 4.000 0 0 -1 0 0 2
	 -270 7065 -180 6930
2 1 0 1 0 7 50 -1 -1 4.000 0 0 -1 0 0 2
	 -180 7065 -90 6930
2 1 0 1 0 7 50 -1 -1 4.000 0 0 -1 0 0 2
	 -45 7065 45 6930
-6
6 2430 6885 2970 7065
2 1 0 3 0 7 50 -1 -1 8.000 0 0 -1 0 0 2
	 2475 6930 2925 6930
2 1 0 1 0 7 50 -1 -1 4.000 0 0 -1 0 0 2
	 2520 7065 2610 6930
2 1 0 1 0 7 50 -1 -1 4.000 0 0 -1 0 0 2
	 2610 7065 2700 6930
2 1 0 1 0 7 50 -1 -1 4.000 0 0 -1 0 0 2
	 2745 7065 2835 6930
-6
2 1 0 3 0 7 50 -1 -1 8.000 0 0 -1 0 0 3
	 -90 6930 -90 5130 1260 5130
2 1 0 3 0 7 50 -1 -1 8.000 0 0 -1 0 0 3
	 -90 6930 -90 5130 1260 5130
2 1 0 3 0 7 50 -1 -1 8.000 0 0 -1 0 0 2
	 -90 6930 -90 5130
2 1 0 3 0 7 50 -1 -1 8.000 0 0 -1 0 0 3
	 2700 6930 2700 5130 1350 5130
-6
6 3960 5085 7290 7065
6 3960 6885 4500 7065
2 1 0 3 0 7 50 -1 -1 8.000 0 0 -1 0 0 2
	 4005 6930 4455 6930
2 1 0 1 0 7 50 -1 -1 4.000 0 0 -1 0 0 2
	 4050 7065 4140 6930
2 1 0 1 0 7 50 -1 -1 4.000 0 0 -1 0 0 2
	 4140 7065 4230 6930
2 1 0 1 0 7 50 -1 -1 4.000 0 0 -1 0 0 2
	 4275 7065 4365 6930
-6
6 6750 6885 7290 7065
2 1 0 3 0 7 50 -1 -1 8.000 0 0 -1 0 0 2
	 6795 6930 7245 6930
2 1 0 1 0 7 50 -1 -1 4.000 0 0 -1 0 0 2
	 6840 7065 6930 6930
2 1 0 1 0 7 50 -1 -1 4.000 0 0 -1 0 0 2
	 6930 7065 7020 6930
2 1 0 1 0 7 50 -1 -1 4.000 0 0 -1 0 0 2
	 7065 7065 7155 6930
-6
2 1 0 3 0 7 50 -1 -1 8.000 0 0 -1 0 0 3
	 4230 6930 4230 5130 5580 5130
2 1 0 3 0 7 50 -1 -1 8.000 0 0 -1 0 0 3
	 4230 6930 4230 5130 5580 5130
2 1 0 3 0 7 50 -1 -1 8.000 0 0 -1 0 0 2
	 4230 6930 4230 5130
2 1 0 3 0 7 50 -1 -1 8.000 0 0 -1 0 0 3
	 7020 6930 7020 5130 5670 5130
-6
6 7965 5040 11295 7020
6 7965 6840 8505 7020
2 1 0 3 0 7 50 -1 -1 8.000 0 0 -1 0 0 2
	 8010 6885 8460 6885
2 1 0 1 0 7 50 -1 -1 4.000 0 0 -1 0 0 2
	 8055 7020 8145 6885
2 1 0 1 0 7 50 -1 -1 4.000 0 0 -1 0 0 2
	 8145 7020 8235 6885
2 1 0 1 0 7 50 -1 -1 4.000 0 0 -1 0 0 2
	 8280 7020 8370 6885
-6
6 10755 6840 11295 7020
2 1 0 3 0 7 50 -1 -1 8.000 0 0 -1 0 0 2
	 10800 6885 11250 6885
2 1 0 1 0 7 50 -1 -1 4.000 0 0 -1 0 0 2
	 10845 7020 10935 6885
2 1 0 1 0 7 50 -1 -1 4.000 0 0 -1 0 0 2
	 10935 7020 11025 6885
2 1 0 1 0 7 50 -1 -1 4.000 0 0 -1 0 0 2
	 11070 7020 11160 6885
-6
2 1 0 3 0 7 50 -1 -1 8.000 0 0 -1 0 0 3
	 8235 6885 8235 5085 9585 5085
2 1 0 3 0 7 50 -1 -1 8.000 0 0 -1 0 0 3
	 8235 6885 8235 5085 9585 5085
2 1 0 3 0 7 50 -1 -1 8.000 0 0 -1 0 0 2
	 8235 6885 8235 5085
2 1 0 3 0 7 50 -1 -1 8.000 0 0 -1 0 0 3
	 11025 6885 11025 5085 9675 5085
-6
6 3945 9390 4485 9570
2 1 0 3 0 7 50 -1 -1 8.000 0 0 -1 0 0 2
	 3990 9435 4440 9435
2 1 0 1 0 7 50 -1 -1 4.000 0 0 -1 0 0 2
	 4035 9570 4125 9435
2 1 0 1 0 7 50 -1 -1 4.000 0 0 -1 0 0 2
	 4125 9570 4215 9435
2 1 0 1 0 7 50 -1 -1 4.000 0 0 -1 0 0 2
	 4260 9570 4350 9435
-6
6 6675 9390 7215 9570
2 1 0 3 0 7 50 -1 -1 8.000 0 0 -1 0 0 2
	 6720 9435 7170 9435
2 1 0 1 0 7 50 -1 -1 4.000 0 0 -1 0 0 2
	 6765 9570 6855 9435
2 1 0 1 0 7 50 -1 -1 4.000 0 0 -1 0 0 2
	 6855 9570 6945 9435
2 1 0 1 0 7 50 -1 -1 4.000 0 0 -1 0 0 2
	 6990 9570 7080 9435
-6
2 1 0 3 0 7 50 -1 -1 8.000 0 0 -1 0 0 4
	 0 3600 0 1800 2700 1800 2700 3615
2 1 0 3 0 7 50 -1 -1 8.000 0 0 -1 0 0 2
	 2475 3600 2925 3600
2 1 0 1 0 7 50 -1 -1 4.000 0 0 -1 0 0 2
	 2520 3735 2610 3600
2 1 0 1 0 7 50 -1 -1 4.000 0 0 -1 0 0 2
	 2655 3735 2745 3600
2 1 0 1 0 7 50 -1 -1 4.000 0 0 -1 0 0 2
	 2835 3735 2925 3600
2 1 0 1 0 7 50 -1 -1 4.000 0 0 -1 0 0 2
	 0 3870 0 4455
2 1 0 1 0 7 50 -1 -1 4.000 0 0 -1 0 0 2
	 2700 3960 2700 4545
2 1 0 1 0 7 50 -1 -1 4.000 0 0 -1 0 0 2
	 3015 1800 3510 1800
2 1 0 1 0 7 50 -1 -1 4.000 0 0 -1 0 0 2
	 3060 3600 3555 3600
2 1 0 1 0 7 50 -1 -1 4.000 0 0 -1 1 1 2
	1 1 1.00 60.00 120.00
	1 1 1.00 60.00 120.00
	 0 4320 2655 4320
2 1 0 1 0 7 50 -1 -1 4.000 0 0 -1 1 1 2
	1 1 1.00 60.00 120.00
	1 1 1.00 60.00 120.00
	 3420 3600 3420 1800
2 1 0 1 0 7 50 -1 -1 4.000 0 0 -1 1 0 2
	1 1 1.00 60.00 120.00
	 -540 1800 -90 1800
2 1 0 1 0 7 50 -1 -1 0.000 0 0 -1 1 0 2
	1 1 1.00 60.00 120.00
	 5535 1665 6030 1665
2 1 0 1 0 7 50 -1 -1 0.000 0 0 -1 1 0 2
	1 1 1.00 60.00 120.00
	 5760 1755 5760 1260
2 1 0 3 0 7 50 -1 -1 8.000 0 0 -1 0 0 3
	 8235 3600 8235 1800 9585 1800
2 1 0 3 0 7 50 -1 -1 8.000 0 0 -1 0 0 3
	 8235 3600 8235 1800 9585 1800
2 1 0 3 0 7 50 -1 -1 8.000 0 0 -1 0 0 2
	 8235 3600 8235 1800
2 1 0 3 0 7 50 -1 -1 8.000 0 0 -1 0 0 3
	 11025 3600 11025 1800 9675 1800
2 1 0 1 0 7 50 -1 -1 0.000 0 0 -1 1 0 2
	1 1 1.00 60.00 120.00
	 9765 1935 9270 1935
2 1 0 1 0 7 50 -1 -1 0.000 0 0 -1 1 0 2
	1 1 1.00 60.00 120.00
	 9540 1665 10035 1665
2 1 0 1 0 7 50 -1 -1 0.000 0 0 -1 0 0 3
	 8235 1800 7920 3600 8235 3600
2 1 0 1 0 7 50 -1 -1 0.000 0 0 -1 0 0 3
	 11041 1789 11356 3589 11041 3589
2 1 0 1 0 7 50 -1 -1 0.000 0 0 -1 1 0 2
	1 1 1.00 60.00 120.00
	 5535 5220 5535 5625
2 1 0 1 0 7 50 -1 -1 0.000 0 0 -1 1 0 2
	1 1 1.00 60.00 120.00
	 5670 5040 5670 4635
2 1 0 1 0 7 50 -1 -1 4.000 0 0 -1 1 0 2
	1 1 1.00 60.00 120.00
	 -630 5175 -180 5175
2 1 0 1 0 7 50 -1 -1 0.000 0 0 -1 1 0 3
	1 1 1.00 60.00 120.00
	 -90 5130 -585 6930 -90 6930
2 1 0 1 0 7 50 -1 -1 0.000 0 0 -1 0 0 3
	 5565 5130 4215 4740 4215 5160
2 1 0 1 0 7 50 -1 -1 0.000 0 0 -1 0 0 4
	 4245 5160 3810 5160 3810 6900 4230 6885
2 1 0 1 0 7 50 -1 -1 0.000 0 0 -1 0 0 3
	 5649 5134 6999 5524 6999 5104
2 1 0 1 0 7 50 -1 -1 0.000 0 0 -1 0 0 4
	 7005 5160 6570 5160 6570 6900 6990 6885
2 1 0 1 0 7 50 -1 -1 0.000 0 0 -1 0 0 3
	 9585 5100 9585 5415 8235 5415
2 1 0 1 0 7 50 -1 -1 0.000 0 0 -1 0 0 3
	 8625 5100 8625 6870 8235 6855
2 1 0 1 0 7 50 -1 -1 0.000 0 0 -1 0 0 3
	 10575 5085 10575 6855 11010 6855
2 1 0 1 0 7 50 -1 -1 0.000 0 0 -1 0 0 3
	 9675 5115 9675 5430 11025 5430
2 1 0 3 0 7 50 -1 -1 8.000 0 0 -1 0 0 4
	 4260 9405 4260 7605 6960 7605 6960 9420
2 1 0 1 0 7 50 -1 -1 0.000 0 0 -1 0 0 3
	 4275 7950 6960 7230 6960 7590
2 1 0 1 0 7 50 -1 -1 0.000 0 0 -1 0 0 3
	 4725 7605 3615 9450 4275 9435
2 1 0 1 0 7 50 -1 -1 0.000 0 0 -1 0 0 3
	 7397 7615 6287 9460 6947 9445
2 1 0 1 0 7 50 -1 -1 0.000 0 0 -1 0 0 2
	 6990 7605 7425 7605
3 0 0 1 0 7 50 -1 -1 0.000 0 1 0 3
	1 1 1.00 60.00 120.00
	 5625 1710 5625 1485 5310 1485
	 0.000 1.000 0.000
3 0 0 1 0 7 50 -1 -1 0.000 0 1 0 3
	1 1 1.00 60.00 120.00
	 5715 1755 5715 1530 6030 1530
	 0.000 1.000 0.000
4 0 0 50 -1 0 24 0.0000 4 270 210 990 4275 6\001
4 0 0 50 -1 0 24 1.5708 4 270 210 3330 2790 4\001
4 0 0 50 -1 0 24 0.0000 4 285 210 -540 1755 5\001
4 0 0 50 -1 0 16 0.0000 4 180 135 9765 1620 1\001
4 0 0 50 -1 0 16 0.0000 4 180 135 9225 2205 1\001
4 0 0 50 -1 0 16 0.0000 4 180 135 7695 3420 4\001
4 0 0 50 -1 0 16 0.0000 4 180 135 11475 3375 4\001
4 0 0 50 -1 0 16 0.0000 4 180 135 1440 4950 0\001
4 0 0 50 -1 0 20 0.0000 4 225 300 9045 1350 M\001
4 0 0 50 -1 0 16 0.0000 4 180 135 9360 1395 1\001
4 0 0 50 -1 0 20 0.0000 4 225 300 9225 4635 M\001
4 0 0 50 -1 0 16 0.0000 4 180 135 9540 4725 3\001
4 0 0 50 -1 0 20 0.0000 4 225 300 4995 4680 M\001
4 0 0 50 -1 0 16 0.0000 4 180 135 5355 4770 2\001
4 0 0 50 -1 0 20 0.0000 4 225 300 1170 4860 M\001
4 0 0 50 -1 0 20 0.0000 4 300 2280 4635 3015 primary structure\001
4 0 0 50 -1 0 20 0.0000 4 225 1455 4770 3465 redundants\001
4 0 0 50 -1 0 24 0.0000 4 285 210 -585 5085 5\001
4 0 0 50 -1 0 20 0.0000 4 225 330 -585 7290 20\001
4 0 0 50 -1 0 20 0.0000 4 225 165 3885 5130 3\001
4 0 0 50 -1 0 20 0.0000 4 225 165 6225 5685 3\001
4 0 0 50 -1 0 20 0.0000 4 225 165 8745 5715 1\001
4 0 0 50 -1 0 20 0.0000 4 225 165 10335 5730 1\001
4 0 0 50 -1 0 20 0.0000 4 225 300 5295 7290 M\001
4 0 0 50 -1 0 20 0.0000 4 225 165 4560 8175 4\001
4 0 0 50 -1 0 20 0.0000 4 225 165 3450 9210 6\001
4 0 0 50 -1 0 20 0.0000 4 225 165 6105 9330 6\001
4 0 0 50 -1 0 20 0.0000 4 225 165 7110 7515 4\001
