#FIG 3.2  Produced by xfig version 3.2.5c
Landscape
Center
Inches
Letter  
100.00
Single
-2
1200 2
5 1 0 1 0 7 50 -1 -1 4.000 0 1 1 0 4580.625 1685.625 4950 1740 4920 1530 4815 1395
	1 1 1.00 60.00 120.00
5 1 0 1 0 7 50 -1 -1 4.000 0 1 1 0 3770.753 2024.589 3450 2055 3705 2340 4080 2115
	1 1 1.00 60.00 120.00
5 1 0 1 0 7 50 -1 -1 4.000 0 0 1 0 2157.723 3896.116 2070 4320 1725 3885 1995 3495
	1 1 1.00 60.00 120.00
5 1 0 1 0 7 50 -1 -1 4.000 0 1 1 0 3864.815 3900.917 4005 4350 4335 3885 3930 3435
	1 1 1.00 60.00 120.00
2 1 0 2 0 7 50 -1 -1 6.000 0 0 -1 1 0 2
	1 1 2.00 120.00 240.00
	 1200 1920 1650 825
2 1 0 2 0 7 50 -1 -1 6.000 0 0 -1 1 0 2
	1 1 2.00 120.00 240.00
	 1215 1920 1860 1845
2 1 0 1 0 7 50 -1 -1 4.000 0 0 -1 1 0 2
	1 1 1.00 60.00 120.00
	 2055 1740 2385 1740
2 1 0 1 0 7 50 -1 -1 4.000 0 0 -1 1 0 2
	1 1 1.00 60.00 120.00
	 1860 840 2190 840
2 3 0 2 0 7 50 -1 -1 6.000 0 0 -1 0 0 5
	 3780 1905 5175 1695 4665 720 3765 1170 3780 1905
2 3 1 2 0 7 50 -1 -1 6.000 0 0 -1 0 0 5
	 3765 1890 5058 1326 4313 516 3560 1184 3765 1890
2 1 0 2 0 7 50 -1 -1 6.000 0 0 -1 0 0 2
	 6960 1305 8460 1305
2 1 0 2 0 7 50 -1 -1 6.000 0 0 -1 0 0 2
	 6945 2160 8445 2160
2 1 3 1 0 7 50 -1 -1 4.000 0 0 -1 0 0 2
	 6420 1740 9210 1740
2 1 0 2 0 7 50 -1 -1 6.000 0 0 -1 1 0 2
	1 1 2.00 120.00 240.00
	 8760 1725 8760 2490
2 2 0 1 0 7 50 -1 50 4.000 0 0 -1 0 0 5
	 7005 1290 8535 1290 8535 960 7005 960 7005 1290
2 2 0 3 0 7 50 -1 -1 8.000 0 0 -1 0 0 5
	 2415 4515 3420 4515 3420 3330 2415 3330 2415 4515
2 1 0 1 0 7 50 -1 -1 4.000 0 0 -1 0 0 2
	 4380 3330 3420 3330
2 1 0 1 0 7 50 -1 -1 4.000 0 0 -1 0 0 2
	 4380 4515 3420 4515
2 1 0 1 0 7 50 -1 -1 4.000 0 0 -1 0 0 2
	 2415 3330 1455 3330
2 1 0 1 0 7 50 -1 -1 4.000 0 0 -1 0 0 2
	 2415 4530 1455 4530
2 1 1 3 0 7 50 -1 -1 8.000 0 0 -1 0 0 2
	 2310 3330 2535 4530
2 1 1 3 0 7 50 -1 -1 8.000 0 0 -1 0 0 2
	 2985 3345 3870 4515
2 1 3 1 0 7 50 -1 -1 4.000 0 0 -1 0 0 2
	 1470 3915 4395 3915
2 1 0 1 0 7 50 -1 -1 4.000 0 0 -1 0 0 2
	 2430 4635 2430 5070
2 1 0 1 0 7 50 -1 -1 4.000 0 0 -1 0 0 2
	 3435 4620 3435 5055
3 0 0 1 0 7 50 -1 -1 4.000 0 0 0 4
	 7080 1050 6825 1455 7185 1830 6735 2385
	 0.000 1.000 1.000 0.000
3 0 0 1 0 7 50 -1 -1 4.000 0 0 0 4
	 8670 990 8415 1395 8775 1770 8325 2325
	 0.000 1.000 1.000 0.000
3 0 1 1 0 7 50 -1 -1 4.000 0 0 0 4
	 6450 2040 7410 2355 8325 2475 9180 2445
	 0.000 1.000 1.000 0.000
4 0 0 50 -1 1 24 0.0000 4 270 255 1815 1200 F\001
4 0 0 50 -1 1 24 0.0000 4 180 210 2010 2010 u\001
4 0 0 50 -1 1 24 0.0000 4 270 255 915 1935 P\001
4 0 0 50 -1 32 24 0.0000 4 375 210 4575 1755 f\001
4 0 0 50 -1 1 24 0.0000 4 270 345 4080 2430 M\001
4 0 0 50 -1 1 24 0.0000 4 375 120 7620 915 f\001
4 0 0 50 -1 1 24 0.0000 4 180 180 8865 2115 v\001
4 0 0 50 -1 1 24 0.0000 4 270 345 1395 3810 M\001
4 0 0 50 -1 1 24 0.0000 4 270 345 4320 3720 M\001
4 0 0 50 -1 1 24 0.0000 4 180 180 2985 4935 x\001
4 0 0 50 -1 0 24 0.0000 4 270 435 3195 3180 +d\001
4 0 0 50 -1 32 24 0.0000 4 300 165 3600 3195 g\001
4 0 0 50 -1 32 24 0.0000 4 300 165 2970 3195 g\001
4 0 0 50 -1 32 24 0.0000 4 300 165 2190 3240 g\001
4 0 0 50 -1 0 24 0.0000 4 270 210 2775 4935 d\001
4 0 0 50 -1 0 24 0.0000 4 180 300 930 975 a:\001
4 0 0 50 -1 0 24 0.0000 4 270 330 3195 915 b:\001
4 0 0 50 -1 0 24 0.0000 4 180 300 6495 885 c:\001
4 0 0 50 -1 0 24 0.0000 4 270 330 1095 3075 d:\001
