#FIG 3.2  Produced by xfig version 3.2.5c
Landscape
Center
Inches
Letter  
100.00
Single
-2
1200 2
1 4 0 1 0 7 50 -1 -1 0.000 1 0.0000 2400 1230 67 67 2400 1298 2400 1163
2 1 0 3 0 7 50 -1 -1 0.000 0 0 -1 0 0 2
	 30 1230 2325 1230
2 1 0 3 0 7 50 -1 -1 0.000 0 0 -1 0 0 2
	 2490 1215 5970 1215
2 1 0 1 0 7 50 -1 -1 0.000 0 0 -1 0 0 2
	 30 840 30 1590
2 1 0 1 0 7 50 -1 -1 0.000 0 0 -1 0 0 2
	 45 930 -120 1050
2 1 0 1 0 7 50 -1 -1 0.000 0 0 -1 0 0 2
	 15 1065 -150 1185
2 1 0 1 0 7 50 -1 -1 0.000 0 0 -1 0 0 2
	 30 1185 -135 1305
2 1 0 1 0 7 50 -1 -1 0.000 0 0 -1 0 0 2
	 45 1335 -120 1455
2 1 0 1 0 7 50 -1 -1 0.000 0 0 -1 0 0 2
	 45 1455 -120 1575
2 1 1 1 0 7 50 -1 -1 4.000 0 0 -1 0 0 2
	 15 1680 15 4530
2 1 1 1 0 7 50 -1 -1 4.000 0 0 -1 0 0 2
	 2430 1785 2430 4635
2 1 1 1 0 7 50 -1 -1 4.000 0 0 -1 0 0 2
	 4830 1665 4830 4515
2 3 0 1 0 7 50 -1 -1 0.000 0 0 -1 0 0 4
	 4830 1230 4665 1440 5025 1440 4830 1230
2 1 1 1 0 7 50 -1 -1 4.000 0 0 -1 0 0 2
	 5940 1725 5940 4575
2 2 0 1 0 7 50 -1 50 4.000 0 0 -1 0 0 5
	 4860 1170 5955 1170 5955 885 4860 885 4860 1170
2 1 0 1 0 7 50 -1 -1 4.000 0 0 -1 0 0 2
	 15 2250 5925 2250
2 1 0 1 0 7 50 -1 -1 4.000 0 0 -1 0 0 4
	 15 2250 15 2775 4830 1725 4830 1710
2 1 0 1 0 7 50 -1 -1 4.000 0 0 -1 0 0 2
	 30 4080 5940 4080
2 1 0 2 0 7 50 -1 -1 6.000 0 0 -1 1 0 2
	1 1 2.00 120.00 240.00
	 30 1575 645 1575
2 1 0 2 0 7 50 -1 -1 6.000 0 0 -1 1 0 2
	1 1 2.00 120.00 240.00
	 2430 1590 3150 1590
2 1 0 2 0 7 50 -1 -1 6.000 0 0 -1 1 0 2
	1 1 2.00 120.00 240.00
	 5940 1485 5235 1485
3 0 0 1 0 7 50 -1 -1 4.000 0 0 0 4
	 4845 1710 5130 2070 5565 2205 5925 2235
	 0.000 1.000 1.000 0.000
3 0 0 2 0 7 50 -1 -1 6.000 0 0 0 3
	 30 4095 1230 4020 2430 3555
	 0.000 1.000 0.000
3 0 0 2 0 7 50 -1 -1 6.000 0 0 0 5
	 2445 3555 3855 3690 4815 4050 5490 4350 5940 4605
	 0.000 1.000 1.000 1.000 0.000
4 0 0 50 -1 0 24 0.0000 4 270 135 1065 630 I\001
4 0 0 50 -1 0 24 0.0000 4 270 270 3435 615 II\001
4 0 0 50 -1 0 24 0.0000 4 270 405 5235 645 III\001
4 0 0 50 -1 1 24 0.0000 4 270 480 405 2040 M:\001
4 0 0 50 -1 0 24 0.0000 4 285 525 300 2955 0.5\001
4 0 0 50 -1 0 24 0.0000 4 285 525 4995 1905 0.5\001
4 0 0 50 -1 0 24 0.0000 4 270 735 1875 3495 0.66\001
4 0 0 50 -1 0 24 0.0000 4 285 735 6060 4545 0.79\001
4 0 0 50 -1 1 24 0.0000 4 180 315 420 3555 v:\001
