#FIG 3.2
Landscape
Center
Metric
Letter  
100.00
Single
-2
1200 2
2 1 0 3 0 7 50 0 -1 8.000 0 0 -1 0 0 2
	 1800 1800 5355 1800
2 1 0 1 0 7 50 0 -1 4.000 0 0 -1 1 0 2
	1 1 1.00 60.00 120.00
	 1800 1350 3510 1350
2 1 0 1 0 7 50 0 -1 4.000 0 0 -1 0 0 2
	 1800 1800 1800 1305
2 1 0 1 0 7 50 0 -1 4.000 0 0 -1 0 0 2
	 3510 1260 3510 1890
2 1 0 1 0 7 50 0 -1 4.000 0 0 -1 1 0 2
	1 1 1.00 60.00 120.00
	 3510 1800 3510 2700
2 1 1 1 0 7 50 0 -1 4.000 0 0 -1 0 0 2
	 3825 315 3645 2025
2 1 1 1 0 7 50 0 -1 4.000 0 0 -1 1 0 2
	1 1 1.00 60.00 120.00
	 3600 2340 3555 2700
3 2 1 3 0 7 50 0 -1 8.000 0 0 0 3
	 1800 2250 3600 2700 5355 2610
	 0.000 -1.000 0.000
4 0 0 50 0 0 24 0.0000 4 330 600 3600 2340 v(x)\001
4 0 0 50 0 0 24 0.0000 4 255 240 3825 1260 R\001
4 0 0 50 0 0 24 0.0000 4 180 195 2520 1305 x\001
