#FIG 3.2  Produced by xfig version 3.2.6a
Landscape
Center
Metric
A4
100.00
Single
-2
1200 2
2 1 0 3 0 7 50 -1 -1 8.000 0 0 -1 0 0 2
	 0 4500 5355 4500
2 3 0 1 0 7 50 -1 -1 4.000 0 0 -1 0 0 4
	 -180 4725 0 4500 135 4725 -180 4725
2 1 0 1 0 7 50 -1 -1 4.000 0 0 -1 0 0 2
	 4185 4815 4500 4815
2 1 0 1 0 7 50 -1 -1 4.000 0 0 -1 0 0 2
	 0 4950 0 5715
2 1 0 1 0 7 50 -1 -1 0.000 0 0 -1 0 1 2
	1 1 1.00 60.00 120.00
	 4365 4950 4365 5715
2 1 0 1 0 7 50 -1 -1 4.000 0 0 -1 0 0 2
	 5310 4950 5310 5715
2 1 0 1 0 7 50 -1 -1 4.000 0 0 -1 1 1 2
	1 1 1.00 60.00 120.00
	1 1 1.00 60.00 120.00
	 4365 5400 5310 5400
2 1 0 1 0 7 50 -1 -1 4.000 0 0 -1 1 1 2
	1 1 1.00 60.00 120.00
	1 1 1.00 60.00 120.00
	 0 5400 4365 5400
2 1 0 2 0 7 50 -1 -1 6.000 0 0 -1 1 0 2
	1 1 2.00 120.00 240.00
	 0 4410 1260 4410
2 1 0 2 0 7 50 -1 -1 6.000 0 0 -1 1 0 2
	1 1 2.00 120.00 240.00
	 0 4410 0 3465
2 1 0 2 0 7 50 -1 -1 6.000 0 0 -1 1 0 2
	1 1 2.00 120.00 240.00
	 4761 3906 5302 4447
2 1 0 2 0 7 50 -1 -1 6.000 0 0 -1 1 0 2
	1 1 2.00 120.00 240.00
	 6750 4590 6750 5310
2 1 0 2 0 7 50 -1 -1 6.000 0 0 -1 1 0 2
	1 1 2.00 120.00 240.00
	 6705 4545 6075 4545
2 1 0 2 0 7 50 -1 -1 6.000 0 0 -1 1 0 2
	1 1 2.00 120.00 240.00
	 12105 3780 12105 4500
2 1 0 2 0 7 50 -1 -1 6.000 0 0 -1 1 0 2
	1 1 2.00 120.00 240.00
	 11250 5310 11250 4590
2 1 0 3 0 7 50 -1 -1 8.000 0 0 -1 0 0 2
	 6750 4545 12105 4545
2 1 0 2 0 7 50 -1 -1 6.000 0 0 -1 1 0 2
	1 1 2.00 120.00 240.00
	 12195 4545 12825 4545
2 1 0 1 0 7 50 -1 -1 4.000 0 0 -1 1 0 3
	1 1 1.00 60.00 120.00
	 6750 4545 11250 3825 12105 4545
2 1 0 1 0 7 50 -1 -1 4.000 0 0 -1 0 0 2
	 11250 4545 11250 3780
2 3 0 1 0 7 50 -1 -1 4.000 0 0 -1 0 0 4
	 4185 4725 4365 4500 4500 4725 4185 4725
4 0 0 50 -1 0 24 0.0000 4 270 210 4770 5310 2\001
4 0 0 50 -1 0 24 0.0000 4 270 420 2115 5310 10\001
4 0 0 50 -1 1 24 0.0000 4 270 255 180 4995 A\001
4 0 0 50 -1 1 24 0.0000 4 270 255 3960 4905 B\001
4 0 0 50 -1 0 24 0.0000 4 270 270 5310 4770 C\001
4 0 0 50 -1 0 24 0.0000 4 270 660 4860 4050 F=1\001
4 0 0 50 -1 1 24 0.0000 4 180 180 1035 4275 x\001
4 0 0 50 -1 1 24 0.0000 4 255 180 135 3780 y\001
4 0 0 50 -1 0 24 0.0000 4 270 945 6975 5175 0.141\001
4 0 0 50 -1 0 24 0.0000 4 270 945 11340 5265 0.848\001
4 0 0 50 -1 0 24 0.0000 4 270 945 12240 4365 0.707\001
4 0 0 50 -1 0 24 0.0000 4 270 945 5805 4410 0.707\001
4 0 0 50 -1 0 24 0.0000 4 270 945 10215 3870 1.414\001
4 0 0 50 -1 0 24 0.0000 4 270 480 8955 3600 M:\001
