<?xml version="1.0" encoding="UTF-8" standalone="no"?>
<!-- Created with Inkscape (http://www.inkscape.org/) -->

<svg
   width="51.771168mm"
   height="55.67804mm"
   viewBox="0 0 51.771168 55.678039"
   version="1.1"
   id="svg3743"
   inkscape:version="1.1.1 (3bf5ae0d25, 2021-09-20)"
   sodipodi:docname="07.svg"
   xmlns:inkscape="http://www.inkscape.org/namespaces/inkscape"
   xmlns:sodipodi="http://sodipodi.sourceforge.net/DTD/sodipodi-0.dtd"
   xmlns="http://www.w3.org/2000/svg"
   xmlns:svg="http://www.w3.org/2000/svg">
  <sodipodi:namedview
     id="namedview3745"
     pagecolor="#ffffff"
     bordercolor="#666666"
     borderopacity="1.0"
     inkscape:pageshadow="2"
     inkscape:pageopacity="0.0"
     inkscape:pagecheckerboard="0"
     inkscape:document-units="mm"
     showgrid="false"
     fit-margin-top="0"
     fit-margin-left="0"
     fit-margin-right="0"
     fit-margin-bottom="0"
     inkscape:zoom="2.5620932"
     inkscape:cx="120.79967"
     inkscape:cy="128.21548"
     inkscape:window-width="1852"
     inkscape:window-height="1016"
     inkscape:window-x="0"
     inkscape:window-y="0"
     inkscape:window-maximized="1"
     inkscape:current-layer="layer1"
     showguides="false" />
  <defs
     id="defs3740">
    <clipPath
       clipPathUnits="userSpaceOnUse"
       id="clipPath130">
      <path
         d="M 120.343,408.692 H 296.658 V 579.189 H 120.343 Z"
         id="path128" />
    </clipPath>
    <clipPath
       clipPathUnits="userSpaceOnUse"
       id="clipPath142">
      <path
         d="m 131.345,543.647 c -0.72,-1.493 0.17,-3.069 0.581,-4.622 v 0 c 0.177,-0.664 1.345,-1.22 1.999,-1.817 v 0 c 1.498,-1.366 -0.705,-2.878 0.077,-4.399 v 0 c 0.699,-1.359 1.044,-2.598 1.259,-3.94 v 0 c 0.111,-0.698 1.669,-1.066 2.343,-1.553 v 0 c 1.33,-0.962 0.537,-2.423 1.63,-3.469 v 0 c 0.765,-0.73 0.693,-1.65 2.146,-2.202 v 0 c 1.289,-0.49 2.084,-1.21 3.391,-1.48 v 0 c 1.526,-0.313 3.491,-0.463 5.604,-0.366 v 0 23.848 z"
         id="path140" />
    </clipPath>
    <clipPath
       clipPathUnits="userSpaceOnUse"
       id="clipPath286">
      <path
         d="m 148.063,551.322 c -0.576,-0.323 -1.192,-0.619 -1.845,-0.853 v 0 c -1.617,-0.58 -3.735,-0.345 -5.243,-1.159 v 0 c -0.097,-0.054 -0.334,-0.044 -0.588,-0.036 v 0 c -0.251,0.009 -0.52,0.017 -0.691,-0.033 v 0 c -2.387,-0.692 -2.947,-1.82 -4.167,-2.854 v 0 c -1.049,-0.89 -3.331,-1.452 -3.943,-2.331 v 0 c -0.102,-0.145 -0.186,-0.292 -0.255,-0.439 v 0 h 19.044 v 7.989 c -0.968,-0.094 -1.847,-0.022 -2.312,-0.284"
         id="path284" />
    </clipPath>
    <clipPath
       clipPathUnits="userSpaceOnUse"
       id="clipPath338">
      <path
         d="m 131.345,543.647 c -0.72,-1.493 0.17,-3.069 0.581,-4.622 v 0 c 0.177,-0.664 1.345,-1.22 1.999,-1.817 v 0 c 1.498,-1.366 -0.705,-2.878 0.077,-4.399 v 0 c 0.699,-1.359 1.044,-2.598 1.259,-3.94 v 0 c 0.111,-0.698 1.669,-1.066 2.343,-1.553 v 0 c 1.33,-0.962 0.537,-2.423 1.63,-3.469 v 0 c 0.765,-0.73 0.693,-1.65 2.146,-2.202 v 0 c 1.289,-0.49 2.084,-1.21 3.391,-1.48 v 0 c 1.526,-0.313 3.491,-0.463 5.604,-0.366 v 0 23.848 z"
         id="path336" />
    </clipPath>
    <clipPath
       clipPathUnits="userSpaceOnUse"
       id="clipPath354">
      <path
         d="m 148.063,551.322 c -0.576,-0.323 -1.192,-0.619 -1.845,-0.853 v 0 c -1.617,-0.58 -3.735,-0.345 -5.243,-1.159 v 0 c -0.097,-0.054 -0.334,-0.044 -0.588,-0.036 v 0 c -0.251,0.009 -0.52,0.017 -0.691,-0.033 v 0 c -2.387,-0.692 -2.947,-1.82 -4.167,-2.854 v 0 c -1.049,-0.89 -3.331,-1.452 -3.943,-2.331 v 0 c -0.102,-0.145 -0.186,-0.292 -0.255,-0.439 v 0 h 19.044 v 7.989 c -0.968,-0.094 -1.847,-0.022 -2.312,-0.284"
         id="path352" />
    </clipPath>
    <clipPath
       clipPathUnits="userSpaceOnUse"
       id="clipPath402">
      <path
         d="M 120.343,408.692 H 296.658 V 579.189 H 120.343 Z"
         id="path400" />
    </clipPath>
    <clipPath
       clipPathUnits="userSpaceOnUse"
       id="clipPath422">
      <path
         d="M 120.343,408.692 H 296.658 V 579.189 H 120.343 Z"
         id="path420" />
    </clipPath>
    <clipPath
       clipPathUnits="userSpaceOnUse"
       id="clipPath502">
      <path
         d="M 120.343,408.692 H 296.658 V 579.189 H 120.343 Z"
         id="path500" />
    </clipPath>
    <clipPath
       clipPathUnits="userSpaceOnUse"
       id="clipPath528">
      <path
         d="M 120.343,408.692 H 296.658 V 579.188 H 120.343 Z"
         id="path526" />
    </clipPath>
    <clipPath
       clipPathUnits="userSpaceOnUse"
       id="clipPath540">
      <path
         d="M 120.343,408.692 H 296.658 V 579.189 H 120.343 Z"
         id="path538" />
    </clipPath>
    <clipPath
       clipPathUnits="userSpaceOnUse"
       id="clipPath576">
      <path
         d="m 150.454,540.718 v -7.646 h 75.494 l 5.928,-5.929 v -98.221 h 7.647 v 111.796 z"
         id="path574" />
    </clipPath>
    <clipPath
       clipPathUnits="userSpaceOnUse"
       id="clipPath596">
      <path
         d="M 205.58354,583.97385 293.81571,471.52239 184.39341,385.66724 96.161245,498.11871 Z"
         id="path594" />
    </clipPath>
    <linearGradient
       x1="0"
       y1="0"
       x2="1"
       y2="0"
       gradientUnits="userSpaceOnUse"
       gradientTransform="matrix(9.9382935,-12.666306,-62.172607,-48.781998,230.01672,556.07332)"
       id="linearGradient602">
      <stop
         style="stop-opacity:1;stop-color:#bdbbbc"
         offset="0"
         id="stop598" />
      <stop
         style="stop-opacity:1;stop-color:#f8f8f8"
         offset="1"
         id="stop600" />
    </linearGradient>
    <clipPath
       clipPathUnits="userSpaceOnUse"
       id="clipPath620">
      <path
         d="M 205.58326,583.97404 293.81496,471.5221 184.39266,385.66695 96.160961,498.11889 Z"
         id="path618" />
    </clipPath>
    <linearGradient
       x1="0"
       y1="0"
       x2="1"
       y2="0"
       gradientUnits="userSpaceOnUse"
       gradientTransform="matrix(8.1313019,-10.363403,-62.172607,-48.781998,239.95473,543.4068)"
       id="linearGradient626">
      <stop
         style="stop-opacity:1;stop-color:#f8f8f8"
         offset="0"
         id="stop622" />
      <stop
         style="stop-opacity:1;stop-color:#bdbbbc"
         offset="1"
         id="stop624" />
    </linearGradient>
    <clipPath
       clipPathUnits="userSpaceOnUse"
       id="clipPath636">
      <path
         d="m 150.454,540.718 v -7.646 h 75.494 l 5.928,-5.929 v -98.221 h 7.647 v 111.796 z"
         id="path634" />
    </clipPath>
    <clipPath
       clipPathUnits="userSpaceOnUse"
       id="clipPath648">
      <path
         d="M 120.343,408.692 H 296.658 V 579.189 H 120.343 Z"
         id="path646" />
    </clipPath>
  </defs>
  <g
     inkscape:label="Layer 1"
     inkscape:groupmode="layer"
     id="layer1"
     transform="translate(-1.7437064e-7,-0.67004477)">
    <g
       id="g124"
       transform="matrix(0.35277777,0,0,-0.35277777,-46.239564,200.52564)">
      <g
         id="g126"
         clip-path="url(#clipPath130)">
        <g
           id="g132"
           transform="translate(150.37489,519.7995)">
          <path
             d="m 0,0 v 31.807 c -0.968,-0.095 -1.847,-0.022 -2.313,-0.284 -0.576,-0.324 -1.191,-0.62 -1.844,-0.854 -1.616,-0.58 -3.735,-0.345 -5.243,-1.16 -0.193,-0.104 -0.933,0.034 -1.279,-0.068 -2.386,-0.691 -2.947,-1.819 -4.167,-2.854 -1.05,-0.89 -3.331,-1.453 -3.943,-2.331 -1.128,-1.612 -0.108,-3.335 0.34,-5.03 0.177,-0.664 1.346,-1.221 2,-1.817 1.497,-1.366 -0.706,-2.879 0.076,-4.4 0.699,-1.359 1.044,-2.597 1.259,-3.94 0.111,-0.697 1.67,-1.066 2.342,-1.552 1.331,-0.962 0.537,-2.423 1.631,-3.47 0.765,-0.73 0.693,-1.649 2.146,-2.201 1.289,-0.49 2.084,-1.21 3.391,-1.481 C -4.078,0.051 -2.112,-0.098 0,0"
             style="fill:#d3d2d2;fill-opacity:1;fill-rule:nonzero;stroke:none"
             id="path134" />
        </g>
      </g>
    </g>
    <g
       id="g136"
       transform="matrix(0.35277777,0,0,-0.35277777,-46.239564,200.52564)">
      <g
         id="g138"
         clip-path="url(#clipPath142)">
        <g
           id="g144"
           transform="translate(146.0663,538.3933)">
          <path
             d="M 0,0 0.515,0.515 0.927,-0.309 Z"
             style="fill:#231f20;fill-opacity:1;fill-rule:nonzero;stroke:none"
             id="path146" />
        </g>
        <g
           id="g148"
           transform="translate(137.54089,539.114)">
          <path
             d="M 0,0 0.104,1.03 0.824,0 Z"
             style="fill:#231f20;fill-opacity:1;fill-rule:nonzero;stroke:none"
             id="path150" />
        </g>
        <g
           id="g152"
           transform="translate(142.4843,538.2903)">
          <path
             d="M 0,0 0.102,1.03 0.824,0 Z"
             style="fill:#231f20;fill-opacity:1;fill-rule:nonzero;stroke:none"
             id="path154" />
        </g>
        <g
           id="g156"
           transform="translate(148.86909,541.278)">
          <path
             d="M 0,0 0.103,1.03 0.824,0 Z"
             style="fill:#231f20;fill-opacity:1;fill-rule:nonzero;stroke:none"
             id="path158" />
        </g>
        <g
           id="g160"
           transform="translate(149.2812,534.1692)">
          <path
             d="M 0,0 0.103,1.03 0.824,0 Z"
             style="fill:#231f20;fill-opacity:1;fill-rule:nonzero;stroke:none"
             id="path162" />
        </g>
        <g
           id="g164"
           transform="translate(145.2657,533.2419)">
          <path
             d="M 0,0 0.102,1.03 0.823,0 Z"
             style="fill:#231f20;fill-opacity:1;fill-rule:nonzero;stroke:none"
             id="path166" />
        </g>
        <g
           id="g168"
           transform="translate(145.6767,522.8372)">
          <path
             d="M 0,0 0.104,1.03 0.824,0 Z"
             style="fill:#231f20;fill-opacity:1;fill-rule:nonzero;stroke:none"
             id="path170" />
        </g>
        <g
           id="g172"
           transform="translate(136.71671,536.02319)">
          <path
             d="M 0,0 0.103,1.031 0.824,0 Z"
             style="fill:#231f20;fill-opacity:1;fill-rule:nonzero;stroke:none"
             id="path174" />
        </g>
        <g
           id="g176"
           transform="translate(134.3495,533.34489)">
          <path
             d="M 0,0 0.103,1.03 0.823,0 Z"
             style="fill:#231f20;fill-opacity:1;fill-rule:nonzero;stroke:none"
             id="path178" />
        </g>
        <g
           id="g180"
           transform="translate(136.82021,529.94501)">
          <path
             d="M 0,0 0.103,1.03 0.824,0 Z"
             style="fill:#231f20;fill-opacity:1;fill-rule:nonzero;stroke:none"
             id="path182" />
        </g>
        <g
           id="g184"
           transform="translate(141.248,527.2673)">
          <path
             d="M 0,0 0.103,1.03 0.824,0 Z"
             style="fill:#231f20;fill-opacity:1;fill-rule:nonzero;stroke:none"
             id="path186" />
        </g>
        <g
           id="g188"
           transform="translate(138.5712,526.5451)">
          <path
             d="M 0,0 0.618,0.413 1.03,-0.515 Z"
             style="fill:#231f20;fill-opacity:1;fill-rule:nonzero;stroke:none"
             id="path190" />
        </g>
        <g
           id="g192"
           transform="translate(134.03999,537.466)">
          <path
             d="M 0,0 0.618,0.412 1.03,-0.515 Z"
             style="fill:#231f20;fill-opacity:1;fill-rule:nonzero;stroke:none"
             id="path194" />
        </g>
        <g
           id="g196"
           transform="translate(141.1454,531.3869)">
          <path
             d="M 0,0 0.617,0.413 1.029,-0.515 Z"
             style="fill:#231f20;fill-opacity:1;fill-rule:nonzero;stroke:none"
             id="path198" />
        </g>
        <g
           id="g200"
           transform="translate(149.1777,525.2058)">
          <path
             d="M 0,0 0.618,0.412 1.03,-0.515 Z"
             style="fill:#231f20;fill-opacity:1;fill-rule:nonzero;stroke:none"
             id="path202" />
        </g>
        <g
           id="g204"
           transform="translate(133.7314,543.5442)">
          <path
             d="M 0,0 0.618,0.412 1.029,-0.515 Z"
             style="fill:#231f20;fill-opacity:1;fill-rule:nonzero;stroke:none"
             id="path206" />
        </g>
        <g
           id="g208"
           transform="translate(147.4267,528.19411)">
          <path
             d="M 0,0 0.104,1.03 0.824,0 Z"
             style="fill:#231f20;fill-opacity:1;fill-rule:nonzero;stroke:none"
             id="path210" />
        </g>
        <g
           id="g212"
           transform="translate(141.3515,522.32201)">
          <path
             d="M 0,0 0.617,0.412 1.029,-0.516 Z"
             style="fill:#231f20;fill-opacity:1;fill-rule:nonzero;stroke:none"
             id="path214" />
        </g>
        <g
           id="g216"
           transform="translate(139.832,540.88789)">
          <path
             d="M 0,0 C 0.306,0.166 3.409,2.296 3.409,1.6 3.409,0.904 2.574,0.487 2.853,0 3.13,-0.488 3.27,-0.766 3.13,-1.114 2.991,-1.462 1.809,-1.67 1.879,-2.366 1.948,-3.062 1.392,-2.784 1.113,-2.644 0.835,-2.505 0.418,-1.183 0.905,-0.905 0.905,-0.905 -0.764,-0.418 0,0"
             style="fill:#ffffff;fill-opacity:1;fill-rule:nonzero;stroke:none"
             id="path218" />
        </g>
        <g
           id="g220"
           transform="translate(139.832,540.88789)">
          <path
             d="M 0,0 C 0.306,0.166 3.409,2.296 3.409,1.6 3.409,0.904 2.574,0.487 2.853,0 3.13,-0.488 3.27,-0.766 3.13,-1.114 2.991,-1.462 1.809,-1.67 1.879,-2.366 1.948,-3.062 1.392,-2.784 1.113,-2.644 0.835,-2.505 0.418,-1.183 0.905,-0.905 0.905,-0.905 -0.764,-0.418 0,0 Z"
             style="fill:none;stroke:#231f20;stroke-width:0.216;stroke-linecap:butt;stroke-linejoin:miter;stroke-miterlimit:4;stroke-dasharray:none;stroke-opacity:1"
             id="path222" />
        </g>
        <g
           id="g224"
           transform="translate(147.4657,533.52609)">
          <path
             d="m 0,0 c -0.348,-0.34 -0.458,-0.749 -0.837,-1.019 -0.069,-0.05 -0.233,-0.257 -0.283,-0.39 -0.069,-0.197 -0.069,-0.42 0.023,-0.484 0.084,-0.059 0.295,-0.043 0.361,-0.101 0.196,-0.173 -0.14,-0.835 0.164,-0.892 0.262,-0.05 0.702,0.068 1.054,0.403 0.287,0.275 0.189,0.544 0.255,0.835 0.067,0.289 0.343,0.619 0.576,0.826 0.124,0.11 0.338,0.278 0.391,0.359 0.602,0.93 0.232,1.717 -0.51,1.611 C 0.757,1.086 0.384,0.374 0,0"
             style="fill:#ffffff;fill-opacity:1;fill-rule:nonzero;stroke:none"
             id="path226" />
        </g>
        <g
           id="g228"
           transform="translate(147.4657,533.52609)">
          <path
             d="m 0,0 c -0.348,-0.34 -0.458,-0.749 -0.837,-1.019 -0.069,-0.05 -0.233,-0.257 -0.283,-0.39 -0.069,-0.197 -0.069,-0.42 0.023,-0.484 0.084,-0.059 0.295,-0.043 0.361,-0.101 0.196,-0.173 -0.14,-0.835 0.164,-0.892 0.262,-0.05 0.702,0.068 1.054,0.403 0.287,0.275 0.189,0.544 0.255,0.835 0.067,0.289 0.343,0.619 0.576,0.826 0.124,0.11 0.338,0.278 0.391,0.359 0.602,0.93 0.232,1.717 -0.51,1.611 C 0.757,1.086 0.384,0.374 0,0 Z"
             style="fill:none;stroke:#231f20;stroke-width:0.216;stroke-linecap:butt;stroke-linejoin:miter;stroke-miterlimit:4;stroke-dasharray:none;stroke-opacity:1"
             id="path230" />
        </g>
        <g
           id="g232"
           transform="translate(132.5977,525.3093)">
          <path
             d="M 0,0 0.618,0.412 1.03,-0.515 Z"
             style="fill:#231f20;fill-opacity:1;fill-rule:nonzero;stroke:none"
             id="path234" />
        </g>
        <g
           id="g236"
           transform="translate(135.58389,523.96989)">
          <path
             d="M 0,0 0.618,0.412 1.03,-0.515 Z"
             style="fill:#231f20;fill-opacity:1;fill-rule:nonzero;stroke:none"
             id="path238" />
        </g>
        <g
           id="g240"
           transform="translate(142.58681,535.5081)">
          <path
             d="M 0,0 0.618,0.412 1.03,-0.515 Z"
             style="fill:#231f20;fill-opacity:1;fill-rule:nonzero;stroke:none"
             id="path242" />
        </g>
        <g
           id="g244"
           transform="translate(130.8466,528.19411)">
          <path
             d="M 0,0 0.104,1.03 0.824,0 Z"
             style="fill:#231f20;fill-opacity:1;fill-rule:nonzero;stroke:none"
             id="path246" />
        </g>
        <g
           id="g248"
           transform="translate(132.495,521.4968)">
          <path
             d="M 0,0 0.618,0.412 1.03,-0.515 Z"
             style="fill:#231f20;fill-opacity:1;fill-rule:nonzero;stroke:none"
             id="path250" />
        </g>
        <g
           id="g252"
           transform="translate(131.7744,539.011)">
          <path
             d="M 0,0 0.103,1.03 0.823,0 Z"
             style="fill:#231f20;fill-opacity:1;fill-rule:nonzero;stroke:none"
             id="path254" />
        </g>
        <g
           id="g256"
           transform="translate(130.9501,534.6843)">
          <path
             d="M 0,0 0.618,0.412 1.03,-0.515 Z"
             style="fill:#231f20;fill-opacity:1;fill-rule:nonzero;stroke:none"
             id="path258" />
        </g>
        <g
           id="g260"
           transform="translate(138.5712,526.5451)">
          <path
             d="M 0,0 C 0.274,-0.128 0.716,-0.253 0.982,-0.076 1.101,0.004 0.995,0.308 0.865,0.491 0.679,0.752 0.448,0.949 0.557,1.255 0.591,1.354 0.725,1.496 0.755,1.566 1.002,2.125 0.132,2.269 -0.296,2.468 -0.572,2.596 -0.706,2.9 -0.724,3.213 -0.862,3.108 -1.035,3.005 -1.209,2.865 -1.287,2.803 -1.248,2.439 -1.35,2.448 c 0,0 -0.972,-0.557 -0.938,-0.731 C -2.155,1.058 -2.184,0.569 -2.322,0.465 -2.461,0.361 -3.227,0.082 -2.636,-0.092 -2.044,-0.266 -1.592,0.361 -1.279,0.221 -0.966,0.082 0,0 0,0"
             style="fill:#ffffff;fill-opacity:1;fill-rule:nonzero;stroke:none"
             id="path262" />
        </g>
        <g
           id="g264"
           transform="translate(138.5712,526.5451)">
          <path
             d="M 0,0 C 0.274,-0.128 0.716,-0.253 0.982,-0.076 1.101,0.004 0.995,0.308 0.865,0.491 0.679,0.752 0.448,0.949 0.557,1.255 0.591,1.354 0.725,1.496 0.755,1.566 1.002,2.125 0.132,2.269 -0.296,2.468 -0.572,2.596 -0.706,2.9 -0.724,3.213 -0.862,3.108 -1.035,3.005 -1.209,2.865 -1.287,2.803 -1.248,2.439 -1.35,2.448 c 0,0 -0.972,-0.557 -0.938,-0.731 C -2.155,1.058 -2.184,0.569 -2.322,0.465 -2.461,0.361 -3.227,0.082 -2.636,-0.092 -2.044,-0.266 -1.592,0.361 -1.279,0.221 -0.966,0.082 0,0 0,0 Z"
             style="fill:none;stroke:#231f20;stroke-width:0.216;stroke-linecap:butt;stroke-linejoin:miter;stroke-miterlimit:4;stroke-dasharray:none;stroke-opacity:1"
             id="path266" />
        </g>
        <g
           id="g268"
           transform="translate(146.5009,522.8372)">
          <path
             d="M 0,0 C 0.275,-0.129 0.716,-0.253 0.981,-0.076 1.102,0.004 0.995,0.307 0.864,0.49 0.679,0.751 0.448,0.948 0.556,1.254 0.591,1.353 0.725,1.496 0.755,1.566 1.001,2.124 0.131,2.269 -0.296,2.467 -0.572,2.595 -0.706,2.899 -0.723,3.212 -0.862,3.108 -1.036,3.004 -1.21,2.864 -1.287,2.803 -1.248,2.438 -1.349,2.447 c 0,0 -0.973,-0.557 -0.939,-0.731 C -2.156,1.057 -2.184,0.568 -2.322,0.464 -2.461,0.36 -3.227,0.081 -2.636,-0.093 -2.044,-0.267 -1.592,0.36 -1.279,0.22 -0.967,0.081 0,0 0,0"
             style="fill:#ffffff;fill-opacity:1;fill-rule:nonzero;stroke:none"
             id="path270" />
        </g>
        <g
           id="g272"
           transform="translate(146.5009,522.8372)">
          <path
             d="M 0,0 C 0.275,-0.129 0.716,-0.253 0.981,-0.076 1.102,0.004 0.995,0.307 0.864,0.49 0.679,0.751 0.448,0.948 0.556,1.254 0.591,1.353 0.725,1.496 0.755,1.566 1.001,2.124 0.131,2.269 -0.296,2.467 -0.572,2.595 -0.706,2.899 -0.723,3.212 -0.862,3.108 -1.036,3.004 -1.21,2.864 -1.287,2.803 -1.248,2.438 -1.349,2.447 c 0,0 -0.973,-0.557 -0.939,-0.731 C -2.156,1.057 -2.184,0.568 -2.322,0.464 -2.461,0.36 -3.227,0.081 -2.636,-0.093 -2.044,-0.267 -1.592,0.36 -1.279,0.22 -0.967,0.081 0,0 0,0 Z"
             style="fill:none;stroke:#231f20;stroke-width:0.216;stroke-linecap:butt;stroke-linejoin:miter;stroke-miterlimit:4;stroke-dasharray:none;stroke-opacity:1"
             id="path274" />
        </g>
        <g
           id="g276"
           transform="translate(138.416,522.27029)">
          <path
             d="M 0,0 0.618,0.413 1.03,-0.515 Z"
             style="fill:#231f20;fill-opacity:1;fill-rule:nonzero;stroke:none"
             id="path278" />
        </g>
      </g>
    </g>
    <g
       id="g280"
       transform="matrix(0.35277777,0,0,-0.35277777,-46.239564,200.52564)">
      <g
         id="g282"
         clip-path="url(#clipPath286)">
        <g
           id="g288"
           transform="translate(137.1581,547.09689)">
          <path
             d="M 0,0 0.515,0.515 0.927,-0.309 Z"
             style="fill:#231f20;fill-opacity:1;fill-rule:nonzero;stroke:none"
             id="path290" />
        </g>
        <g
           id="g292"
           transform="translate(139.96091,549.9821)">
          <path
             d="M 0,0 0.103,1.03 0.824,0 Z"
             style="fill:#231f20;fill-opacity:1;fill-rule:nonzero;stroke:none"
             id="path294" />
        </g>
        <g
           id="g296"
           transform="translate(140.373,542.8728)">
          <path
             d="M 0,0 0.103,1.031 0.824,0 Z"
             style="fill:#231f20;fill-opacity:1;fill-rule:nonzero;stroke:none"
             id="path298" />
        </g>
        <g
           id="g300"
           transform="translate(149.8466,550.08521)">
          <path
             d="M 0,0 0.618,0.412 1.03,-0.515 Z"
             style="fill:#231f20;fill-opacity:1;fill-rule:nonzero;stroke:none"
             id="path302" />
        </g>
        <g
           id="g304"
           transform="translate(147.2724,546.5822)">
          <path
             d="M 0,0 0.515,0.515 0.927,-0.309 Z"
             style="fill:#231f20;fill-opacity:1;fill-rule:nonzero;stroke:none"
             id="path306" />
        </g>
        <g
           id="g308"
           transform="translate(141.9169,545.8611)">
          <path
             d="M 0,0 0.103,1.03 0.824,0 Z"
             style="fill:#231f20;fill-opacity:1;fill-rule:nonzero;stroke:none"
             id="path310" />
        </g>
        <g
           id="g312"
           transform="translate(144.5948,548.9519)">
          <path
             d="M 0,0 0.103,1.03 0.824,0 Z"
             style="fill:#231f20;fill-opacity:1;fill-rule:nonzero;stroke:none"
             id="path314" />
        </g>
        <g
           id="g316"
           transform="translate(147.1689,554.1003)">
          <path
             d="m 0,0 c -0.331,-0.147 -0.435,-0.512 -0.794,-0.567 -0.065,-0.009 -0.222,-0.129 -0.267,-0.241 -0.068,-0.165 -0.068,-0.402 0.018,-0.524 0.079,-0.115 0.277,-0.227 0.339,-0.329 0.183,-0.304 -0.137,-0.799 0.149,-1.046 0.245,-0.212 0.662,-0.359 0.993,-0.218 0.271,0.116 0.182,0.46 0.246,0.728 0.064,0.265 0.326,0.445 0.547,0.522 0.115,0.041 0.319,0.088 0.37,0.141 C 2.17,-0.916 1.827,0.143 1.129,0.486 0.718,0.686 0.363,0.16 0,0"
             style="fill:#ffffff;fill-opacity:1;fill-rule:nonzero;stroke:none"
             id="path318" />
        </g>
        <g
           id="g320"
           transform="translate(147.1689,554.1003)">
          <path
             d="m 0,0 c -0.331,-0.147 -0.435,-0.512 -0.794,-0.567 -0.065,-0.009 -0.222,-0.129 -0.267,-0.241 -0.068,-0.165 -0.068,-0.402 0.018,-0.524 0.079,-0.115 0.277,-0.227 0.339,-0.329 0.183,-0.304 -0.137,-0.799 0.149,-1.046 0.245,-0.212 0.662,-0.359 0.993,-0.218 0.271,0.116 0.182,0.46 0.246,0.728 0.064,0.265 0.326,0.445 0.547,0.522 0.115,0.041 0.319,0.088 0.37,0.141 C 2.17,-0.916 1.827,0.143 1.129,0.486 0.718,0.686 0.363,0.16 0,0 Z"
             style="fill:none;stroke:#231f20;stroke-width:0.216;stroke-linecap:butt;stroke-linejoin:miter;stroke-miterlimit:4;stroke-dasharray:none;stroke-opacity:1"
             id="path322" />
        </g>
        <g
           id="g324"
           transform="translate(148.621,544.4509)">
          <path
             d="M 0,0 C 0.276,-0.128 0.716,-0.252 0.982,-0.075 1.102,0.005 0.996,0.308 0.865,0.491 0.68,0.752 0.448,0.949 0.557,1.255 0.592,1.354 0.725,1.497 0.756,1.567 1.003,2.125 0.132,2.27 -0.296,2.468 -0.572,2.596 -0.706,2.9 -0.721,3.213 -0.861,3.109 -1.036,3.005 -1.209,2.865 -1.286,2.804 -1.247,2.439 -1.348,2.448 c 0,0 -0.974,-0.557 -0.939,-0.731 C -2.155,1.058 -2.182,0.569 -2.322,0.465 -2.461,0.361 -3.225,0.082 -2.635,-0.092 -2.043,-0.266 -1.591,0.361 -1.279,0.221 -0.966,0.082 0,0 0,0"
             style="fill:#ffffff;fill-opacity:1;fill-rule:nonzero;stroke:none"
             id="path326" />
        </g>
        <g
           id="g328"
           transform="translate(148.621,544.4509)">
          <path
             d="M 0,0 C 0.276,-0.128 0.716,-0.252 0.982,-0.075 1.102,0.005 0.996,0.308 0.865,0.491 0.68,0.752 0.448,0.949 0.557,1.255 0.592,1.354 0.725,1.497 0.756,1.567 1.003,2.125 0.132,2.27 -0.296,2.468 -0.572,2.596 -0.706,2.9 -0.721,3.213 -0.861,3.109 -1.036,3.005 -1.209,2.865 -1.286,2.804 -1.247,2.439 -1.348,2.448 c 0,0 -0.974,-0.557 -0.939,-0.731 C -2.155,1.058 -2.182,0.569 -2.322,0.465 -2.461,0.361 -3.225,0.082 -2.635,-0.092 -2.043,-0.266 -1.591,0.361 -1.279,0.221 -0.966,0.082 0,0 0,0 Z m -10.063,-2.221 c -0.349,-0.339 -0.458,-0.749 -0.837,-1.018 -0.07,-0.051 -0.234,-0.259 -0.282,-0.391 -0.071,-0.197 -0.07,-0.42 0.021,-0.484 0.085,-0.059 0.295,-0.043 0.362,-0.101 0.196,-0.172 -0.139,-0.835 0.163,-0.893 0.262,-0.048 0.704,0.069 1.054,0.404 0.287,0.276 0.19,0.544 0.256,0.834 0.066,0.29 0.344,0.619 0.577,0.828 0.122,0.109 0.337,0.277 0.39,0.358 0.6,0.93 0.231,1.717 -0.51,1.612 -0.436,-0.063 -0.809,-0.775 -1.194,-1.149 z"
             style="fill:none;stroke:#231f20;stroke-width:0.216;stroke-linecap:butt;stroke-linejoin:miter;stroke-miterlimit:4;stroke-dasharray:none;stroke-opacity:1"
             id="path330" />
        </g>
      </g>
    </g>
    <g
       id="g332"
       transform="matrix(0.35277777,0,0,-0.35277777,-46.239564,200.52564)">
      <g
         id="g334"
         clip-path="url(#clipPath338)">
        <g
           id="g340"
           transform="translate(135.4296,519.2829)">
          <path
             d="M 0,0 0.104,1.03 0.823,0 Z"
             style="fill:#231f20;fill-opacity:1;fill-rule:nonzero;stroke:none"
             id="path342" />
        </g>
        <g
           id="g344"
           transform="translate(130.6572,519.40691)">
          <path
             d="M 0,0 0.515,0.516 0.927,-0.309 Z"
             style="fill:#231f20;fill-opacity:1;fill-rule:nonzero;stroke:none"
             id="path346" />
        </g>
      </g>
    </g>
    <g
       id="g348"
       transform="matrix(0.35277777,0,0,-0.35277777,-46.239564,200.52564)">
      <g
         id="g350"
         clip-path="url(#clipPath354)">
        <g
           id="g356"
           transform="translate(137.1797,551.93919)">
          <path
             d="M 0,0 0.618,0.412 1.03,-0.515 Z"
             style="fill:#231f20;fill-opacity:1;fill-rule:nonzero;stroke:none"
             id="path358" />
        </g>
        <g
           id="g360"
           transform="translate(137.0771,548.1281)">
          <path
             d="M 0,0 0.618,0.412 1.03,-0.516 Z"
             style="fill:#231f20;fill-opacity:1;fill-rule:nonzero;stroke:none"
             id="path362" />
        </g>
        <g
           id="g364"
           transform="translate(133.87199,550.7238)">
          <path
             d="M 0,0 0.103,1.031 0.823,0 Z"
             style="fill:#231f20;fill-opacity:1;fill-rule:nonzero;stroke:none"
             id="path366" />
        </g>
        <g
           id="g368"
           transform="translate(132.05659,550.0808)">
          <path
             d="m 0,0 c -0.349,-0.339 -0.457,-0.749 -0.837,-1.017 -0.068,-0.051 -0.233,-0.259 -0.281,-0.392 -0.071,-0.197 -0.07,-0.419 0.021,-0.483 0.084,-0.059 0.294,-0.043 0.361,-0.101 0.195,-0.173 -0.139,-0.835 0.164,-0.893 0.26,-0.049 0.704,0.069 1.053,0.404 0.287,0.275 0.19,0.543 0.256,0.834 0.066,0.289 0.343,0.619 0.576,0.828 0.124,0.108 0.338,0.277 0.391,0.358 C 2.305,0.468 1.936,1.254 1.193,1.149 0.759,1.087 0.385,0.375 0,0"
             style="fill:#ffffff;fill-opacity:1;fill-rule:nonzero;stroke:none"
             id="path370" />
        </g>
        <g
           id="g372"
           transform="translate(132.05659,550.0808)">
          <path
             d="m 0,0 c -0.349,-0.339 -0.457,-0.749 -0.837,-1.017 -0.068,-0.051 -0.233,-0.259 -0.281,-0.392 -0.071,-0.197 -0.07,-0.419 0.021,-0.483 0.084,-0.059 0.294,-0.043 0.361,-0.101 0.195,-0.173 -0.139,-0.835 0.164,-0.893 0.26,-0.049 0.704,0.069 1.053,0.404 0.287,0.275 0.19,0.543 0.256,0.834 0.066,0.289 0.343,0.619 0.576,0.828 0.124,0.108 0.338,0.277 0.391,0.358 C 2.305,0.468 1.936,1.254 1.193,1.149 0.759,1.087 0.385,0.375 0,0 Z"
             style="fill:none;stroke:#231f20;stroke-width:0.216;stroke-linecap:butt;stroke-linejoin:miter;stroke-miterlimit:4;stroke-dasharray:none;stroke-opacity:1"
             id="path374" />
        </g>
        <g
           id="g376"
           transform="translate(132.1337,541.43089)">
          <path
             d="M 0,0 C 0.276,-0.129 0.718,-0.254 0.982,-0.076 1.103,0.003 0.996,0.306 0.866,0.49 0.681,0.751 0.448,0.948 0.558,1.255 0.594,1.353 0.726,1.496 0.756,1.565 1.003,2.124 0.132,2.269 -0.296,2.467 -0.57,2.595 -0.706,2.898 -0.722,3.213 -0.86,3.108 -1.034,3.003 -1.208,2.865 -1.286,2.803 -1.247,2.438 -1.348,2.447 c 0,0 -0.972,-0.556 -0.939,-0.731 C -2.154,1.057 -2.182,0.569 -2.32,0.464 -2.461,0.36 -3.225,0.081 -2.635,-0.093 -2.043,-0.266 -1.592,0.36 -1.277,0.221 -0.965,0.081 0,0 0,0"
             style="fill:#ffffff;fill-opacity:1;fill-rule:nonzero;stroke:none"
             id="path378" />
        </g>
        <g
           id="g380"
           transform="translate(132.1337,541.43089)">
          <path
             d="M 0,0 C 0.276,-0.129 0.718,-0.254 0.982,-0.076 1.103,0.003 0.996,0.306 0.866,0.49 0.681,0.751 0.448,0.948 0.558,1.255 0.594,1.353 0.726,1.496 0.756,1.565 1.003,2.124 0.132,2.269 -0.296,2.467 -0.57,2.595 -0.706,2.898 -0.722,3.213 -0.86,3.108 -1.034,3.003 -1.208,2.865 -1.286,2.803 -1.247,2.438 -1.348,2.447 c 0,0 -0.972,-0.556 -0.939,-0.731 C -2.154,1.057 -2.182,0.569 -2.32,0.464 -2.461,0.36 -3.225,0.081 -2.635,-0.093 -2.043,-0.266 -1.592,0.36 -1.277,0.221 -0.965,0.081 0,0 0,0 Z"
             style="fill:none;stroke:#231f20;stroke-width:0.216;stroke-linecap:butt;stroke-linejoin:miter;stroke-miterlimit:4;stroke-dasharray:none;stroke-opacity:1"
             id="path382" />
        </g>
      </g>
    </g>
    <g
       id="g396"
       transform="matrix(0.35277777,0,0,-0.35277777,-46.239564,200.52564)">
      <g
         id="g398"
         clip-path="url(#clipPath402)">
        <g
           id="g404"
           transform="translate(150.37,551.6062)">
          <path
             d="M 0,0 V -31.807"
             style="fill:none;stroke:#231f20;stroke-width:0.5;stroke-linecap:butt;stroke-linejoin:miter;stroke-miterlimit:4;stroke-dasharray:none;stroke-opacity:1"
             id="path406" />
        </g>
      </g>
    </g>
    <g
       id="g416"
       transform="matrix(0.35277777,0,0,-0.35277777,-46.239564,200.52564)">
      <g
         id="g418"
         clip-path="url(#clipPath422)">
        <g
           id="g424"
           transform="translate(150.8437,543.362)">
          <path
             d="M 0,0 V 16.445"
             style="fill:none;stroke:#231f20;stroke-width:1;stroke-linecap:butt;stroke-linejoin:miter;stroke-miterlimit:4;stroke-dasharray:none;stroke-opacity:1"
             id="path426" />
        </g>
        <g
           id="g428"
           transform="translate(150.78999,540.7722)">
          <path
             d="M 0,0 -1.725,5.026 0.054,4.31 1.714,5.03 Z"
             style="fill:#231f20;fill-opacity:1;fill-rule:nonzero;stroke:none"
             id="path430" />
        </g>
        <g
           id="g432"
           transform="translate(165.0995,543.362)">
          <path
             d="M 0,0 V 16.445"
             style="fill:none;stroke:#231f20;stroke-width:0.75;stroke-linecap:butt;stroke-linejoin:miter;stroke-miterlimit:4;stroke-dasharray:none;stroke-opacity:1"
             id="path434" />
        </g>
        <g
           id="g436"
           transform="translate(165.05659,540.7722)">
          <path
             d="M 0,0 -1.724,5.026 0.056,4.31 1.716,5.03 Z"
             style="fill:#231f20;fill-opacity:1;fill-rule:nonzero;stroke:none"
             id="path438" />
        </g>
        <g
           id="g440"
           transform="translate(179.35249,543.362)">
          <path
             d="M 0,0 V 16.445"
             style="fill:none;stroke:#231f20;stroke-width:0.75;stroke-linecap:butt;stroke-linejoin:miter;stroke-miterlimit:4;stroke-dasharray:none;stroke-opacity:1"
             id="path442" />
        </g>
        <g
           id="g444"
           transform="translate(179.3261,540.7722)">
          <path
             d="M 0,0 -1.725,5.026 0.054,4.31 1.715,5.03 Z"
             style="fill:#231f20;fill-opacity:1;fill-rule:nonzero;stroke:none"
             id="path446" />
        </g>
        <g
           id="g448"
           transform="translate(193.6064,543.362)">
          <path
             d="M 0,0 V 16.445"
             style="fill:none;stroke:#231f20;stroke-width:0.75;stroke-linecap:butt;stroke-linejoin:miter;stroke-miterlimit:4;stroke-dasharray:none;stroke-opacity:1"
             id="path450" />
        </g>
        <g
           id="g452"
           transform="translate(193.5937,540.7722)">
          <path
             d="M 0,0 -1.724,5.026 0.056,4.31 1.716,5.03 Z"
             style="fill:#231f20;fill-opacity:1;fill-rule:nonzero;stroke:none"
             id="path454" />
        </g>
        <g
           id="g456"
           transform="translate(207.86031,543.362)">
          <path
             d="M 0,0 V 16.445"
             style="fill:none;stroke:#231f20;stroke-width:0.75;stroke-linecap:butt;stroke-linejoin:miter;stroke-miterlimit:4;stroke-dasharray:none;stroke-opacity:1"
             id="path458" />
        </g>
        <g
           id="g460"
           transform="translate(207.8632,540.7722)">
          <path
             d="M 0,0 -1.726,5.026 0.055,4.31 1.715,5.03 Z"
             style="fill:#231f20;fill-opacity:1;fill-rule:nonzero;stroke:none"
             id="path462" />
        </g>
        <g
           id="g464"
           transform="translate(222.11369,543.362)">
          <path
             d="M 0,0 V 16.445"
             style="fill:none;stroke:#231f20;stroke-width:0.75;stroke-linecap:butt;stroke-linejoin:miter;stroke-miterlimit:4;stroke-dasharray:none;stroke-opacity:1"
             id="path466" />
        </g>
        <g
           id="g468"
           transform="translate(222.13071,540.7722)">
          <path
             d="M 0,0 -1.725,5.026 0.056,4.31 1.715,5.03 Z"
             style="fill:#231f20;fill-opacity:1;fill-rule:nonzero;stroke:none"
             id="path470" />
        </g>
        <g
           id="g472"
           transform="translate(236.36771,543.362)">
          <path
             d="M 0,0 V 16.445"
             style="fill:none;stroke:#231f20;stroke-width:0.75;stroke-linecap:butt;stroke-linejoin:miter;stroke-miterlimit:4;stroke-dasharray:none;stroke-opacity:1"
             id="path474" />
        </g>
        <g
           id="g476"
           transform="translate(236.4007,540.7722)">
          <path
             d="M 0,0 -1.727,5.026 0.053,4.31 1.713,5.03 Z"
             style="fill:#231f20;fill-opacity:1;fill-rule:nonzero;stroke:none"
             id="path478" />
        </g>
        <g
           id="g480"
           transform="translate(150.5732,559.8069)">
          <path
             d="M 0,0 H 85.794"
             style="fill:none;stroke:#231f20;stroke-width:0.3;stroke-linecap:butt;stroke-linejoin:miter;stroke-miterlimit:4;stroke-dasharray:none;stroke-opacity:1"
             id="path482" />
        </g>
      </g>
    </g>
    <g
       id="g496"
       transform="matrix(0.35277777,0,0,-0.35277777,-46.239564,200.52564)">
      <g
         id="g498"
         clip-path="url(#clipPath502)">
        <g
           id="g504"
           transform="translate(153.5312,413.11121)">
          <path
             d="M 0,0 -0.344,0.824 0,1.649 -3.094,0.824 Z"
             style="fill:#231f20;fill-opacity:1;fill-rule:nonzero;stroke:none"
             id="path506" />
        </g>
        <g
           id="g508"
           transform="translate(152.8154,413.91521)">
          <path
             d="m 0,0 h 33.52 m 13.673,0 h 33.36"
             style="fill:none;stroke:#231f20;stroke-width:0.3;stroke-linecap:round;stroke-linejoin:miter;stroke-miterlimit:4;stroke-dasharray:none;stroke-opacity:1"
             id="path510" />
        </g>
        <g
           id="g512"
           transform="translate(232.95171,414.76019)">
          <path
             d="M 0,0 0.343,-0.825 0,-1.649 3.093,-0.825 Z"
             style="fill:#231f20;fill-opacity:1;fill-rule:nonzero;stroke:none"
             id="path514" />
        </g>
      </g>
    </g>
    <g
       id="g522"
       transform="matrix(0.35277777,0,0,-0.35277777,-46.239564,200.52564)">
      <g
         id="g524"
         clip-path="url(#clipPath528)">
        <g
           id="g530"
           transform="translate(150.45399,516.35229)">
          <path
             d="m 0,0 v -107.51 m 85.581,17.254 v -17.254"
             style="fill:none;stroke:#231f20;stroke-width:0.3;stroke-linecap:round;stroke-linejoin:miter;stroke-miterlimit:4;stroke-dasharray:none;stroke-opacity:1"
             id="path532" />
        </g>
      </g>
    </g>
    <g
       id="g542"
       transform="matrix(0.35277777,0,0,-0.35277777,44.464787,12.222324)">
      <path
         d="M 0,0 0.826,0.345 1.65,0 0.826,3.095 Z"
         style="fill:#231f20;fill-opacity:1;fill-rule:nonzero;stroke:none"
         id="path544" />
    </g>
    <g
       id="g546"
       transform="matrix(0.35277777,0,0,-0.35277777,44.751595,11.937417)">
      <path
         d="M 0,0 V -48.001"
         style="fill:none;stroke:#231f20;stroke-width:0.3;stroke-linecap:round;stroke-linejoin:miter;stroke-miterlimit:4;stroke-dasharray:none;stroke-opacity:1"
         id="path548" />
    </g>
    <g
       id="g550"
       transform="matrix(0.35277777,0,0,-0.35277777,45.047223,47.904381)">
      <path
         d="M 0,0 -0.825,-0.343 -1.651,0 -0.825,-3.093 Z"
         style="fill:#231f20;fill-opacity:1;fill-rule:nonzero;stroke:none"
         id="path552" />
    </g>
    <g
       id="g554"
       transform="matrix(0.35277777,0,0,-0.35277777,44.751595,48.368989)">
      <path
         d="m 0,0 v 46.603 m 5.711,59.001 h -21.764"
         style="fill:none;stroke:#231f20;stroke-width:0.3;stroke-linecap:round;stroke-linejoin:miter;stroke-miterlimit:4;stroke-dasharray:none;stroke-opacity:1"
         id="path556" />
    </g>
    <g
       id="g558"
       transform="matrix(0.35277777,0,0,-0.35277777,51.771167,49.023392)">
      <path
         d="m 0,0 -6.854,-2.386 0.975,2.46 -0.98,2.295 z"
         style="fill:#231f20;fill-opacity:1;fill-rule:nonzero;stroke:none"
         id="path560" />
    </g>
    <g
       id="g562"
       transform="matrix(0.35277777,0,0,-0.35277777,50.007278,48.998694)">
      <path
         d="M 0,0 H -33.004"
         style="fill:none;stroke:#231f20;stroke-width:1.11;stroke-linecap:butt;stroke-linejoin:miter;stroke-miterlimit:4;stroke-dasharray:none;stroke-opacity:1"
         id="path564" />
    </g>
    <g
       id="g570"
       transform="matrix(0.35277777,0,0,-0.35277777,-46.239564,200.52564)">
      <g
         id="g572"
         clip-path="url(#clipPath576)">
        <g
           id="g578"
           transform="translate(-2536.8572,4082.4482)">
          <path
             d="m 0,0 -62.17,-48.78 2766.871,-3526.377 62.174,48.782"
             style="fill:#bdbcbc;fill-opacity:1;fill-rule:nonzero;stroke:none"
             id="path580" />
        </g>
      </g>
    </g>
    <g
       id="g582"
       transform="matrix(0.35277777,0,0,-0.35277777,-46.239564,200.52564)">
      <g
         id="g584">
        <g
           id="g590">
          <g
             id="g592"
             clip-path="url(#clipPath596)">
            <path
               d="m 150.455,540.718 -0.001,-10e-4 v -7.645 h 75.494 l 5.928,-5.929 v -98.221 h 7.645 l 0.002,10e-4 v 111.795 z"
               style="fill:url(#linearGradient602);stroke:none"
               id="path604" />
          </g>
        </g>
      </g>
    </g>
    <g
       id="g606"
       transform="matrix(0.35277777,0,0,-0.35277777,-46.239564,200.52564)">
      <g
         id="g608">
        <g
           id="g614">
          <g
             id="g616"
             clip-path="url(#clipPath620)">
            <path
               d="m 150.454,540.718 v -7.646 h 75.494 l 5.928,-5.929 v -98.221 h 7.645 l 0.002,10e-4 v 111.795 z"
               style="fill:url(#linearGradient626);stroke:none"
               id="path628" />
          </g>
        </g>
      </g>
    </g>
    <g
       id="g630"
       transform="matrix(0.35277777,0,0,-0.35277777,-46.239564,200.52564)">
      <g
         id="g632"
         clip-path="url(#clipPath636)">
        <g
           id="g638"
           transform="translate(248.0867,533.0432)">
          <path
             d="m 0,0 -62.173,-48.783 2766.869,-3526.372 62.18,48.78"
             style="fill:#bdbcbc;fill-opacity:1;fill-rule:nonzero;stroke:none"
             id="path640" />
        </g>
      </g>
    </g>
    <g
       id="g642"
       transform="matrix(0.35277777,0,0,-0.35277777,-46.239564,200.52564)">
      <g
         id="g644"
         clip-path="url(#clipPath648)">
        <g
           id="g650"
           transform="translate(150.45399,540.718)">
          <path
             d="m 0,0 v -7.646 h 75.494 l 5.928,-5.929 v -98.221 H 89.07 V 0 Z"
             style="fill:none;stroke:#231f20;stroke-width:0.5;stroke-linecap:butt;stroke-linejoin:miter;stroke-miterlimit:4;stroke-dasharray:none;stroke-opacity:1"
             id="path652" />
        </g>
      </g>
    </g>
    <text
       xml:space="preserve"
       style="font-size:2.11667px;line-height:1.25;font-family:sans-serif;stroke-width:0.264583"
       x="41.131157"
       y="30.853226"
       id="text5226"><tspan
         sodipodi:role="line"
         id="tspan5224"
         style="font-size:2.11667px;stroke-width:0.264583"
         x="41.131157"
         y="30.853226">$4$\;m</tspan></text>
    <text
       xml:space="preserve"
       style="font-size:2.11667px;line-height:1.25;font-family:sans-serif;stroke-width:0.264583;text-anchor:middle;text-align:center"
       x="21.434151"
       y="55.194916"
       id="text10256"><tspan
         sodipodi:role="line"
         id="tspan10254"
         style="font-size:2.11667px;stroke-width:0.264583;text-anchor:middle;text-align:center"
         x="17.847801"
         y="55.194916">$3$\;m</tspan></text>
    <text
       xml:space="preserve"
       style="font-size:2.11667px;line-height:1.25;font-family:sans-serif;text-align:end;text-anchor:end;stroke-width:0.264583"
       x="51.428219"
       y="52.019913"
       id="text12162"><tspan
         sodipodi:role="line"
         id="tspan12160"
         style="font-size:2.11667px;text-align:end;text-anchor:end;stroke-width:0.264583"
         x="51.428219"
         y="52.019913">$12$\;kN</tspan></text>
    <text
       xml:space="preserve"
       style="font-size:2.11667px;line-height:1.25;font-family:sans-serif;text-align:center;text-anchor:middle;stroke-width:0.264583"
       x="22.220665"
       y="2.2782178"
       id="text13653"><tspan
         sodipodi:role="line"
         id="tspan13651"
         style="font-size:2.11667px;text-align:center;text-anchor:middle;stroke-width:0.264583"
         x="22.220665"
         y="2.2782178">$6$\;kNm$^{-1}$</tspan></text>
    <text
       xml:space="preserve"
       style="font-size:2.11667px;line-height:1.25;font-family:sans-serif;stroke-width:0.264583"
       x="9.235548"
       y="15.361479"
       id="text14945"><tspan
         sodipodi:role="line"
         id="tspan14943"
         style="font-size:2.11667px;stroke-width:0.264583"
         x="9.235548"
         y="15.361479">$A$</tspan></text>
    <text
       xml:space="preserve"
       style="font-size:2.11667px;line-height:1.25;font-family:sans-serif;text-align:end;text-anchor:end;stroke-width:0.264583"
       x="34.367741"
       y="49.903244"
       id="text15307"><tspan
         sodipodi:role="line"
         id="tspan15305"
         style="font-size:2.11667px;text-align:end;text-anchor:end;stroke-width:0.264583"
         x="34.367741"
         y="49.903244">$C$</tspan></text>
    <text
       xml:space="preserve"
       style="font-size:2.11667px;line-height:1.25;font-family:sans-serif;stroke-width:0.264583"
       x="29.343889"
       y="15.361479"
       id="text19103"><tspan
         sodipodi:role="line"
         id="tspan19101"
         style="font-size:2.11667px;stroke-width:0.264583"
         x="29.343889"
         y="15.361479">$B$</tspan></text>
    <g
       id="g20265"
       transform="matrix(-0.35277777,0,0,0.35277777,66.204829,-177.44237)">
      <g
         id="g20263"
         clip-path="url(#clipPath402)"
         transform="rotate(13.055746,160.06784,610.4699)"
         style="stroke-width:0.992126;stroke-miterlimit:4;stroke-dasharray:none">
        <g
           id="g20261"
           transform="translate(150.37,551.6062)"
           style="stroke-width:0.992126;stroke-miterlimit:4;stroke-dasharray:none">
          <path
             d="M 0,0 1.0441953,-41.134471"
             style="fill:none;stroke:#231f20;stroke-width:0.992126;stroke-linecap:butt;stroke-linejoin:miter;stroke-miterlimit:4;stroke-dasharray:none;stroke-opacity:1"
             id="path20259"
             sodipodi:nodetypes="cc" />
        </g>
      </g>
    </g>
    <text
       xml:space="preserve"
       style="font-size:2.11667px;line-height:1.25;font-family:sans-serif;text-align:center;text-anchor:middle;fill:#666666;stroke-width:0.264583"
       x="1.053998"
       y="2.2782178"
       id="text21621"><tspan
         sodipodi:role="line"
         id="tspan21619"
         style="font-size:2.11667px;text-align:center;text-anchor:middle;fill:#666666;stroke-width:0.264583"
         x="1.0539978"
         y="2.2782178">$0.5$\;mrad</tspan></text>
    <path
       style="fill:none;stroke:#000000;stroke-width:0.264583px;stroke-linecap:butt;stroke-linejoin:miter;stroke-opacity:1"
       d="m 6.9775758,4.0587002 c 0,0 -0.4996565,-0.4304738 -1.0602424,-0.4586683 -0.426053,-0.021428 -0.8619995,0.4315708 -0.8619995,0.4315708"
       id="path23698"
       sodipodi:nodetypes="csc" />
    <text
       xml:space="preserve"
       style="font-size:2.11667px;line-height:1.25;font-family:sans-serif;text-align:end;text-anchor:end;stroke-width:0.264583;fill:#666666"
       x="-33.57568"
       y="34.621365"
       id="text24413"
       transform="rotate(-90)"><tspan
         sodipodi:role="line"
         id="tspan24411"
         style="font-size:2.11667px;text-align:end;text-anchor:end;stroke-width:0.264583;fill:#666666"
         x="-33.57568"
         y="34.621365">$20^\circ$C</tspan></text>
    <text
       xml:space="preserve"
       style="font-size:2.11667px;line-height:1.25;font-family:sans-serif;text-align:end;text-anchor:end;stroke-width:0.264583;fill:#666666"
       x="-33.046513"
       y="40.971371"
       id="text24651"
       transform="rotate(-90)"><tspan
         sodipodi:role="line"
         id="tspan24649"
         style="font-size:2.11667px;text-align:end;text-anchor:end;stroke-width:0.264583;fill:#666666"
         x="-33.046513"
         y="40.971371">$-15^\circ$C</tspan></text>
  </g>
</svg>
