#FIG 3.2
Landscape
Center
Inches
Letter  
100.00
Single
-2
1200 2
6 3525 2400 3825 2700
2 3 0 1 0 7 50 0 -1 4.000 0 0 -1 0 0 4
	 3525 2625 3675 2400 3825 2625 3525 2625
2 1 0 1 0 7 50 0 -1 4.000 0 0 -1 0 0 2
	 3525 2700 3825 2700
-6
6 1050 2325 6150 2700
6 5850 2400 6150 2700
2 3 0 1 0 7 50 0 -1 4.000 0 0 -1 0 0 4
	 5850 2625 6000 2400 6150 2625 5850 2625
2 1 0 1 0 7 50 0 -1 4.000 0 0 -1 0 0 2
	 5850 2700 6150 2700
-6
2 1 0 3 0 7 50 0 -1 8.000 0 0 -1 0 0 2
	 1200 2400 6000 2400
2 3 0 1 0 7 50 0 -1 4.000 0 0 -1 0 0 4
	 1050 2625 1200 2400 1350 2625 1050 2625
-6
6 12225 2400 12525 2700
2 3 0 1 0 7 50 0 -1 4.000 0 0 -1 0 0 4
	 12225 2625 12375 2400 12525 2625 12225 2625
2 1 0 1 0 7 50 0 -1 4.000 0 0 -1 0 0 2
	 12225 2700 12525 2700
-6
2 1 0 1 0 7 50 0 -1 4.000 0 0 -1 0 0 2
	 3675 2775 3675 3450
2 1 0 1 0 7 50 0 -1 4.000 0 0 -1 0 0 2
	 6000 2775 6000 3450
2 1 0 1 0 7 50 0 -1 4.000 0 0 -1 0 0 2
	 1200 2775 1200 3450
2 1 0 1 0 7 50 0 -1 4.000 0 0 -1 0 0 2
	 4800 2775 4800 3450
2 1 0 1 0 7 50 0 -1 4.000 0 0 -1 1 1 2
	1 1 1.00 60.00 120.00
	1 1 1.00 60.00 120.00
	 1200 3300 3675 3300
2 1 0 1 0 7 50 0 -1 4.000 0 0 -1 1 1 2
	1 1 1.00 60.00 120.00
	1 1 1.00 60.00 120.00
	 3675 3300 4800 3300
2 1 0 1 0 7 50 0 -1 4.000 0 0 -1 1 1 2
	1 1 1.00 60.00 120.00
	1 1 1.00 60.00 120.00
	 4800 3300 6000 3300
2 1 0 2 0 7 50 0 -1 6.000 0 0 -1 1 0 2
	1 1 2.00 120.00 240.00
	 4800 1725 4800 2325
2 1 0 1 0 7 50 0 -1 4.000 0 0 -1 0 0 2
	 1200 975 1200 1650
2 1 0 1 0 7 50 0 -1 4.000 0 0 -1 0 0 2
	 3675 975 3675 1650
2 1 0 1 0 7 50 0 -1 4.000 0 0 -1 0 0 2
	 6000 975 6000 1650
2 1 0 1 0 7 50 0 -1 4.000 0 0 -1 1 0 2
	1 1 1.00 60.00 120.00
	 1200 1350 2025 1350
2 1 0 1 0 7 50 0 -1 4.000 0 0 -1 1 0 2
	1 1 1.00 60.00 120.00
	 3675 1350 2850 1350
2 1 0 1 0 7 50 0 -1 4.000 0 0 -1 1 0 2
	1 1 1.00 60.00 120.00
	 3675 1350 3975 1350
2 1 0 1 0 7 50 0 -1 4.000 0 0 -1 1 0 2
	1 1 1.00 60.00 120.00
	 6000 1350 5700 1350
2 1 1 2 0 7 50 0 -1 6.000 0 0 -1 1 0 2
	1 1 2.00 120.00 240.00
	 9975 3150 9975 2400
2 1 0 3 0 7 50 0 -1 8.000 0 0 -1 0 0 2
	 7575 2400 12375 2400
2 3 0 1 0 7 50 0 -1 4.000 0 0 -1 0 0 4
	 7425 2625 7575 2400 7725 2625 7425 2625
2 1 0 3 0 7 50 0 -1 8.000 0 0 -1 0 0 2
	 1200 5400 6000 5400
2 1 0 3 0 7 50 0 -1 8.000 0 0 -1 0 0 2
	 7575 5325 12375 5325
2 1 0 2 0 7 50 0 -1 0.000 0 0 -1 0 0 3
	 1200 5400 4800 6225 6000 5400
2 1 0 1 0 7 50 0 -1 4.000 0 0 -1 0 0 4
	 3600 5400 3600 5925 4800 5925 4800 6225
2 1 0 2 0 7 50 0 -1 6.000 0 0 -1 0 0 3
	 7575 5325 9975 4350 12375 5325
2 1 0 1 0 7 50 0 -1 4.000 0 0 -1 0 0 2
	 9975 5325 9975 4350
2 1 0 1 0 7 50 0 -1 4.000 0 0 -1 0 0 3
	 11175 5325 11175 4875 9975 4875
2 1 0 3 0 7 50 0 -1 8.000 0 0 -1 0 0 2
	 1200 7950 6000 7950
2 1 0 2 0 7 50 0 -1 6.000 0 0 -1 0 0 4
	 1200 7950 3600 7125 4800 8925 6000 7950
2 1 0 1 0 7 50 0 -1 4.000 0 0 -1 0 0 2
	 3600 7125 3600 7950
2 1 0 1 0 7 50 0 -1 4.000 0 0 -1 0 0 2
	 4800 8925 4800 7950
2 1 0 3 0 7 50 0 -1 8.000 0 0 -1 0 0 2
	 7425 7950 12225 7950
2 1 0 2 0 7 50 0 -1 6.000 0 0 -1 0 0 8
	 7425 7950 7425 8175 9975 8175 9975 6975 11175 6975 11175 8550
	 12225 8550 12225 7950
2 1 0 1 0 7 50 0 -1 0.000 0 0 -1 0 0 2
	 4800 2400 4800 2550
4 0 0 50 0 0 24 0.0000 4 255 360 2325 3225 10\001
4 0 0 50 0 0 24 0.0000 4 255 180 4200 3225 5\001
4 0 0 50 0 0 24 0.0000 4 255 180 5400 3225 5\001
4 0 0 50 0 1 24 0.0000 4 255 225 4950 2175 F\001
4 0 0 50 0 0 16 0.0000 4 165 120 2550 1575 1\001
4 0 0 50 0 1 24 0.0000 4 255 390 2175 1500 EJ\001
4 0 0 50 0 1 24 0.0000 4 255 1680 3975 1500 EJ  = EJ /2\001
4 0 0 50 0 0 16 0.0000 4 165 120 4350 1575 2\001
4 0 0 50 0 0 16 0.0000 4 165 120 5175 1575 1\001
4 0 0 50 0 1 24 0.0000 4 270 225 1425 2850 A\001
4 0 0 50 0 1 24 0.0000 4 255 225 3975 2850 B\001
4 0 0 50 0 1 24 0.0000 4 255 240 5550 2850 C\001
4 0 0 50 0 1 24 0.0000 4 255 225 10125 3075 X\001
4 0 0 50 0 0 24 0.0000 4 255 3990 8100 1650 PRIMARY STRUCTURE:\001
4 0 0 50 0 1 32 0.0000 4 330 660 3225 4725 M :\001
4 0 0 50 0 1 32 0.0000 4 330 540 7725 4500 M:\001
4 0 0 50 0 32 32 0.0000 4 345 225 7425 4500 d\001
4 0 0 50 0 0 24 0.0000 4 300 765 3675 5775 5/2 F\001
4 0 0 50 0 0 24 0.0000 4 300 945 3825 6525 15/4 F\001
4 0 0 50 0 0 24 0.0000 4 300 765 4875 6075 5/4 F\001
4 0 0 50 0 0 24 0.0000 4 255 180 10200 4350 5\001
4 0 0 50 0 0 24 0.0000 4 255 450 9450 5175 2.5\001
4 0 0 50 0 0 24 0.0000 4 255 450 9450 4800 2.5\001
4 0 0 50 0 0 24 0.0000 4 180 180 3600 4875 o\001
4 0 0 50 0 1 32 0.0000 4 330 540 2175 7200 M:\001
4 0 0 50 0 0 24 0.0000 4 255 930 3750 9000 1.87 F\001
4 0 0 50 0 0 24 0.0000 4 255 930 3825 7350 1.25 F\001
4 0 0 50 0 0 24 0.0000 4 255 1320 7500 8475 -0.125 F\001
4 0 0 50 0 0 24 0.0000 4 255 1110 8775 7275 0.625 F\001
4 0 0 50 0 0 24 0.0000 4 255 1110 10275 8475 0.375 F\001
4 0 0 50 0 1 32 0.0000 4 330 435 7575 7275 V:\001
4 0 0 50 0 1 24 0.0000 4 255 195 4875 2775 d\001
