#FIG 3.2
Landscape
Center
Metric
A4      
100.00
Single
-2
1200 2
5 1 0 1 0 7 50 0 -1 4.000 0 1 1 0 2475.978 2153.152 3780 2250 3735 1800 3600 1485
	1 1 1.00 60.00 120.00
5 1 0 1 0 7 50 0 -1 4.000 0 1 1 0 5917.500 2385.000 4995 2250 4995 2520 5040 2700
	1 1 1.00 60.00 120.00
5 1 0 2 0 7 50 0 -1 6.000 0 1 1 0 6981.015 5492.451 7470 5625 7335 5130 6885 4995
	1 1 2.00 120.00 240.00
5 1 0 2 0 7 50 0 -1 6.000 0 1 1 0 1982.451 5393.000 2115 4905 1620 5040 1485 5490
	1 1 2.00 120.00 240.00
6 2115 2025 6885 2475
2 1 0 3 0 7 50 0 -1 0.000 0 0 -1 0 0 2
	 2250 2250 6750 2250
2 1 0 1 0 7 50 0 -1 0.000 0 0 -1 0 0 2
	 2250 2025 2250 2475
2 1 0 1 0 7 50 0 -1 0.000 0 0 -1 0 0 2
	 2250 2025 2115 2205
2 1 0 1 0 7 50 0 -1 0.000 0 0 -1 0 0 2
	 2250 2160 2115 2340
2 1 0 1 0 7 50 0 -1 0.000 0 0 -1 0 0 2
	 2250 2295 2115 2475
2 1 0 1 0 7 50 0 -1 0.000 0 0 -1 0 0 2
	 6750 2025 6750 2475
2 1 0 1 0 7 50 0 -1 0.000 0 0 -1 0 0 2
	 6750 2475 6885 2295
2 1 0 1 0 7 50 0 -1 0.000 0 0 -1 0 0 2
	 6750 2340 6885 2160
2 1 0 1 0 7 50 0 -1 0.000 0 0 -1 0 0 2
	 6750 2205 6885 2025
-6
6 2115 3735 6885 4185
2 1 0 3 0 7 50 0 -1 0.000 0 0 -1 0 0 2
	 2250 3960 6750 3960
2 1 0 1 0 7 50 0 -1 0.000 0 0 -1 0 0 2
	 2250 3735 2250 4185
2 1 0 1 0 7 50 0 -1 0.000 0 0 -1 0 0 2
	 2250 3735 2115 3915
2 1 0 1 0 7 50 0 -1 0.000 0 0 -1 0 0 2
	 2250 3870 2115 4050
2 1 0 1 0 7 50 0 -1 0.000 0 0 -1 0 0 2
	 2250 4005 2115 4185
2 1 0 1 0 7 50 0 -1 0.000 0 0 -1 0 0 2
	 6750 3735 6750 4185
2 1 0 1 0 7 50 0 -1 0.000 0 0 -1 0 0 2
	 6750 4185 6885 4005
2 1 0 1 0 7 50 0 -1 0.000 0 0 -1 0 0 2
	 6750 4050 6885 3870
2 1 0 1 0 7 50 0 -1 0.000 0 0 -1 0 0 2
	 6750 3915 6885 3735
-6
6 2115 5535 6885 5985
2 1 0 3 0 7 50 0 -1 0.000 0 0 -1 0 0 2
	 2250 5760 6750 5760
2 1 0 1 0 7 50 0 -1 0.000 0 0 -1 0 0 2
	 2250 5535 2250 5985
2 1 0 1 0 7 50 0 -1 0.000 0 0 -1 0 0 2
	 2250 5535 2115 5715
2 1 0 1 0 7 50 0 -1 0.000 0 0 -1 0 0 2
	 2250 5670 2115 5850
2 1 0 1 0 7 50 0 -1 0.000 0 0 -1 0 0 2
	 2250 5805 2115 5985
2 1 0 1 0 7 50 0 -1 0.000 0 0 -1 0 0 2
	 6750 5535 6750 5985
2 1 0 1 0 7 50 0 -1 0.000 0 0 -1 0 0 2
	 6750 5985 6885 5805
2 1 0 1 0 7 50 0 -1 0.000 0 0 -1 0 0 2
	 6750 5850 6885 5670
2 1 0 1 0 7 50 0 -1 0.000 0 0 -1 0 0 2
	 6750 5715 6885 5535
-6
2 1 0 1 0 7 50 0 -1 4.000 0 0 -1 0 0 2
	 2295 2250 3735 1395
2 1 0 1 0 7 50 0 -1 4.000 0 0 -1 0 0 2
	 6750 2250 4995 2700
2 1 0 1 0 7 50 0 -1 4.000 0 0 -1 0 0 2
	 2655 3735 4680 3735
2 1 0 1 0 7 50 0 -1 4.000 0 0 -1 0 0 2
	 7695 3060 5625 3060
2 1 0 1 0 7 50 0 -1 4.000 0 0 -1 0 0 2
	 6750 4230 6750 4500
2 1 0 1 0 7 50 0 -1 4.000 0 0 -1 0 0 2
	 7695 3195 7695 4500
2 1 0 1 0 7 50 0 -1 4.000 0 0 -1 0 0 2
	 2250 3600 2250 3240
2 1 0 1 0 7 50 0 -1 4.000 0 0 -1 0 0 2
	 2655 3600 2655 3195
2 1 0 1 0 7 50 0 -1 4.000 0 0 -1 1 0 2
	1 1 1.00 60.00 120.00
	 2250 3375 2655 3375
2 1 0 1 0 7 50 0 -1 4.000 0 0 -1 1 0 2
	1 1 1.00 60.00 120.00
	 4590 3960 4590 3735
2 1 0 1 0 7 50 0 -1 4.000 0 0 -1 1 0 2
	1 1 1.00 60.00 120.00
	 6750 4365 7695 4365
2 1 0 1 0 7 50 0 -1 4.000 0 0 -1 1 0 2
	1 1 1.00 60.00 120.00
	 5940 3960 5940 3060
2 1 0 2 0 7 50 0 -1 6.000 0 0 -1 1 0 2
	1 1 2.00 120.00 240.00
	 6930 5760 7560 5760
2 1 0 2 0 7 50 0 -1 6.000 0 0 -1 1 0 2
	1 1 2.00 120.00 240.00
	 1530 5760 2070 5760
2 1 0 2 0 7 50 0 -1 6.000 0 0 -1 1 0 2
	1 1 2.00 120.00 240.00
	 6750 5400 6750 4860
2 1 0 2 0 7 50 0 -1 6.000 0 0 -1 1 0 2
	1 1 2.00 120.00 240.00
	 2250 5400 2250 4860
2 1 0 1 0 7 50 0 -1 4.000 0 0 -1 0 0 2
	 2250 6120 2250 6705
2 1 0 1 0 7 50 0 -1 4.000 0 0 -1 0 0 2
	 6750 6120 6750 6705
2 1 0 1 0 7 50 0 -1 4.000 0 0 -1 1 1 2
	1 1 1.00 60.00 120.00
	1 1 1.00 60.00 120.00
	 2250 6525 6750 6525
3 0 1 3 0 7 50 0 -1 8.000 0 0 0 7
	 2250 2250 2970 1845 3915 1665 4815 2070 5940 2385 6480 2340
	 6750 2250
	 0.000 1.000 1.000 1.000 1.000 1.000 0.000
3 0 1 3 0 7 50 0 -1 8.000 0 0 0 4
	 2655 3735 3420 3735 6975 3060 7695 3060
	 0.000 1.000 1.000 0.000
4 0 0 50 0 1 24 0.0000 4 165 180 7110 4320 u\001
4 0 0 50 0 1 24 0.0000 4 165 180 2340 3285 u\001
4 0 0 50 0 1 24 0.0000 4 165 180 6075 3645 v\001
4 0 0 50 0 1 24 0.0000 4 165 180 4770 3870 v\001
4 0 0 50 0 1 18 0.0000 4 195 75 2475 3375 i\001
4 0 0 50 0 1 18 0.0000 4 195 75 4905 3915 i\001
4 0 0 50 0 1 18 0.0000 4 240 75 7245 4455 j\001
4 0 0 50 0 32 24 0.0000 4 330 210 3375 2115 f\001
4 0 0 50 0 32 24 0.0000 4 330 210 5085 2565 f\001
4 0 0 50 0 1 24 0.0000 4 240 105 2205 1890 i\001
4 0 0 50 0 1 24 0.0000 4 315 90 6660 1890 j\001
4 0 0 50 0 1 18 0.0000 4 195 75 3600 2205 i\001
4 0 0 50 0 1 18 0.0000 4 240 75 5310 2655 j\001
4 0 0 50 0 1 18 0.0000 4 240 75 6210 3735 j\001
4 0 0 50 0 1 24 0.0000 4 255 225 7110 6210 X\001
4 0 0 50 0 1 24 0.0000 4 255 225 1665 6255 X\001
4 0 0 50 0 1 24 0.0000 4 255 210 6390 5310 Y\001
4 0 0 50 0 1 24 0.0000 4 255 210 2430 5355 Y\001
4 0 0 50 0 1 24 0.0000 4 255 300 6975 5490 M\001
4 0 0 50 0 1 24 0.0000 4 255 300 1665 5490 M\001
4 0 0 50 0 1 18 0.0000 4 195 75 2565 5445 i\001
4 0 0 50 0 1 18 0.0000 4 195 75 1935 5535 i\001
4 0 0 50 0 1 18 0.0000 4 195 75 1890 6300 i\001
4 0 0 50 0 1 18 0.0000 4 240 75 6570 5400 j\001
4 0 0 50 0 1 18 0.0000 4 240 75 7245 5580 j\001
4 0 0 50 0 1 18 0.0000 4 240 75 7380 6255 j\001
4 0 0 50 0 1 24 0.0000 4 255 90 4140 6435 l\001
4 0 0 50 0 1 24 0.0000 4 255 390 4005 5445 EJ\001
4 0 0 50 0 1 18 0.0000 4 240 210 4230 6525 i,j\001
4 0 0 50 0 1 18 0.0000 4 240 210 4320 5535 i,j\001
