#FIG 3.2  Produced by xfig version 3.2.5c
Landscape
Center
Metric
Letter  
100.00
Single
-2
1200 2
6 -165 2685 7365 5775
2 1 0 3 0 7 50 -1 -1 0.000 0 0 -1 0 0 2
	 0 2715 0 5415
2 1 0 3 0 7 50 -1 -1 0.000 0 0 -1 0 0 2
	 7215 2700 7215 5400
2 1 0 3 0 7 50 -1 -1 0.000 0 0 -1 0 0 2
	 15 5400 7245 5400
2 1 0 3 0 7 50 -1 -1 0.000 0 0 -1 0 0 2
	 30 2715 7260 2715
2 1 0 3 0 7 50 -1 -1 0.000 0 0 -1 0 0 2
	 0 5400 3615 2700
2 1 0 3 0 7 50 -1 -1 0.000 0 0 -1 0 0 2
	 3600 2730 7215 5385
2 3 0 1 0 7 50 -1 -1 0.000 0 0 -1 0 0 4
	 15 5415 -165 5670 165 5670 15 5415
2 3 0 1 0 7 50 -1 -1 0.000 0 0 -1 0 0 4
	 7215 5415 7035 5670 7365 5670 7215 5415
2 1 0 1 0 7 50 -1 -1 0.000 0 0 -1 0 0 2
	 7035 5775 7350 5775
-6
2 1 0 2 0 7 50 -1 -1 0.000 0 0 -1 1 0 2
	1 1 2.00 120.00 240.00
	 3600 2865 3600 3570
2 1 0 2 0 7 50 -1 -1 0.000 0 0 -1 1 0 2
	1 1 2.00 120.00 240.00
	 0 2580 915 2580
2 1 1 2 0 7 50 -1 -1 6.000 0 0 -1 0 0 2
	 75 5160 3315 2745
4 0 0 50 -1 32 24 0.0000 4 270 210 270 5745 1\001
4 0 0 50 -1 32 24 0.0000 4 285 210 6615 5700 2\001
4 0 0 50 -1 32 24 0.0000 4 285 210 -60 2490 3\001
4 0 0 50 -1 32 24 0.0000 4 285 210 3330 2640 4\001
4 0 0 50 -1 32 24 0.0000 4 285 210 7035 2580 5\001
4 0 0 50 -1 0 24 0.0000 4 270 615 3285 3870 v=?\001
4 0 0 50 -1 0 24 0.0000 4 270 615 300 2445 u=?\001
4 0 0 50 -1 0 24 0.6109 4 270 1065 998 4362 t=20K\001
4 0 0 50 -1 0 24 0.0000 4 360 6060 30 1995 LC 2, temp. increase in member 1,4:\001
