#FIG 3.2
Landscape
Center
Metric
Letter  
100.00
Single
-2
1200 2
6 1485 4455 2115 4635
2 1 0 3 0 7 50 0 -1 8.000 0 0 -1 0 0 2
	 1530 4500 2070 4500
2 1 0 1 0 7 50 0 -1 4.000 0 0 -1 0 0 2
	 1620 4500 1530 4635
2 1 0 1 0 7 50 0 -1 4.000 0 0 -1 0 0 2
	 1890 4500 1800 4635
2 1 0 1 0 7 50 0 -1 4.000 0 0 -1 0 0 2
	 2025 4500 1935 4635
2 1 0 1 0 7 50 0 -1 4.000 0 0 -1 0 0 2
	 1755 4500 1665 4635
-6
6 4185 4455 4815 4635
2 1 0 3 0 7 50 0 -1 8.000 0 0 -1 0 0 2
	 4230 4500 4770 4500
2 1 0 1 0 7 50 0 -1 4.000 0 0 -1 0 0 2
	 4320 4500 4230 4635
2 1 0 1 0 7 50 0 -1 4.000 0 0 -1 0 0 2
	 4590 4500 4500 4635
2 1 0 1 0 7 50 0 -1 4.000 0 0 -1 0 0 2
	 4725 4500 4635 4635
2 1 0 1 0 7 50 0 -1 4.000 0 0 -1 0 0 2
	 4455 4500 4365 4635
-6
2 1 0 3 0 7 50 0 -1 8.000 0 0 -1 0 0 4
	 1800 4500 1800 2250 4500 2250 4500 4500
2 1 0 2 0 7 50 0 -1 6.000 0 0 -1 1 0 2
	1 1 2.00 120.00 240.00
	 1215 2295 1755 2295
2 1 0 2 0 7 50 0 -1 6.000 0 0 -1 0 0 1
	 4860 3060
2 1 0 1 0 7 50 0 -1 4.000 0 0 -1 1 0 2
	1 1 1.00 60.00 120.00
	 4500 2700 4950 2700
2 1 0 1 0 7 50 0 -1 4.000 0 0 -1 1 0 2
	1 1 1.00 60.00 120.00
	 4230 2250 4770 2160
2 1 0 1 0 7 50 0 -1 4.000 0 0 -1 1 0 2
	1 1 1.00 60.00 120.00
	 5085 2700 5310 2700
2 1 0 1 0 7 50 0 -1 4.000 0 0 -1 1 0 2
	1 1 1.00 60.00 120.00
	 4590 1800 4815 1800
3 0 1 3 0 7 50 0 -1 8.000 0 0 0 4
	 1800 4500 1890 3645 2205 2970 2340 2295
	 0.000 1.000 1.000 0.000
3 0 1 3 0 7 50 0 -1 8.000 0 0 0 4
	 4512 4461 4602 3606 4917 2931 5052 2256
	 0.000 1.000 1.000 0.000
3 0 1 3 0 7 50 0 -1 8.000 0 0 0 4
	 2340 2250 3285 2520 4230 1980 5085 2250
	 0.000 1.000 1.000 0.000
4 0 0 50 0 0 24 0.0000 4 330 630 4590 2070 u(x)\001
4 0 0 50 0 0 24 0.0000 4 330 630 5085 2970 u(x)\001
4 0 0 50 0 0 24 0.0000 4 255 210 1395 2160 F\001
