#FIG 3.2
Landscape
Center
Metric
A4      
100.00
Single
-2
1200 2
5 1 0 1 0 7 50 0 -1 4.000 0 1 1 0 4882.500 3960.000 6255 4050 6255 3870 6210 3600
	1 1 1.00 60.00 120.00
5 1 0 1 0 7 50 0 -1 4.000 0 0 1 0 4612.500 5782.500 4995 5580 5040 5715 5040 5850
	1 1 1.00 60.00 120.00
5 1 0 1 0 7 50 0 -1 4.000 0 1 1 0 6623.343 5240.983 6975 5085 6570 4860 6255 5130
	1 1 1.00 60.00 120.00
5 1 0 1 0 7 50 0 -1 4.000 0 1 1 0 2258.343 5465.983 2610 5310 2205 5085 1890 5355
	1 1 1.00 60.00 120.00
6 2115 1935 6885 2565
6 2115 1980 2250 2565
2 1 0 1 0 7 50 0 -1 0.000 0 0 -1 0 0 2
	 2250 1980 2250 2520
2 1 0 1 0 7 50 0 -1 0.000 0 0 -1 0 0 2
	 2250 1980 2115 2160
2 1 0 1 0 7 50 0 -1 0.000 0 0 -1 0 0 2
	 2250 2115 2115 2295
2 1 0 1 0 7 50 0 -1 0.000 0 0 -1 0 0 2
	 2250 2250 2115 2430
2 1 0 1 0 7 50 0 -1 0.000 0 0 -1 0 0 2
	 2250 2385 2115 2565
-6
6 6750 1935 6885 2520
2 1 0 1 0 7 50 0 -1 0.000 0 0 -1 0 0 2
	 6750 2520 6750 1980
2 1 0 1 0 7 50 0 -1 0.000 0 0 -1 0 0 2
	 6750 2520 6885 2340
2 1 0 1 0 7 50 0 -1 0.000 0 0 -1 0 0 2
	 6750 2385 6885 2205
2 1 0 1 0 7 50 0 -1 0.000 0 0 -1 0 0 2
	 6750 2250 6885 2070
2 1 0 1 0 7 50 0 -1 0.000 0 0 -1 0 0 2
	 6750 2115 6885 1935
-6
2 1 0 2 0 7 50 0 -1 0.000 0 0 -1 0 0 2
	 2250 2250 6750 2250
-6
6 2070 3195 6840 4365
6 2070 3735 2250 4365
2 1 0 1 0 7 50 0 -1 0.000 0 0 -1 0 0 2
	 2189 3768 2245 4305
2 1 0 1 0 7 50 0 -1 0.000 0 0 -1 0 0 2
	 2189 3768 2073 3962
2 1 0 1 0 7 50 0 -1 0.000 0 0 -1 0 0 2
	 2202 3903 2086 4096
2 1 0 1 0 7 50 0 -1 0.000 0 0 -1 0 0 2
	 2216 4036 2101 4230
2 1 0 1 0 7 50 0 -1 0.000 0 0 -1 0 0 2
	 2231 4171 2115 4364
-6
6 6660 3195 6840 3870
2 1 0 1 0 7 50 0 -1 0.000 0 0 -1 0 0 2
	 6719 3835 6663 3298
2 1 0 1 0 7 50 0 -1 0.000 0 0 -1 0 0 2
	 6719 3835 6835 3642
2 1 0 1 0 7 50 0 -1 0.000 0 0 -1 0 0 2
	 6706 3701 6821 3508
2 1 0 1 0 7 50 0 -1 0.000 0 0 -1 0 0 2
	 6692 3566 6807 3373
2 1 0 1 0 7 50 0 -1 0.000 0 0 -1 0 0 2
	 6677 3432 6793 3239
-6
2 1 0 2 0 7 50 0 -1 0.000 0 0 -1 0 0 2
	 2216 4036 6692 3566
-6
6 2070 5535 2205 6120
2 1 0 1 0 7 50 0 -1 0.000 0 0 -1 0 0 2
	 2205 5535 2205 6075
2 1 0 1 0 7 50 0 -1 0.000 0 0 -1 0 0 2
	 2205 5535 2070 5715
2 1 0 1 0 7 50 0 -1 0.000 0 0 -1 0 0 2
	 2205 5670 2070 5850
2 1 0 1 0 7 50 0 -1 0.000 0 0 -1 0 0 2
	 2205 5805 2070 5985
2 1 0 1 0 7 50 0 -1 0.000 0 0 -1 0 0 2
	 2205 5940 2070 6120
-6
6 6705 5085 6840 5670
2 1 0 1 0 7 50 0 -1 0.000 0 0 -1 0 0 2
	 6705 5670 6705 5130
2 1 0 1 0 7 50 0 -1 0.000 0 0 -1 0 0 2
	 6705 5670 6840 5490
2 1 0 1 0 7 50 0 -1 0.000 0 0 -1 0 0 2
	 6705 5535 6840 5355
2 1 0 1 0 7 50 0 -1 0.000 0 0 -1 0 0 2
	 6705 5400 6840 5220
2 1 0 1 0 7 50 0 -1 0.000 0 0 -1 0 0 2
	 6705 5265 6840 5085
-6
2 1 3 2 0 7 50 0 -1 4.500 0 0 -1 0 0 2
	 6750 1935 6750 1620
2 1 0 1 0 7 50 0 -1 0.000 0 0 -1 1 0 2
	1 1 1.00 60.00 120.00
	 6570 2250 6570 1800
2 1 3 1 0 7 50 0 -1 4.000 0 0 -1 0 0 2
	 2250 4050 6840 4050
2 1 3 1 0 7 50 0 -1 4.000 0 0 -1 0 0 2
	 2250 3555 6840 3555
2 1 3 1 0 7 50 0 -1 4.000 0 0 -1 0 0 2
	 2115 5400 6705 5400
2 1 3 1 0 7 50 0 -1 4.000 0 0 -1 0 0 2
	 2205 5850 6795 5850
2 1 2 1 0 7 50 0 -1 3.000 0 0 -1 0 0 2
	 2250 5850 6750 5400
2 1 0 1 0 7 50 0 -1 4.000 0 0 -1 1 0 2
	1 1 1.00 60.00 120.00
	 5265 5580 5265 5400
3 0 3 2 0 7 50 0 -1 4.500 0 0 0 5
	 2295 2250 3375 2205 4500 2025 5625 1800 6750 1800
	 0.000 1.000 1.000 1.000 0.000
3 0 0 2 0 7 50 0 -1 0.000 0 0 0 5
	 2250 5850 3330 5805 4455 5625 5580 5400 6705 5400
	 0.000 1.000 1.000 1.000 0.000
4 0 0 50 0 0 24 0.0000 4 180 165 6255 2115 v\001
4 0 0 50 0 32 24 0.0000 4 270 270 5895 3915 y\001
4 0 0 50 0 32 24 0.0000 4 270 465 5265 5265 -y\001
4 0 0 50 0 32 24 0.0000 4 270 465 4500 5850 -y\001
4 0 0 50 0 1 24 0.0000 4 255 300 2160 5040 M\001
4 0 0 50 0 1 24 0.0000 4 255 300 6435 4770 M\001
4 0 0 50 0 1 18 0.0000 4 225 330 2430 5130 1,2\001
4 0 0 50 0 1 18 0.0000 4 225 330 6705 4860 2,1\001
