Place,Name,BirthDate,Sex,Equipment,Division,BodyweightKg,WeightClassKg,Squat1Kg,Squat2Kg,Squat3Kg,Best3SquatKg,Bench1Kg,Bench2Kg,Bench3Kg,Best3BenchKg,Deadlift1Kg,Deadlift2Kg,Deadlift3Kg,Best3DeadliftKg,TotalKg,Event
1,Karmen Harvey,,F,Raw,FR-O,107.5,84+,155,162.5,170,170,90,-94,94,94,155,165,-172.5,165,429,SBD
2,Wing Koon,,F,Raw,FR-O,93.55,84+,135,145,155,155,60,65,70,70,140,150,160,160,385,SBD
1,Camila Cardwell,,F,Raw,FR-O,75.95,76,132.5,140,145,145,70,75,77.5,77.5,157.5,170,-180,170,392.5,SBD
2,Sophia King-Mason,,F,Raw,FR-O,72.8,76,140,147.5,155,155,60,65,-67.5,65,140,150,157.5,157.5,377.5,SBD
3,Elizabeth Windle,,F,Raw,FR-O,74.3,76,80,87.5,95,95,50,52.5,-55.5,52.5,107.5,113,118,118,265.5,SBD
1,Natasha Brooks,,F,Raw,FR-O,83.35,84,167.5,177.5,182.5,182.5,85,90,-92.5,90,187.5,200,207.5,207.5,480,SBD
2,Grace Howse,,F,Raw,FR-O,79.35,84,140,150,155,155,-100,105,108,108,160,170,177.5,177.5,440.5,SBD
3,Tiana Ettienne,,F,Raw,FR-O,81.85,84,142.5,-150,-150,142.5,65,67.5,70,70,140,155,170,170,382.5,SBD
4,Deniz Yazgan,,F,Raw,FR-O,84,84,107.5,115,120,120,50,-52.5,-52.5,50,130,140,150,150,320,SBD
1,Courtney Brown #2,,F,Raw,FR-O,61.45,63,102.5,110,115,115,70,75,77.5,77.5,137.5,147.5,157.5,157.5,350,SBD
2,Jessica Rigley,,F,Raw,FR-O,60.8,63,92.5,97.5,-102.5,97.5,57.5,60,62.5,62.5,122.5,130,135,135,295,SBD
3,Elizabeth Culyer,,F,Raw,FR-O,62.35,63,82.5,90,95,95,50,55,60,60,130,140,-160,140,295,SBD
1,Alanna Flewitt,,F,Raw,FR-O,55.1,57,92.5,100,105,105,47.5,52.5,-55,52.5,105,115,120,120,277.5,SBD
1,Zara Guppy,,F,Raw,FR-O,67.8,69,105,112.5,115,115,70,-75,75,75,145,160,165,165,355,SBD
2,Rebekah Aitken,,F,Raw,FR-O,68.5,69,-115,120,-130,120,70,75,-77.5,75,145,-152.5,-152.5,145,340,SBD
1,Ashley Priddle,,M,Single-ply,M-Sj,90.15,93,135,142.5,-150,142.5,80,87.5,90,90,135,145,150,150,382.5,SBD
1,Chris Gallagher,,M,Raw,MR-O,82.75,83,220,240,250,250,-150,157.5,165,165,220,235,-242.5,235,650,SBD
1,Archie Cleverley,,M,Raw,MR-O,177.6,120+,245,-260,260,260,157.5,165,170,170,242.5,257.5,270,270,700,SBD
1,Tom Stapley,,M,Raw,MR-O,93,93,-207.5,212.5,-220,212.5,152.5,-157.5,-157.5,152.5,232.5,242.5,247.5,247.5,612.5,SBD
2,Jay Keenan,,M,Raw,MR-O,92.15,93,170,182.5,190,190,125,132.5,140,140,175,195,210,210,540,SBD
3,Jack Cannon,,M,Raw,MR-O,92.35,93,180,200,205,205,90,102.5,-107.5,102.5,180,200,210,210,517.5,SBD
1,Tom Beech,,M,Raw,MR-O,73.9,74,205,215,-225,215,102.5,-110,-110,102.5,240,257.5,265,265,582.5,SBD
2,Luke Warner,,M,Raw,MR-O,73.8,74,152.5,157.5,165,165,120,130,-140,130,205,220,240,240,535,SBD
3,George Abbott,,M,Raw,MR-O,69.4,74,150,162.5,172.5,172.5,105,-110,-110,105,230,245,250,250,527.5,SBD
4,Toby Locke,,M,Raw,MR-O,73.9,74,165,172.5,177.5,177.5,-95,95,100,100,185,200,-212.5,200,477.5,SBD
1,Louis Keightley-Smith,,M,Raw,MR-O,117.9,120,270,287.5,-295,287.5,187.5,197.5,205,205,275,295,307.5,307.5,800,SBD
2,Adam Crafer,,M,Raw,MR-O,118.35,120,235,250,260,260,135,142.5,145,145,260,280,295,295,700,SBD
1,Matthew Rudd-Einecker,,M,Raw,MR-O,104.4,105,220,235,-242.5,235,160,170,-175,170,250,270,-282.5,270,675,SBD
2,Chris Taylor #17,,M,Raw,MR-O,98.15,105,220,227.5,-230,227.5,130,-140,-140,130,245,252.5,257.5,257.5,615,SBD
3,Kieron Tang,,M,Raw,MR-O,104.5,105,185,200,210,210,-115,115,125,125,190,205,220,220,555,SBD
4,Ben Burch,,M,Raw,MR-O,100.7,105,-165,165,172.5,172.5,-120,127.5,-135,127.5,-210,220,225,225,525,SBD
1,Harry Lincoln,2007-03-01,M,Raw,MR-Sj,76.85,83,105,112.5,125,125,-70,75,-77.5,75,180,195,215,215,415,SBD
1,Megan Redshaw,,F,Raw,FR-O,51.05,52,92.5,-97.5,97.5,97.5,45,47.5,-50,47.5,117.5,125,-127.5,125,270,SBD
1,Elif Celikay,,F,Raw,FR-O,63.6,69,125,132.5,137.5,137.5,60,-65,65,65,150,160,170,170,372.5,SBD
2,Abbie Holroyd,,F,Raw,FR-O,68.1,69,120,130,137.5,137.5,-65,72.5,-80,72.5,135,145,152.5,152.5,362.5,SBD
3,Isabella Henry,,F,Raw,FR-O,65.4,69,120,125,130,130,62.5,-65,-65,62.5,115,125,-130,125,317.5,SBD
DQ,Jazz Harrison,,F,Raw,FR-O,67.3,69,120,125,-130,125,-55,-60,-60,,140,150,160,160,,SBD
1,Zara Anwar,,F,Raw,FR-O,80.2,84,145,155,165,165,77.5,82.5,-90,82.5,167.5,180,192.5,192.5,440,SBD
1,Danny Haynes,,F,Raw,FR-O,89.1,84+,80,90,97.5,97.5,45,55,62.5,62.5,90,100,107.5,107.5,267.5,SBD
1,John Anderson #3,,M,Raw,MR-O,65.8,66,177.5,185,195,195,105,112.5,117.5,117.5,200,207.5,-215,207.5,520,SBD
2,Oliver Armstrong,,M,Raw,MR-O,62.7,66,105,110,115,115,67.5,70,72.5,72.5,140,150,-155,150,337.5,SBD
1,Simon Howarth,,M,Raw,MR-O,73.1,74,190,205,-210,205,120,130,-135,130,215,225,240,240,575,SBD
2,Byron Skipsey,,M,Raw,MR-O,71.9,74,190,200,205,205,115,122.5,127.5,127.5,215,227.5,232.5,232.5,565,SBD
3,Aiden Jenkins,,M,Raw,MR-O,73.1,74,170,175,-180,175,100,105,107.5,107.5,220,232.5,-245,232.5,515,SBD
4,Kyle Williams,,M,Raw,MR-O,69,74,157.5,165,172.5,172.5,95,102.5,-105,102.5,205,215,-225,215,490,SBD
5,Mahmoud Abazeed,,M,Raw,MR-O,68.6,74,132.5,142.5,147.5,147.5,105,112.5,120,120,165,182.5,-187.5,182.5,450,SBD
6,Joel Craven Huffer,,M,Raw,MR-O,69.6,74,125,132.5,137.5,137.5,65,70,72.5,72.5,165,175,-180,175,385,SBD
