{
  "annotations": {
    "list": [
      {
        "builtIn": 1,
        "datasource": {
          "type": "datasource",
          "uid": "grafana"
        },
        "enable": true,
        "hide": true,
        "iconColor": "rgba(0, 211, 255, 1)",
        "name": "Annotations & Alerts",
        "target": {
          "limit": 100,
          "matchAny": false,
          "tags": [],
          "type": "dashboard"
        },
        "type": "dashboard"
      }
    ]
  },
  "description": "Power measurement for Shelly Devices",
  "editable": true,
  "fiscalYearStartMonth": 0,
  "graphTooltip": 0,
  "id": 4,
  "iteration": 1652561902588,
  "links": [],
  "liveNow": true,
  "panels": [
    {
      "collapsed": false,
      "gridPos": {
        "h": 1,
        "w": 24,
        "x": 0,
        "y": 0
      },
      "id": 19,
      "panels": [],
      "title": "Power consumption",
      "type": "row"
    },
    {
      "datasource": {
        "type": "influxdb",
        "uid": "jxoskTzRk"
      },
      "description": "",
      "fieldConfig": {
        "defaults": {
          "color": {
            "mode": "palette-classic"
          },
          "custom": {
            "axisLabel": "",
            "axisPlacement": "auto",
            "barAlignment": 0,
            "drawStyle": "line",
            "fillOpacity": 30,
            "gradientMode": "opacity",
            "hideFrom": {
              "legend": false,
              "tooltip": false,
              "viz": false
            },
            "lineInterpolation": "smooth",
            "lineStyle": {
              "fill": "solid"
            },
            "lineWidth": 1,
            "pointSize": 5,
            "scaleDistribution": {
              "type": "linear"
            },
            "showPoints": "auto",
            "spanNulls": false,
            "stacking": {
              "group": "A",
              "mode": "none"
            },
            "thresholdsStyle": {
              "mode": "off"
            }
          },
          "mappings": [],
          "thresholds": {
            "mode": "absolute",
            "steps": [
              {
                "color": "green",
                "value": null
              },
              {
                "color": "red",
                "value": 80
              }
            ]
          },
          "unit": "watt"
        },
        "overrides": [
          {
            "matcher": {
              "id": "byName",
              "options": "Power usage average"
            },
            "properties": [
              {
                "id": "color",
                "value": {
                  "fixedColor": "#FADE2A",
                  "mode": "fixed"
                }
              },
              {
                "id": "custom.fillOpacity",
                "value": 0
              }
            ]
          }
        ]
      },
      "gridPos": {
        "h": 7,
        "w": 12,
        "x": 0,
        "y": 1
      },
      "hideTimeOverride": false,
      "id": 2,
      "libraryPanel": {
        "description": "",
        "meta": {
          "connectedDashboards": 2,
          "created": "2022-04-24T01:48:34+02:00",
          "createdBy": {
            "avatarUrl": "/avatar/9c6128be127cc7fbee43b08f8f8d98f9",
            "id": 1,
            "name": "jan.staffel"
          },
          "folderName": "General",
          "folderUid": "",
          "updated": "2022-05-11T01:07:10+02:00",
          "updatedBy": {
            "avatarUrl": "/avatar/9c6128be127cc7fbee43b08f8f8d98f9",
            "id": 1,
            "name": "jan.staffel"
          }
        },
        "name": "Power consumption",
        "type": "timeseries",
        "uid": "16QonTkgk",
        "version": 11
      },
      "maxPerRow": 4,
      "options": {
        "legend": {
          "calcs": [],
          "displayMode": "list",
          "placement": "bottom"
        },
        "tooltip": {
          "mode": "multi",
          "sort": "none"
        }
      },
      "pluginVersion": "8.4.7",
      "repeat": "Location",
      "repeatDirection": "h",
      "targets": [
        {
          "alias": "Power usage",
          "datasource": {
            "type": "influxdb",
            "uid": "jxoskTzRk"
          },
          "groupBy": [],
          "measurement": "mqtt_consumer",
          "orderByTime": "ASC",
          "policy": "default",
          "query": "SELECT \"apower\" FROM \"mqtt_consumer\" WHERE (\"topic\" =~ /^$Location$/) AND $timeFilter",
          "rawQuery": false,
          "refId": "Power",
          "resultFormat": "time_series",
          "select": [
            [
              {
                "params": [
                  "apower"
                ],
                "type": "field"
              }
            ]
          ],
          "tags": [
            {
              "key": "topic",
              "operator": "=~",
              "value": "/^$Location$/"
            }
          ]
        },
        {
          "alias": "Power usage average",
          "datasource": {
            "type": "influxdb",
            "uid": "jxoskTzRk"
          },
          "groupBy": [
            {
              "params": [
                "$interval"
              ],
              "type": "time"
            }
          ],
          "hide": false,
          "measurement": "mqtt_consumer",
          "orderByTime": "ASC",
          "policy": "default",
          "query": "SELECT moving_average(mean(\"apower\"), 10) FROM \"mqtt_consumer\" WHERE (\"topic\" = 'shelly-testdevice/status/switch:0') AND $timeFilter GROUP BY time($__interval) fill(linear)",
          "rawQuery": false,
          "refId": "Power_moving_average",
          "resultFormat": "time_series",
          "select": [
            [
              {
                "params": [
                  "apower"
                ],
                "type": "field"
              },
              {
                "params": [],
                "type": "mean"
              },
              {
                "params": [
                  5
                ],
                "type": "moving_average"
              }
            ]
          ],
          "tags": [
            {
              "key": "topic",
              "operator": "=~",
              "value": "/^$Location$/"
            }
          ]
        }
      ],
      "title": "$Location",
      "transformations": [],
      "type": "timeseries"
    },
    {
      "collapsed": false,
      "gridPos": {
        "h": 1,
        "w": 24,
        "x": 0,
        "y": 8
      },
      "id": 22,
      "panels": [],
      "title": "Energy consumption",
      "type": "row"
    },
    {
      "datasource": {
        "type": "influxdb",
        "uid": "jxoskTzRk"
      },
      "fieldConfig": {
        "defaults": {
          "color": {
            "fixedColor": "text",
            "mode": "fixed"
          },
          "decimals": 2,
          "mappings": [],
          "thresholds": {
            "mode": "absolute",
            "steps": [
              {
                "color": "green",
                "value": null
              },
              {
                "color": "red",
                "value": 80
              }
            ]
          },
          "unit": "watth"
        },
        "overrides": []
      },
      "gridPos": {
        "h": 8,
        "w": 12,
        "x": 0,
        "y": 9
      },
      "id": 10,
      "maxPerRow": 4,
      "options": {
        "colorMode": "none",
        "graphMode": "area",
        "justifyMode": "auto",
        "orientation": "auto",
        "reduceOptions": {
          "calcs": [
            "lastNotNull"
          ],
          "fields": "",
          "values": false
        },
        "text": {},
        "textMode": "auto"
      },
      "pluginVersion": "8.5.2",
      "repeat": "Location",
      "repeatDirection": "h",
      "targets": [
        {
          "alias": "Energy by Minute",
          "datasource": {
            "type": "influxdb",
            "uid": "jxoskTzRk"
          },
          "groupBy": [
            {
              "params": [
                "1m"
              ],
              "type": "time"
            },
            {
              "params": [
                "null"
              ],
              "type": "fill"
            }
          ],
          "measurement": "mqtt_consumer",
          "orderByTime": "ASC",
          "policy": "default",
          "query": "SELECT sum(e) as energysum FROM (SELECT (sum(\"aenergy_by_minute_0\")  / 1000) as e FROM \"mqtt_consumer\" WHERE  (\"topic\" =~ /^$Location$/) AND $timeFilter GROUP BY time(1m) fill(null))",
          "rawQuery": true,
          "refId": "A",
          "resultFormat": "logs",
          "select": [
            [
              {
                "params": [
                  "aenergy_by_minute_0"
                ],
                "type": "field"
              },
              {
                "params": [],
                "type": "sum"
              },
              {
                "params": [
                  " / 1000"
                ],
                "type": "math"
              }
            ]
          ],
          "tags": []
        }
      ],
      "title": "$Location",
      "type": "stat"
    },
    {
      "collapsed": false,
      "datasource": {
        "type": "redis-datasource",
        "uid": "PU6OQARRz"
      },
      "gridPos": {
        "h": 1,
        "w": 24,
        "x": 0,
        "y": 17
      },
      "id": 6,
      "panels": [],
      "title": "Voltage / Current",
      "type": "row"
    },
    {
      "datasource": {
        "type": "influxdb",
        "uid": "jxoskTzRk"
      },
      "fieldConfig": {
        "defaults": {
          "color": {
            "mode": "palette-classic"
          },
          "custom": {
            "axisLabel": "",
            "axisPlacement": "auto",
            "barAlignment": 0,
            "drawStyle": "line",
            "fillOpacity": 0,
            "gradientMode": "none",
            "hideFrom": {
              "legend": false,
              "tooltip": false,
              "viz": false
            },
            "lineInterpolation": "smooth",
            "lineStyle": {
              "fill": "solid"
            },
            "lineWidth": 1,
            "pointSize": 2,
            "scaleDistribution": {
              "type": "linear"
            },
            "showPoints": "auto",
            "spanNulls": false,
            "stacking": {
              "group": "A",
              "mode": "none"
            },
            "thresholdsStyle": {
              "mode": "off"
            }
          },
          "mappings": [],
          "max": 240,
          "min": 220,
          "thresholds": {
            "mode": "absolute",
            "steps": [
              {
                "color": "green",
                "value": null
              },
              {
                "color": "red",
                "value": 80
              }
            ]
          },
          "unit": "volt"
        },
        "overrides": [
          {
            "matcher": {
              "id": "byName",
              "options": "Current"
            },
            "properties": [
              {
                "id": "color",
                "value": {
                  "fixedColor": "green",
                  "mode": "fixed"
                }
              },
              {
                "id": "custom.axisPlacement",
                "value": "right"
              },
              {
                "id": "unit",
                "value": "amp"
              },
              {
                "id": "custom.axisSoftMin",
                "value": 0
              },
              {
                "id": "min"
              },
              {
                "id": "max"
              }
            ]
          }
        ]
      },
      "gridPos": {
        "h": 8,
        "w": 12,
        "x": 0,
        "y": 18
      },
      "id": 4,
      "maxPerRow": 4,
      "options": {
        "legend": {
          "calcs": [],
          "displayMode": "list",
          "placement": "bottom"
        },
        "tooltip": {
          "mode": "single",
          "sort": "none"
        }
      },
      "pluginVersion": "8.4.7",
      "repeat": "Location",
      "repeatDirection": "h",
      "targets": [
        {
          "alias": "Current",
          "datasource": {
            "type": "influxdb",
            "uid": "jxoskTzRk"
          },
          "groupBy": [
            {
              "params": [
                "$__interval"
              ],
              "type": "time"
            },
            {
              "params": [
                "linear"
              ],
              "type": "fill"
            }
          ],
          "measurement": "mqtt_consumer",
          "orderByTime": "ASC",
          "policy": "default",
          "query": "SELECT moving_average(mean(\"apower\"), 100) FROM \"mqtt_consumer\" WHERE (\"topic\" = 'shelly-testdevice/status/switch:0') AND $timeFilter GROUP BY time($__interval) fill(linear)",
          "rawQuery": false,
          "refId": "A",
          "resultFormat": "time_series",
          "select": [
            [
              {
                "params": [
                  "current"
                ],
                "type": "field"
              },
              {
                "params": [],
                "type": "mean"
              }
            ]
          ],
          "tags": [
            {
              "key": "topic",
              "operator": "=~",
              "value": "/^$Location$/"
            }
          ]
        },
        {
          "alias": "Voltage",
          "datasource": {
            "type": "influxdb",
            "uid": "jxoskTzRk"
          },
          "groupBy": [
            {
              "params": [
                "$__interval"
              ],
              "type": "time"
            },
            {
              "params": [
                "linear"
              ],
              "type": "fill"
            }
          ],
          "hide": false,
          "measurement": "mqtt_consumer",
          "orderByTime": "ASC",
          "policy": "default",
          "query": "SELECT moving_average(mean(\"apower\"), 100) FROM \"mqtt_consumer\" WHERE (\"topic\" = 'shelly-testdevice/status/switch:0') AND $timeFilter GROUP BY time($__interval) fill(linear)",
          "rawQuery": false,
          "refId": "B",
          "resultFormat": "time_series",
          "select": [
            [
              {
                "params": [
                  "voltage"
                ],
                "type": "field"
              },
              {
                "params": [],
                "type": "mean"
              }
            ]
          ],
          "tags": [
            {
              "key": "topic",
              "operator": "=~",
              "value": "/^$Location$/"
            }
          ]
        }
      ],
      "title": "$Location",
      "type": "timeseries"
    },
    {
      "collapsed": false,
      "gridPos": {
        "h": 1,
        "w": 24,
        "x": 0,
        "y": 26
      },
      "id": 25,
      "panels": [],
      "title": "Energy consumption since last switchoff",
      "type": "row"
    },
    {
      "datasource": {
        "type": "influxdb",
        "uid": "jxoskTzRk"
      },
      "description": "",
      "fieldConfig": {
        "defaults": {
          "color": {
            "fixedColor": "text",
            "mode": "fixed"
          },
          "mappings": [],
          "thresholds": {
            "mode": "absolute",
            "steps": [
              {
                "color": "green",
                "value": null
              },
              {
                "color": "red",
                "value": 80
              }
            ]
          },
          "unit": "watth"
        },
        "overrides": []
      },
      "gridPos": {
        "h": 8,
        "w": 12,
        "x": 0,
        "y": 27
      },
      "id": 12,
      "maxPerRow": 4,
      "options": {
        "colorMode": "value",
        "graphMode": "area",
        "justifyMode": "auto",
        "orientation": "auto",
        "reduceOptions": {
          "calcs": [
            "lastNotNull"
          ],
          "fields": "",
          "values": false
        },
        "textMode": "auto"
      },
      "pluginVersion": "8.5.2",
      "repeat": "Location",
      "repeatDirection": "h",
      "targets": [
        {
          "datasource": {
            "type": "influxdb",
            "uid": "jxoskTzRk"
          },
          "groupBy": [
            {
              "params": [
                "$__interval"
              ],
              "type": "time"
            },
            {
              "params": [
                "null"
              ],
              "type": "fill"
            }
          ],
          "measurement": "mqtt_consumer",
          "orderByTime": "ASC",
          "policy": "default",
          "refId": "A",
          "resultFormat": "time_series",
          "select": [
            [
              {
                "params": [
                  "aenergy_total"
                ],
                "type": "field"
              },
              {
                "params": [],
                "type": "last"
              }
            ]
          ],
          "tags": [
            {
              "key": "topic",
              "operator": "=~",
              "value": "/^$Location$/"
            }
          ]
        }
      ],
      "title": "$Location",
      "type": "stat"
    }
  ],
  "refresh": "",
  "schemaVersion": 36,
  "style": "dark",
  "tags": [],
  "templating": {
    "list": [
      {
        "current": {
          "selected": true,
          "text": [
            "All"
          ],
          "value": [
            "$__all"
          ]
        },
        "datasource": {
          "type": "influxdb",
          "uid": "jxoskTzRk"
        },
        "definition": " SHOW TAG VALUES FROM mqtt_consumer WITH KEY = \"topic\" WHERE topic =~ /switch/",
        "hide": 0,
        "includeAll": true,
        "multi": true,
        "name": "Location",
        "options": [],
        "query": " SHOW TAG VALUES FROM mqtt_consumer WITH KEY = \"topic\" WHERE topic =~ /switch/",
        "refresh": 1,
        "regex": "(?<value>shelly-(?<text>.*)\\/status.*)",
        "skipUrlSync": false,
        "sort": 0,
        "type": "query"
      }
    ]
  },
  "time": {
    "from": "now-12h",
    "to": "now"
  },
  "timepicker": {
    "hidden": false
  },
  "timezone": "",
  "title": "Power metering",
  "uid": "zjHg7Tkgk",
  "version": 29,
  "weekStart": ""
}
