module test

go 1.15

require (
	github.com/coreos/etcd v3.3.25+incompatible // indirect
	github.com/coreos/go-semver v0.3.0 // indirect
	github.com/coreos/pkg v0.0.0-20180928190104-399ea9e2e55f // indirect
	github.com/gogo/protobuf v1.3.2 // indirect
	github.com/google/uuid v1.2.0 // indirect
	go.etcd.io/etcd v3.3.25+incompatible // indirect
	go.uber.org/zap v1.16.0 // indirect
	google.golang.org/grpc v1.26.0
)

replace github.com/coreos/go-systemd => github.com/coreos/go-systemd/v22 v22.0.0
