%YAML 1.1
%TAG !u! tag:unity3d.com,2011:
--- !u!114 &11400000
MonoBehaviour:
  m_ObjectHideFlags: 0
  m_CorrespondingSourceObject: {fileID: 0}
  m_PrefabInstance: {fileID: 0}
  m_PrefabAsset: {fileID: 0}
  m_GameObject: {fileID: 0}
  m_Enabled: 1
  m_EditorHideFlags: 0
  m_Script: {fileID: 11500000, guid: 056e143c112833b49b8bdfcddb8dc4bb, type: 3}
  m_Name: AmmoMedium
  m_EditorClassIdentifier: 
  itemName: MediumAmmoBag
  icon: {fileID: 21300000, guid: 32cc1e4a440f7f0449d1374c963cc1d4, type: 3}
  chance: 1
  value: 1
  itemType: 0
  description: 
  reestockBullets: 25
