%YAML 1.1
%TAG !u! tag:unity3d.com,2011:
--- !u!114 &11400000
MonoBehaviour:
  m_ObjectHideFlags: 0
  m_CorrespondingSourceObject: {fileID: 0}
  m_PrefabInstance: {fileID: 0}
  m_PrefabAsset: {fileID: 0}
  m_GameObject: {fileID: 0}
  m_Enabled: 1
  m_EditorHideFlags: 0
  m_Script: {fileID: 11500000, guid: 498190dc9f131a84aa02643d4cc192b8, type: 3}
  m_Name: Floor2
  m_EditorClassIdentifier: 
  name: Floor_2
  minX: -22.6
  minY: -23
  maxX: 17.38
  maxY: 22.9
  startPosition: {x: 0, y: 0, z: 0}
  prefabMap: {fileID: 8301336284356517291, guid: 197d88d08a33f074691a79bd4ac750bf,
    type: 3}
