{
	"info": {
		"_postman_id": "e7048a1d-3484-4eeb-affd-6eaa4fc155a6",
		"name": "AWS Device Farm - Create Test Run",
		"schema": "https://schema.getpostman.com/json/collection/v2.1.0/collection.json"
	},
	"item": [
		{
			"name": "List Projects",
			"event": [
				{
					"listen": "test",
					"script": {
						"id": "fa519bc0-d634-4f6b-a3e1-77dd8964581f",
						"exec": [
							"let responseData = JSON.parse(responseBody)",
							"",
							"pm.environment.set(\"projectArn\", responseData.projects[0].arn);",
							"pm.environment.set(\"projectName\", responseData.projects[0].name);",
							"",
							"pm.test(\"Project successfully set\", function () {",
							"    pm.response.to.have.status(200);",
							"});"
						],
						"type": "text/javascript"
					}
				}
			],
			"request": {
				"method": "POST",
				"header": [
					{
						"key": "X-Amz-Target",
						"value": "DeviceFarm_20150623.ListProjects",
						"type": "text",
						"description": "(Required) "
					},
					{
						"key": "Content-Type",
						"value": "application/x-amz-json-1.1",
						"type": "text"
					}
				],
				"body": {
					"mode": "raw",
					"raw": "{}",
					"options": {
						"raw": {
							"language": "json"
						}
					}
				},
				"url": {
					"raw": "{{baseUrl}}",
					"host": [
						"{{baseUrl}}"
					]
				},
				"description": "Gets information about projects."
			},
			"response": [
				{
					"name": "ServiceAccountException",
					"originalRequest": {
						"method": "POST",
						"header": [
							{
								"description": "(Required) ",
								"key": "X-Amz-Target",
								"value": "<string>"
							},
							{
								"key": "X-Amz-Content-Sha256",
								"value": "<string>"
							},
							{
								"key": "X-Amz-Date",
								"value": "<string>"
							},
							{
								"key": "X-Amz-Algorithm",
								"value": "<string>"
							},
							{
								"key": "X-Amz-Credential",
								"value": "<string>"
							},
							{
								"key": "X-Amz-Security-Token",
								"value": "<string>"
							},
							{
								"key": "X-Amz-Signature",
								"value": "<string>"
							},
							{
								"key": "X-Amz-SignedHeaders",
								"value": "<string>"
							}
						],
						"body": {
							"mode": "raw",
							"raw": "{\n    \"arn\": {},\n    \"nextToken\": {}\n}"
						},
						"url": {
							"raw": "http://devicefarm.{{region}}.amazonaws.com/#X-Amz-Target=DeviceFarm_20150623.ListProjects?nextToken=<string>",
							"protocol": "http",
							"host": [
								"devicefarm",
								"{{region}}",
								"amazonaws",
								"com"
							],
							"path": [
								""
							],
							"hash": "X-Amz-Target=DeviceFarm_20150623.ListProjects?nextToken=<string>"
						}
					},
					"code": 483,
					"_postman_previewlanguage": "json",
					"header": [
						{
							"key": "Content-Type",
							"value": "application/json"
						}
					],
					"cookie": [],
					"body": "\"schema type not provided\""
				},
				{
					"name": "Success",
					"originalRequest": {
						"method": "POST",
						"header": [
							{
								"description": "(Required) ",
								"key": "X-Amz-Target",
								"value": "<string>"
							},
							{
								"key": "X-Amz-Content-Sha256",
								"value": "<string>"
							},
							{
								"key": "X-Amz-Date",
								"value": "<string>"
							},
							{
								"key": "X-Amz-Algorithm",
								"value": "<string>"
							},
							{
								"key": "X-Amz-Credential",
								"value": "<string>"
							},
							{
								"key": "X-Amz-Security-Token",
								"value": "<string>"
							},
							{
								"key": "X-Amz-Signature",
								"value": "<string>"
							},
							{
								"key": "X-Amz-SignedHeaders",
								"value": "<string>"
							}
						],
						"body": {
							"mode": "raw",
							"raw": "{\n    \"arn\": {},\n    \"nextToken\": {}\n}"
						},
						"url": {
							"raw": "http://devicefarm.{{region}}.amazonaws.com/#X-Amz-Target=DeviceFarm_20150623.ListProjects?nextToken=<string>",
							"protocol": "http",
							"host": [
								"devicefarm",
								"{{region}}",
								"amazonaws",
								"com"
							],
							"path": [
								""
							],
							"hash": "X-Amz-Target=DeviceFarm_20150623.ListProjects?nextToken=<string>"
						}
					},
					"status": "OK",
					"code": 200,
					"_postman_previewlanguage": "json",
					"header": [
						{
							"key": "Content-Type",
							"value": "application/json"
						}
					],
					"cookie": [],
					"body": "{\n \"nextToken\": {},\n \"projects\": {}\n}"
				},
				{
					"name": "NotFoundException",
					"originalRequest": {
						"method": "POST",
						"header": [
							{
								"description": "(Required) ",
								"key": "X-Amz-Target",
								"value": "<string>"
							},
							{
								"key": "X-Amz-Content-Sha256",
								"value": "<string>"
							},
							{
								"key": "X-Amz-Date",
								"value": "<string>"
							},
							{
								"key": "X-Amz-Algorithm",
								"value": "<string>"
							},
							{
								"key": "X-Amz-Credential",
								"value": "<string>"
							},
							{
								"key": "X-Amz-Security-Token",
								"value": "<string>"
							},
							{
								"key": "X-Amz-Signature",
								"value": "<string>"
							},
							{
								"key": "X-Amz-SignedHeaders",
								"value": "<string>"
							}
						],
						"body": {
							"mode": "raw",
							"raw": "{\n    \"arn\": {},\n    \"nextToken\": {}\n}"
						},
						"url": {
							"raw": "http://devicefarm.{{region}}.amazonaws.com/#X-Amz-Target=DeviceFarm_20150623.ListProjects?nextToken=<string>",
							"protocol": "http",
							"host": [
								"devicefarm",
								"{{region}}",
								"amazonaws",
								"com"
							],
							"path": [
								""
							],
							"hash": "X-Amz-Target=DeviceFarm_20150623.ListProjects?nextToken=<string>"
						}
					},
					"code": 481,
					"_postman_previewlanguage": "json",
					"header": [
						{
							"key": "Content-Type",
							"value": "application/json"
						}
					],
					"cookie": [],
					"body": "\"schema type not provided\""
				},
				{
					"name": "LimitExceededException",
					"originalRequest": {
						"method": "POST",
						"header": [
							{
								"description": "(Required) ",
								"key": "X-Amz-Target",
								"value": "<string>"
							},
							{
								"key": "X-Amz-Content-Sha256",
								"value": "<string>"
							},
							{
								"key": "X-Amz-Date",
								"value": "<string>"
							},
							{
								"key": "X-Amz-Algorithm",
								"value": "<string>"
							},
							{
								"key": "X-Amz-Credential",
								"value": "<string>"
							},
							{
								"key": "X-Amz-Security-Token",
								"value": "<string>"
							},
							{
								"key": "X-Amz-Signature",
								"value": "<string>"
							},
							{
								"key": "X-Amz-SignedHeaders",
								"value": "<string>"
							}
						],
						"body": {
							"mode": "raw",
							"raw": "{\n    \"arn\": {},\n    \"nextToken\": {}\n}"
						},
						"url": {
							"raw": "http://devicefarm.{{region}}.amazonaws.com/#X-Amz-Target=DeviceFarm_20150623.ListProjects?nextToken=<string>",
							"protocol": "http",
							"host": [
								"devicefarm",
								"{{region}}",
								"amazonaws",
								"com"
							],
							"path": [
								""
							],
							"hash": "X-Amz-Target=DeviceFarm_20150623.ListProjects?nextToken=<string>"
						}
					},
					"code": 482,
					"_postman_previewlanguage": "json",
					"header": [
						{
							"key": "Content-Type",
							"value": "application/json"
						}
					],
					"cookie": [],
					"body": "\"schema type not provided\""
				},
				{
					"name": "ArgumentException",
					"originalRequest": {
						"method": "POST",
						"header": [
							{
								"description": "(Required) ",
								"key": "X-Amz-Target",
								"value": "<string>"
							},
							{
								"key": "X-Amz-Content-Sha256",
								"value": "<string>"
							},
							{
								"key": "X-Amz-Date",
								"value": "<string>"
							},
							{
								"key": "X-Amz-Algorithm",
								"value": "<string>"
							},
							{
								"key": "X-Amz-Credential",
								"value": "<string>"
							},
							{
								"key": "X-Amz-Security-Token",
								"value": "<string>"
							},
							{
								"key": "X-Amz-Signature",
								"value": "<string>"
							},
							{
								"key": "X-Amz-SignedHeaders",
								"value": "<string>"
							}
						],
						"body": {
							"mode": "raw",
							"raw": "{\n    \"arn\": {},\n    \"nextToken\": {}\n}"
						},
						"url": {
							"raw": "http://devicefarm.{{region}}.amazonaws.com/#X-Amz-Target=DeviceFarm_20150623.ListProjects?nextToken=<string>",
							"protocol": "http",
							"host": [
								"devicefarm",
								"{{region}}",
								"amazonaws",
								"com"
							],
							"path": [
								""
							],
							"hash": "X-Amz-Target=DeviceFarm_20150623.ListProjects?nextToken=<string>"
						}
					},
					"code": 480,
					"_postman_previewlanguage": "json",
					"header": [
						{
							"key": "Content-Type",
							"value": "application/json"
						}
					],
					"cookie": [],
					"body": "\"schema type not provided\""
				}
			]
		},
		{
			"name": "List Device Pools",
			"event": [
				{
					"listen": "test",
					"script": {
						"id": "2bf826e8-6daa-42cd-8e5e-9c68af22b2b3",
						"exec": [
							"let responseData = JSON.parse(responseBody)",
							"",
							"pm.environment.set(\"devicePoolArn\", responseData.devicePools[2].arn);",
							"pm.environment.set(\"devicePoolName\", responseData.devicePools[2].name);",
							"",
							"pm.test(\"Device pool successfully set\", function () {",
							"    pm.response.to.have.status(200);",
							"});"
						],
						"type": "text/javascript"
					}
				}
			],
			"request": {
				"method": "POST",
				"header": [
					{
						"key": "X-Amz-Target",
						"value": "DeviceFarm_20150623.ListDevicePools",
						"type": "text",
						"description": "(Required) "
					},
					{
						"key": "Content-Type",
						"value": "application/x-amz-json-1.1",
						"type": "text"
					}
				],
				"body": {
					"mode": "raw",
					"raw": "{\n    \"arn\": \"{{projectArn}}\"\n}",
					"options": {
						"raw": {
							"language": "json"
						}
					}
				},
				"url": {
					"raw": "{{baseUrl}}",
					"host": [
						"{{baseUrl}}"
					]
				},
				"description": "Gets information about device pools."
			},
			"response": [
				{
					"name": "ServiceAccountException",
					"originalRequest": {
						"method": "POST",
						"header": [
							{
								"description": "(Required) ",
								"key": "X-Amz-Target",
								"value": "<string>"
							},
							{
								"key": "X-Amz-Content-Sha256",
								"value": "<string>"
							},
							{
								"key": "X-Amz-Date",
								"value": "<string>"
							},
							{
								"key": "X-Amz-Algorithm",
								"value": "<string>"
							},
							{
								"key": "X-Amz-Credential",
								"value": "<string>"
							},
							{
								"key": "X-Amz-Security-Token",
								"value": "<string>"
							},
							{
								"key": "X-Amz-Signature",
								"value": "<string>"
							},
							{
								"key": "X-Amz-SignedHeaders",
								"value": "<string>"
							}
						],
						"body": {
							"mode": "raw",
							"raw": "{\n    \"arn\": {},\n    \"nextToken\": {},\n    \"type\": {}\n}"
						},
						"url": {
							"raw": "http://devicefarm.{{region}}.amazonaws.com/#X-Amz-Target=DeviceFarm_20150623.ListDevicePools?nextToken=<string>",
							"protocol": "http",
							"host": [
								"devicefarm",
								"{{region}}",
								"amazonaws",
								"com"
							],
							"path": [
								""
							],
							"hash": "X-Amz-Target=DeviceFarm_20150623.ListDevicePools?nextToken=<string>"
						}
					},
					"code": 483,
					"_postman_previewlanguage": "json",
					"header": [
						{
							"key": "Content-Type",
							"value": "application/json"
						}
					],
					"cookie": [],
					"body": "\"schema type not provided\""
				},
				{
					"name": "LimitExceededException",
					"originalRequest": {
						"method": "POST",
						"header": [
							{
								"description": "(Required) ",
								"key": "X-Amz-Target",
								"value": "<string>"
							},
							{
								"key": "X-Amz-Content-Sha256",
								"value": "<string>"
							},
							{
								"key": "X-Amz-Date",
								"value": "<string>"
							},
							{
								"key": "X-Amz-Algorithm",
								"value": "<string>"
							},
							{
								"key": "X-Amz-Credential",
								"value": "<string>"
							},
							{
								"key": "X-Amz-Security-Token",
								"value": "<string>"
							},
							{
								"key": "X-Amz-Signature",
								"value": "<string>"
							},
							{
								"key": "X-Amz-SignedHeaders",
								"value": "<string>"
							}
						],
						"body": {
							"mode": "raw",
							"raw": "{\n    \"arn\": {},\n    \"nextToken\": {},\n    \"type\": {}\n}"
						},
						"url": {
							"raw": "http://devicefarm.{{region}}.amazonaws.com/#X-Amz-Target=DeviceFarm_20150623.ListDevicePools?nextToken=<string>",
							"protocol": "http",
							"host": [
								"devicefarm",
								"{{region}}",
								"amazonaws",
								"com"
							],
							"path": [
								""
							],
							"hash": "X-Amz-Target=DeviceFarm_20150623.ListDevicePools?nextToken=<string>"
						}
					},
					"code": 482,
					"_postman_previewlanguage": "json",
					"header": [
						{
							"key": "Content-Type",
							"value": "application/json"
						}
					],
					"cookie": [],
					"body": "\"schema type not provided\""
				},
				{
					"name": "Success",
					"originalRequest": {
						"method": "POST",
						"header": [
							{
								"description": "(Required) ",
								"key": "X-Amz-Target",
								"value": "<string>"
							},
							{
								"key": "X-Amz-Content-Sha256",
								"value": "<string>"
							},
							{
								"key": "X-Amz-Date",
								"value": "<string>"
							},
							{
								"key": "X-Amz-Algorithm",
								"value": "<string>"
							},
							{
								"key": "X-Amz-Credential",
								"value": "<string>"
							},
							{
								"key": "X-Amz-Security-Token",
								"value": "<string>"
							},
							{
								"key": "X-Amz-Signature",
								"value": "<string>"
							},
							{
								"key": "X-Amz-SignedHeaders",
								"value": "<string>"
							}
						],
						"body": {
							"mode": "raw",
							"raw": "{\n    \"arn\": {},\n    \"nextToken\": {},\n    \"type\": {}\n}"
						},
						"url": {
							"raw": "http://devicefarm.{{region}}.amazonaws.com/#X-Amz-Target=DeviceFarm_20150623.ListDevicePools?nextToken=<string>",
							"protocol": "http",
							"host": [
								"devicefarm",
								"{{region}}",
								"amazonaws",
								"com"
							],
							"path": [
								""
							],
							"hash": "X-Amz-Target=DeviceFarm_20150623.ListDevicePools?nextToken=<string>"
						}
					},
					"status": "OK",
					"code": 200,
					"_postman_previewlanguage": "json",
					"header": [
						{
							"key": "Content-Type",
							"value": "application/json"
						}
					],
					"cookie": [],
					"body": "{\n \"devicePools\": {},\n \"nextToken\": {}\n}"
				},
				{
					"name": "NotFoundException",
					"originalRequest": {
						"method": "POST",
						"header": [
							{
								"description": "(Required) ",
								"key": "X-Amz-Target",
								"value": "<string>"
							},
							{
								"key": "X-Amz-Content-Sha256",
								"value": "<string>"
							},
							{
								"key": "X-Amz-Date",
								"value": "<string>"
							},
							{
								"key": "X-Amz-Algorithm",
								"value": "<string>"
							},
							{
								"key": "X-Amz-Credential",
								"value": "<string>"
							},
							{
								"key": "X-Amz-Security-Token",
								"value": "<string>"
							},
							{
								"key": "X-Amz-Signature",
								"value": "<string>"
							},
							{
								"key": "X-Amz-SignedHeaders",
								"value": "<string>"
							}
						],
						"body": {
							"mode": "raw",
							"raw": "{\n    \"arn\": {},\n    \"nextToken\": {},\n    \"type\": {}\n}"
						},
						"url": {
							"raw": "http://devicefarm.{{region}}.amazonaws.com/#X-Amz-Target=DeviceFarm_20150623.ListDevicePools?nextToken=<string>",
							"protocol": "http",
							"host": [
								"devicefarm",
								"{{region}}",
								"amazonaws",
								"com"
							],
							"path": [
								""
							],
							"hash": "X-Amz-Target=DeviceFarm_20150623.ListDevicePools?nextToken=<string>"
						}
					},
					"code": 481,
					"_postman_previewlanguage": "json",
					"header": [
						{
							"key": "Content-Type",
							"value": "application/json"
						}
					],
					"cookie": [],
					"body": "\"schema type not provided\""
				},
				{
					"name": "ArgumentException",
					"originalRequest": {
						"method": "POST",
						"header": [
							{
								"description": "(Required) ",
								"key": "X-Amz-Target",
								"value": "<string>"
							},
							{
								"key": "X-Amz-Content-Sha256",
								"value": "<string>"
							},
							{
								"key": "X-Amz-Date",
								"value": "<string>"
							},
							{
								"key": "X-Amz-Algorithm",
								"value": "<string>"
							},
							{
								"key": "X-Amz-Credential",
								"value": "<string>"
							},
							{
								"key": "X-Amz-Security-Token",
								"value": "<string>"
							},
							{
								"key": "X-Amz-Signature",
								"value": "<string>"
							},
							{
								"key": "X-Amz-SignedHeaders",
								"value": "<string>"
							}
						],
						"body": {
							"mode": "raw",
							"raw": "{\n    \"arn\": {},\n    \"nextToken\": {},\n    \"type\": {}\n}"
						},
						"url": {
							"raw": "http://devicefarm.{{region}}.amazonaws.com/#X-Amz-Target=DeviceFarm_20150623.ListDevicePools?nextToken=<string>",
							"protocol": "http",
							"host": [
								"devicefarm",
								"{{region}}",
								"amazonaws",
								"com"
							],
							"path": [
								""
							],
							"hash": "X-Amz-Target=DeviceFarm_20150623.ListDevicePools?nextToken=<string>"
						}
					},
					"code": 480,
					"_postman_previewlanguage": "json",
					"header": [
						{
							"key": "Content-Type",
							"value": "application/json"
						}
					],
					"cookie": [],
					"body": "\"schema type not provided\""
				}
			]
		},
		{
			"name": "Create Upload Test Package",
			"event": [
				{
					"listen": "test",
					"script": {
						"id": "e30f8731-6246-4b20-b699-65f15a391b43",
						"exec": [
							"let responseData = JSON.parse(responseBody)",
							"",
							"pm.environment.set(\"testPackageUploadName\", responseData.upload.name);",
							"pm.environment.set(\"testPackageUploadUrl\", responseData.upload.url);",
							"pm.environment.set(\"testPackageArn\", responseData.upload.arn);",
							"",
							"pm.test(\"Test package uploaded\", function () {",
							"    pm.response.to.have.status(200);",
							"});"
						],
						"type": "text/javascript"
					}
				}
			],
			"request": {
				"method": "POST",
				"header": [
					{
						"key": "X-Amz-Target",
						"value": "DeviceFarm_20150623.CreateUpload",
						"type": "text",
						"description": "(Required) "
					},
					{
						"key": "Content-Type",
						"value": "application/x-amz-json-1.1",
						"type": "text"
					}
				],
				"body": {
					"mode": "raw",
					"raw": "{\n    \"projectArn\": \"{{projectArn}}\",\n    \"name\": \"Test Package\",\n    \"type\": \"APPIUM_JAVA_TESTNG_TEST_PACKAGE\"\n}",
					"options": {
						"raw": {
							"language": "json"
						}
					}
				},
				"url": {
					"raw": "{{baseUrl}}",
					"host": [
						"{{baseUrl}}"
					]
				},
				"description": "Uploads an app or test scripts."
			},
			"response": [
				{
					"name": "ArgumentException",
					"originalRequest": {
						"method": "POST",
						"header": [
							{
								"description": "(Required) ",
								"key": "X-Amz-Target",
								"value": "<string>"
							},
							{
								"key": "X-Amz-Content-Sha256",
								"value": "<string>"
							},
							{
								"key": "X-Amz-Date",
								"value": "<string>"
							},
							{
								"key": "X-Amz-Algorithm",
								"value": "<string>"
							},
							{
								"key": "X-Amz-Credential",
								"value": "<string>"
							},
							{
								"key": "X-Amz-Security-Token",
								"value": "<string>"
							},
							{
								"key": "X-Amz-Signature",
								"value": "<string>"
							},
							{
								"key": "X-Amz-SignedHeaders",
								"value": "<string>"
							}
						],
						"body": {
							"mode": "raw",
							"raw": "{\n    \"projectArn\": {},\n    \"name\": {},\n    \"type\": {},\n    \"contentType\": {}\n}"
						},
						"url": {
							"raw": "http://devicefarm.{{region}}.amazonaws.com/#X-Amz-Target=DeviceFarm_20150623.CreateUpload?",
							"protocol": "http",
							"host": [
								"devicefarm",
								"{{region}}",
								"amazonaws",
								"com"
							],
							"path": [
								""
							],
							"hash": "X-Amz-Target=DeviceFarm_20150623.CreateUpload?"
						}
					},
					"code": 480,
					"_postman_previewlanguage": "json",
					"header": [
						{
							"key": "Content-Type",
							"value": "application/json"
						}
					],
					"cookie": [],
					"body": "\"schema type not provided\""
				},
				{
					"name": "LimitExceededException",
					"originalRequest": {
						"method": "POST",
						"header": [
							{
								"description": "(Required) ",
								"key": "X-Amz-Target",
								"value": "<string>"
							},
							{
								"key": "X-Amz-Content-Sha256",
								"value": "<string>"
							},
							{
								"key": "X-Amz-Date",
								"value": "<string>"
							},
							{
								"key": "X-Amz-Algorithm",
								"value": "<string>"
							},
							{
								"key": "X-Amz-Credential",
								"value": "<string>"
							},
							{
								"key": "X-Amz-Security-Token",
								"value": "<string>"
							},
							{
								"key": "X-Amz-Signature",
								"value": "<string>"
							},
							{
								"key": "X-Amz-SignedHeaders",
								"value": "<string>"
							}
						],
						"body": {
							"mode": "raw",
							"raw": "{\n    \"projectArn\": {},\n    \"name\": {},\n    \"type\": {},\n    \"contentType\": {}\n}"
						},
						"url": {
							"raw": "http://devicefarm.{{region}}.amazonaws.com/#X-Amz-Target=DeviceFarm_20150623.CreateUpload?",
							"protocol": "http",
							"host": [
								"devicefarm",
								"{{region}}",
								"amazonaws",
								"com"
							],
							"path": [
								""
							],
							"hash": "X-Amz-Target=DeviceFarm_20150623.CreateUpload?"
						}
					},
					"code": 482,
					"_postman_previewlanguage": "json",
					"header": [
						{
							"key": "Content-Type",
							"value": "application/json"
						}
					],
					"cookie": [],
					"body": "\"schema type not provided\""
				},
				{
					"name": "Success",
					"originalRequest": {
						"method": "POST",
						"header": [
							{
								"description": "(Required) ",
								"key": "X-Amz-Target",
								"value": "<string>"
							},
							{
								"key": "X-Amz-Content-Sha256",
								"value": "<string>"
							},
							{
								"key": "X-Amz-Date",
								"value": "<string>"
							},
							{
								"key": "X-Amz-Algorithm",
								"value": "<string>"
							},
							{
								"key": "X-Amz-Credential",
								"value": "<string>"
							},
							{
								"key": "X-Amz-Security-Token",
								"value": "<string>"
							},
							{
								"key": "X-Amz-Signature",
								"value": "<string>"
							},
							{
								"key": "X-Amz-SignedHeaders",
								"value": "<string>"
							}
						],
						"body": {
							"mode": "raw",
							"raw": "{\n    \"projectArn\": {},\n    \"name\": {},\n    \"type\": {},\n    \"contentType\": {}\n}"
						},
						"url": {
							"raw": "http://devicefarm.{{region}}.amazonaws.com/#X-Amz-Target=DeviceFarm_20150623.CreateUpload?",
							"protocol": "http",
							"host": [
								"devicefarm",
								"{{region}}",
								"amazonaws",
								"com"
							],
							"path": [
								""
							],
							"hash": "X-Amz-Target=DeviceFarm_20150623.CreateUpload?"
						}
					},
					"status": "OK",
					"code": 200,
					"_postman_previewlanguage": "json",
					"header": [
						{
							"key": "Content-Type",
							"value": "application/json"
						}
					],
					"cookie": [],
					"body": "{\n \"upload\": {\n  \"arn\": {},\n  \"category\": {},\n  \"contentType\": {},\n  \"created\": {},\n  \"message\": {},\n  \"metadata\": {},\n  \"name\": {},\n  \"status\": {},\n  \"type\": {},\n  \"url\": {}\n }\n}"
				},
				{
					"name": "ServiceAccountException",
					"originalRequest": {
						"method": "POST",
						"header": [
							{
								"description": "(Required) ",
								"key": "X-Amz-Target",
								"value": "<string>"
							},
							{
								"key": "X-Amz-Content-Sha256",
								"value": "<string>"
							},
							{
								"key": "X-Amz-Date",
								"value": "<string>"
							},
							{
								"key": "X-Amz-Algorithm",
								"value": "<string>"
							},
							{
								"key": "X-Amz-Credential",
								"value": "<string>"
							},
							{
								"key": "X-Amz-Security-Token",
								"value": "<string>"
							},
							{
								"key": "X-Amz-Signature",
								"value": "<string>"
							},
							{
								"key": "X-Amz-SignedHeaders",
								"value": "<string>"
							}
						],
						"body": {
							"mode": "raw",
							"raw": "{\n    \"projectArn\": {},\n    \"name\": {},\n    \"type\": {},\n    \"contentType\": {}\n}"
						},
						"url": {
							"raw": "http://devicefarm.{{region}}.amazonaws.com/#X-Amz-Target=DeviceFarm_20150623.CreateUpload?",
							"protocol": "http",
							"host": [
								"devicefarm",
								"{{region}}",
								"amazonaws",
								"com"
							],
							"path": [
								""
							],
							"hash": "X-Amz-Target=DeviceFarm_20150623.CreateUpload?"
						}
					},
					"code": 483,
					"_postman_previewlanguage": "json",
					"header": [
						{
							"key": "Content-Type",
							"value": "application/json"
						}
					],
					"cookie": [],
					"body": "\"schema type not provided\""
				},
				{
					"name": "NotFoundException",
					"originalRequest": {
						"method": "POST",
						"header": [
							{
								"description": "(Required) ",
								"key": "X-Amz-Target",
								"value": "<string>"
							},
							{
								"key": "X-Amz-Content-Sha256",
								"value": "<string>"
							},
							{
								"key": "X-Amz-Date",
								"value": "<string>"
							},
							{
								"key": "X-Amz-Algorithm",
								"value": "<string>"
							},
							{
								"key": "X-Amz-Credential",
								"value": "<string>"
							},
							{
								"key": "X-Amz-Security-Token",
								"value": "<string>"
							},
							{
								"key": "X-Amz-Signature",
								"value": "<string>"
							},
							{
								"key": "X-Amz-SignedHeaders",
								"value": "<string>"
							}
						],
						"body": {
							"mode": "raw",
							"raw": "{\n    \"projectArn\": {},\n    \"name\": {},\n    \"type\": {},\n    \"contentType\": {}\n}"
						},
						"url": {
							"raw": "http://devicefarm.{{region}}.amazonaws.com/#X-Amz-Target=DeviceFarm_20150623.CreateUpload?",
							"protocol": "http",
							"host": [
								"devicefarm",
								"{{region}}",
								"amazonaws",
								"com"
							],
							"path": [
								""
							],
							"hash": "X-Amz-Target=DeviceFarm_20150623.CreateUpload?"
						}
					},
					"code": 481,
					"_postman_previewlanguage": "json",
					"header": [
						{
							"key": "Content-Type",
							"value": "application/json"
						}
					],
					"cookie": [],
					"body": "\"schema type not provided\""
				}
			]
		},
		{
			"name": "Upload Test Package",
			"event": [
				{
					"listen": "test",
					"script": {
						"id": "5eafb7e4-a7f6-44e2-9ddf-db97e9f08b60",
						"exec": [
							"pm.test(\"Test package upload ready\", function () {",
							"    pm.response.to.have.status(200);",
							"});"
						],
						"type": "text/javascript"
					}
				}
			],
			"request": {
				"auth": {
					"type": "noauth"
				},
				"method": "PUT",
				"header": [],
				"body": {
					"mode": "file",
					"file": {
						"src": "target/zip-with-dependencies.zip"
					},
					"options": {
						"formdata": {}
					}
				},
				"url": {
					"raw": "{{testPackageUploadUrl}}",
					"host": [
						"{{testPackageUploadUrl}}"
					]
				}
			},
			"response": []
		},
		{
			"name": "Confirm Upload Test Package",
			"event": [
				{
					"listen": "test",
					"script": {
						"id": "bdee8264-756e-4dbb-9b9e-7b1eb8fb6820",
						"exec": [
							"let responseData = JSON.parse(responseBody)",
							"",
							"",
							"switch(responseData.upload.status) {",
							"    case \"INITIALIZED\":",
							"    case \"PROCESSING\":",
							"        postman.setNextRequest(\"Confirm Upload Test Package\")",
							"        break",
							"    case \"FAILED\":",
							"        postman.setNextRequest(\"Upload Test Package\")",
							"        break",
							"    default:",
							"        postman.setNextRequest(\"Create Upload APK\")",
							"",
							"        pm.test(\"Test package successfully uploaded\", function () {",
							"            pm.response.to.have.status(200);",
							"            pm.expect(responseData.upload.status).to.eql(\"SUCCEEDED\")",
							"        });",
							"        break",
							"",
							"}"
						],
						"type": "text/javascript"
					}
				}
			],
			"request": {
				"method": "POST",
				"header": [
					{
						"description": "(Required) ",
						"key": "X-Amz-Target",
						"value": "DeviceFarm_20150623.GetUpload"
					},
					{
						"key": "Content-Type",
						"value": "application/x-amz-json-1.1"
					}
				],
				"body": {
					"mode": "raw",
					"raw": "{\n    \"arn\": \"{{testPackageArn}}\"\n}",
					"options": {
						"raw": {
							"language": "json"
						}
					}
				},
				"url": {
					"raw": "{{baseUrl}}",
					"host": [
						"{{baseUrl}}"
					]
				},
				"description": "Gets information about an upload."
			},
			"response": [
				{
					"name": "ArgumentException",
					"originalRequest": {
						"method": "POST",
						"header": [
							{
								"description": "(Required) ",
								"key": "X-Amz-Target",
								"value": "<string>"
							},
							{
								"key": "X-Amz-Content-Sha256",
								"value": "<string>"
							},
							{
								"key": "X-Amz-Date",
								"value": "<string>"
							},
							{
								"key": "X-Amz-Algorithm",
								"value": "<string>"
							},
							{
								"key": "X-Amz-Credential",
								"value": "<string>"
							},
							{
								"key": "X-Amz-Security-Token",
								"value": "<string>"
							},
							{
								"key": "X-Amz-Signature",
								"value": "<string>"
							},
							{
								"key": "X-Amz-SignedHeaders",
								"value": "<string>"
							}
						],
						"body": {
							"mode": "raw",
							"raw": "{\n    \"arn\": {}\n}"
						},
						"url": {
							"raw": "http://devicefarm.{{region}}.amazonaws.com/#X-Amz-Target=DeviceFarm_20150623.GetUpload?",
							"protocol": "http",
							"host": [
								"devicefarm",
								"{{region}}",
								"amazonaws",
								"com"
							],
							"path": [
								""
							],
							"hash": "X-Amz-Target=DeviceFarm_20150623.GetUpload?"
						}
					},
					"code": 480,
					"_postman_previewlanguage": "json",
					"header": [
						{
							"key": "Content-Type",
							"value": "application/json"
						}
					],
					"cookie": [],
					"body": "\"schema type not provided\""
				},
				{
					"name": "ServiceAccountException",
					"originalRequest": {
						"method": "POST",
						"header": [
							{
								"description": "(Required) ",
								"key": "X-Amz-Target",
								"value": "<string>"
							},
							{
								"key": "X-Amz-Content-Sha256",
								"value": "<string>"
							},
							{
								"key": "X-Amz-Date",
								"value": "<string>"
							},
							{
								"key": "X-Amz-Algorithm",
								"value": "<string>"
							},
							{
								"key": "X-Amz-Credential",
								"value": "<string>"
							},
							{
								"key": "X-Amz-Security-Token",
								"value": "<string>"
							},
							{
								"key": "X-Amz-Signature",
								"value": "<string>"
							},
							{
								"key": "X-Amz-SignedHeaders",
								"value": "<string>"
							}
						],
						"body": {
							"mode": "raw",
							"raw": "{\n    \"arn\": {}\n}"
						},
						"url": {
							"raw": "http://devicefarm.{{region}}.amazonaws.com/#X-Amz-Target=DeviceFarm_20150623.GetUpload?",
							"protocol": "http",
							"host": [
								"devicefarm",
								"{{region}}",
								"amazonaws",
								"com"
							],
							"path": [
								""
							],
							"hash": "X-Amz-Target=DeviceFarm_20150623.GetUpload?"
						}
					},
					"code": 483,
					"_postman_previewlanguage": "json",
					"header": [
						{
							"key": "Content-Type",
							"value": "application/json"
						}
					],
					"cookie": [],
					"body": "\"schema type not provided\""
				},
				{
					"name": "LimitExceededException",
					"originalRequest": {
						"method": "POST",
						"header": [
							{
								"description": "(Required) ",
								"key": "X-Amz-Target",
								"value": "<string>"
							},
							{
								"key": "X-Amz-Content-Sha256",
								"value": "<string>"
							},
							{
								"key": "X-Amz-Date",
								"value": "<string>"
							},
							{
								"key": "X-Amz-Algorithm",
								"value": "<string>"
							},
							{
								"key": "X-Amz-Credential",
								"value": "<string>"
							},
							{
								"key": "X-Amz-Security-Token",
								"value": "<string>"
							},
							{
								"key": "X-Amz-Signature",
								"value": "<string>"
							},
							{
								"key": "X-Amz-SignedHeaders",
								"value": "<string>"
							}
						],
						"body": {
							"mode": "raw",
							"raw": "{\n    \"arn\": {}\n}"
						},
						"url": {
							"raw": "http://devicefarm.{{region}}.amazonaws.com/#X-Amz-Target=DeviceFarm_20150623.GetUpload?",
							"protocol": "http",
							"host": [
								"devicefarm",
								"{{region}}",
								"amazonaws",
								"com"
							],
							"path": [
								""
							],
							"hash": "X-Amz-Target=DeviceFarm_20150623.GetUpload?"
						}
					},
					"code": 482,
					"_postman_previewlanguage": "json",
					"header": [
						{
							"key": "Content-Type",
							"value": "application/json"
						}
					],
					"cookie": [],
					"body": "\"schema type not provided\""
				},
				{
					"name": "Success",
					"originalRequest": {
						"method": "POST",
						"header": [
							{
								"description": "(Required) ",
								"key": "X-Amz-Target",
								"value": "<string>"
							},
							{
								"key": "X-Amz-Content-Sha256",
								"value": "<string>"
							},
							{
								"key": "X-Amz-Date",
								"value": "<string>"
							},
							{
								"key": "X-Amz-Algorithm",
								"value": "<string>"
							},
							{
								"key": "X-Amz-Credential",
								"value": "<string>"
							},
							{
								"key": "X-Amz-Security-Token",
								"value": "<string>"
							},
							{
								"key": "X-Amz-Signature",
								"value": "<string>"
							},
							{
								"key": "X-Amz-SignedHeaders",
								"value": "<string>"
							}
						],
						"body": {
							"mode": "raw",
							"raw": "{\n    \"arn\": {}\n}"
						},
						"url": {
							"raw": "http://devicefarm.{{region}}.amazonaws.com/#X-Amz-Target=DeviceFarm_20150623.GetUpload?",
							"protocol": "http",
							"host": [
								"devicefarm",
								"{{region}}",
								"amazonaws",
								"com"
							],
							"path": [
								""
							],
							"hash": "X-Amz-Target=DeviceFarm_20150623.GetUpload?"
						}
					},
					"status": "OK",
					"code": 200,
					"_postman_previewlanguage": "json",
					"header": [
						{
							"key": "Content-Type",
							"value": "application/json"
						}
					],
					"cookie": [],
					"body": "{\n \"upload\": {}\n}"
				},
				{
					"name": "NotFoundException",
					"originalRequest": {
						"method": "POST",
						"header": [
							{
								"description": "(Required) ",
								"key": "X-Amz-Target",
								"value": "<string>"
							},
							{
								"key": "X-Amz-Content-Sha256",
								"value": "<string>"
							},
							{
								"key": "X-Amz-Date",
								"value": "<string>"
							},
							{
								"key": "X-Amz-Algorithm",
								"value": "<string>"
							},
							{
								"key": "X-Amz-Credential",
								"value": "<string>"
							},
							{
								"key": "X-Amz-Security-Token",
								"value": "<string>"
							},
							{
								"key": "X-Amz-Signature",
								"value": "<string>"
							},
							{
								"key": "X-Amz-SignedHeaders",
								"value": "<string>"
							}
						],
						"body": {
							"mode": "raw",
							"raw": "{\n    \"arn\": {}\n}"
						},
						"url": {
							"raw": "http://devicefarm.{{region}}.amazonaws.com/#X-Amz-Target=DeviceFarm_20150623.GetUpload?",
							"protocol": "http",
							"host": [
								"devicefarm",
								"{{region}}",
								"amazonaws",
								"com"
							],
							"path": [
								""
							],
							"hash": "X-Amz-Target=DeviceFarm_20150623.GetUpload?"
						}
					},
					"code": 481,
					"_postman_previewlanguage": "json",
					"header": [
						{
							"key": "Content-Type",
							"value": "application/json"
						}
					],
					"cookie": [],
					"body": "\"schema type not provided\""
				}
			]
		},
		{
			"name": "Create Upload APK",
			"event": [
				{
					"listen": "test",
					"script": {
						"id": "f0060b8c-392b-412d-9773-473f30845210",
						"exec": [
							"let responseData = JSON.parse(responseBody)",
							"",
							"pm.environment.set(\"apkUploadName\", responseData.upload.name);",
							"pm.environment.set(\"apkUploadUrl\", responseData.upload.url);",
							"pm.environment.set(\"apkArn\", responseData.upload.arn);",
							"",
							"pm.test(\"Apk upload ready\", function () {",
							"    pm.response.to.have.status(200);",
							"});"
						],
						"type": "text/javascript"
					}
				}
			],
			"request": {
				"method": "POST",
				"header": [
					{
						"key": "X-Amz-Target",
						"value": "DeviceFarm_20150623.CreateUpload",
						"type": "text",
						"description": "(Required) "
					},
					{
						"key": "Content-Type",
						"value": "application/x-amz-json-1.1",
						"type": "text"
					}
				],
				"body": {
					"mode": "raw",
					"raw": "{\n    \"projectArn\": \"{{projectArn}}\",\n    \"name\": \"package.apk\",\n    \"type\": \"ANDROID_APP\"\n}",
					"options": {
						"raw": {
							"language": "json"
						}
					}
				},
				"url": {
					"raw": "{{baseUrl}}",
					"host": [
						"{{baseUrl}}"
					]
				},
				"description": "Uploads an app or test scripts."
			},
			"response": [
				{
					"name": "ServiceAccountException",
					"originalRequest": {
						"method": "POST",
						"header": [
							{
								"description": "(Required) ",
								"key": "X-Amz-Target",
								"value": "<string>"
							},
							{
								"key": "X-Amz-Content-Sha256",
								"value": "<string>"
							},
							{
								"key": "X-Amz-Date",
								"value": "<string>"
							},
							{
								"key": "X-Amz-Algorithm",
								"value": "<string>"
							},
							{
								"key": "X-Amz-Credential",
								"value": "<string>"
							},
							{
								"key": "X-Amz-Security-Token",
								"value": "<string>"
							},
							{
								"key": "X-Amz-Signature",
								"value": "<string>"
							},
							{
								"key": "X-Amz-SignedHeaders",
								"value": "<string>"
							}
						],
						"body": {
							"mode": "raw",
							"raw": "{\n    \"projectArn\": {},\n    \"name\": {},\n    \"type\": {},\n    \"contentType\": {}\n}"
						},
						"url": {
							"raw": "http://devicefarm.{{region}}.amazonaws.com/#X-Amz-Target=DeviceFarm_20150623.CreateUpload?",
							"protocol": "http",
							"host": [
								"devicefarm",
								"{{region}}",
								"amazonaws",
								"com"
							],
							"path": [
								""
							],
							"hash": "X-Amz-Target=DeviceFarm_20150623.CreateUpload?"
						}
					},
					"code": 483,
					"_postman_previewlanguage": "json",
					"header": [
						{
							"key": "Content-Type",
							"value": "application/json"
						}
					],
					"cookie": [],
					"body": "\"schema type not provided\""
				},
				{
					"name": "Success",
					"originalRequest": {
						"method": "POST",
						"header": [
							{
								"description": "(Required) ",
								"key": "X-Amz-Target",
								"value": "<string>"
							},
							{
								"key": "X-Amz-Content-Sha256",
								"value": "<string>"
							},
							{
								"key": "X-Amz-Date",
								"value": "<string>"
							},
							{
								"key": "X-Amz-Algorithm",
								"value": "<string>"
							},
							{
								"key": "X-Amz-Credential",
								"value": "<string>"
							},
							{
								"key": "X-Amz-Security-Token",
								"value": "<string>"
							},
							{
								"key": "X-Amz-Signature",
								"value": "<string>"
							},
							{
								"key": "X-Amz-SignedHeaders",
								"value": "<string>"
							}
						],
						"body": {
							"mode": "raw",
							"raw": "{\n    \"projectArn\": {},\n    \"name\": {},\n    \"type\": {},\n    \"contentType\": {}\n}"
						},
						"url": {
							"raw": "http://devicefarm.{{region}}.amazonaws.com/#X-Amz-Target=DeviceFarm_20150623.CreateUpload?",
							"protocol": "http",
							"host": [
								"devicefarm",
								"{{region}}",
								"amazonaws",
								"com"
							],
							"path": [
								""
							],
							"hash": "X-Amz-Target=DeviceFarm_20150623.CreateUpload?"
						}
					},
					"status": "OK",
					"code": 200,
					"_postman_previewlanguage": "json",
					"header": [
						{
							"key": "Content-Type",
							"value": "application/json"
						}
					],
					"cookie": [],
					"body": "{\n \"upload\": {\n  \"arn\": {},\n  \"category\": {},\n  \"contentType\": {},\n  \"created\": {},\n  \"message\": {},\n  \"metadata\": {},\n  \"name\": {},\n  \"status\": {},\n  \"type\": {},\n  \"url\": {}\n }\n}"
				},
				{
					"name": "ArgumentException",
					"originalRequest": {
						"method": "POST",
						"header": [
							{
								"description": "(Required) ",
								"key": "X-Amz-Target",
								"value": "<string>"
							},
							{
								"key": "X-Amz-Content-Sha256",
								"value": "<string>"
							},
							{
								"key": "X-Amz-Date",
								"value": "<string>"
							},
							{
								"key": "X-Amz-Algorithm",
								"value": "<string>"
							},
							{
								"key": "X-Amz-Credential",
								"value": "<string>"
							},
							{
								"key": "X-Amz-Security-Token",
								"value": "<string>"
							},
							{
								"key": "X-Amz-Signature",
								"value": "<string>"
							},
							{
								"key": "X-Amz-SignedHeaders",
								"value": "<string>"
							}
						],
						"body": {
							"mode": "raw",
							"raw": "{\n    \"projectArn\": {},\n    \"name\": {},\n    \"type\": {},\n    \"contentType\": {}\n}"
						},
						"url": {
							"raw": "http://devicefarm.{{region}}.amazonaws.com/#X-Amz-Target=DeviceFarm_20150623.CreateUpload?",
							"protocol": "http",
							"host": [
								"devicefarm",
								"{{region}}",
								"amazonaws",
								"com"
							],
							"path": [
								""
							],
							"hash": "X-Amz-Target=DeviceFarm_20150623.CreateUpload?"
						}
					},
					"code": 480,
					"_postman_previewlanguage": "json",
					"header": [
						{
							"key": "Content-Type",
							"value": "application/json"
						}
					],
					"cookie": [],
					"body": "\"schema type not provided\""
				},
				{
					"name": "NotFoundException",
					"originalRequest": {
						"method": "POST",
						"header": [
							{
								"description": "(Required) ",
								"key": "X-Amz-Target",
								"value": "<string>"
							},
							{
								"key": "X-Amz-Content-Sha256",
								"value": "<string>"
							},
							{
								"key": "X-Amz-Date",
								"value": "<string>"
							},
							{
								"key": "X-Amz-Algorithm",
								"value": "<string>"
							},
							{
								"key": "X-Amz-Credential",
								"value": "<string>"
							},
							{
								"key": "X-Amz-Security-Token",
								"value": "<string>"
							},
							{
								"key": "X-Amz-Signature",
								"value": "<string>"
							},
							{
								"key": "X-Amz-SignedHeaders",
								"value": "<string>"
							}
						],
						"body": {
							"mode": "raw",
							"raw": "{\n    \"projectArn\": {},\n    \"name\": {},\n    \"type\": {},\n    \"contentType\": {}\n}"
						},
						"url": {
							"raw": "http://devicefarm.{{region}}.amazonaws.com/#X-Amz-Target=DeviceFarm_20150623.CreateUpload?",
							"protocol": "http",
							"host": [
								"devicefarm",
								"{{region}}",
								"amazonaws",
								"com"
							],
							"path": [
								""
							],
							"hash": "X-Amz-Target=DeviceFarm_20150623.CreateUpload?"
						}
					},
					"code": 481,
					"_postman_previewlanguage": "json",
					"header": [
						{
							"key": "Content-Type",
							"value": "application/json"
						}
					],
					"cookie": [],
					"body": "\"schema type not provided\""
				},
				{
					"name": "LimitExceededException",
					"originalRequest": {
						"method": "POST",
						"header": [
							{
								"description": "(Required) ",
								"key": "X-Amz-Target",
								"value": "<string>"
							},
							{
								"key": "X-Amz-Content-Sha256",
								"value": "<string>"
							},
							{
								"key": "X-Amz-Date",
								"value": "<string>"
							},
							{
								"key": "X-Amz-Algorithm",
								"value": "<string>"
							},
							{
								"key": "X-Amz-Credential",
								"value": "<string>"
							},
							{
								"key": "X-Amz-Security-Token",
								"value": "<string>"
							},
							{
								"key": "X-Amz-Signature",
								"value": "<string>"
							},
							{
								"key": "X-Amz-SignedHeaders",
								"value": "<string>"
							}
						],
						"body": {
							"mode": "raw",
							"raw": "{\n    \"projectArn\": {},\n    \"name\": {},\n    \"type\": {},\n    \"contentType\": {}\n}"
						},
						"url": {
							"raw": "http://devicefarm.{{region}}.amazonaws.com/#X-Amz-Target=DeviceFarm_20150623.CreateUpload?",
							"protocol": "http",
							"host": [
								"devicefarm",
								"{{region}}",
								"amazonaws",
								"com"
							],
							"path": [
								""
							],
							"hash": "X-Amz-Target=DeviceFarm_20150623.CreateUpload?"
						}
					},
					"code": 482,
					"_postman_previewlanguage": "json",
					"header": [
						{
							"key": "Content-Type",
							"value": "application/json"
						}
					],
					"cookie": [],
					"body": "\"schema type not provided\""
				}
			]
		},
		{
			"name": "Upload APK",
			"event": [
				{
					"listen": "test",
					"script": {
						"id": "b7074ba4-c5d5-4085-9dc9-2bbd3f170f1b",
						"exec": [
							"pm.test(\"APK upload ready\", function () {",
							"    pm.response.to.have.status(200);",
							"});"
						],
						"type": "text/javascript"
					}
				}
			],
			"protocolProfileBehavior": {
				"disabledSystemHeaders": {
					"content-type": true
				}
			},
			"request": {
				"auth": {
					"type": "noauth"
				},
				"method": "PUT",
				"header": [
					{
						"key": "Content-Type",
						"type": "text",
						"value": "application/octet-stream"
					}
				],
				"body": {
					"mode": "file",
					"file": {
						"src": "mobileapp/mall-cz_20.08.17.apk"
					},
					"options": {
						"formdata": {}
					}
				},
				"url": {
					"raw": "{{apkUploadUrl}}",
					"host": [
						"{{apkUploadUrl}}"
					]
				}
			},
			"response": []
		},
		{
			"name": "Confirm Upload APK",
			"event": [
				{
					"listen": "test",
					"script": {
						"id": "d6678da9-39be-4867-8f68-cbd2b3571c73",
						"exec": [
							"let responseData = JSON.parse(responseBody)",
							"",
							"",
							"switch(responseData.upload.status) {",
							"    case \"INITIALIZED\":",
							"    case \"PROCESSING\":",
							"        postman.setNextRequest(\"Confirm Upload APK\")",
							"        break",
							"    case \"FAILED\":",
							"        postman.setNextRequest(\"Upload APK\")",
							"        break",
							"    default:",
							"        postman.setNextRequest(\"Create Upload Spec file\")",
							"",
							"        pm.test(\"APK successfully uploaded\", function () {",
							"            pm.response.to.have.status(200);",
							"            pm.expect(responseData.upload.status).to.eql(\"SUCCEEDED\")",
							"        });",
							"        break",
							"}"
						],
						"type": "text/javascript"
					}
				}
			],
			"request": {
				"method": "POST",
				"header": [
					{
						"description": "(Required) ",
						"key": "X-Amz-Target",
						"value": "DeviceFarm_20150623.GetUpload"
					},
					{
						"key": "Content-Type",
						"value": "application/x-amz-json-1.1"
					}
				],
				"body": {
					"mode": "raw",
					"raw": "{\n    \"arn\": \"{{apkArn}}\"\n}",
					"options": {
						"raw": {
							"language": "json"
						}
					}
				},
				"url": {
					"raw": "{{baseUrl}}",
					"host": [
						"{{baseUrl}}"
					]
				},
				"description": "Gets information about an upload."
			},
			"response": [
				{
					"name": "Success",
					"originalRequest": {
						"method": "POST",
						"header": [
							{
								"description": "(Required) ",
								"key": "X-Amz-Target",
								"value": "<string>"
							},
							{
								"key": "X-Amz-Content-Sha256",
								"value": "<string>"
							},
							{
								"key": "X-Amz-Date",
								"value": "<string>"
							},
							{
								"key": "X-Amz-Algorithm",
								"value": "<string>"
							},
							{
								"key": "X-Amz-Credential",
								"value": "<string>"
							},
							{
								"key": "X-Amz-Security-Token",
								"value": "<string>"
							},
							{
								"key": "X-Amz-Signature",
								"value": "<string>"
							},
							{
								"key": "X-Amz-SignedHeaders",
								"value": "<string>"
							}
						],
						"body": {
							"mode": "raw",
							"raw": "{\n    \"arn\": {}\n}"
						},
						"url": {
							"raw": "http://devicefarm.{{region}}.amazonaws.com/#X-Amz-Target=DeviceFarm_20150623.GetUpload?",
							"protocol": "http",
							"host": [
								"devicefarm",
								"{{region}}",
								"amazonaws",
								"com"
							],
							"path": [
								""
							],
							"hash": "X-Amz-Target=DeviceFarm_20150623.GetUpload?"
						}
					},
					"status": "OK",
					"code": 200,
					"_postman_previewlanguage": "json",
					"header": [
						{
							"key": "Content-Type",
							"value": "application/json"
						}
					],
					"cookie": [],
					"body": "{\n \"upload\": {}\n}"
				},
				{
					"name": "NotFoundException",
					"originalRequest": {
						"method": "POST",
						"header": [
							{
								"description": "(Required) ",
								"key": "X-Amz-Target",
								"value": "<string>"
							},
							{
								"key": "X-Amz-Content-Sha256",
								"value": "<string>"
							},
							{
								"key": "X-Amz-Date",
								"value": "<string>"
							},
							{
								"key": "X-Amz-Algorithm",
								"value": "<string>"
							},
							{
								"key": "X-Amz-Credential",
								"value": "<string>"
							},
							{
								"key": "X-Amz-Security-Token",
								"value": "<string>"
							},
							{
								"key": "X-Amz-Signature",
								"value": "<string>"
							},
							{
								"key": "X-Amz-SignedHeaders",
								"value": "<string>"
							}
						],
						"body": {
							"mode": "raw",
							"raw": "{\n    \"arn\": {}\n}"
						},
						"url": {
							"raw": "http://devicefarm.{{region}}.amazonaws.com/#X-Amz-Target=DeviceFarm_20150623.GetUpload?",
							"protocol": "http",
							"host": [
								"devicefarm",
								"{{region}}",
								"amazonaws",
								"com"
							],
							"path": [
								""
							],
							"hash": "X-Amz-Target=DeviceFarm_20150623.GetUpload?"
						}
					},
					"code": 481,
					"_postman_previewlanguage": "json",
					"header": [
						{
							"key": "Content-Type",
							"value": "application/json"
						}
					],
					"cookie": [],
					"body": "\"schema type not provided\""
				},
				{
					"name": "ArgumentException",
					"originalRequest": {
						"method": "POST",
						"header": [
							{
								"description": "(Required) ",
								"key": "X-Amz-Target",
								"value": "<string>"
							},
							{
								"key": "X-Amz-Content-Sha256",
								"value": "<string>"
							},
							{
								"key": "X-Amz-Date",
								"value": "<string>"
							},
							{
								"key": "X-Amz-Algorithm",
								"value": "<string>"
							},
							{
								"key": "X-Amz-Credential",
								"value": "<string>"
							},
							{
								"key": "X-Amz-Security-Token",
								"value": "<string>"
							},
							{
								"key": "X-Amz-Signature",
								"value": "<string>"
							},
							{
								"key": "X-Amz-SignedHeaders",
								"value": "<string>"
							}
						],
						"body": {
							"mode": "raw",
							"raw": "{\n    \"arn\": {}\n}"
						},
						"url": {
							"raw": "http://devicefarm.{{region}}.amazonaws.com/#X-Amz-Target=DeviceFarm_20150623.GetUpload?",
							"protocol": "http",
							"host": [
								"devicefarm",
								"{{region}}",
								"amazonaws",
								"com"
							],
							"path": [
								""
							],
							"hash": "X-Amz-Target=DeviceFarm_20150623.GetUpload?"
						}
					},
					"code": 480,
					"_postman_previewlanguage": "json",
					"header": [
						{
							"key": "Content-Type",
							"value": "application/json"
						}
					],
					"cookie": [],
					"body": "\"schema type not provided\""
				},
				{
					"name": "ServiceAccountException",
					"originalRequest": {
						"method": "POST",
						"header": [
							{
								"description": "(Required) ",
								"key": "X-Amz-Target",
								"value": "<string>"
							},
							{
								"key": "X-Amz-Content-Sha256",
								"value": "<string>"
							},
							{
								"key": "X-Amz-Date",
								"value": "<string>"
							},
							{
								"key": "X-Amz-Algorithm",
								"value": "<string>"
							},
							{
								"key": "X-Amz-Credential",
								"value": "<string>"
							},
							{
								"key": "X-Amz-Security-Token",
								"value": "<string>"
							},
							{
								"key": "X-Amz-Signature",
								"value": "<string>"
							},
							{
								"key": "X-Amz-SignedHeaders",
								"value": "<string>"
							}
						],
						"body": {
							"mode": "raw",
							"raw": "{\n    \"arn\": {}\n}"
						},
						"url": {
							"raw": "http://devicefarm.{{region}}.amazonaws.com/#X-Amz-Target=DeviceFarm_20150623.GetUpload?",
							"protocol": "http",
							"host": [
								"devicefarm",
								"{{region}}",
								"amazonaws",
								"com"
							],
							"path": [
								""
							],
							"hash": "X-Amz-Target=DeviceFarm_20150623.GetUpload?"
						}
					},
					"code": 483,
					"_postman_previewlanguage": "json",
					"header": [
						{
							"key": "Content-Type",
							"value": "application/json"
						}
					],
					"cookie": [],
					"body": "\"schema type not provided\""
				},
				{
					"name": "LimitExceededException",
					"originalRequest": {
						"method": "POST",
						"header": [
							{
								"description": "(Required) ",
								"key": "X-Amz-Target",
								"value": "<string>"
							},
							{
								"key": "X-Amz-Content-Sha256",
								"value": "<string>"
							},
							{
								"key": "X-Amz-Date",
								"value": "<string>"
							},
							{
								"key": "X-Amz-Algorithm",
								"value": "<string>"
							},
							{
								"key": "X-Amz-Credential",
								"value": "<string>"
							},
							{
								"key": "X-Amz-Security-Token",
								"value": "<string>"
							},
							{
								"key": "X-Amz-Signature",
								"value": "<string>"
							},
							{
								"key": "X-Amz-SignedHeaders",
								"value": "<string>"
							}
						],
						"body": {
							"mode": "raw",
							"raw": "{\n    \"arn\": {}\n}"
						},
						"url": {
							"raw": "http://devicefarm.{{region}}.amazonaws.com/#X-Amz-Target=DeviceFarm_20150623.GetUpload?",
							"protocol": "http",
							"host": [
								"devicefarm",
								"{{region}}",
								"amazonaws",
								"com"
							],
							"path": [
								""
							],
							"hash": "X-Amz-Target=DeviceFarm_20150623.GetUpload?"
						}
					},
					"code": 482,
					"_postman_previewlanguage": "json",
					"header": [
						{
							"key": "Content-Type",
							"value": "application/json"
						}
					],
					"cookie": [],
					"body": "\"schema type not provided\""
				}
			]
		},
		{
			"name": "Create Upload Spec file",
			"event": [
				{
					"listen": "test",
					"script": {
						"id": "5f055359-8b59-4397-9018-4e5159e4cf7d",
						"exec": [
							"let responseData = JSON.parse(responseBody)",
							"",
							"pm.environment.set(\"specUploadName\", responseData.upload.name);",
							"pm.environment.set(\"specUploadUrl\", responseData.upload.url);",
							"pm.environment.set(\"specArn\", responseData.upload.arn);",
							"",
							"",
							"pm.test(\"Spec file upload ready\", function () {",
							"    pm.response.to.have.status(200);",
							"});"
						],
						"type": "text/javascript"
					}
				}
			],
			"request": {
				"method": "POST",
				"header": [
					{
						"description": "(Required) ",
						"key": "X-Amz-Target",
						"type": "text",
						"value": "DeviceFarm_20150623.CreateUpload"
					},
					{
						"key": "Content-Type",
						"type": "text",
						"value": "application/x-amz-json-1.1"
					}
				],
				"body": {
					"mode": "raw",
					"raw": "{\n    \"projectArn\": \"{{projectArn}}\",\n    \"name\": \"spec.yaml\",\n    \"type\": \"APPIUM_JAVA_TESTNG_TEST_SPEC\"\n}",
					"options": {
						"raw": {
							"language": "json"
						}
					}
				},
				"url": {
					"raw": "{{baseUrl}}",
					"host": [
						"{{baseUrl}}"
					]
				},
				"description": "Uploads an app or test scripts."
			},
			"response": [
				{
					"name": "NotFoundException",
					"originalRequest": {
						"method": "POST",
						"header": [
							{
								"description": "(Required) ",
								"key": "X-Amz-Target",
								"value": "<string>"
							},
							{
								"key": "X-Amz-Content-Sha256",
								"value": "<string>"
							},
							{
								"key": "X-Amz-Date",
								"value": "<string>"
							},
							{
								"key": "X-Amz-Algorithm",
								"value": "<string>"
							},
							{
								"key": "X-Amz-Credential",
								"value": "<string>"
							},
							{
								"key": "X-Amz-Security-Token",
								"value": "<string>"
							},
							{
								"key": "X-Amz-Signature",
								"value": "<string>"
							},
							{
								"key": "X-Amz-SignedHeaders",
								"value": "<string>"
							}
						],
						"body": {
							"mode": "raw",
							"raw": "{\n    \"projectArn\": {},\n    \"name\": {},\n    \"type\": {},\n    \"contentType\": {}\n}"
						},
						"url": {
							"raw": "http://devicefarm.{{region}}.amazonaws.com/#X-Amz-Target=DeviceFarm_20150623.CreateUpload?",
							"protocol": "http",
							"host": [
								"devicefarm",
								"{{region}}",
								"amazonaws",
								"com"
							],
							"path": [
								""
							],
							"hash": "X-Amz-Target=DeviceFarm_20150623.CreateUpload?"
						}
					},
					"code": 481,
					"_postman_previewlanguage": "json",
					"header": [
						{
							"key": "Content-Type",
							"value": "application/json"
						}
					],
					"cookie": [],
					"body": "\"schema type not provided\""
				},
				{
					"name": "LimitExceededException",
					"originalRequest": {
						"method": "POST",
						"header": [
							{
								"description": "(Required) ",
								"key": "X-Amz-Target",
								"value": "<string>"
							},
							{
								"key": "X-Amz-Content-Sha256",
								"value": "<string>"
							},
							{
								"key": "X-Amz-Date",
								"value": "<string>"
							},
							{
								"key": "X-Amz-Algorithm",
								"value": "<string>"
							},
							{
								"key": "X-Amz-Credential",
								"value": "<string>"
							},
							{
								"key": "X-Amz-Security-Token",
								"value": "<string>"
							},
							{
								"key": "X-Amz-Signature",
								"value": "<string>"
							},
							{
								"key": "X-Amz-SignedHeaders",
								"value": "<string>"
							}
						],
						"body": {
							"mode": "raw",
							"raw": "{\n    \"projectArn\": {},\n    \"name\": {},\n    \"type\": {},\n    \"contentType\": {}\n}"
						},
						"url": {
							"raw": "http://devicefarm.{{region}}.amazonaws.com/#X-Amz-Target=DeviceFarm_20150623.CreateUpload?",
							"protocol": "http",
							"host": [
								"devicefarm",
								"{{region}}",
								"amazonaws",
								"com"
							],
							"path": [
								""
							],
							"hash": "X-Amz-Target=DeviceFarm_20150623.CreateUpload?"
						}
					},
					"code": 482,
					"_postman_previewlanguage": "json",
					"header": [
						{
							"key": "Content-Type",
							"value": "application/json"
						}
					],
					"cookie": [],
					"body": "\"schema type not provided\""
				},
				{
					"name": "ArgumentException",
					"originalRequest": {
						"method": "POST",
						"header": [
							{
								"description": "(Required) ",
								"key": "X-Amz-Target",
								"value": "<string>"
							},
							{
								"key": "X-Amz-Content-Sha256",
								"value": "<string>"
							},
							{
								"key": "X-Amz-Date",
								"value": "<string>"
							},
							{
								"key": "X-Amz-Algorithm",
								"value": "<string>"
							},
							{
								"key": "X-Amz-Credential",
								"value": "<string>"
							},
							{
								"key": "X-Amz-Security-Token",
								"value": "<string>"
							},
							{
								"key": "X-Amz-Signature",
								"value": "<string>"
							},
							{
								"key": "X-Amz-SignedHeaders",
								"value": "<string>"
							}
						],
						"body": {
							"mode": "raw",
							"raw": "{\n    \"projectArn\": {},\n    \"name\": {},\n    \"type\": {},\n    \"contentType\": {}\n}"
						},
						"url": {
							"raw": "http://devicefarm.{{region}}.amazonaws.com/#X-Amz-Target=DeviceFarm_20150623.CreateUpload?",
							"protocol": "http",
							"host": [
								"devicefarm",
								"{{region}}",
								"amazonaws",
								"com"
							],
							"path": [
								""
							],
							"hash": "X-Amz-Target=DeviceFarm_20150623.CreateUpload?"
						}
					},
					"code": 480,
					"_postman_previewlanguage": "json",
					"header": [
						{
							"key": "Content-Type",
							"value": "application/json"
						}
					],
					"cookie": [],
					"body": "\"schema type not provided\""
				},
				{
					"name": "Success",
					"originalRequest": {
						"method": "POST",
						"header": [
							{
								"description": "(Required) ",
								"key": "X-Amz-Target",
								"value": "<string>"
							},
							{
								"key": "X-Amz-Content-Sha256",
								"value": "<string>"
							},
							{
								"key": "X-Amz-Date",
								"value": "<string>"
							},
							{
								"key": "X-Amz-Algorithm",
								"value": "<string>"
							},
							{
								"key": "X-Amz-Credential",
								"value": "<string>"
							},
							{
								"key": "X-Amz-Security-Token",
								"value": "<string>"
							},
							{
								"key": "X-Amz-Signature",
								"value": "<string>"
							},
							{
								"key": "X-Amz-SignedHeaders",
								"value": "<string>"
							}
						],
						"body": {
							"mode": "raw",
							"raw": "{\n    \"projectArn\": {},\n    \"name\": {},\n    \"type\": {},\n    \"contentType\": {}\n}"
						},
						"url": {
							"raw": "http://devicefarm.{{region}}.amazonaws.com/#X-Amz-Target=DeviceFarm_20150623.CreateUpload?",
							"protocol": "http",
							"host": [
								"devicefarm",
								"{{region}}",
								"amazonaws",
								"com"
							],
							"path": [
								""
							],
							"hash": "X-Amz-Target=DeviceFarm_20150623.CreateUpload?"
						}
					},
					"status": "OK",
					"code": 200,
					"_postman_previewlanguage": "json",
					"header": [
						{
							"key": "Content-Type",
							"value": "application/json"
						}
					],
					"cookie": [],
					"body": "{\n \"upload\": {\n  \"arn\": {},\n  \"category\": {},\n  \"contentType\": {},\n  \"created\": {},\n  \"message\": {},\n  \"metadata\": {},\n  \"name\": {},\n  \"status\": {},\n  \"type\": {},\n  \"url\": {}\n }\n}"
				},
				{
					"name": "ServiceAccountException",
					"originalRequest": {
						"method": "POST",
						"header": [
							{
								"description": "(Required) ",
								"key": "X-Amz-Target",
								"value": "<string>"
							},
							{
								"key": "X-Amz-Content-Sha256",
								"value": "<string>"
							},
							{
								"key": "X-Amz-Date",
								"value": "<string>"
							},
							{
								"key": "X-Amz-Algorithm",
								"value": "<string>"
							},
							{
								"key": "X-Amz-Credential",
								"value": "<string>"
							},
							{
								"key": "X-Amz-Security-Token",
								"value": "<string>"
							},
							{
								"key": "X-Amz-Signature",
								"value": "<string>"
							},
							{
								"key": "X-Amz-SignedHeaders",
								"value": "<string>"
							}
						],
						"body": {
							"mode": "raw",
							"raw": "{\n    \"projectArn\": {},\n    \"name\": {},\n    \"type\": {},\n    \"contentType\": {}\n}"
						},
						"url": {
							"raw": "http://devicefarm.{{region}}.amazonaws.com/#X-Amz-Target=DeviceFarm_20150623.CreateUpload?",
							"protocol": "http",
							"host": [
								"devicefarm",
								"{{region}}",
								"amazonaws",
								"com"
							],
							"path": [
								""
							],
							"hash": "X-Amz-Target=DeviceFarm_20150623.CreateUpload?"
						}
					},
					"code": 483,
					"_postman_previewlanguage": "json",
					"header": [
						{
							"key": "Content-Type",
							"value": "application/json"
						}
					],
					"cookie": [],
					"body": "\"schema type not provided\""
				}
			]
		},
		{
			"name": "Upload Spec file",
			"event": [
				{
					"listen": "prerequest",
					"script": {
						"id": "068cde45-bc77-4ad0-af75-ac178e8081af",
						"exec": [
							""
						],
						"type": "text/javascript"
					}
				},
				{
					"listen": "test",
					"script": {
						"id": "99b8ac26-5a3d-47e6-a0da-4cb3bf4b5110",
						"exec": [
							"pm.test(\"Spec file upload ready\", function () {",
							"    pm.response.to.have.status(200);",
							"});"
						],
						"type": "text/javascript"
					}
				}
			],
			"request": {
				"auth": {
					"type": "noauth"
				},
				"method": "PUT",
				"header": [],
				"body": {
					"mode": "file",
					"file": {
						"src": "aws_spec.yaml"
					},
					"options": {
						"formdata": {}
					}
				},
				"url": {
					"raw": "{{specUploadUrl}}",
					"host": [
						"{{specUploadUrl}}"
					]
				}
			},
			"response": []
		},
		{
			"name": "Confirm Upload Spec file",
			"event": [
				{
					"listen": "test",
					"script": {
						"id": "f914b49c-30cb-44ba-8a3e-a19eb933c80e",
						"exec": [
							"let responseData = JSON.parse(responseBody)",
							"",
							"",
							"switch(responseData.upload.status) {",
							"    case \"INITIALIZED\":",
							"    case \"PROCESSING\":",
							"        postman.setNextRequest(\"Confirm Upload Spec file\")",
							"        break",
							"    case \"FAILED\":",
							"        postman.setNextRequest(\"Create Upload Spec file\")",
							"        break",
							"    default:",
							"        postman.setNextRequest(\"Schedule Run\")",
							"        pm.test(\"Spec file successfully uploaded\", function () {",
							"            pm.response.to.have.status(200);",
							"            pm.expect(responseData.upload.status).to.eql(\"SUCCEEDED\")",
							"        });",
							"        break",
							"}"
						],
						"type": "text/javascript"
					}
				}
			],
			"request": {
				"method": "POST",
				"header": [
					{
						"description": "(Required) ",
						"key": "X-Amz-Target",
						"value": "DeviceFarm_20150623.GetUpload"
					},
					{
						"key": "Content-Type",
						"value": "application/x-amz-json-1.1"
					}
				],
				"body": {
					"mode": "raw",
					"raw": "{\n    \"arn\": \"{{specArn}}\"\n}",
					"options": {
						"raw": {
							"language": "json"
						}
					}
				},
				"url": {
					"raw": "{{baseUrl}}",
					"host": [
						"{{baseUrl}}"
					]
				},
				"description": "Gets information about an upload."
			},
			"response": [
				{
					"name": "LimitExceededException",
					"originalRequest": {
						"method": "POST",
						"header": [
							{
								"description": "(Required) ",
								"key": "X-Amz-Target",
								"value": "<string>"
							},
							{
								"key": "X-Amz-Content-Sha256",
								"value": "<string>"
							},
							{
								"key": "X-Amz-Date",
								"value": "<string>"
							},
							{
								"key": "X-Amz-Algorithm",
								"value": "<string>"
							},
							{
								"key": "X-Amz-Credential",
								"value": "<string>"
							},
							{
								"key": "X-Amz-Security-Token",
								"value": "<string>"
							},
							{
								"key": "X-Amz-Signature",
								"value": "<string>"
							},
							{
								"key": "X-Amz-SignedHeaders",
								"value": "<string>"
							}
						],
						"body": {
							"mode": "raw",
							"raw": "{\n    \"arn\": {}\n}"
						},
						"url": {
							"raw": "http://devicefarm.{{region}}.amazonaws.com/#X-Amz-Target=DeviceFarm_20150623.GetUpload?",
							"protocol": "http",
							"host": [
								"devicefarm",
								"{{region}}",
								"amazonaws",
								"com"
							],
							"path": [
								""
							],
							"hash": "X-Amz-Target=DeviceFarm_20150623.GetUpload?"
						}
					},
					"code": 482,
					"_postman_previewlanguage": "json",
					"header": [
						{
							"key": "Content-Type",
							"value": "application/json"
						}
					],
					"cookie": [],
					"body": "\"schema type not provided\""
				},
				{
					"name": "NotFoundException",
					"originalRequest": {
						"method": "POST",
						"header": [
							{
								"description": "(Required) ",
								"key": "X-Amz-Target",
								"value": "<string>"
							},
							{
								"key": "X-Amz-Content-Sha256",
								"value": "<string>"
							},
							{
								"key": "X-Amz-Date",
								"value": "<string>"
							},
							{
								"key": "X-Amz-Algorithm",
								"value": "<string>"
							},
							{
								"key": "X-Amz-Credential",
								"value": "<string>"
							},
							{
								"key": "X-Amz-Security-Token",
								"value": "<string>"
							},
							{
								"key": "X-Amz-Signature",
								"value": "<string>"
							},
							{
								"key": "X-Amz-SignedHeaders",
								"value": "<string>"
							}
						],
						"body": {
							"mode": "raw",
							"raw": "{\n    \"arn\": {}\n}"
						},
						"url": {
							"raw": "http://devicefarm.{{region}}.amazonaws.com/#X-Amz-Target=DeviceFarm_20150623.GetUpload?",
							"protocol": "http",
							"host": [
								"devicefarm",
								"{{region}}",
								"amazonaws",
								"com"
							],
							"path": [
								""
							],
							"hash": "X-Amz-Target=DeviceFarm_20150623.GetUpload?"
						}
					},
					"code": 481,
					"_postman_previewlanguage": "json",
					"header": [
						{
							"key": "Content-Type",
							"value": "application/json"
						}
					],
					"cookie": [],
					"body": "\"schema type not provided\""
				},
				{
					"name": "ServiceAccountException",
					"originalRequest": {
						"method": "POST",
						"header": [
							{
								"description": "(Required) ",
								"key": "X-Amz-Target",
								"value": "<string>"
							},
							{
								"key": "X-Amz-Content-Sha256",
								"value": "<string>"
							},
							{
								"key": "X-Amz-Date",
								"value": "<string>"
							},
							{
								"key": "X-Amz-Algorithm",
								"value": "<string>"
							},
							{
								"key": "X-Amz-Credential",
								"value": "<string>"
							},
							{
								"key": "X-Amz-Security-Token",
								"value": "<string>"
							},
							{
								"key": "X-Amz-Signature",
								"value": "<string>"
							},
							{
								"key": "X-Amz-SignedHeaders",
								"value": "<string>"
							}
						],
						"body": {
							"mode": "raw",
							"raw": "{\n    \"arn\": {}\n}"
						},
						"url": {
							"raw": "http://devicefarm.{{region}}.amazonaws.com/#X-Amz-Target=DeviceFarm_20150623.GetUpload?",
							"protocol": "http",
							"host": [
								"devicefarm",
								"{{region}}",
								"amazonaws",
								"com"
							],
							"path": [
								""
							],
							"hash": "X-Amz-Target=DeviceFarm_20150623.GetUpload?"
						}
					},
					"code": 483,
					"_postman_previewlanguage": "json",
					"header": [
						{
							"key": "Content-Type",
							"value": "application/json"
						}
					],
					"cookie": [],
					"body": "\"schema type not provided\""
				},
				{
					"name": "ArgumentException",
					"originalRequest": {
						"method": "POST",
						"header": [
							{
								"description": "(Required) ",
								"key": "X-Amz-Target",
								"value": "<string>"
							},
							{
								"key": "X-Amz-Content-Sha256",
								"value": "<string>"
							},
							{
								"key": "X-Amz-Date",
								"value": "<string>"
							},
							{
								"key": "X-Amz-Algorithm",
								"value": "<string>"
							},
							{
								"key": "X-Amz-Credential",
								"value": "<string>"
							},
							{
								"key": "X-Amz-Security-Token",
								"value": "<string>"
							},
							{
								"key": "X-Amz-Signature",
								"value": "<string>"
							},
							{
								"key": "X-Amz-SignedHeaders",
								"value": "<string>"
							}
						],
						"body": {
							"mode": "raw",
							"raw": "{\n    \"arn\": {}\n}"
						},
						"url": {
							"raw": "http://devicefarm.{{region}}.amazonaws.com/#X-Amz-Target=DeviceFarm_20150623.GetUpload?",
							"protocol": "http",
							"host": [
								"devicefarm",
								"{{region}}",
								"amazonaws",
								"com"
							],
							"path": [
								""
							],
							"hash": "X-Amz-Target=DeviceFarm_20150623.GetUpload?"
						}
					},
					"code": 480,
					"_postman_previewlanguage": "json",
					"header": [
						{
							"key": "Content-Type",
							"value": "application/json"
						}
					],
					"cookie": [],
					"body": "\"schema type not provided\""
				},
				{
					"name": "Success",
					"originalRequest": {
						"method": "POST",
						"header": [
							{
								"description": "(Required) ",
								"key": "X-Amz-Target",
								"value": "<string>"
							},
							{
								"key": "X-Amz-Content-Sha256",
								"value": "<string>"
							},
							{
								"key": "X-Amz-Date",
								"value": "<string>"
							},
							{
								"key": "X-Amz-Algorithm",
								"value": "<string>"
							},
							{
								"key": "X-Amz-Credential",
								"value": "<string>"
							},
							{
								"key": "X-Amz-Security-Token",
								"value": "<string>"
							},
							{
								"key": "X-Amz-Signature",
								"value": "<string>"
							},
							{
								"key": "X-Amz-SignedHeaders",
								"value": "<string>"
							}
						],
						"body": {
							"mode": "raw",
							"raw": "{\n    \"arn\": {}\n}"
						},
						"url": {
							"raw": "http://devicefarm.{{region}}.amazonaws.com/#X-Amz-Target=DeviceFarm_20150623.GetUpload?",
							"protocol": "http",
							"host": [
								"devicefarm",
								"{{region}}",
								"amazonaws",
								"com"
							],
							"path": [
								""
							],
							"hash": "X-Amz-Target=DeviceFarm_20150623.GetUpload?"
						}
					},
					"status": "OK",
					"code": 200,
					"_postman_previewlanguage": "json",
					"header": [
						{
							"key": "Content-Type",
							"value": "application/json"
						}
					],
					"cookie": [],
					"body": "{\n \"upload\": {}\n}"
				}
			]
		},
		{
			"name": "Schedule Run",
			"event": [
				{
					"listen": "prerequest",
					"script": {
						"id": "3e8ff60b-01cd-487f-85f4-023ef927bb8b",
						"exec": [
							"var moment = require(\"moment\")",
							"",
							"pm.environment.set(\"testName\", \"Test Run\" + \"_\" + moment().format(\"DD-MM-YYYY/hh-mm-ss\"));"
						],
						"type": "text/javascript"
					}
				},
				{
					"listen": "test",
					"script": {
						"id": "2eead857-a617-49f8-8565-5f3bb0821fef",
						"exec": [
							"pm.test(\"Test run created\", function () {",
							"    pm.response.to.have.status(200);",
							"});"
						],
						"type": "text/javascript"
					}
				}
			],
			"request": {
				"method": "POST",
				"header": [
					{
						"key": "X-Amz-Target",
						"value": "DeviceFarm_20150623.ScheduleRun",
						"type": "text",
						"description": "(Required) "
					},
					{
						"key": "Content-Type",
						"value": "application/x-amz-json-1.1",
						"type": "text"
					}
				],
				"body": {
					"mode": "raw",
					"raw": "{\n    \"appArn\": \"{{apkArn}}\",\n    \"configuration\": {\n        \"billingMethod\": \"METERED\",\n        \"locale\": \"en_US\",\n        \"location\": {\n            \"latitude\": 47.6204,\n            \"longitude\": -122.3491\n        },\n        \"networkProfileArn\": \"arn:aws:devicefarm:us-west-2::networkprofile:public\",\n        \"radios\": {\n            \"bluetooth\": false,\n            \"gps\": true,\n            \"nfc\": true,\n            \"wifi\": true\n        }\n    },\n    \"devicePoolArn\": \"{{devicePoolArn}}\",\n    \"name\": \"{{testName}}\",\n    \"projectArn\": \"{{projectArn}}\",\n    \"test\": {\n        \"testPackageArn\": \"{{testPackageArn}}\",\n        \"testSpecArn\": \"{{specArn}}\",\n        \"type\": \"APPIUM_JAVA_TESTNG\"\n    }\n}",
					"options": {
						"raw": {
							"language": "json"
						}
					}
				},
				"url": {
					"raw": "{{baseUrl}}",
					"host": [
						"{{baseUrl}}"
					]
				},
				"description": "Schedules a run."
			},
			"response": [
				{
					"name": "IdempotencyException",
					"originalRequest": {
						"method": "POST",
						"header": [
							{
								"description": "(Required) ",
								"key": "X-Amz-Target",
								"value": "<string>"
							},
							{
								"key": "X-Amz-Content-Sha256",
								"value": "<string>"
							},
							{
								"key": "X-Amz-Date",
								"value": "<string>"
							},
							{
								"key": "X-Amz-Algorithm",
								"value": "<string>"
							},
							{
								"key": "X-Amz-Credential",
								"value": "<string>"
							},
							{
								"key": "X-Amz-Security-Token",
								"value": "<string>"
							},
							{
								"key": "X-Amz-Signature",
								"value": "<string>"
							},
							{
								"key": "X-Amz-SignedHeaders",
								"value": "<string>"
							}
						],
						"body": {
							"mode": "raw",
							"raw": "{\n    \"projectArn\": {},\n    \"test\": {\n        \"filter\": {},\n        \"parameters\": {},\n        \"testPackageArn\": {},\n        \"testSpecArn\": {},\n        \"type\": {}\n    },\n    \"appArn\": {},\n    \"configuration\": {\n        \"auxiliaryApps\": {},\n        \"billingMethod\": {},\n        \"customerArtifactPaths\": {\n            \"androidPaths\": {},\n            \"deviceHostPaths\": {},\n            \"iosPaths\": {}\n        },\n        \"extraDataPackageArn\": {},\n        \"locale\": {},\n        \"location\": {\n            \"latitude\": {},\n            \"longitude\": {}\n        },\n        \"networkProfileArn\": {},\n        \"radios\": {\n            \"bluetooth\": {},\n            \"gps\": {},\n            \"nfc\": {},\n            \"wifi\": {}\n        },\n        \"vpceConfigurationArns\": {}\n    },\n    \"devicePoolArn\": {},\n    \"deviceSelectionConfiguration\": {\n        \"filters\": {},\n        \"maxDevices\": {}\n    },\n    \"executionConfiguration\": {\n        \"accountsCleanup\": {},\n        \"appPackagesCleanup\": {},\n        \"jobTimeoutMinutes\": {},\n        \"skipAppResign\": {},\n        \"videoCapture\": {}\n    },\n    \"name\": {}\n}"
						},
						"url": {
							"raw": "http://devicefarm.{{region}}.amazonaws.com/#X-Amz-Target=DeviceFarm_20150623.ScheduleRun?",
							"protocol": "http",
							"host": [
								"devicefarm",
								"{{region}}",
								"amazonaws",
								"com"
							],
							"path": [
								""
							],
							"hash": "X-Amz-Target=DeviceFarm_20150623.ScheduleRun?"
						}
					},
					"code": 483,
					"_postman_previewlanguage": "json",
					"header": [
						{
							"key": "Content-Type",
							"value": "application/json"
						}
					],
					"cookie": [],
					"body": "\"schema type not provided\""
				},
				{
					"name": "ServiceAccountException",
					"originalRequest": {
						"method": "POST",
						"header": [
							{
								"description": "(Required) ",
								"key": "X-Amz-Target",
								"value": "<string>"
							},
							{
								"key": "X-Amz-Content-Sha256",
								"value": "<string>"
							},
							{
								"key": "X-Amz-Date",
								"value": "<string>"
							},
							{
								"key": "X-Amz-Algorithm",
								"value": "<string>"
							},
							{
								"key": "X-Amz-Credential",
								"value": "<string>"
							},
							{
								"key": "X-Amz-Security-Token",
								"value": "<string>"
							},
							{
								"key": "X-Amz-Signature",
								"value": "<string>"
							},
							{
								"key": "X-Amz-SignedHeaders",
								"value": "<string>"
							}
						],
						"body": {
							"mode": "raw",
							"raw": "{\n    \"projectArn\": {},\n    \"test\": {\n        \"filter\": {},\n        \"parameters\": {},\n        \"testPackageArn\": {},\n        \"testSpecArn\": {},\n        \"type\": {}\n    },\n    \"appArn\": {},\n    \"configuration\": {\n        \"auxiliaryApps\": {},\n        \"billingMethod\": {},\n        \"customerArtifactPaths\": {\n            \"androidPaths\": {},\n            \"deviceHostPaths\": {},\n            \"iosPaths\": {}\n        },\n        \"extraDataPackageArn\": {},\n        \"locale\": {},\n        \"location\": {\n            \"latitude\": {},\n            \"longitude\": {}\n        },\n        \"networkProfileArn\": {},\n        \"radios\": {\n            \"bluetooth\": {},\n            \"gps\": {},\n            \"nfc\": {},\n            \"wifi\": {}\n        },\n        \"vpceConfigurationArns\": {}\n    },\n    \"devicePoolArn\": {},\n    \"deviceSelectionConfiguration\": {\n        \"filters\": {},\n        \"maxDevices\": {}\n    },\n    \"executionConfiguration\": {\n        \"accountsCleanup\": {},\n        \"appPackagesCleanup\": {},\n        \"jobTimeoutMinutes\": {},\n        \"skipAppResign\": {},\n        \"videoCapture\": {}\n    },\n    \"name\": {}\n}"
						},
						"url": {
							"raw": "http://devicefarm.{{region}}.amazonaws.com/#X-Amz-Target=DeviceFarm_20150623.ScheduleRun?",
							"protocol": "http",
							"host": [
								"devicefarm",
								"{{region}}",
								"amazonaws",
								"com"
							],
							"path": [
								""
							],
							"hash": "X-Amz-Target=DeviceFarm_20150623.ScheduleRun?"
						}
					},
					"code": 484,
					"_postman_previewlanguage": "json",
					"header": [
						{
							"key": "Content-Type",
							"value": "application/json"
						}
					],
					"cookie": [],
					"body": "\"schema type not provided\""
				},
				{
					"name": "Success",
					"originalRequest": {
						"method": "POST",
						"header": [
							{
								"description": "(Required) ",
								"key": "X-Amz-Target",
								"value": "<string>"
							},
							{
								"key": "X-Amz-Content-Sha256",
								"value": "<string>"
							},
							{
								"key": "X-Amz-Date",
								"value": "<string>"
							},
							{
								"key": "X-Amz-Algorithm",
								"value": "<string>"
							},
							{
								"key": "X-Amz-Credential",
								"value": "<string>"
							},
							{
								"key": "X-Amz-Security-Token",
								"value": "<string>"
							},
							{
								"key": "X-Amz-Signature",
								"value": "<string>"
							},
							{
								"key": "X-Amz-SignedHeaders",
								"value": "<string>"
							}
						],
						"body": {
							"mode": "raw",
							"raw": "{\n    \"projectArn\": {},\n    \"test\": {\n        \"filter\": {},\n        \"parameters\": {},\n        \"testPackageArn\": {},\n        \"testSpecArn\": {},\n        \"type\": {}\n    },\n    \"appArn\": {},\n    \"configuration\": {\n        \"auxiliaryApps\": {},\n        \"billingMethod\": {},\n        \"customerArtifactPaths\": {\n            \"androidPaths\": {},\n            \"deviceHostPaths\": {},\n            \"iosPaths\": {}\n        },\n        \"extraDataPackageArn\": {},\n        \"locale\": {},\n        \"location\": {\n            \"latitude\": {},\n            \"longitude\": {}\n        },\n        \"networkProfileArn\": {},\n        \"radios\": {\n            \"bluetooth\": {},\n            \"gps\": {},\n            \"nfc\": {},\n            \"wifi\": {}\n        },\n        \"vpceConfigurationArns\": {}\n    },\n    \"devicePoolArn\": {},\n    \"deviceSelectionConfiguration\": {\n        \"filters\": {},\n        \"maxDevices\": {}\n    },\n    \"executionConfiguration\": {\n        \"accountsCleanup\": {},\n        \"appPackagesCleanup\": {},\n        \"jobTimeoutMinutes\": {},\n        \"skipAppResign\": {},\n        \"videoCapture\": {}\n    },\n    \"name\": {}\n}"
						},
						"url": {
							"raw": "http://devicefarm.{{region}}.amazonaws.com/#X-Amz-Target=DeviceFarm_20150623.ScheduleRun?",
							"protocol": "http",
							"host": [
								"devicefarm",
								"{{region}}",
								"amazonaws",
								"com"
							],
							"path": [
								""
							],
							"hash": "X-Amz-Target=DeviceFarm_20150623.ScheduleRun?"
						}
					},
					"status": "OK",
					"code": 200,
					"_postman_previewlanguage": "json",
					"header": [
						{
							"key": "Content-Type",
							"value": "application/json"
						}
					],
					"cookie": [],
					"body": "{\n \"run\": {}\n}"
				},
				{
					"name": "NotFoundException",
					"originalRequest": {
						"method": "POST",
						"header": [
							{
								"description": "(Required) ",
								"key": "X-Amz-Target",
								"value": "<string>"
							},
							{
								"key": "X-Amz-Content-Sha256",
								"value": "<string>"
							},
							{
								"key": "X-Amz-Date",
								"value": "<string>"
							},
							{
								"key": "X-Amz-Algorithm",
								"value": "<string>"
							},
							{
								"key": "X-Amz-Credential",
								"value": "<string>"
							},
							{
								"key": "X-Amz-Security-Token",
								"value": "<string>"
							},
							{
								"key": "X-Amz-Signature",
								"value": "<string>"
							},
							{
								"key": "X-Amz-SignedHeaders",
								"value": "<string>"
							}
						],
						"body": {
							"mode": "raw",
							"raw": "{\n    \"projectArn\": {},\n    \"test\": {\n        \"filter\": {},\n        \"parameters\": {},\n        \"testPackageArn\": {},\n        \"testSpecArn\": {},\n        \"type\": {}\n    },\n    \"appArn\": {},\n    \"configuration\": {\n        \"auxiliaryApps\": {},\n        \"billingMethod\": {},\n        \"customerArtifactPaths\": {\n            \"androidPaths\": {},\n            \"deviceHostPaths\": {},\n            \"iosPaths\": {}\n        },\n        \"extraDataPackageArn\": {},\n        \"locale\": {},\n        \"location\": {\n            \"latitude\": {},\n            \"longitude\": {}\n        },\n        \"networkProfileArn\": {},\n        \"radios\": {\n            \"bluetooth\": {},\n            \"gps\": {},\n            \"nfc\": {},\n            \"wifi\": {}\n        },\n        \"vpceConfigurationArns\": {}\n    },\n    \"devicePoolArn\": {},\n    \"deviceSelectionConfiguration\": {\n        \"filters\": {},\n        \"maxDevices\": {}\n    },\n    \"executionConfiguration\": {\n        \"accountsCleanup\": {},\n        \"appPackagesCleanup\": {},\n        \"jobTimeoutMinutes\": {},\n        \"skipAppResign\": {},\n        \"videoCapture\": {}\n    },\n    \"name\": {}\n}"
						},
						"url": {
							"raw": "http://devicefarm.{{region}}.amazonaws.com/#X-Amz-Target=DeviceFarm_20150623.ScheduleRun?",
							"protocol": "http",
							"host": [
								"devicefarm",
								"{{region}}",
								"amazonaws",
								"com"
							],
							"path": [
								""
							],
							"hash": "X-Amz-Target=DeviceFarm_20150623.ScheduleRun?"
						}
					},
					"code": 481,
					"_postman_previewlanguage": "json",
					"header": [
						{
							"key": "Content-Type",
							"value": "application/json"
						}
					],
					"cookie": [],
					"body": "\"schema type not provided\""
				},
				{
					"name": "LimitExceededException",
					"originalRequest": {
						"method": "POST",
						"header": [
							{
								"description": "(Required) ",
								"key": "X-Amz-Target",
								"value": "<string>"
							},
							{
								"key": "X-Amz-Content-Sha256",
								"value": "<string>"
							},
							{
								"key": "X-Amz-Date",
								"value": "<string>"
							},
							{
								"key": "X-Amz-Algorithm",
								"value": "<string>"
							},
							{
								"key": "X-Amz-Credential",
								"value": "<string>"
							},
							{
								"key": "X-Amz-Security-Token",
								"value": "<string>"
							},
							{
								"key": "X-Amz-Signature",
								"value": "<string>"
							},
							{
								"key": "X-Amz-SignedHeaders",
								"value": "<string>"
							}
						],
						"body": {
							"mode": "raw",
							"raw": "{\n    \"projectArn\": {},\n    \"test\": {\n        \"filter\": {},\n        \"parameters\": {},\n        \"testPackageArn\": {},\n        \"testSpecArn\": {},\n        \"type\": {}\n    },\n    \"appArn\": {},\n    \"configuration\": {\n        \"auxiliaryApps\": {},\n        \"billingMethod\": {},\n        \"customerArtifactPaths\": {\n            \"androidPaths\": {},\n            \"deviceHostPaths\": {},\n            \"iosPaths\": {}\n        },\n        \"extraDataPackageArn\": {},\n        \"locale\": {},\n        \"location\": {\n            \"latitude\": {},\n            \"longitude\": {}\n        },\n        \"networkProfileArn\": {},\n        \"radios\": {\n            \"bluetooth\": {},\n            \"gps\": {},\n            \"nfc\": {},\n            \"wifi\": {}\n        },\n        \"vpceConfigurationArns\": {}\n    },\n    \"devicePoolArn\": {},\n    \"deviceSelectionConfiguration\": {\n        \"filters\": {},\n        \"maxDevices\": {}\n    },\n    \"executionConfiguration\": {\n        \"accountsCleanup\": {},\n        \"appPackagesCleanup\": {},\n        \"jobTimeoutMinutes\": {},\n        \"skipAppResign\": {},\n        \"videoCapture\": {}\n    },\n    \"name\": {}\n}"
						},
						"url": {
							"raw": "http://devicefarm.{{region}}.amazonaws.com/#X-Amz-Target=DeviceFarm_20150623.ScheduleRun?",
							"protocol": "http",
							"host": [
								"devicefarm",
								"{{region}}",
								"amazonaws",
								"com"
							],
							"path": [
								""
							],
							"hash": "X-Amz-Target=DeviceFarm_20150623.ScheduleRun?"
						}
					},
					"code": 482,
					"_postman_previewlanguage": "json",
					"header": [
						{
							"key": "Content-Type",
							"value": "application/json"
						}
					],
					"cookie": [],
					"body": "\"schema type not provided\""
				},
				{
					"name": "ArgumentException",
					"originalRequest": {
						"method": "POST",
						"header": [
							{
								"description": "(Required) ",
								"key": "X-Amz-Target",
								"value": "<string>"
							},
							{
								"key": "X-Amz-Content-Sha256",
								"value": "<string>"
							},
							{
								"key": "X-Amz-Date",
								"value": "<string>"
							},
							{
								"key": "X-Amz-Algorithm",
								"value": "<string>"
							},
							{
								"key": "X-Amz-Credential",
								"value": "<string>"
							},
							{
								"key": "X-Amz-Security-Token",
								"value": "<string>"
							},
							{
								"key": "X-Amz-Signature",
								"value": "<string>"
							},
							{
								"key": "X-Amz-SignedHeaders",
								"value": "<string>"
							}
						],
						"body": {
							"mode": "raw",
							"raw": "{\n    \"projectArn\": {},\n    \"test\": {\n        \"filter\": {},\n        \"parameters\": {},\n        \"testPackageArn\": {},\n        \"testSpecArn\": {},\n        \"type\": {}\n    },\n    \"appArn\": {},\n    \"configuration\": {\n        \"auxiliaryApps\": {},\n        \"billingMethod\": {},\n        \"customerArtifactPaths\": {\n            \"androidPaths\": {},\n            \"deviceHostPaths\": {},\n            \"iosPaths\": {}\n        },\n        \"extraDataPackageArn\": {},\n        \"locale\": {},\n        \"location\": {\n            \"latitude\": {},\n            \"longitude\": {}\n        },\n        \"networkProfileArn\": {},\n        \"radios\": {\n            \"bluetooth\": {},\n            \"gps\": {},\n            \"nfc\": {},\n            \"wifi\": {}\n        },\n        \"vpceConfigurationArns\": {}\n    },\n    \"devicePoolArn\": {},\n    \"deviceSelectionConfiguration\": {\n        \"filters\": {},\n        \"maxDevices\": {}\n    },\n    \"executionConfiguration\": {\n        \"accountsCleanup\": {},\n        \"appPackagesCleanup\": {},\n        \"jobTimeoutMinutes\": {},\n        \"skipAppResign\": {},\n        \"videoCapture\": {}\n    },\n    \"name\": {}\n}"
						},
						"url": {
							"raw": "http://devicefarm.{{region}}.amazonaws.com/#X-Amz-Target=DeviceFarm_20150623.ScheduleRun?",
							"protocol": "http",
							"host": [
								"devicefarm",
								"{{region}}",
								"amazonaws",
								"com"
							],
							"path": [
								""
							],
							"hash": "X-Amz-Target=DeviceFarm_20150623.ScheduleRun?"
						}
					},
					"code": 480,
					"_postman_previewlanguage": "json",
					"header": [
						{
							"key": "Content-Type",
							"value": "application/json"
						}
					],
					"cookie": [],
					"body": "\"schema type not provided\""
				}
			]
		}
	],
	"auth": {
		"type": "awsv4",
		"awsv4": [
			{
				"key": "service",
				"value": "devicefarm",
				"type": "string"
			},
			{
				"key": "addAuthDataToQuery",
				"value": false,
				"type": "boolean"
			},
			{
				"key": "region",
				"value": "us-west-2",
				"type": "string"
			},
			{
				"key": "secretKey",
				"value": "{{awsSecretAccesKey}}",
				"type": "string"
			},
			{
				"key": "accessKey",
				"value": "{{awsAccesKey}}",
				"type": "string"
			}
		]
	},
	"event": [
		{
			"listen": "prerequest",
			"script": {
				"id": "aff80c6d-f122-459e-8bdf-b0c2388ba502",
				"type": "text/javascript",
				"exec": [
					""
				]
			}
		},
		{
			"listen": "test",
			"script": {
				"id": "2f9b04bd-61af-4b84-9a92-8a96c6ad3578",
				"type": "text/javascript",
				"exec": [
					""
				]
			}
		}
	],
	"protocolProfileBehavior": {}
}