      ______ ______
    _/      Y      \_
   // ~~ ~~ | ~~ ~  \\
  // ~ ~ ~~ | ~~~ ~~ \\      AddressBook
 //________.|.________\\     Spring: Základní kurz
`----------`-'----------'
 :: Spring Boot :: ${spring-boot.formatted-version}