Date,Price
1950,34.730
1951,34.720
1952,34.490
1953,34.880
1954,34.860
1955,35.040
1956,34.990
1957,34.880
1958,35.010
1959,35.070
1960,35.090
1961,35.560
1962,35.160
1963,35.060
1964,35.080
1965,35.130
1966,35.150
1967,35.180
1968,35.180
1969,42.291
1970,34.946
1971,37.868
1972,45.640
1973,65.127
1974,129.027
1975,176.864
1976,131.695
1977,132.306
1978,173.207
1979,226.986
1980,674.580
1981,557.813
1982,384.163
1983,481.838
1984,370.735
1985,302.852
1986,345.561
1987,408.524
1988,477.758
1989,404.445
1990,410.118
1991,384.591
1992,354.436
1993,328.993
1994,387.110
1995,378.738
1996,398.695
1997,355.025
1998,289.264
1999,287.333
2000,284.590
2001,265.934
2002,281.764
2003,356.864
2004,414.495
2005,424.080
2006,549.433
2007,630.352
2008,887.784
2009,857.726
2010,1119.575
2011,1360.475
2012,1656.095
2013,1671.886
2014,1243.068
2015,1249.333
2016,1095.655
2017,1192.648
2018,1332.809