0 -0.000554519 -0.0267016 0.979723 0.224966 0.339451 0.772533 -0.487192
1 -0.000363094 -0.0267227 0.979823 0.224293 0.340044 0.772745 -0.486753
2 -6.06056e-05 -0.0265486 0.979753 0.224143 0.339799 0.772552 -0.487298
3 -2.64518e-05 -0.0266096 0.979808 0.224149 0.34007 0.772329 -0.487461
4 5.25003e-05 -0.0266331 0.979754 0.223871 0.339713 0.772614 -0.487385
5 -0.000214435 -0.0266598 0.979697 0.22445 0.339625 0.772648 -0.487127
6 -0.000485977 -0.0267212 0.979753 0.225062 0.339471 0.772746 -0.486796
7 -0.000476187 -0.0268154 0.979744 0.224922 0.339718 0.772585 -0.486943
8 -0.000597961 -0.0267909 0.979765 0.224984 0.33956 0.7728 -0.486683
9 -0.000379803 -0.0267899 0.979757 0.224356 0.33974 0.77264 -0.487103
10 -0.000421191 -0.0267811 0.979698 0.224818 0.339605 0.772571 -0.487093
11 -0.000265155 -0.0267195 0.979669 0.224621 0.339965 0.772529 -0.486999
12 -0.000381325 -0.0267093 0.979714 0.224875 0.339575 0.772576 -0.487079
13 -0.000177603 -0.0266454 0.979724 0.224608 0.34 0.772389 -0.487203
14 -0.000209607 -0.026795 0.979613 0.224579 0.339717 0.772542 -0.487171
15 -0.00043093 -0.0266476 0.979777 0.22509 0.339647 0.772558 -0.486959
16 -0.000307221 -0.0266836 0.979701 0.224792 0.339411 0.772697 -0.48704
17 -0.000319602 -0.0269469 0.979623 0.224716 0.339867 0.772455 -0.48714
18 -0.000346888 -0.0267365 0.979718 0.224912 0.339879 0.772417 -0.487103
19 -0.000399827 -0.0266573 0.97976 0.224949 0.339782 0.772592 -0.486875
20 -0.000452103 -0.026856 0.979698 0.224929 0.339753 0.772615 -0.486869
21 -0.000422114 -0.026775 0.979699 0.224909 0.34007 0.772364 -0.487055
22 -0.000381506 -0.0268319 0.97963 0.224764 0.339696 0.772628 -0.486963
23 -0.000292868 -0.0267522 0.979768 0.224303 0.339916 0.772738 -0.486848
24 -0.000352922 -0.0268237 0.979642 0.224782 0.339731 0.772556 -0.487044
25 -0.000498451 -0.0267634 0.979724 0.225106 0.33935 0.772803 -0.486769
26 -0.000551045 -0.0268015 0.979712 0.225243 0.339636 0.772602 -0.486825
27 -0.000411911 -0.0267534 0.979827 0.224535 0.339711 0.772733 -0.486892
28 -0.000449209 -0.0268494 0.979758 0.224672 0.339859 0.77261 -0.486921
29 -0.000490044 -0.0267758 0.979768 0.224872 0.3394 0.772838 -0.486788
30 -0.000509791 -0.0268032 0.979653 0.225165 0.339793 0.772596 -0.486762
31 -0.000343281 -0.0268634 0.979666 0.224615 0.339879 0.772501 -0.487107
32 -0.000344876 -0.0267875 0.979697 0.224661 0.339782 0.772703 -0.486832
33 -0.000450815 -0.0267974 0.979673 0.224967 0.339482 0.772604 -0.487057
34 -0.000341091 -0.0267461 0.979712 0.22476 0.339743 0.772529 -0.48709
35 -0.000316703 -0.0268745 0.979717 0.224579 0.339762 0.772704 -0.486883
36 -0.000558114 -0.0267501 0.979647 0.225348 0.339789 0.772473 -0.486875
37 -0.000464491 -0.0269136 0.979643 0.224924 0.339602 0.772621 -0.486967
38 -0.000584474 -0.0268106 0.97978 0.225015 0.339733 0.772649 -0.486789
39 -0.000431391 -0.0268481 0.979684 0.224676 0.339764 0.772618 -0.486972
40 -0.000245922 -0.026927 0.979714 0.224187 0.340134 0.772649 -0.486891
41 -0.000365416 -0.026859 0.979771 0.224437 0.339944 0.772727 -0.486785
42 -0.000557957 -0.0267225 0.979746 0.224917 0.33982 0.772612 -0.486832
43 -0.000468301 -0.0268103 0.979725 0.224736 0.339773 0.772565 -0.487023
44 -0.000418238 -0.0268306 0.979713 0.224639 0.339913 0.772465 -0.487128
45 -0.000278105 -0.0268725 0.979701 0.224129 0.339833 0.772536 -0.487306
46 -0.000343305 -0.0267254 0.979677 0.22471 0.339627 0.772558 -0.487148
47 -0.000418133 -0.0268931 0.979675 0.224576 0.33953 0.772733 -0.486999
48 -0.000517967 -0.0267389 0.979804 0.224866 0.339351 0.77269 -0.487059
49 -0.000318666 -0.0265328 0.979982 0.224442 0.339526 0.772669 -0.487166
50 -0.000194766 -0.0266412 0.979936 0.224302 0.339361 0.772816 -0.487112
51 -6.54713e-05 -0.0266494 0.97967 0.224844 0.340563 0.77202 -0.487286
52 0.000494209 -0.0265734 0.979396 0.227197 0.34342 0.770606 -0.486427
53 0.000661276 -0.0266104 0.979256 0.229226 0.344117 0.769911 -0.486082
54 0.000633878 -0.0261566 0.978933 0.22947 0.347103 0.768808 -0.485589
55 9.69616e-05 -0.0260713 0.978636 0.231097 0.349492 0.768266 -0.483959
56 -0.000181172 -0.0258528 0.978189 0.233444 0.353119 0.766464 -0.483058
57 -0.000610488 -0.0256492 0.977909 0.234899 0.356295 0.764879 -0.482531
58 -0.000844409 -0.0256788 0.977794 0.235031 0.355561 0.765148 -0.482583
59 -0.00166666 -0.0259176 0.978113 0.234165 0.353517 0.76619 -0.482851
60 -0.00269084 -0.026573 0.977827 0.232165 0.35407 0.763559 -0.487557
61 -0.00369048 -0.0295362 0.976444 0.230966 0.35498 0.761448 -0.490756
62 -0.00420709 -0.0346808 0.974745 0.227459 0.35545 0.76441 -0.487437
63 -0.00393207 -0.0414881 0.973568 0.219963 0.35729 0.771916 -0.477604
64 -0.00300703 -0.0494713 0.971871 0.212137 0.358912 0.781137 -0.464764
65 -0.00106939 -0.057025 0.970184 0.20454 0.358648 0.790366 -0.45261
66 0.00158322 -0.0661232 0.968903 0.194735 0.357433 0.802957 -0.435408
67 0.00529845 -0.0752588 0.967839 0.186367 0.354436 0.816066 -0.416749
68 0.01022 -0.0837254 0.967022 0.177838 0.349948 0.829388 -0.397523
69 0.0157389 -0.092601 0.96695 0.167678 0.347524 0.84344 -0.37379
70 0.0220547 -0.100537 0.966015 0.162757 0.345065 0.852624 -0.357033
71 0.029345 -0.105693 0.964734 0.162435 0.343082 0.856912 -0.348727
72 0.0364915 -0.108915 0.96385 0.165601 0.339907 0.859547 -0.34383
73 0.0445426 -0.111192 0.962744 0.171171 0.337116 0.859018 -0.345168
74 0.0533772 -0.112319 0.962195 0.175808 0.336318 0.857792 -0.346663
75 0.0629361 -0.113649 0.962443 0.178368 0.337873 0.858363 -0.342404
76 0.0733672 -0.115484 0.963413 0.178475 0.340586 0.860231 -0.334889
77 0.0849375 -0.117038 0.964459 0.17883 0.342601 0.861766 -0.328638
78 0.0973587 -0.118711 0.966137 0.176667 0.34637 0.864131 -0.319521
79 0.110752 -0.12083 0.967802 0.173903 0.349345 0.866715 -0.310679
80 0.124592 -0.123097 0.969824 0.172254 0.349613 0.869875 -0.302354
81 0.138881 -0.126025 0.971994 0.167135 0.349894 0.875724 -0.287659
82 0.153369 -0.12916 0.973972 0.16282 0.349168 0.881697 -0.272364
83 0.167859 -0.131441 0.975753 0.159528 0.348908 0.885822 -0.261023
84 0.182245 -0.133041 0.977202 0.155341 0.348176 0.889618 -0.25144
85 0.195599 -0.134748 0.978708 0.152338 0.34585 0.893819 -0.241391
86 0.209134 -0.136846 0.980413 0.146091 0.342861 0.898987 -0.230056
87 0.221392 -0.139661 0.981718 0.140661 0.340196 0.904655 -0.214666
88 0.233264 -0.142524 0.982697 0.134628 0.335999 0.910853 -0.19831
89 0.244278 -0.145176 0.983161 0.130428 0.329968 0.917033 -0.1821
90 0.255174 -0.147228 0.983714 0.125937 0.321232 0.92309 -0.169869
91 0.264546 -0.148152 0.984257 0.124535 0.314088 0.926978 -0.162947
92 0.273245 -0.148985 0.984893 0.122856 0.306953 0.930574 -0.157219
93 0.281641 -0.15028 0.985705 0.119216 0.298698 0.935322 -0.147442
94 0.289535 -0.151861 0.986382 0.116025 0.288693 0.94064 -0.13561
95 0.296581 -0.153188 0.987177 0.114487 0.278627 0.945373 -0.12462
96 0.302791 -0.153636 0.987853 0.114835 0.268836 0.949098 -0.11727
97 0.308612 -0.153976 0.988935 0.114024 0.259273 0.952532 -0.111616
98 0.312896 -0.154342 0.989853 0.113918 0.250852 0.955595 -0.104569
99 0.315502 -0.154229 0.990419 0.116808 0.242611 0.957889 -0.0997217
100 0.316465 -0.153283 0.990945 0.124958 0.234492 0.958894 -0.0996105
101 0.315241 -0.151893 0.991127 0.131594 0.229191 0.959003 -0.102309
102 0.311439 -0.150144 0.991617 0.13896 0.225238 0.958759 -0.103633
103 0.30566 -0.148101 0.991337 0.149027 0.220901 0.957659 -0.109009
104 0.298393 -0.146285 0.99075 0.16021 0.214301 0.956816 -0.11363
105 0.290375 -0.144976 0.990222 0.166601 0.209755 0.956473 -0.115786
106 0.28366 -0.144662 0.988961 0.16712 0.204262 0.957991 -0.112253
107 0.277912 -0.145444 0.987611 0.161892 0.198245 0.960772 -0.1068
108 0.272311 -0.146043 0.986235 0.156652 0.19268 0.962732 -0.107149
109 0.266519 -0.14664 0.985208 0.150861 0.188268 0.964132 -0.110659
110 0.260352 -0.148619 0.983192 0.140251 0.185144 0.966862 -0.105964
111 0.253508 -0.150514 0.980818 0.127213 0.182195 0.969711 -0.101405
112 0.245836 -0.152454 0.978135 0.116499 0.181632 0.971164 -0.101386
113 0.237124 -0.153624 0.976107 0.108645 0.180181 0.971894 -0.105611
114 0.22767 -0.15533 0.973874 0.100004 0.178252 0.972727 -0.109668
115 0.217851 -0.15717 0.971099 0.0895719 0.175535 0.973811 -0.11339
116 0.207366 -0.158357 0.968545 0.0800614 0.171004 0.974982 -0.117298
117 0.196604 -0.159315 0.965758 0.0698744 0.163701 0.976856 -0.118622
118 0.185384 -0.160354 0.962808 0.0604613 0.157206 0.978636 -0.117908
119 0.174637 -0.16055 0.960065 0.0514432 0.151544 0.979574 -0.121745
120 0.164739 -0.161144 0.957212 0.0443543 0.145057 0.980149 -0.127665
121 0.154525 -0.162425 0.954674 0.0423995 0.140243 0.98006 -0.134227
122 0.145002 -0.164093 0.952463 0.0424544 0.135824 0.979749 -0.140859
123 0.135964 -0.166198 0.950808 0.0453018 0.130393 0.979609 -0.145987
124 0.127528 -0.168975 0.949736 0.0495268 0.12452 0.979688 -0.149177
125 0.11993 -0.171937 0.949143 0.0542374 0.117853 0.979835 -0.15196
126 0.113145 -0.174777 0.948836 0.0591744 0.111251 0.979952 -0.154321
127 0.10725 -0.177295 0.948793 0.0641074 0.104687 0.979997 -0.156642
128 0.101888 -0.17927 0.948905 0.0694028 0.100127 0.979746 -0.158917
129 0.0968023 -0.180691 0.949 0.0749286 0.099164 0.979072 -0.161154
130 0.0921447 -0.181557 0.949036 0.0806473 0.100298 0.978063 -0.163798
131 0.0882523 -0.182132 0.949086 0.0855106 0.101922 0.97708 -0.166176
132 0.0851395 -0.182605 0.949132 0.0893262 0.103362 0.97629 -0.167913
133 0.0826273 -0.183014 0.949157 0.0923163 0.104731 0.975656 -0.169129
134 0.0806107 -0.183342 0.949165 0.0947322 0.10584 0.975137 -0.17009
135 0.0789953 -0.183605 0.949163 0.0966832 0.106736 0.974715 -0.170854
136 0.0777031 -0.183812 0.949156 0.0982487 0.10746 0.974371 -0.171464
137 0.0766705 -0.183979 0.949147 0.0995002 0.108037 0.974095 -0.171949
138 0.075845 -0.18411 0.949137 0.100497 0.108503 0.973874 -0.172328
139 0.0751847 -0.184215 0.949124 0.101292 0.108886 0.973697 -0.172621
140 0.0746597 -0.184298 0.949109 0.101912 0.109208 0.973556 -0.172846
141 0.074242 -0.184361 0.949094 0.1024 0.109473 0.973444 -0.173025
142 0.0739097 -0.18441 0.949077 0.102789 0.109683 0.973355 -0.17316
143 0.0736459 -0.184449 0.949059 0.103097 0.109846 0.973286 -0.173261
144 0.0734371 -0.184478 0.94904 0.103341 0.10997 0.973233 -0.173334
145 0.0732719 -0.1845 0.949023 0.103536 0.110062 0.973193 -0.173386
146 0.0731415 -0.184518 0.949005 0.103691 0.110128 0.973164 -0.173413
147 0.0730392 -0.184533 0.948985 0.103812 0.110177 0.973144 -0.173421
148 -0.075426 -0.19758 0.921903 0.171523 -0.26674 -0.915422 0.247856
149 -0.070281 -0.197888 0.920523 0.176315 -0.278748 -0.910588 0.249083
150 -0.065405 -0.1981 0.918932 0.179143 -0.290195 -0.905996 0.250731
151 -0.061078 -0.198068 0.91751 0.179679 -0.297965 -0.90304 0.251897
152 -0.0570549 -0.198042 0.916371 0.179859 -0.303651 -0.900895 0.252654
153 -0.0531565 -0.198393 0.915682 0.180372 -0.309316 -0.899166 0.251576
154 -0.0490484 -0.19867 0.915382 0.180767 -0.313797 -0.898004 0.249888
155 -0.0453676 -0.198842 0.915229 0.180895 -0.317263 -0.897123 0.248579
156 -0.0420267 -0.198669 0.915174 0.180615 -0.320122 -0.896406 0.247704
157 -0.0389032 -0.198497 0.915183 0.179843 -0.322515 -0.895787 0.247399
158 -0.0364053 -0.198326 0.915106 0.179178 -0.324531 -0.895242 0.247217
159 -0.0337426 -0.198596 0.914878 0.17865 -0.326447 -0.894732 0.246925
160 -0.0313733 -0.199414 0.914675 0.179245 -0.328673 -0.894285 0.245154
161 -0.0288786 -0.200775 0.914381 0.179473 -0.331241 -0.89373 0.243548
162 -0.0263826 -0.202249 0.914012 0.181086 -0.333595 -0.893065 0.241574
163 -0.0240043 -0.203971 0.913415 0.183813 -0.3358 -0.892372 0.239003
164 -0.0217611 -0.205931 0.912963 0.18723 -0.338564 -0.891458 0.235842
165 -0.0195582 -0.207922 0.912467 0.191146 -0.341369 -0.89038 0.232711
166 -0.0171104 -0.210518 0.911949 0.196168 -0.344902 -0.889014 0.228506
167 -0.014792 -0.213234 0.911549 0.201221 -0.348834 -0.887504 0.223968
168 -0.0126776 -0.216258 0.911034 0.206728 -0.353487 -0.885666 0.218878
169 -0.0107295 -0.219711 0.910453 0.213485 -0.359328 -0.883104 0.213154
170 -0.00896656 -0.223467 0.910003 0.21998 -0.366035 -0.880286 0.206696
171 -0.00749181 -0.227507 0.909615 0.226549 -0.373683 -0.877099 0.199333
172 -0.00599421 -0.2315 0.909314 0.232882 -0.381291 -0.873771 0.192112
173 -0.00457065 -0.235205 0.909112 0.238592 -0.388455 -0.870527 0.185361
174 -0.00335126 -0.238599 0.909266 0.242972 -0.395286 -0.867549 0.179086
175 -0.00286442 -0.241795 0.909697 0.24553 -0.40231 -0.864908 0.172613
176 -0.00232695 -0.244728 0.910111 0.24786 -0.408758 -0.862362 0.166774
177 -0.00224016 -0.24741 0.910617 0.249081 -0.414966 -0.860102 0.161201
178 -0.00200768 -0.249927 0.910891 0.250589 -0.420518 -0.85785 0.156407
179 -0.00244853 -0.252137 0.911454 0.250162 -0.426028 -0.856109 0.151643
180 -0.0027435 -0.25406 0.911845 0.24993 -0.430676 -0.854536 0.147718
181 -0.00280156 -0.255765 0.912048 0.24999 -0.434458 -0.85312 0.144696
182 -0.00329763 -0.257124 0.912463 0.248681 -0.438001 -0.852171 0.141836
183 -0.00450814 -0.258268 0.913252 0.245401 -0.441859 -0.851676 0.13852
184 -0.00549224 -0.259329 0.913855 0.242731 -0.445234 -0.851148 0.135632
185 -0.00584442 -0.260437 0.914595 0.241081 -0.448399 -0.850304 0.133422
186 -0.00603917 -0.261825 0.915052 0.240557 -0.451728 -0.849092 0.13083
187 -0.00579599 -0.263337 0.915439 0.241072 -0.454859 -0.847624 0.128538
188 -0.00532066 -0.265207 0.915629 0.242684 -0.458162 -0.845818 0.125631
189 -0.00467465 -0.267393 0.9156 0.245207 -0.461457 -0.843802 0.12218
190 -0.0037987 -0.269505 0.915838 0.247661 -0.464633 -0.841766 0.119208
191 -0.00300268 -0.271614 0.915903 0.249986 -0.467466 -0.83992 0.116262
192 -0.00225502 -0.273054 0.916158 0.251014 -0.469362 -0.838754 0.114818
193 -0.00160184 -0.27365 0.91642 0.250928 -0.470149 -0.838269 0.115332
194 -0.000987647 -0.274064 0.916545 0.250655 -0.470829 -0.837785 0.116658
195 -0.000262359 -0.274151 0.916558 0.250476 -0.471048 -0.837377 0.119063
196 0.000466128 -0.274224 0.916554 0.250465 -0.471332 -0.836874 0.121472
197 0.00122703 -0.274285 0.916353 0.250949 -0.47163 -0.836171 0.124131
198 0.00159417 -0.274492 0.916234 0.250653 -0.472571 -0.835433 0.126097
199 0.00175917 -0.275024 0.915976 0.250864 -0.474256 -0.83426 0.127116
200 0.00169768 -0.275934 0.915753 0.250873 -0.476581 -0.832947 0.127013
201 0.00187378 -0.276821 0.915326 0.251649 -0.47856 -0.831541 0.127251
202 0.00195028 -0.277644 0.914767 0.253326 -0.48054 -0.829876 0.127329
203 0.00197341 -0.278122 0.914422 0.254362 -0.482455 -0.828289 0.128351
204 0.0019843 -0.278207 0.91422 0.254691 -0.484531 -0.826693 0.130157
205 0.00232339 -0.278588 0.91362 0.255961 -0.486142 -0.825129 0.131578
206 0.00311062 -0.279117 0.912927 0.257368 -0.487488 -0.823595 0.133445
207 0.00393039 -0.280302 0.912088 0.259641 -0.48888 -0.822004 0.133763
208 0.00476376 -0.281643 0.911322 0.261653 -0.490803 -0.82023 0.133688
209 0.00584447 -0.283183 0.910271 0.264179 -0.491941 -0.818751 0.133605
210 0.00733928 -0.284193 0.909249 0.266413 -0.492266 -0.817496 0.135642
211 0.00889161 -0.284563 0.908394 0.267885 -0.491571 -0.81682 0.139286
212 0.0102285 -0.284619 0.907663 0.268783 -0.490981 -0.816188 0.143282
213 0.0113486 -0.284399 0.906908 0.269484 -0.490512 -0.815497 0.147448
214 0.01222 -0.284025 0.906128 0.26968 -0.489955 -0.814971 0.151782
215 0.012559 -0.283252 0.905491 0.268262 -0.489727 -0.814724 0.156293
216 0.0126493 -0.282307 0.90484 0.266078 -0.489269 -0.814809 0.160946
217 0.0124749 -0.28101 0.90435 0.262771 -0.488474 -0.815344 0.166008
218 0.0122121 -0.279646 0.903837 0.259129 -0.48796 -0.815701 0.171404
219 0.0118607 -0.27825 0.903283 0.254949 -0.487371 -0.816158 0.177079
220 0.0113873 -0.276838 0.902759 0.250847 -0.487464 -0.816167 0.182556
221 0.0105893 -0.27517 0.902396 0.24592 -0.488311 -0.815871 0.188231
222 0.00985587 -0.273739 0.902214 0.241442 -0.488998 -0.815661 0.193091
223 0.00917712 -0.272477 0.902218 0.237279 -0.489498 -0.815572 0.197313
224 0.00860864 -0.271297 0.902323 0.233498 -0.489812 -0.815521 0.201215
225 0.00826681 -0.27029 0.902483 0.230704 -0.490459 -0.815066 0.204677
226 0.00830044 -0.269587 0.902612 0.22929 -0.491035 -0.814345 0.207734
227 0.00859284 -0.268943 0.902796 0.228564 -0.491477 -0.813463 0.21092
228 0.00908332 -0.26846 0.902943 0.228538 -0.491701 -0.812574 0.213833
229 0.00968131 -0.268041 0.903066 0.228933 -0.492186 -0.811433 0.216609
230 0.0104732 -0.267571 0.903116 0.229753 -0.492467 -0.810155 0.219861
231 0.0113559 -0.267082 0.903124 0.230727 -0.492558 -0.808931 0.22312
232 0.0121155 -0.26668 0.903115 0.231603 -0.492589 -0.807884 0.22592
233 0.0128504 -0.266285 0.903007 0.232566 -0.492492 -0.806889 0.228683
234 0.0135172 -0.265903 0.902954 0.233332 -0.492277 -0.806101 0.23113
235 0.0141353 -0.265615 0.90292 0.234161 -0.492282 -0.805297 0.233074
236 0.0146422 -0.265514 0.902878 0.235182 -0.492557 -0.804465 0.234337
237 0.0149112 -0.265653 0.902875 0.236227 -0.493372 -0.80359 0.234572
238 0.0150468 -0.265731 0.902929 0.236748 -0.494108 -0.802957 0.234664
239 0.0151411 -0.265772 0.902949 0.237136 -0.494682 -0.80244 0.234832
240 0.0152278 -0.265805 0.902957 0.23747 -0.495128 -0.802023 0.234979
241 0.0153077 -0.265834 0.902954 0.237756 -0.49547 -0.801693 0.235094
242 0.0153584 -0.265855 0.902946 0.237942 -0.495729 -0.801451 0.235188
243 0.0153978 -0.265934 0.902936 0.238196 -0.495934 -0.80128 0.23508
244 0.0153593 -0.265972 0.902969 0.23822 -0.496146 -0.801191 0.234913
245 0.0151956 -0.265937 0.903077 0.237824 -0.496357 -0.80125 0.234665
246 0.0148757 -0.265735 0.903285 0.236738 -0.496548 -0.801486 0.234553
247 0.014435 -0.265389 0.903567 0.235098 -0.496715 -0.801855 0.234588
248 0.0139354 -0.264905 0.90389 0.233047 -0.496838 -0.802287 0.234897
249 0.0133868 -0.264309 0.904245 0.230669 -0.496988 -0.802721 0.235442
250 0.0128957 -0.263768 0.904551 0.228512 -0.497119 -0.803099 0.235981
251 0.0124572 -0.263273 0.90482 0.226575 -0.497235 -0.803425 0.236495
252 0.0121008 -0.262881 0.904992 0.225085 -0.49731 -0.803658 0.236968
253 0.0118186 -0.262569 0.905128 0.223911 -0.497352 -0.803845 0.237355
254 0.0116495 -0.262314 0.905179 0.223154 -0.497361 -0.80391 0.23783
255 0.0114993 -0.262114 0.905202 0.222546 -0.497361 -0.803965 0.238213
256 0.0113714 -0.261957 0.905222 0.222054 -0.49734 -0.804026 0.238509
257 0.0112497 -0.261827 0.905197 0.221648 -0.497319 -0.804062 0.238808
258 0.0111357 -0.261718 0.905154 0.221299 -0.497298 -0.804091 0.23908
259 0.0110079 -0.26152 0.905141 0.22077 -0.497384 -0.804038 0.239567
260 0.010874 -0.261422 0.905149 0.22034 -0.497369 -0.80412 0.23972
261 0.0106902 -0.261224 0.905196 0.219585 -0.497381 -0.804216 0.240066
262 0.01055 -0.261125 0.905222 0.21906 -0.497248 -0.804404 0.240191
263 0.0104203 -0.260915 0.905271 0.218438 -0.497411 -0.804334 0.240654
264 0.010285 -0.260745 0.905318 0.217862 -0.497665 -0.804228 0.241006
265 0.0100988 -0.26044 0.905344 0.217002 -0.498202 -0.803893 0.241786
266 0.00987498 -0.260133 0.905403 0.215994 -0.498921 -0.803506 0.242493
267 0.00954962 -0.259728 0.905623 0.214377 -0.500014 -0.803072 0.243113
268 0.00913109 -0.25925 0.905726 0.212588 -0.501215 -0.802515 0.244047
269 0.00896165 -0.259254 0.905825 0.212124 -0.502064 -0.802174 0.24383
270 0.00885991 -0.259737 0.905819 0.212658 -0.502468 -0.802235 0.242325
271 0.00869853 -0.260428 0.9058 0.213352 -0.502562 -0.802661 0.240098
272 0.00855613 -0.261118 0.905791 0.214055 -0.502498 -0.803186 0.237843
273 0.0084283 -0.261672 0.905787 0.214584 -0.502449 -0.803618 0.236
274 0.00832501 -0.262117 0.905783 0.215005 -0.502408 -0.803967 0.234513
275 0.00824022 -0.262472 0.905779 0.215331 -0.502376 -0.804246 0.233321
276 0.00816983 -0.262754 0.905779 0.215573 -0.502352 -0.804474 0.232363
277 0.00811066 -0.262977 0.905781 0.215749 -0.502335 -0.804659 0.231593
278 0.00806047 -0.263153 0.905786 0.215871 -0.502324 -0.804811 0.230973
279 0.0080175 -0.263291 0.905792 0.215951 -0.502319 -0.804936 0.230474
280 0.00798047 -0.2634 0.905796 0.216007 -0.50232 -0.805036 0.230071
281 0.00794853 -0.263486 0.905801 0.216039 -0.502324 -0.805118 0.229746
282 0.00792097 -0.263553 0.905806 0.216052 -0.502329 -0.805186 0.229482
283 0.00789673 -0.263606 0.90581 0.216055 -0.502337 -0.805241 0.229268
284 0.00787545 -0.263646 0.905814 0.216046 -0.502345 -0.805288 0.229094
285 0.00785616 -0.263677 0.905819 0.216026 -0.502354 -0.805328 0.228953
286 0.00783858 -0.2637 0.905824 0.215997 -0.502363 -0.805363 0.228839
287 0.00782301 -0.263717 0.905828 0.215968 -0.502372 -0.805392 0.228746
288 0.00780904 -0.26373 0.905832 0.215936 -0.50238 -0.805416 0.22867
289 0.00779613 -0.263738 0.905835 0.215903 -0.502389 -0.805437 0.22861
290 0.00778435 -0.263744 0.905838 0.215868 -0.502397 -0.805455 0.228561
291 0.00777361 -0.263748 0.90584 0.215833 -0.502405 -0.805471 0.228521
292 0.00776345 -0.263759 0.90584 0.215812 -0.502405 -0.805494 0.228459
293 0.0077717 -0.264073 0.905778 0.216295 -0.502189 -0.805758 0.227543
294 0.00782876 -0.264794 0.905617 0.217483 -0.501625 -0.806353 0.225539
295 0.00790645 -0.265716 0.905406 0.219039 -0.50093 -0.807075 0.222982
296 0.00798495 -0.266634 0.905212 0.220629 -0.500415 -0.807655 0.220458
297 0.0511053 -0.154331 1.00275 0.218671 0.0851497 0.337895 -0.91146
298 0.0476707 -0.153277 1.002 0.231841 0.0863648 0.340445 -0.907132
299 0.0435279 -0.15301 1.00078 0.24694 0.0855912 0.340736 -0.903102
300 0.0392795 -0.153571 0.998989 0.261659 0.0823048 0.338139 -0.900235
301 0.0350815 -0.154691 0.996988 0.274618 0.0805643 0.334245 -0.897984
302 0.0315782 -0.156184 0.994859 0.284975 0.0767823 0.329126 -0.896978
303 0.0292144 -0.157777 0.992787 0.292324 0.0732945 0.323422 -0.89698
304 0.0276726 -0.159359 0.990894 0.297504 0.0702788 0.317749 -0.897546
305 0.0264763 -0.160708 0.989351 0.301614 0.0678024 0.312914 -0.898063
306 0.0255179 -0.161791 0.988124 0.304893 0.0658486 0.309033 -0.898445
307 0.0247557 -0.162659 0.987149 0.307501 0.0643156 0.305921 -0.898732
308 0.0241544 -0.163354 0.986372 0.309577 0.0631093 0.303433 -0.898948
309 0.0235342 -0.163845 0.9858 0.311826 0.0621099 0.30133 -0.898948
310 0.0230642 -0.164215 0.985366 0.313569 0.0614305 0.299852 -0.898883
311 0.0224001 -0.164475 0.985081 0.315286 0.0606027 0.298924 -0.898647
312 0.021868 -0.164689 0.984853 0.316661 0.0599416 0.298178 -0.898456
313 0.0214394 -0.164865 0.984668 0.317763 0.0594196 0.297577 -0.8983
314 0.0210986 -0.165004 0.984528 0.318626 0.0590331 0.297142 -0.898164
315 0.020823 -0.165121 0.984413 0.319317 0.0587108 0.296771 -0.898063
316 0.020606 -0.165221 0.984317 0.319873 0.0584451 0.296439 -0.897992
317 0.0204368 -0.165303 0.984239 0.320319 0.0582412 0.296168 -0.897936
318 0.0203058 -0.165373 0.984176 0.320676 0.0580872 0.295947 -0.897891
319 0.0202052 -0.165431 0.984125 0.320962 0.0579725 0.295766 -0.897856
320 0.0201291 -0.165481 0.984084 0.321192 0.0578899 0.295616 -0.897828
321 0.0200653 -0.165525 0.984051 0.321373 0.0578256 0.295503 -0.897805
322 0.0200115 -0.165565 0.984024 0.321515 0.0577757 0.295418 -0.897785
323 0.0199662 -0.1656 0.984003 0.321628 0.0577367 0.295353 -0.897768
324 0.0199261 -0.165632 0.983987 0.321715 0.0577104 0.295311 -0.897753
325 0.0198902 -0.165661 0.983974 0.321783 0.0576937 0.295283 -0.897739
326 0.0198583 -0.165689 0.983964 0.321835 0.0576851 0.295268 -0.897726
327 0.0198282 -0.165714 0.983958 0.32187 0.0576852 0.295275 -0.897711
328 0.0198009 -0.165739 0.983952 0.321897 0.0576892 0.295284 -0.897698
329 0.0197739 -0.165762 0.983947 0.321914 0.0577017 0.295295 -0.897687
330 0.0197463 -0.165786 0.983944 0.321918 0.0577252 0.295321 -0.897676
331 0.0197184 -0.165808 0.983942 0.321911 0.0577575 0.295359 -0.897664
332 0.0196913 -0.16583 0.98394 0.321901 0.0577919 0.295393 -0.897654
333 0.0196706 -0.165851 0.983938 0.321888 0.0578383 0.295425 -0.897645
334 0.0196534 -0.165866 0.983943 0.321849 0.057916 0.295508 -0.897627
335 0.0196453 -0.165874 0.983953 0.321793 0.0580266 0.295621 -0.897603
336 0.01964 -0.165883 0.98396 0.321744 0.0581329 0.295716 -0.897582
337 0.0196368 -0.165894 0.983965 0.3217 0.0582348 0.295796 -0.897565
338 0.0196358 -0.165907 0.983969 0.321662 0.058334 0.295864 -0.897549
339 0.0196371 -0.16592 0.983971 0.321627 0.058429 0.295921 -0.897537
340 0.0196318 -0.165934 0.983973 0.321606 0.058509 0.295972 -0.897523
341 0.0191051 -0.165884 0.984086 0.32216 0.0580036 0.29644 -0.897202
342 0.0183327 -0.165781 0.984285 0.32301 0.0567632 0.29761 -0.896589
343 0.0171346 -0.165453 0.984705 0.324975 0.0552857 0.299757 -0.895254
344 0.0162454 -0.165059 0.985159 0.326374 0.0543658 0.302645 -0.893829
345 0.0155649 -0.164653 0.985615 0.327069 0.0543686 0.305902 -0.892465
346 0.0152039 -0.164416 0.985888 0.32715 0.0541775 0.308089 -0.891694
347 0.0150654 -0.164048 0.986251 0.327009 0.0551273 0.310092 -0.890993
348 0.0151077 -0.163688 0.986657 0.326538 0.0567411 0.311886 -0.890438
349 0.0150593 -0.163471 0.986936 0.32608 0.0576954 0.313178 -0.890091
350 0.0150468 -0.163333 0.987112 0.325604 0.0584425 0.313971 -0.889938
351 0.0150661 -0.163235 0.987242 0.325213 0.0590893 0.314442 -0.889871
352 0.0150713 -0.163179 0.98731 0.324914 0.0594945 0.314684 -0.889868
353 0.0150642 -0.163235 0.987262 0.324732 0.0595094 0.31439 -0.890038
354 0.0150471 -0.163468 0.987116 0.324714 0.0591062 0.313429 -0.89041
355 0.0149393 -0.163896 0.986889 0.325406 0.0583536 0.311678 -0.890821
356 0.014039 -0.164453 0.986827 0.326813 0.0565207 0.310221 -0.890933
357 0.0132253 -0.165324 0.986593 0.328607 0.054768 0.307925 -0.891179
358 0.0117812 -0.166301 0.986456 0.331854 0.0526923 0.305762 -0.890846
359 0.00924539 -0.166856 0.986843 0.33756 0.05137 0.306151 -0.888643
360 0.0066947 -0.16733 0.98735 0.342732 0.0506317 0.308337 -0.885945
361 0.00487548 -0.167891 0.987679 0.344781 0.0494197 0.310738 -0.884379
362 0.00372295 -0.168453 0.987867 0.344314 0.0480728 0.313209 -0.883763
363 0.0027473 -0.168608 0.988269 0.34329 0.0472432 0.316882 -0.882896
364 0.0015082 -0.168409 0.989054 0.342697 0.0471378 0.321942 -0.881301
365 8.88667e-05 -0.168183 0.989918 0.342933 0.0470839 0.326778 -0.879429
366 -0.000836193 -0.168242 0.990613 0.34264 0.0471866 0.329712 -0.878442
367 -0.00114932 -0.168119 0.991328 0.341559 0.0485171 0.332353 -0.877796
368 -0.00101574 -0.167956 0.992009 0.339977 0.0507903 0.334215 -0.877574
369 -0.000463733 -0.168038 0.992405 0.338271 0.0536188 0.334133 -0.878096
370 -4.77416e-05 -0.168575 0.992205 0.336486 0.0537366 0.332201 -0.879507
371 -0.000228223 -0.169409 0.99152 0.335586 0.0506226 0.329457 -0.881066
372 -0.000848384 -0.170426 0.990417 0.335106 0.0452384 0.326153 -0.88277
373 -0.00201097 -0.171794 0.98907 0.335927 0.0376116 0.321737 -0.884434
374 -0.00366381 -0.173685 0.987386 0.337 0.0279985 0.316159 -0.886392
375 -0.00547441 -0.175925 0.985537 0.337804 0.0176845 0.309674 -0.888638
376 -0.00724635 -0.178188 0.98368 0.338102 0.00813913 0.303204 -0.890892
377 -0.00868537 -0.180056 0.982025 0.338113 0.000250296 0.297417 -0.892873
378 -0.00980636 -0.181446 0.980601 0.337677 -0.00573222 0.292802 -0.894543
379 -0.010726 -0.182446 0.979338 0.336886 -0.00995239 0.289338 -0.895931
380 -0.0114758 -0.183177 0.978173 0.33595 -0.0130207 0.286508 -0.897151
381 -0.0119997 -0.183582 0.977164 0.335144 -0.0147469 0.284445 -0.898082
382 -0.0123705 -0.18375 0.976287 0.334569 -0.0153132 0.282962 -0.898756
383 -0.0127642 -0.18387 0.975388 0.334251 -0.0151527 0.281568 -0.899314
384 -0.0132541 -0.184058 0.974475 0.33434 -0.0147966 0.279945 -0.899794
385 -0.0140188 -0.184524 0.973488 0.335237 -0.0150374 0.277534 -0.900202
386 -0.0151605 -0.185498 0.972189 0.337193 -0.0160803 0.273262 -0.900761
387 -0.0167057 -0.187083 0.970568 0.340442 -0.0178648 0.266703 -0.901471
388 -0.0187446 -0.18944 0.968535 0.345953 -0.0198998 0.257514 -0.902002
389 -0.0210656 -0.192341 0.966082 0.353027 -0.0214093 0.246524 -0.902297
390 -0.0228792 -0.194674 0.963938 0.358792 -0.0223244 0.23719 -0.902502
391 -0.0241494 -0.196295 0.962177 0.36283 -0.0231228 0.229873 -0.902762
392 -0.0249406 -0.197287 0.960708 0.36605 -0.02408 0.22389 -0.90294
393 -0.0257964 -0.198562 0.959206 0.371031 -0.0248479 0.217199 -0.902521
394 -0.0271099 -0.200819 0.957637 0.380175 -0.0264634 0.2099 -0.900393
395 -0.0282708 -0.203473 0.95606 0.393033 -0.0267811 0.203106 -0.896413
396 -0.0293475 -0.206306 0.954793 0.40834 -0.0249562 0.200364 -0.890219
397 -0.0305633 -0.209091 0.954009 0.423435 -0.02186 0.201528 -0.882956
398 -0.0317116 -0.211735 0.953402 0.436955 -0.0190611 0.202239 -0.876246
399 -0.0327427 -0.2141 0.952932 0.449171 -0.0167147 0.202807 -0.869963
400 -0.0334908 -0.215735 0.952719 0.458089 -0.0143292 0.204622 -0.864915
401 -0.0331268 -0.215954 0.952429 0.46551 -0.011966 0.205877 -0.860681
402 -0.0333067 -0.216267 0.952216 0.471177 -0.0091135 0.206436 -0.857492
403 -0.033411 -0.216429 0.952117 0.475724 -0.00681306 0.207757 -0.85468
404 -0.0334708 -0.216536 0.952083 0.478957 -0.00505897 0.209628 -0.852427
405 -0.0331675 -0.216653 0.951971 0.480201 -0.00209823 0.209578 -0.851751
406 -0.0325603 -0.216256 0.951881 0.481738 -1.2251e-06 0.210502 -0.850657
407 -0.0322215 -0.215945 0.951916 0.482903 0.00190214 0.212162 -0.849581
408 -0.0318488 -0.215186 0.952026 0.485643 0.00397661 0.21207 -0.848034
409 -0.0318978 -0.214472 0.952098 0.490048 0.00567213 0.209943 -0.846017
410 -0.0319726 -0.21364 0.952282 0.495484 0.00701703 0.207925 -0.843335
411 -0.0318875 -0.213171 0.952608 0.500186 0.0109839 0.204257 -0.841411
412 -0.0321327 -0.212672 0.953208 0.503192 0.0152475 0.205382 -0.839276
413 -0.0321257 -0.211611 0.953965 0.506503 0.0179183 0.209737 -0.836148
414 -0.0328457 -0.210742 0.954796 0.509247 0.0192607 0.216271 -0.83278
415 -0.0352957 -0.210395 0.955698 0.51245 0.0195999 0.223736 -0.828826
416 -0.0372387 -0.209974 0.956389 0.514872 0.0201749 0.230234 -0.825525
417 -0.0385194 -0.209572 0.956843 0.516308 0.0206098 0.235421 -0.823152
418 -0.0391382 -0.209057 0.957094 0.517283 0.0208626 0.239308 -0.82141
419 -0.0395147 -0.208744 0.957139 0.517248 0.020667 0.242251 -0.820574
420 -0.0402333 -0.208635 0.957155 0.517539 0.0197983 0.24456 -0.819727
421 -0.0412398 -0.208623 0.95717 0.518399 0.0186519 0.246264 -0.8187
422 -0.0419761 -0.208566 0.957122 0.519237 0.017548 0.24724 -0.817898
423 -0.0424861 -0.208462 0.956993 0.52011 0.0164432 0.247479 -0.817294
424 -0.0427477 -0.208307 0.956797 0.52089 0.0155925 0.247062 -0.81694
425 -0.0428807 -0.208144 0.956546 0.521726 0.014736 0.24603 -0.816734
426 -0.0428733 -0.207958 0.956228 0.522555 0.0139009 0.244423 -0.816701
427 -0.0428127 -0.207826 0.955964 0.523212 0.0132253 0.242922 -0.816739
428 -0.0426732 -0.207731 0.955789 0.523533 0.0129831 0.241816 -0.816866
429 -0.0424725 -0.207671 0.955682 0.523667 0.0129133 0.240926 -0.817044
430 -0.0422426 -0.207629 0.955641 0.523578 0.0131423 0.240404 -0.817251
431 -0.0420012 -0.207605 0.955632 0.523416 0.0134139 0.240025 -0.817462
432 -0.0418176 -0.207613 0.955676 0.523164 0.0137231 0.240009 -0.817623
433 -0.0415795 -0.207641 0.955757 0.522822 0.0141667 0.240015 -0.817832
434 -0.0413538 -0.207689 0.955867 0.522454 0.0145757 0.240133 -0.818026
435 -0.0410923 -0.207719 0.955962 0.522051 0.0150743 0.240213 -0.81825
436 -0.0407811 -0.207744 0.956015 0.521761 0.0154341 0.239903 -0.818519
437 -0.0404661 -0.207801 0.956084 0.521484 0.0157436 0.239514 -0.818804
438 -0.0400293 -0.207769 0.956037 0.521313 0.0160333 0.238616 -0.819169
439 -0.0397378 -0.207799 0.956068 0.521096 0.0162376 0.238203 -0.819424
440 -0.0393963 -0.207788 0.956027 0.520996 0.0162763 0.237443 -0.819707
441 -0.039075 -0.207779 0.955962 0.520973 0.0163028 0.236556 -0.819977
442 -0.03874 -0.207758 0.955885 0.52091 0.0164327 0.23568 -0.820267
443 -0.0383911 -0.207711 0.955806 0.520762 0.0167314 0.234926 -0.820571
444 -0.0380562 -0.207674 0.955711 0.520719 0.0169008 0.233993 -0.820861
445 -0.0377335 -0.207663 0.955687 0.520311 0.0173907 0.233676 -0.8212
446 -0.0569517 -0.0263029 0.978397 0.188325 0.285013 0.796361 -0.499109
447 -0.0569493 -0.0262807 0.978397 0.188105 0.284633 0.796333 -0.499453
448 -0.056843 -0.0261838 0.978318 0.188312 0.285002 0.796042 -0.49963
449 -0.0568233 -0.0262216 0.978347 0.18819 0.285041 0.79605 -0.49964
450 -0.0567779 -0.0262087 0.978399 0.18826 0.284107 0.796428 -0.499543
451 -0.0566175 -0.0260417 0.978278 0.187744 0.285074 0.795848 -0.500111
452 -0.0567353 -0.0262066 0.978344 0.188084 0.284459 0.796222 -0.499739
453 -0.0567242 -0.0263196 0.978433 0.188086 0.284956 0.796455 -0.499082
