{
  "dependencies": [
    {
      "source": {
        "git": {
          "remote": "https://github.com/thanos-io/kube-thanos",
          "subdir": "jsonnet/kube-thanos"
        }
      },
      "version": "master"
    }
  ],
  "legacyImports": true
}
