%!PS-Adobe-3.0 EPSF-3.0
%%Creator: (MATLAB, The Mathworks, Inc. Version 9.1.0.441655 \(R2016b\). Operating System: Linux)
%%Title: /home/frdm/Documents/RLS/rls-2017/sp2/figures/f1.eps
%%CreationDate: 2017-11-14T00:20:12
%%Pages: (atend)
%%BoundingBox: 0 0 731 458
%%LanguageLevel: 3
%%EndComments
%%BeginProlog
%%BeginResource: procset (Apache XML Graphics Std ProcSet) 1.2 0
%%Version: 1.2 0
%%Copyright: (Copyright 2001-2003,2010 The Apache Software Foundation. License terms: http://www.apache.org/licenses/LICENSE-2.0)
/bd{bind def}bind def
/ld{load def}bd
/GR/grestore ld
/M/moveto ld
/LJ/setlinejoin ld
/C/curveto ld
/f/fill ld
/LW/setlinewidth ld
/GC/setgray ld
/t/show ld
/N/newpath ld
/CT/concat ld
/cp/closepath ld
/S/stroke ld
/L/lineto ld
/CC/setcmykcolor ld
/A/ashow ld
/GS/gsave ld
/RC/setrgbcolor ld
/RM/rmoveto ld
/ML/setmiterlimit ld
/re {4 2 roll M
1 index 0 rlineto
0 exch rlineto
neg 0 rlineto
cp } bd
/_ctm matrix def
/_tm matrix def
/BT { _ctm currentmatrix pop matrix _tm copy pop 0 0 moveto } bd
/ET { _ctm setmatrix } bd
/iTm { _ctm setmatrix _tm concat } bd
/Tm { _tm astore pop iTm 0 0 moveto } bd
/ux 0.0 def
/uy 0.0 def
/F {
  /Tp exch def
  /Tf exch def
  Tf findfont Tp scalefont setfont
  /cf Tf def  /cs Tp def
} bd
/ULS {currentpoint /uy exch def /ux exch def} bd
/ULE {
  /Tcx currentpoint pop def
  gsave
  newpath
  cf findfont cs scalefont dup
  /FontMatrix get 0 get /Ts exch def /FontInfo get dup
  /UnderlinePosition get Ts mul /To exch def
  /UnderlineThickness get Ts mul /Tt exch def
  ux uy To add moveto  Tcx uy To add lineto
  Tt setlinewidth stroke
  grestore
} bd
/OLE {
  /Tcx currentpoint pop def
  gsave
  newpath
  cf findfont cs scalefont dup
  /FontMatrix get 0 get /Ts exch def /FontInfo get dup
  /UnderlinePosition get Ts mul /To exch def
  /UnderlineThickness get Ts mul /Tt exch def
  ux uy To add cs add moveto Tcx uy To add cs add lineto
  Tt setlinewidth stroke
  grestore
} bd
/SOE {
  /Tcx currentpoint pop def
  gsave
  newpath
  cf findfont cs scalefont dup
  /FontMatrix get 0 get /Ts exch def /FontInfo get dup
  /UnderlinePosition get Ts mul /To exch def
  /UnderlineThickness get Ts mul /Tt exch def
  ux uy To add cs 10 mul 26 idiv add moveto Tcx uy To add cs 10 mul 26 idiv add lineto
  Tt setlinewidth stroke
  grestore
} bd
/QT {
/Y22 exch store
/X22 exch store
/Y21 exch store
/X21 exch store
currentpoint
/Y21 load 2 mul add 3 div exch
/X21 load 2 mul add 3 div exch
/X21 load 2 mul /X22 load add 3 div
/Y21 load 2 mul /Y22 load add 3 div
/X22 load /Y22 load curveto
} bd
/SSPD {
dup length /d exch dict def
{
/v exch def
/k exch def
currentpagedevice k known {
/cpdv currentpagedevice k get def
v cpdv ne {
/upd false def
/nullv v type /nulltype eq def
/nullcpdv cpdv type /nulltype eq def
nullv nullcpdv or
{
/upd true def
} {
/sametype v type cpdv type eq def
sametype {
v type /arraytype eq {
/vlen v length def
/cpdvlen cpdv length def
vlen cpdvlen eq {
0 1 vlen 1 sub {
/i exch def
/obj v i get def
/cpdobj cpdv i get def
obj cpdobj ne {
/upd true def
exit
} if
} for
} {
/upd true def
} ifelse
} {
v type /dicttype eq {
v {
/dv exch def
/dk exch def
/cpddv cpdv dk get def
dv cpddv ne {
/upd true def
exit
} if
} forall
} {
/upd true def
} ifelse
} ifelse
} if
} ifelse
upd true eq {
d k v put
} if
} if
} if
} forall
d length 0 gt {
d setpagedevice
} if
} bd
/RE { % /NewFontName [NewEncodingArray] /FontName RE -
  findfont dup length dict begin
  {
    1 index /FID ne
    {def} {pop pop} ifelse
  } forall
  /Encoding exch def
  /FontName 1 index def
  currentdict definefont pop
  end
} bind def
%%EndResource
%%BeginResource: procset (Apache XML Graphics EPS ProcSet) 1.0 0
%%Version: 1.0 0
%%Copyright: (Copyright 2002-2003 The Apache Software Foundation. License terms: http://www.apache.org/licenses/LICENSE-2.0)
/BeginEPSF { %def
/b4_Inc_state save def         % Save state for cleanup
/dict_count countdictstack def % Count objects on dict stack
/op_count count 1 sub def      % Count objects on operand stack
userdict begin                 % Push userdict on dict stack
/showpage { } def              % Redefine showpage, { } = null proc
0 setgray 0 setlinecap         % Prepare graphics state
1 setlinewidth 0 setlinejoin
10 setmiterlimit [ ] 0 setdash newpath
/languagelevel where           % If level not equal to 1 then
{pop languagelevel             % set strokeadjust and
1 ne                           % overprint to their defaults.
{false setstrokeadjust false setoverprint
} if
} if
} bd
/EndEPSF { %def
count op_count sub {pop} repeat            % Clean up stacks
countdictstack dict_count sub {end} repeat
b4_Inc_state restore
} bd
%%EndResource
%FOPBeginFontDict
%%IncludeResource: font Courier-Bold
%%IncludeResource: font Helvetica
%%IncludeResource: font Courier-BoldOblique
%%IncludeResource: font Courier-Oblique
%%IncludeResource: font Times-Roman
%%IncludeResource: font Helvetica-BoldOblique
%%IncludeResource: font Helvetica-Bold
%%IncludeResource: font Helvetica-Oblique
%%IncludeResource: font Times-BoldItalic
%%IncludeResource: font Courier
%%IncludeResource: font Times-Italic
%%IncludeResource: font Times-Bold
%%IncludeResource: font Symbol
%%IncludeResource: font ZapfDingbats
%FOPEndFontDict
%%BeginResource: encoding WinAnsiEncoding
/WinAnsiEncoding [
/.notdef /.notdef /.notdef /.notdef /.notdef
/.notdef /.notdef /.notdef /.notdef /.notdef
/.notdef /.notdef /.notdef /.notdef /.notdef
/.notdef /.notdef /.notdef /.notdef /.notdef
/.notdef /.notdef /.notdef /.notdef /.notdef
/.notdef /.notdef /.notdef /.notdef /.notdef
/.notdef /.notdef /space /exclam /quotedbl
/numbersign /dollar /percent /ampersand /quotesingle
/parenleft /parenright /asterisk /plus /comma
/hyphen /period /slash /zero /one
/two /three /four /five /six
/seven /eight /nine /colon /semicolon
/less /equal /greater /question /at
/A /B /C /D /E
/F /G /H /I /J
/K /L /M /N /O
/P /Q /R /S /T
/U /V /W /X /Y
/Z /bracketleft /backslash /bracketright /asciicircum
/underscore /quoteleft /a /b /c
/d /e /f /g /h
/i /j /k /l /m
/n /o /p /q /r
/s /t /u /v /w
/x /y /z /braceleft /bar
/braceright /asciitilde /bullet /Euro /bullet
/quotesinglbase /florin /quotedblbase /ellipsis /dagger
/daggerdbl /circumflex /perthousand /Scaron /guilsinglleft
/OE /bullet /Zcaron /bullet /bullet
/quoteleft /quoteright /quotedblleft /quotedblright /bullet
/endash /emdash /asciitilde /trademark /scaron
/guilsinglright /oe /bullet /zcaron /Ydieresis
/space /exclamdown /cent /sterling /currency
/yen /brokenbar /section /dieresis /copyright
/ordfeminine /guillemotleft /logicalnot /sfthyphen /registered
/macron /degree /plusminus /twosuperior /threesuperior
/acute /mu /paragraph /middot /cedilla
/onesuperior /ordmasculine /guillemotright /onequarter /onehalf
/threequarters /questiondown /Agrave /Aacute /Acircumflex
/Atilde /Adieresis /Aring /AE /Ccedilla
/Egrave /Eacute /Ecircumflex /Edieresis /Igrave
/Iacute /Icircumflex /Idieresis /Eth /Ntilde
/Ograve /Oacute /Ocircumflex /Otilde /Odieresis
/multiply /Oslash /Ugrave /Uacute /Ucircumflex
/Udieresis /Yacute /Thorn /germandbls /agrave
/aacute /acircumflex /atilde /adieresis /aring
/ae /ccedilla /egrave /eacute /ecircumflex
/edieresis /igrave /iacute /icircumflex /idieresis
/eth /ntilde /ograve /oacute /ocircumflex
/otilde /odieresis /divide /oslash /ugrave
/uacute /ucircumflex /udieresis /yacute /thorn
/ydieresis
] def
%%EndResource
%FOPBeginFontReencode
/Courier-Bold findfont
dup length dict begin
  {1 index /FID ne {def} {pop pop} ifelse} forall
  /Encoding WinAnsiEncoding def
  currentdict
end
/Courier-Bold exch definefont pop
/Helvetica findfont
dup length dict begin
  {1 index /FID ne {def} {pop pop} ifelse} forall
  /Encoding WinAnsiEncoding def
  currentdict
end
/Helvetica exch definefont pop
/Courier-BoldOblique findfont
dup length dict begin
  {1 index /FID ne {def} {pop pop} ifelse} forall
  /Encoding WinAnsiEncoding def
  currentdict
end
/Courier-BoldOblique exch definefont pop
/Courier-Oblique findfont
dup length dict begin
  {1 index /FID ne {def} {pop pop} ifelse} forall
  /Encoding WinAnsiEncoding def
  currentdict
end
/Courier-Oblique exch definefont pop
/Times-Roman findfont
dup length dict begin
  {1 index /FID ne {def} {pop pop} ifelse} forall
  /Encoding WinAnsiEncoding def
  currentdict
end
/Times-Roman exch definefont pop
/Helvetica-BoldOblique findfont
dup length dict begin
  {1 index /FID ne {def} {pop pop} ifelse} forall
  /Encoding WinAnsiEncoding def
  currentdict
end
/Helvetica-BoldOblique exch definefont pop
/Helvetica-Bold findfont
dup length dict begin
  {1 index /FID ne {def} {pop pop} ifelse} forall
  /Encoding WinAnsiEncoding def
  currentdict
end
/Helvetica-Bold exch definefont pop
/Helvetica-Oblique findfont
dup length dict begin
  {1 index /FID ne {def} {pop pop} ifelse} forall
  /Encoding WinAnsiEncoding def
  currentdict
end
/Helvetica-Oblique exch definefont pop
/Times-BoldItalic findfont
dup length dict begin
  {1 index /FID ne {def} {pop pop} ifelse} forall
  /Encoding WinAnsiEncoding def
  currentdict
end
/Times-BoldItalic exch definefont pop
/Courier findfont
dup length dict begin
  {1 index /FID ne {def} {pop pop} ifelse} forall
  /Encoding WinAnsiEncoding def
  currentdict
end
/Courier exch definefont pop
/Times-Italic findfont
dup length dict begin
  {1 index /FID ne {def} {pop pop} ifelse} forall
  /Encoding WinAnsiEncoding def
  currentdict
end
/Times-Italic exch definefont pop
/Times-Bold findfont
dup length dict begin
  {1 index /FID ne {def} {pop pop} ifelse} forall
  /Encoding WinAnsiEncoding def
  currentdict
end
/Times-Bold exch definefont pop
%FOPEndFontReencode
%%EndProlog
%%Page: 1 1
%%PageBoundingBox: 0 0 731 458
%%BeginPageSetup
[1 0 0 -1 0 458] CT
%%EndPageSetup
GS
[0.75 0 0 0.75 0 -0.25] CT
1 GC
N
0 0 975 611 re
f
GR
GS
[0.75 0 0 0.75 0 -0.25] CT
1 GC
N
0 0 975 611 re
f
GR
GS
[0.75 0 0 0.75 0 -0.25] CT
1 GC
N
127 544 M
882 544 L
882 46 L
127 46 L
cp
f
GR
GS
[0.75 0 0 0.75 0 -0.25] CT
0.149 GC
2 setlinecap
1 LJ
0.667 LW
N
127 544 M
882 544 L
S
GR
GS
[0.75 0 0 0.75 0 -0.25] CT
0.149 GC
2 setlinecap
1 LJ
0.667 LW
N
127 46 M
882 46 L
S
GR
GS
[0.75 0 0 0.75 0 -0.25] CT
0.149 GC
2 setlinecap
1 LJ
0.667 LW
N
127 544 M
127 536.45 L
S
GR
GS
[0.75 0 0 0.75 0 -0.25] CT
0.149 GC
2 setlinecap
1 LJ
0.667 LW
N
221.375 544 M
221.375 536.45 L
S
GR
GS
[0.75 0 0 0.75 0 -0.25] CT
0.149 GC
2 setlinecap
1 LJ
0.667 LW
N
315.75 544 M
315.75 536.45 L
S
GR
GS
[0.75 0 0 0.75 0 -0.25] CT
0.149 GC
2 setlinecap
1 LJ
0.667 LW
N
410.125 544 M
410.125 536.45 L
S
GR
GS
[0.75 0 0 0.75 0 -0.25] CT
0.149 GC
2 setlinecap
1 LJ
0.667 LW
N
504.5 544 M
504.5 536.45 L
S
GR
GS
[0.75 0 0 0.75 0 -0.25] CT
0.149 GC
2 setlinecap
1 LJ
0.667 LW
N
598.875 544 M
598.875 536.45 L
S
GR
GS
[0.75 0 0 0.75 0 -0.25] CT
0.149 GC
2 setlinecap
1 LJ
0.667 LW
N
693.25 544 M
693.25 536.45 L
S
GR
GS
[0.75 0 0 0.75 0 -0.25] CT
0.149 GC
2 setlinecap
1 LJ
0.667 LW
N
787.625 544 M
787.625 536.45 L
S
GR
GS
[0.75 0 0 0.75 0 -0.25] CT
0.149 GC
2 setlinecap
1 LJ
0.667 LW
N
882 544 M
882 536.45 L
S
GR
GS
[0.75 0 0 0.75 0 -0.25] CT
0.149 GC
2 setlinecap
1 LJ
0.667 LW
N
127 46 M
127 53.55 L
S
GR
GS
[0.75 0 0 0.75 0 -0.25] CT
0.149 GC
2 setlinecap
1 LJ
0.667 LW
N
221.375 46 M
221.375 53.55 L
S
GR
GS
[0.75 0 0 0.75 0 -0.25] CT
0.149 GC
2 setlinecap
1 LJ
0.667 LW
N
315.75 46 M
315.75 53.55 L
S
GR
GS
[0.75 0 0 0.75 0 -0.25] CT
0.149 GC
2 setlinecap
1 LJ
0.667 LW
N
410.125 46 M
410.125 53.55 L
S
GR
GS
[0.75 0 0 0.75 0 -0.25] CT
0.149 GC
2 setlinecap
1 LJ
0.667 LW
N
504.5 46 M
504.5 53.55 L
S
GR
GS
[0.75 0 0 0.75 0 -0.25] CT
0.149 GC
2 setlinecap
1 LJ
0.667 LW
N
598.875 46 M
598.875 53.55 L
S
GR
GS
[0.75 0 0 0.75 0 -0.25] CT
0.149 GC
2 setlinecap
1 LJ
0.667 LW
N
693.25 46 M
693.25 53.55 L
S
GR
GS
[0.75 0 0 0.75 0 -0.25] CT
0.149 GC
2 setlinecap
1 LJ
0.667 LW
N
787.625 46 M
787.625 53.55 L
S
GR
GS
[0.75 0 0 0.75 0 -0.25] CT
0.149 GC
2 setlinecap
1 LJ
0.667 LW
N
882 46 M
882 53.55 L
S
GR
GS
[0.75 0 0 0.75 95.25 411.75003] CT
0.149 GC
/Helvetica 13.333 F
GS
[1 0 0 1 0 0] CT
-4.5 13 moveto 
1 -1 scale
(0) t 
GR
GR
GS
[0.75 0 0 0.75 166.03125 411.75003] CT
0.149 GC
/Helvetica 13.333 F
GS
[1 0 0 1 0 0] CT
-8.5 13 moveto 
1 -1 scale
(50) t 
GR
GR
GS
[0.75 0 0 0.75 236.8125 411.75003] CT
0.149 GC
/Helvetica 13.333 F
GS
[1 0 0 1 0 0] CT
-12.5 13 moveto 
1 -1 scale
(100) t 
GR
GR
GS
[0.75 0 0 0.75 307.59375 411.75003] CT
0.149 GC
/Helvetica 13.333 F
GS
[1 0 0 1 0 0] CT
-12.5 13 moveto 
1 -1 scale
(150) t 
GR
GR
GS
[0.75 0 0 0.75 378.375 411.75003] CT
0.149 GC
/Helvetica 13.333 F
GS
[1 0 0 1 0 0] CT
-12.5 13 moveto 
1 -1 scale
(200) t 
GR
GR
GS
[0.75 0 0 0.75 449.15625 411.75003] CT
0.149 GC
/Helvetica 13.333 F
GS
[1 0 0 1 0 0] CT
-12.5 13 moveto 
1 -1 scale
(250) t 
GR
GR
GS
[0.75 0 0 0.75 519.9375 411.75003] CT
0.149 GC
/Helvetica 13.333 F
GS
[1 0 0 1 0 0] CT
-12.5 13 moveto 
1 -1 scale
(300) t 
GR
GR
GS
[0.75 0 0 0.75 590.71875 411.75003] CT
0.149 GC
/Helvetica 13.333 F
GS
[1 0 0 1 0 0] CT
-12.5 13 moveto 
1 -1 scale
(350) t 
GR
GR
GS
[0.75 0 0 0.75 661.5 411.75003] CT
0.149 GC
/Helvetica 13.333 F
GS
[1 0 0 1 0 0] CT
-12.5 13 moveto 
1 -1 scale
(400) t 
GR
GR
GS
[0.75 0 0 0.75 378.37525 425.50002] CT
0.149 GC
/Helvetica 14.667 F
GS
[1 0 0 1 0 0] CT
-57.5 14 moveto 
1 -1 scale
(Time \(seconds\)) t 
GR
GR
GS
[0.75 0 0 0.75 0 -0.25] CT
0.149 GC
2 setlinecap
1 LJ
0.667 LW
N
127 544 M
127 46 L
S
GR
GS
[0.75 0 0 0.75 0 -0.25] CT
0.149 GC
2 setlinecap
1 LJ
0.667 LW
N
882 544 M
882 46 L
S
GR
GS
[0.75 0 0 0.75 0 -0.25] CT
0.149 GC
2 setlinecap
1 LJ
0.667 LW
N
127 544 M
134.55 544 L
S
GR
GS
[0.75 0 0 0.75 0 -0.25] CT
0.149 GC
2 setlinecap
1 LJ
0.667 LW
N
127 461 M
134.55 461 L
S
GR
GS
[0.75 0 0 0.75 0 -0.25] CT
0.149 GC
2 setlinecap
1 LJ
0.667 LW
N
127 378 M
134.55 378 L
S
GR
GS
[0.75 0 0 0.75 0 -0.25] CT
0.149 GC
2 setlinecap
1 LJ
0.667 LW
N
127 295 M
134.55 295 L
S
GR
GS
[0.75 0 0 0.75 0 -0.25] CT
0.149 GC
2 setlinecap
1 LJ
0.667 LW
N
127 212 M
134.55 212 L
S
GR
GS
[0.75 0 0 0.75 0 -0.25] CT
0.149 GC
2 setlinecap
1 LJ
0.667 LW
N
127 129 M
134.55 129 L
S
GR
GS
[0.75 0 0 0.75 0 -0.25] CT
0.149 GC
2 setlinecap
1 LJ
0.667 LW
N
882 544 M
874.45 544 L
S
GR
GS
[0.75 0 0 0.75 0 -0.25] CT
0.149 GC
2 setlinecap
1 LJ
0.667 LW
N
882 461 M
874.45 461 L
S
GR
GS
[0.75 0 0 0.75 0 -0.25] CT
0.149 GC
2 setlinecap
1 LJ
0.667 LW
N
882 378 M
874.45 378 L
S
GR
GS
[0.75 0 0 0.75 0 -0.25] CT
0.149 GC
2 setlinecap
1 LJ
0.667 LW
N
882 295 M
874.45 295 L
S
GR
GS
[0.75 0 0 0.75 0 -0.25] CT
0.149 GC
2 setlinecap
1 LJ
0.667 LW
N
882 212 M
874.45 212 L
S
GR
GS
[0.75 0 0 0.75 0 -0.25] CT
0.149 GC
2 setlinecap
1 LJ
0.667 LW
N
882 129 M
874.45 129 L
S
GR
GS
[0.75 0 0 0.75 91.25 407.75] CT
0.149 GC
/Helvetica 13.333 F
GS
[1 0 0 1 0 0] CT
-34 4.5 moveto 
1 -1 scale
(-0.15) t 
GR
GR
GS
[0.75 0 0 0.75 91.25 345.5] CT
0.149 GC
/Helvetica 13.333 F
GS
[1 0 0 1 0 0] CT
-26 4.5 moveto 
1 -1 scale
(-0.1) t 
GR
GR
GS
[0.75 0 0 0.75 91.25 283.25] CT
0.149 GC
/Helvetica 13.333 F
GS
[1 0 0 1 0 0] CT
-34 4.5 moveto 
1 -1 scale
(-0.05) t 
GR
GR
GS
[0.75 0 0 0.75 91.25 221] CT
0.149 GC
/Helvetica 13.333 F
GS
[1 0 0 1 0 0] CT
-9 4.5 moveto 
1 -1 scale
(0) t 
GR
GR
GS
[0.75 0 0 0.75 91.25 158.75] CT
0.149 GC
/Helvetica 13.333 F
GS
[1 0 0 1 0 0] CT
-29 4.5 moveto 
1 -1 scale
(0.05) t 
GR
GR
GS
[0.75 0 0 0.75 91.25 96.5] CT
0.149 GC
/Helvetica 13.333 F
GS
[1 0 0 1 0 0] CT
-21 4.5 moveto 
1 -1 scale
(0.1) t 
GR
GR
GS
[0.75 0 0 0.75 378.37537 32.1875] CT
N
-84.016 -14.594 M
-84.016 -12.281 L
-84.906 -12.672 -85.766 -12.883 QT
-86.625 -13.094 -87.391 -13.094 QT
-88.406 -13.094 -88.883 -12.813 QT
-89.359 -12.531 -89.359 -11.953 QT
-89.359 -11.5 -89.039 -11.258 QT
-88.719 -11.016 -87.859 -10.844 QT
-86.656 -10.594 L
-84.828 -10.234 -84.063 -9.484 QT
-83.297 -8.734 -83.297 -7.359 QT
-83.297 -5.547 -84.367 -4.664 QT
-85.438 -3.781 -87.641 -3.781 QT
-88.688 -3.781 -89.734 -3.984 QT
-90.781 -4.188 -91.828 -4.578 QT
-91.828 -6.953 L
-90.781 -6.391 -89.805 -6.109 QT
-88.828 -5.828 -87.922 -5.828 QT
-87 -5.828 -86.508 -6.141 QT
-86.016 -6.453 -86.016 -7.016 QT
-86.016 -7.531 -86.344 -7.813 QT
-86.672 -8.094 -87.672 -8.313 QT
-88.766 -8.547 L
-90.406 -8.906 -91.164 -9.672 QT
-91.922 -10.438 -91.922 -11.734 QT
-91.922 -13.375 -90.867 -14.258 QT
-89.813 -15.141 -87.844 -15.141 QT
-86.938 -15.141 -85.984 -15 QT
-85.031 -14.859 -84.016 -14.594 QT
cp
-78.319 -14.531 M
-78.319 -12.203 L
-75.616 -12.203 L
-75.616 -10.328 L
-78.319 -10.328 L
-78.319 -6.844 L
-78.319 -6.281 -78.093 -6.078 QT
-77.866 -5.875 -77.194 -5.875 QT
-75.851 -5.875 L
-75.851 -4 L
-78.101 -4 L
-79.647 -4 -80.296 -4.648 QT
-80.944 -5.297 -80.944 -6.844 QT
-80.944 -10.328 L
-82.241 -10.328 L
-82.241 -12.203 L
-80.944 -12.203 L
-80.944 -14.531 L
-78.319 -14.531 L
cp
-70.501 -7.688 M
-71.329 -7.688 -71.743 -7.414 QT
-72.157 -7.141 -72.157 -6.594 QT
-72.157 -6.094 -71.821 -5.813 QT
-71.485 -5.531 -70.891 -5.531 QT
-70.157 -5.531 -69.649 -6.063 QT
-69.141 -6.594 -69.141 -7.391 QT
-69.141 -7.688 L
-70.501 -7.688 L
cp
-66.501 -8.688 M
-66.501 -4 L
-69.141 -4 L
-69.141 -5.219 L
-69.673 -4.469 -70.329 -4.125 QT
-70.985 -3.781 -71.923 -3.781 QT
-73.204 -3.781 -74.001 -4.531 QT
-74.798 -5.281 -74.798 -6.469 QT
-74.798 -7.906 -73.805 -8.578 QT
-72.813 -9.25 -70.688 -9.25 QT
-69.141 -9.25 L
-69.141 -9.453 L
-69.141 -10.078 -69.634 -10.367 QT
-70.126 -10.656 -71.157 -10.656 QT
-72.001 -10.656 -72.727 -10.492 QT
-73.454 -10.328 -74.079 -9.984 QT
-74.079 -11.984 L
-73.235 -12.188 -72.384 -12.297 QT
-71.532 -12.406 -70.688 -12.406 QT
-68.47 -12.406 -67.485 -11.531 QT
-66.501 -10.656 -66.501 -8.688 QT
cp
-65.314 -12.203 M
-62.704 -12.203 L
-60.658 -6.531 L
-58.626 -12.203 L
-55.986 -12.203 L
-59.22 -4 L
-62.095 -4 L
-65.314 -12.203 L
cp
-50.838 -10.531 M
-51.698 -10.531 -52.158 -9.906 QT
-52.619 -9.281 -52.619 -8.094 QT
-52.619 -6.922 -52.158 -6.289 QT
-51.698 -5.656 -50.838 -5.656 QT
-49.979 -5.656 -49.526 -6.289 QT
-49.073 -6.922 -49.073 -8.094 QT
-49.073 -9.281 -49.526 -9.906 QT
-49.979 -10.531 -50.838 -10.531 QT
cp
-50.838 -12.406 M
-48.713 -12.406 -47.526 -11.258 QT
-46.338 -10.109 -46.338 -8.094 QT
-46.338 -6.078 -47.526 -4.93 QT
-48.713 -3.781 -50.838 -3.781 QT
-52.948 -3.781 -54.151 -4.93 QT
-55.354 -6.078 -55.354 -8.094 QT
-55.354 -10.109 -54.151 -11.258 QT
-52.948 -12.406 -50.838 -12.406 QT
cp
-45.691 -12.203 M
-43.082 -12.203 L
-41.035 -6.531 L
-39.004 -12.203 L
-36.363 -12.203 L
-39.597 -4 L
-42.472 -4 L
-45.691 -12.203 L
cp
-31.434 -7.688 M
-32.262 -7.688 -32.676 -7.414 QT
-33.09 -7.141 -33.09 -6.594 QT
-33.09 -6.094 -32.754 -5.813 QT
-32.419 -5.531 -31.825 -5.531 QT
-31.09 -5.531 -30.583 -6.063 QT
-30.075 -6.594 -30.075 -7.391 QT
-30.075 -7.688 L
-31.434 -7.688 L
cp
-27.434 -8.688 M
-27.434 -4 L
-30.075 -4 L
-30.075 -5.219 L
-30.606 -4.469 -31.262 -4.125 QT
-31.919 -3.781 -32.856 -3.781 QT
-34.137 -3.781 -34.934 -4.531 QT
-35.731 -5.281 -35.731 -6.469 QT
-35.731 -7.906 -34.739 -8.578 QT
-33.747 -9.25 -31.622 -9.25 QT
-30.075 -9.25 L
-30.075 -9.453 L
-30.075 -10.078 -30.567 -10.367 QT
-31.059 -10.656 -32.09 -10.656 QT
-32.934 -10.656 -33.661 -10.492 QT
-34.387 -10.328 -35.012 -9.984 QT
-35.012 -11.984 L
-34.169 -12.188 -33.317 -12.297 QT
-32.465 -12.406 -31.622 -12.406 QT
-29.403 -12.406 -28.419 -11.531 QT
-27.434 -10.656 -27.434 -8.688 QT
cp
-30.637 -16 M
-28.559 -16 L
-31.262 -13.25 L
-32.7 -13.25 L
-30.637 -16 L
cp
-20.52 -12.203 M
-13.363 -12.203 L
-13.363 -10.375 L
-17.692 -5.875 L
-13.363 -5.875 L
-13.363 -4 L
-20.707 -4 L
-20.707 -5.828 L
-16.379 -10.328 L
-20.52 -10.328 L
-20.52 -12.203 L
cp
-8.974 -5.188 M
-8.974 -0.875 L
-11.583 -0.875 L
-11.583 -12.203 L
-8.974 -12.203 L
-8.974 -11 L
-8.427 -11.719 -7.763 -12.063 QT
-7.099 -12.406 -6.255 -12.406 QT
-4.739 -12.406 -3.763 -11.195 QT
-2.786 -9.984 -2.786 -8.094 QT
-2.786 -6.203 -3.763 -4.992 QT
-4.739 -3.781 -6.255 -3.781 QT
-7.099 -3.781 -7.763 -4.125 QT
-8.427 -4.469 -8.974 -5.188 QT
cp
-7.224 -10.5 M
-8.067 -10.5 -8.521 -9.883 QT
-8.974 -9.266 -8.974 -8.094 QT
-8.974 -6.938 -8.521 -6.313 QT
-8.067 -5.688 -7.224 -5.688 QT
-6.38 -5.688 -5.935 -6.305 QT
-5.489 -6.922 -5.489 -8.094 QT
-5.489 -9.266 -5.935 -9.883 QT
-6.38 -10.5 -7.224 -10.5 QT
cp
7.096 -8.125 M
7.096 -7.375 L
0.955 -7.375 L
1.049 -6.453 1.627 -5.992 QT
2.205 -5.531 3.221 -5.531 QT
4.049 -5.531 4.916 -5.773 QT
5.783 -6.016 6.705 -6.516 QT
6.705 -4.5 L
5.768 -4.141 4.838 -3.961 QT
3.908 -3.781 2.986 -3.781 QT
0.752 -3.781 -0.482 -4.914 QT
-1.717 -6.047 -1.717 -8.094 QT
-1.717 -10.094 -0.506 -11.25 QT
0.705 -12.406 2.83 -12.406 QT
4.768 -12.406 5.932 -11.242 QT
7.096 -10.078 7.096 -8.125 QT
cp
4.393 -9 M
4.393 -9.75 3.955 -10.203 QT
3.518 -10.656 2.814 -10.656 QT
2.064 -10.656 1.588 -10.227 QT
1.111 -9.797 0.986 -9 QT
4.393 -9 L
cp
2.502 -13.25 M
0.627 -16 L
1.939 -16 L
3.393 -14.328 L
4.846 -16 L
6.158 -16 L
4.283 -13.25 L
2.502 -13.25 L
cp
11.708 -14.531 M
11.708 -12.203 L
14.411 -12.203 L
14.411 -10.328 L
11.708 -10.328 L
11.708 -6.844 L
11.708 -6.281 11.934 -6.078 QT
12.161 -5.875 12.833 -5.875 QT
14.177 -5.875 L
14.177 -4 L
11.927 -4 L
10.38 -4 9.731 -4.648 QT
9.083 -5.297 9.083 -6.844 QT
9.083 -10.328 L
7.786 -10.328 L
7.786 -12.203 L
9.083 -12.203 L
9.083 -14.531 L
11.708 -14.531 L
cp
24.089 -9 M
24.089 -4 L
21.464 -4 L
21.464 -4.813 L
21.464 -7.828 L
21.464 -8.891 21.417 -9.289 QT
21.37 -9.688 21.245 -9.875 QT
21.089 -10.141 20.831 -10.281 QT
20.573 -10.422 20.23 -10.422 QT
19.401 -10.422 18.933 -9.789 QT
18.464 -9.156 18.464 -8.031 QT
18.464 -4 L
15.855 -4 L
15.855 -12.203 L
18.464 -12.203 L
18.464 -11 L
19.058 -11.719 19.73 -12.063 QT
20.401 -12.406 21.198 -12.406 QT
22.62 -12.406 23.355 -11.531 QT
24.089 -10.656 24.089 -9 QT
cp
29.96 -7.688 M
29.132 -7.688 28.718 -7.414 QT
28.304 -7.141 28.304 -6.594 QT
28.304 -6.094 28.64 -5.813 QT
28.976 -5.531 29.57 -5.531 QT
30.304 -5.531 30.812 -6.063 QT
31.32 -6.594 31.32 -7.391 QT
31.32 -7.688 L
29.96 -7.688 L
cp
33.96 -8.688 M
33.96 -4 L
31.32 -4 L
31.32 -5.219 L
30.789 -4.469 30.132 -4.125 QT
29.476 -3.781 28.539 -3.781 QT
27.257 -3.781 26.46 -4.531 QT
25.664 -5.281 25.664 -6.469 QT
25.664 -7.906 26.656 -8.578 QT
27.648 -9.25 29.773 -9.25 QT
31.32 -9.25 L
31.32 -9.453 L
31.32 -10.078 30.828 -10.367 QT
30.335 -10.656 29.304 -10.656 QT
28.46 -10.656 27.734 -10.492 QT
27.007 -10.328 26.382 -9.984 QT
26.382 -11.984 L
27.226 -12.188 28.078 -12.297 QT
28.929 -12.406 29.773 -12.406 QT
31.992 -12.406 32.976 -11.531 QT
33.96 -10.656 33.96 -8.688 QT
cp
30.757 -16 M
32.835 -16 L
30.132 -13.25 L
28.695 -13.25 L
30.757 -16 L
cp
40.25 -12.203 M
42.859 -12.203 L
44.906 -6.531 L
46.937 -12.203 L
49.578 -12.203 L
46.344 -4 L
43.469 -4 L
40.25 -12.203 L
cp
54.507 -7.688 M
53.679 -7.688 53.265 -7.414 QT
52.85 -7.141 52.85 -6.594 QT
52.85 -6.094 53.186 -5.813 QT
53.522 -5.531 54.116 -5.531 QT
54.85 -5.531 55.358 -6.063 QT
55.866 -6.594 55.866 -7.391 QT
55.866 -7.688 L
54.507 -7.688 L
cp
58.507 -8.688 M
58.507 -4 L
55.866 -4 L
55.866 -5.219 L
55.335 -4.469 54.679 -4.125 QT
54.022 -3.781 53.085 -3.781 QT
51.804 -3.781 51.007 -4.531 QT
50.21 -5.281 50.21 -6.469 QT
50.21 -7.906 51.202 -8.578 QT
52.194 -9.25 54.319 -9.25 QT
55.866 -9.25 L
55.866 -9.453 L
55.866 -10.078 55.374 -10.367 QT
54.882 -10.656 53.85 -10.656 QT
53.007 -10.656 52.28 -10.492 QT
51.554 -10.328 50.929 -9.984 QT
50.929 -11.984 L
51.772 -12.188 52.624 -12.297 QT
53.475 -12.406 54.319 -12.406 QT
56.538 -12.406 57.522 -11.531 QT
58.507 -10.656 58.507 -8.688 QT
cp
60.319 -12.203 M
67.475 -12.203 L
67.475 -10.375 L
63.147 -5.875 L
67.475 -5.875 L
67.475 -4 L
60.131 -4 L
60.131 -5.828 L
64.459 -10.328 L
60.319 -10.328 L
60.319 -12.203 L
cp
73.615 -5.688 M
74.458 -5.688 74.904 -6.305 QT
75.349 -6.922 75.349 -8.094 QT
75.349 -9.266 74.904 -9.883 QT
74.458 -10.5 73.615 -10.5 QT
72.771 -10.5 72.318 -9.883 QT
71.865 -9.266 71.865 -8.094 QT
71.865 -6.938 72.318 -6.313 QT
72.771 -5.688 73.615 -5.688 QT
cp
71.865 -11 M
72.412 -11.719 73.076 -12.063 QT
73.74 -12.406 74.583 -12.406 QT
76.099 -12.406 77.076 -11.195 QT
78.052 -9.984 78.052 -8.094 QT
78.052 -6.203 77.076 -4.992 QT
76.099 -3.781 74.583 -3.781 QT
73.74 -3.781 73.076 -4.125 QT
72.412 -4.469 71.865 -5.188 QT
71.865 -4 L
69.255 -4 L
69.255 -15.391 L
71.865 -15.391 L
71.865 -11 L
cp
83.418 -7.688 M
82.59 -7.688 82.176 -7.414 QT
81.762 -7.141 81.762 -6.594 QT
81.762 -6.094 82.098 -5.813 QT
82.434 -5.531 83.028 -5.531 QT
83.762 -5.531 84.27 -6.063 QT
84.778 -6.594 84.778 -7.391 QT
84.778 -7.688 L
83.418 -7.688 L
cp
87.418 -8.688 M
87.418 -4 L
84.778 -4 L
84.778 -5.219 L
84.247 -4.469 83.59 -4.125 QT
82.934 -3.781 81.997 -3.781 QT
80.715 -3.781 79.918 -4.531 QT
79.122 -5.281 79.122 -6.469 QT
79.122 -7.906 80.114 -8.578 QT
81.106 -9.25 83.231 -9.25 QT
84.778 -9.25 L
84.778 -9.453 L
84.778 -10.078 84.286 -10.367 QT
83.793 -10.656 82.762 -10.656 QT
81.918 -10.656 81.192 -10.492 QT
80.465 -10.328 79.84 -9.984 QT
79.84 -11.984 L
80.684 -12.188 81.536 -12.297 QT
82.387 -12.406 83.231 -12.406 QT
85.45 -12.406 86.434 -11.531 QT
87.418 -10.656 87.418 -8.688 QT
cp
f
GR
GS
[0.75 0 0 0.75 0 -0.25] CT
0 0.447 0.741 RC
1 LJ
0.667 LW
N
127 129 M
127.271 126.745 L
127.271 126.745 L
127.271 126.745 L
127.331 126.257 L
127.331 126.257 L
127.331 126.257 L
127.391 125.774 L
127.451 125.295 L
127.572 124.352 L
127.813 122.523 L
128.294 119.081 L
129.258 113.005 L
131.185 103.672 L
135.039 93.587 L
141.516 92.351 L
142.504 93.203 L
142.504 93.203 L
149.507 103.333 L
156.511 116.896 L
166.809 137.769 L
178.891 160.425 L
193.991 184.661 L
209.091 204.631 L
224.191 221.006 L
239.291 234.418 L
240.25 235.183 L
245.045 238.864 L
259.125 248.414 L
274.225 257.255 L
289.325 264.449 L
304.425 270.327 L
319.525 275.138 L
334.625 279.076 L
349.725 282.301 L
353.5 283.011 L
368.6 284.912 L
383.7 286.058 L
391.25 286.513 L
406.35 286.881 L
421.45 287.22 L
436.55 287.507 L
451.65 287.743 L
466.75 287.938 L
481.85 288.707 L
496.95 289.747 L
512.05 290.679 L
523.375 291.277 L
538.475 291.951 L
553.575 292.504 L
568.675 292.956 L
580 293.241 L
580.71 293.259 L
580.71 293.259 L
595.81 294.224 L
610.91 295.392 L
626.01 296.424 L
641.11 297.283 L
655.5 297.959 L
670.6 298.94 L
685.7 299.698 L
693.25 300.019 L
694.64 300.068 L
694.64 300.068 L
709.74 299.924 L
724.84 299.455 L
739.94 299.002 L
755.04 298.618 L
770.14 298.3 L
785.24 298.04 L
787.625 298.003 L
799.552 297.512 L
806.5 297.278 L
821.6 296.855 L
836.7 296.516 L
851.8 296.241 L
866.9 296.016 L
882 295.832 L
S
GR
GS
[0.75 0 0 0.75 0 -0.25] CT
0.851 0.325 0.098 RC
1 LJ
0.667 LW
N
127 129 M
127.271 127.035 L
127.271 127.035 L
127.271 127.035 L
127.331 126.611 L
127.331 126.611 L
127.331 126.611 L
127.391 126.192 L
127.451 125.778 L
127.572 124.965 L
127.813 123.393 L
128.294 120.465 L
129.258 115.405 L
131.185 108.014 L
135.039 101.276 L
141.516 103.801 L
142.504 105.037 L
142.504 105.037 L
149.507 116.778 L
156.511 130.604 L
166.809 150.677 L
178.891 171.792 L
193.991 194.082 L
209.091 212.369 L
224.191 227.346 L
239.291 239.609 L
240.25 240.309 L
245.045 243.674 L
259.125 252.406 L
274.225 260.459 L
289.325 267.236 L
304.425 272.816 L
319.525 277.391 L
334.625 281.137 L
349.725 284.204 L
353.5 284.88 L
368.6 286.86 L
383.7 288.451 L
391.25 289.132 L
406.35 289.974 L
421.45 290.48 L
436.55 290.862 L
451.65 291.169 L
466.75 291.42 L
481.85 292.033 L
496.95 292.566 L
512.05 293.007 L
523.375 293.285 L
538.475 293.596 L
553.575 293.85 L
568.675 294.059 L
580 294.19 L
580.71 294.214 L
580.71 294.214 L
595.81 294.769 L
610.91 295.252 L
626.01 295.65 L
641.11 295.976 L
655.5 296.232 L
670.6 296.785 L
685.7 297.421 L
693.25 297.709 L
694.64 297.726 L
694.64 297.726 L
709.74 297.812 L
724.84 297.859 L
739.94 297.896 L
755.04 297.925 L
770.14 297.949 L
785.24 297.969 L
787.625 297.972 L
799.552 297.757 L
806.5 297.553 L
821.6 297.11 L
836.7 296.731 L
851.8 296.418 L
866.9 296.161 L
882 295.95 L
S
GR
GS
[0.75 0 0 0.75 0 -0.25] CT
0.929 0.694 0.125 RC
1 LJ
0.667 LW
N
127 129 M
127.271 134.643 L
127.271 134.643 L
127.271 134.643 L
127.331 135.873 L
127.331 135.873 L
127.331 135.873 L
127.391 137.094 L
127.451 138.307 L
127.572 140.705 L
127.813 145.396 L
128.294 154.375 L
129.258 170.824 L
131.185 198.452 L
135.039 237.55 L
141.516 273.067 L
142.504 276.41 L
142.504 276.41 L
149.507 291.248 L
156.511 297.315 L
166.809 300.058 L
178.891 300.276 L
193.991 299.571 L
209.091 298.791 L
224.191 298.113 L
239.291 297.551 L
240.25 297.519 L
245.045 297.364 L
259.125 296.962 L
274.225 296.573 L
289.325 296.271 L
304.425 296.03 L
319.525 295.835 L
334.625 295.675 L
349.725 295.545 L
353.5 295.516 L
368.6 294.488 L
383.7 294.278 L
391.25 294.245 L
406.35 294.252 L
421.45 294.253 L
436.55 294.248 L
451.65 294.243 L
466.75 294.238 L
481.85 295.161 L
496.95 295.285 L
512.05 295.264 L
523.375 295.233 L
538.475 295.192 L
553.575 295.158 L
568.675 295.129 L
580 295.111 L
580.71 295.205 L
580.71 295.205 L
595.81 296.032 L
610.91 296.129 L
626.01 296.094 L
641.11 296.043 L
655.5 295.999 L
670.6 295.927 L
685.7 295.884 L
693.25 295.868 L
694.64 295.686 L
694.64 295.686 L
709.74 294.886 L
724.84 294.767 L
739.94 294.776 L
755.04 294.804 L
770.14 294.831 L
785.24 294.853 L
787.625 294.856 L
799.552 294.894 L
806.5 294.912 L
821.6 294.938 L
836.7 294.951 L
851.8 294.961 L
866.9 294.968 L
882 294.974 L
S
GR
GS
[0.75 0 0 0.75 0 -0.25] CT
0.494 0.184 0.557 RC
1 LJ
0.667 LW
N
127 129 M
127.271 135.593 L
127.271 135.593 L
127.271 135.593 L
127.331 137.026 L
127.331 137.026 L
127.331 137.026 L
127.391 138.448 L
127.451 139.857 L
127.572 142.642 L
127.813 148.075 L
128.294 158.413 L
129.258 177.136 L
131.185 207.861 L
135.039 249.33 L
141.516 283.723 L
142.504 286.696 L
142.504 286.696 L
149.507 298.795 L
156.511 302.726 L
166.809 303.6 L
178.891 302.767 L
193.991 301.431 L
209.091 300.276 L
224.191 299.321 L
239.291 298.538 L
240.25 298.493 L
245.045 298.278 L
259.125 297.72 L
274.225 297.943 L
289.325 297.629 L
304.425 297.285 L
319.525 296.987 L
334.625 296.741 L
349.725 296.538 L
353.5 296.494 L
368.6 296.384 L
383.7 296.267 L
391.25 296.211 L
406.35 295.396 L
421.45 295.224 L
436.55 295.17 L
451.65 295.141 L
466.75 295.12 L
481.85 295.056 L
496.95 295.03 L
512.05 295.021 L
523.375 295.017 L
538.475 295.013 L
553.575 295.011 L
568.675 295.009 L
580 295.008 L
580.71 295.008 L
580.71 295.008 L
595.81 294.958 L
610.91 294.945 L
626.01 294.946 L
641.11 294.949 L
655.5 294.952 L
670.6 295.672 L
685.7 295.764 L
693.25 295.763 L
694.64 295.761 L
694.64 295.761 L
709.74 295.787 L
724.84 295.773 L
739.94 295.75 L
755.04 295.728 L
770.14 295.709 L
785.24 295.694 L
787.625 295.691 L
799.552 294.997 L
806.5 294.892 L
821.6 294.857 L
836.7 294.873 L
851.8 294.894 L
866.9 294.913 L
882 294.929 L
S
GR
GS
[0.75 0 0 0.75 0 -0.25] CT
0.467 0.675 0.188 RC
1 LJ
0.667 LW
N
127 295 M
127.271 295 L
127.271 295 L
127.271 295 L
127.331 295 L
127.331 295 L
127.331 295 L
127.391 295 L
127.451 295 L
127.572 295 L
127.813 295 L
128.294 295 L
129.258 295 L
131.185 295 L
135.039 295 L
141.516 295 L
142.504 295 L
142.504 295 L
149.507 295 L
156.511 295 L
166.809 295 L
178.891 295 L
193.991 295 L
209.091 295 L
224.191 295 L
239.291 295 L
240.25 295 L
245.045 295 L
259.125 461 L
274.225 461 L
289.325 461 L
304.425 461 L
319.525 461 L
334.625 461 L
349.725 461 L
353.5 461 L
368.6 461 L
383.7 461 L
391.25 295 L
406.35 295 L
421.45 295 L
436.55 295 L
451.65 295 L
466.75 295 L
481.85 295 L
496.95 295 L
512.05 295 L
523.375 295 L
538.475 295 L
553.575 295 L
568.675 295 L
580 295 L
580.71 295 L
580.71 295 L
595.81 295 L
610.91 295 L
626.01 295 L
641.11 295 L
655.5 461 L
670.6 461 L
685.7 461 L
693.25 461 L
694.64 461 L
694.64 461 L
709.74 461 L
724.84 461 L
739.94 461 L
755.04 461 L
770.14 461 L
785.24 461 L
787.625 295 L
799.552 295 L
806.5 295 L
821.6 295 L
836.7 295 L
851.8 295 L
866.9 295 L
882 295 L
S
GR
GS
[0.75 0 0 0.75 0 -0.25] CT
0.302 0.745 0.933 RC
1 LJ
0.667 LW
N
127 295 M
127.271 295 L
127.271 295 L
127.271 295 L
127.331 295 L
127.331 295 L
127.331 295 L
127.391 295 L
127.451 295 L
127.572 295 L
127.813 295 L
128.294 295 L
129.258 295 L
131.185 295 L
135.039 295 L
141.516 295 L
142.504 295 L
142.504 295 L
149.507 295 L
156.511 295 L
166.809 295 L
178.891 295 L
193.991 295 L
209.091 295 L
224.191 295 L
239.291 295 L
240.25 295 L
245.045 295 L
259.125 295 L
274.225 295 L
289.325 295 L
304.425 295 L
319.525 295 L
334.625 295 L
349.725 295 L
353.5 129 L
368.6 129 L
383.7 129 L
391.25 129 L
406.35 129 L
421.45 129 L
436.55 129 L
451.65 129 L
466.75 295 L
481.85 295 L
496.95 295 L
512.05 295 L
523.375 295 L
538.475 295 L
553.575 295 L
568.675 295 L
580 461 L
580.71 461 L
580.71 461 L
595.81 461 L
610.91 461 L
626.01 461 L
641.11 461 L
655.5 461 L
670.6 461 L
685.7 461 L
693.25 295 L
694.64 295 L
694.64 295 L
709.74 295 L
724.84 295 L
739.94 295 L
755.04 295 L
770.14 295 L
785.24 295 L
787.625 295 L
799.552 295 L
806.5 295 L
821.6 295 L
836.7 295 L
851.8 295 L
866.9 295 L
882 295 L
S
GR
GS
[0.75 0 0 0.75 0 -0.25] CT
0.635 0.078 0.184 RC
1 LJ
0.667 LW
N
127.271 45.941 M
127.271 295 L
127.331 295 L
127.331 295 L
127.331 295 L
127.391 295 L
127.451 295 L
127.572 295 L
127.813 295 L
128.294 295 L
129.258 295 L
131.185 295 L
135.039 295 L
141.516 295 L
142.504 295 L
142.504 295 L
149.507 295 L
156.511 295 L
166.809 295 L
178.891 295 L
193.991 295 L
209.091 295 L
224.191 295 L
239.291 295 L
240.25 295 L
245.045 295 L
259.125 295 L
274.225 295 L
289.325 295 L
304.425 295 L
319.525 295 L
334.625 295 L
349.725 295 L
353.5 295 L
368.6 295 L
383.7 295 L
391.25 295 L
406.35 295 L
421.45 295 L
436.55 295 L
451.65 295 L
466.75 295 L
481.85 295 L
496.95 295 L
512.05 295 L
523.375 295 L
538.475 295 L
553.575 295 L
568.675 295 L
580 295 L
580.71 295 L
580.71 295 L
595.81 295 L
610.91 295 L
626.01 295 L
641.11 295 L
655.5 295 L
670.6 295 L
685.7 295 L
693.25 295 L
694.64 295 L
694.64 295 L
709.74 295 L
724.84 295 L
739.94 295 L
755.04 295 L
770.14 295 L
785.24 295 L
787.625 295 L
799.552 295 L
806.5 295 L
821.6 295 L
836.7 295 L
851.8 295 L
866.9 295 L
882 295 L
S
GR
GS
[0.75 0 0 0.75 0 -0.25] CT
0 0.447 0.741 RC
1 LJ
0.667 LW
N
127.331 45.941 M
127.331 295 L
127.391 295 L
127.451 295 L
127.572 295 L
127.813 295 L
128.294 295 L
129.258 295 L
131.185 295 L
135.039 295 L
141.516 295 L
142.504 295 L
142.504 295 L
149.507 295 L
156.511 295 L
166.809 295 L
178.891 295 L
193.991 295 L
209.091 295 L
224.191 295 L
239.291 295 L
240.25 295 L
245.045 295 L
259.125 295 L
274.225 295 L
289.325 295 L
304.425 295 L
319.525 295 L
334.625 295 L
349.725 295 L
353.5 295 L
368.6 295 L
383.7 295 L
391.25 295 L
406.35 295 L
421.45 295 L
436.55 295 L
451.65 295 L
466.75 295 L
481.85 295 L
496.95 295 L
512.05 295 L
523.375 295 L
538.475 295 L
553.575 295 L
568.675 295 L
580 295 L
580.71 295 L
580.71 295 L
595.81 295 L
610.91 295 L
626.01 295 L
641.11 295 L
655.5 295 L
670.6 295 L
685.7 295 L
693.25 295 L
694.64 295 L
694.64 295 L
709.74 295 L
724.84 295 L
739.94 295 L
755.04 295 L
770.14 295 L
785.24 295 L
787.625 295 L
799.552 295 L
806.5 295 L
821.6 295 L
836.7 295 L
851.8 295 L
866.9 295 L
882 295 L
S
GR
GS
[0.75 0 0 0.75 0 -0.25] CT
1 GC
N
779 223 M
779 59 L
869 59 L
869 223 L
cp
f
GR
GS
[0.75 0 0 0.75 612 55.25] CT
/Helvetica 12 F
GS
[1 0 0 1 0 0] CT
0 0 moveto 
1 -1 scale
(h) t 
GR
GR
GS
[0.75 0 0 0.75 618 59.75] CT
/Helvetica 9.6 F
GS
[1 0 0 1 0 0] CT
0 0 moveto 
1 -1 scale
(1) t 
GR
GR
GS
[0.75 0 0 0.75 0 -0.25] CT
0 0.447 0.741 RC
1 LJ
0.667 LW
N
783 71.538 M
813 71.538 L
S
GR
GS
[0.75 0 0 0.75 612 71] CT
/Helvetica 12 F
GS
[1 0 0 1 0 0] CT
0 0 moveto 
1 -1 scale
(h) t 
GR
GR
GS
[0.75 0 0 0.75 618 75.5] CT
/Helvetica 9.6 F
GS
[1 0 0 1 0 0] CT
0 0 moveto 
1 -1 scale
(2) t 
GR
GR
GS
[0.75 0 0 0.75 0 -0.25] CT
0.851 0.325 0.098 RC
1 LJ
0.667 LW
N
783 93.104 M
813 93.104 L
S
GR
GS
[0.75 0 0 0.75 612 87.5] CT
/Helvetica 12 F
GS
[1 0 0 1 0 0] CT
0 0 moveto 
1 -1 scale
(h) t 
GR
GR
GS
[0.75 0 0 0.75 618 92] CT
/Helvetica 9.6 F
GS
[1 0 0 1 0 0] CT
0 0 moveto 
1 -1 scale
(3) t 
GR
GR
GS
[0.75 0 0 0.75 0 -0.25] CT
0.929 0.694 0.125 RC
1 LJ
0.667 LW
N
783 114.67 M
813 114.67 L
S
GR
GS
[0.75 0 0 0.75 612 103.25] CT
/Helvetica 12 F
GS
[1 0 0 1 0 0] CT
0 0 moveto 
1 -1 scale
(h) t 
GR
GR
GS
[0.75 0 0 0.75 618 107.75] CT
/Helvetica 9.6 F
GS
[1 0 0 1 0 0] CT
0 0 moveto 
1 -1 scale
(4) t 
GR
GR
GS
[0.75 0 0 0.75 0 -0.25] CT
0.494 0.184 0.557 RC
1 LJ
0.667 LW
N
783 136.235 M
813 136.235 L
S
GR
GS
[0.75 0 0 0.75 612 115.84404] CT
/Helvetica 12 F
GS
[1 0 0 1 0 0] CT
0 4.5 moveto 
1 -1 scale
(sp2) t 
GR
GR
GS
[0.75 0 0 0.75 0 -0.25] CT
0.467 0.675 0.188 RC
1 LJ
0.667 LW
N
783 154.792 M
813 154.792 L
S
GR
GS
[0.75 0 0 0.75 612 127.50459] CT
/Helvetica 12 F
GS
[1 0 0 1 0 0] CT
0 4.5 moveto 
1 -1 scale
(sp1) t 
GR
GR
GS
[0.75 0 0 0.75 0 -0.25] CT
0.302 0.745 0.933 RC
1 LJ
0.667 LW
N
783 170.339 M
813 170.339 L
S
GR
GS
[0.75 0 0 0.75 612 143] CT
/Helvetica 12 F
GS
[1 0 0 1 0 0] CT
0 0 moveto 
1 -1 scale
(|u) t 
GR
GR
GS
[0.75 0 0 0.75 621 147.5] CT
/Helvetica 9.6 F
GS
[1 0 0 1 0 0] CT
0 0 moveto 
1 -1 scale
(1) t 
GR
GR
GS
[0.75 0 0 0.75 626.25 143] CT
/Helvetica 12 F
GS
[1 0 0 1 0 0] CT
0 0 moveto 
1 -1 scale
(| > 5) t 
GR
GR
GS
[0.75 0 0 0.75 0 -0.25] CT
0.635 0.078 0.184 RC
1 LJ
0.667 LW
N
783 188.896 M
813 188.896 L
S
GR
GS
[0.75 0 0 0.75 612 158.75] CT
/Helvetica 12 F
GS
[1 0 0 1 0 0] CT
0 0 moveto 
1 -1 scale
(|u) t 
GR
GR
GS
[0.75 0 0 0.75 621 163.25] CT
/Helvetica 9.6 F
GS
[1 0 0 1 0 0] CT
0 0 moveto 
1 -1 scale
(2) t 
GR
GR
GS
[0.75 0 0 0.75 626.25 158.75] CT
/Helvetica 12 F
GS
[1 0 0 1 0 0] CT
0 0 moveto 
1 -1 scale
(| > 5) t 
GR
GR
GS
[0.75 0 0 0.75 0 -0.25] CT
0 0.447 0.741 RC
1 LJ
0.667 LW
N
783 210.462 M
813 210.462 L
S
GR
GS
[0.75 0 0 0.75 0 -0.25] CT
0.149 GC
10.0 ML
0.667 LW
N
779 223 M
779 59 L
869 59 L
869 223 L
cp
S
GR
%%Trailer
%%Pages: 1
%%EOF
