%!PS-Adobe-3.0 EPSF-3.0
%%Creator: (MATLAB, The Mathworks, Inc. Version 9.1.0.441655 \(R2016b\). Operating System: Linux)
%%Title: /home/frdm/Documents/RLS/rls-2017/sp2/figures/f4_2.eps
%%CreationDate: 2017-11-14T03:13:04
%%Pages: (atend)
%%BoundingBox: 0 0 731 458
%%LanguageLevel: 3
%%EndComments
%%BeginProlog
%%BeginResource: procset (Apache XML Graphics Std ProcSet) 1.2 0
%%Version: 1.2 0
%%Copyright: (Copyright 2001-2003,2010 The Apache Software Foundation. License terms: http://www.apache.org/licenses/LICENSE-2.0)
/bd{bind def}bind def
/ld{load def}bd
/GR/grestore ld
/M/moveto ld
/LJ/setlinejoin ld
/C/curveto ld
/f/fill ld
/LW/setlinewidth ld
/GC/setgray ld
/t/show ld
/N/newpath ld
/CT/concat ld
/cp/closepath ld
/S/stroke ld
/L/lineto ld
/CC/setcmykcolor ld
/A/ashow ld
/GS/gsave ld
/RC/setrgbcolor ld
/RM/rmoveto ld
/ML/setmiterlimit ld
/re {4 2 roll M
1 index 0 rlineto
0 exch rlineto
neg 0 rlineto
cp } bd
/_ctm matrix def
/_tm matrix def
/BT { _ctm currentmatrix pop matrix _tm copy pop 0 0 moveto } bd
/ET { _ctm setmatrix } bd
/iTm { _ctm setmatrix _tm concat } bd
/Tm { _tm astore pop iTm 0 0 moveto } bd
/ux 0.0 def
/uy 0.0 def
/F {
  /Tp exch def
  /Tf exch def
  Tf findfont Tp scalefont setfont
  /cf Tf def  /cs Tp def
} bd
/ULS {currentpoint /uy exch def /ux exch def} bd
/ULE {
  /Tcx currentpoint pop def
  gsave
  newpath
  cf findfont cs scalefont dup
  /FontMatrix get 0 get /Ts exch def /FontInfo get dup
  /UnderlinePosition get Ts mul /To exch def
  /UnderlineThickness get Ts mul /Tt exch def
  ux uy To add moveto  Tcx uy To add lineto
  Tt setlinewidth stroke
  grestore
} bd
/OLE {
  /Tcx currentpoint pop def
  gsave
  newpath
  cf findfont cs scalefont dup
  /FontMatrix get 0 get /Ts exch def /FontInfo get dup
  /UnderlinePosition get Ts mul /To exch def
  /UnderlineThickness get Ts mul /Tt exch def
  ux uy To add cs add moveto Tcx uy To add cs add lineto
  Tt setlinewidth stroke
  grestore
} bd
/SOE {
  /Tcx currentpoint pop def
  gsave
  newpath
  cf findfont cs scalefont dup
  /FontMatrix get 0 get /Ts exch def /FontInfo get dup
  /UnderlinePosition get Ts mul /To exch def
  /UnderlineThickness get Ts mul /Tt exch def
  ux uy To add cs 10 mul 26 idiv add moveto Tcx uy To add cs 10 mul 26 idiv add lineto
  Tt setlinewidth stroke
  grestore
} bd
/QT {
/Y22 exch store
/X22 exch store
/Y21 exch store
/X21 exch store
currentpoint
/Y21 load 2 mul add 3 div exch
/X21 load 2 mul add 3 div exch
/X21 load 2 mul /X22 load add 3 div
/Y21 load 2 mul /Y22 load add 3 div
/X22 load /Y22 load curveto
} bd
/SSPD {
dup length /d exch dict def
{
/v exch def
/k exch def
currentpagedevice k known {
/cpdv currentpagedevice k get def
v cpdv ne {
/upd false def
/nullv v type /nulltype eq def
/nullcpdv cpdv type /nulltype eq def
nullv nullcpdv or
{
/upd true def
} {
/sametype v type cpdv type eq def
sametype {
v type /arraytype eq {
/vlen v length def
/cpdvlen cpdv length def
vlen cpdvlen eq {
0 1 vlen 1 sub {
/i exch def
/obj v i get def
/cpdobj cpdv i get def
obj cpdobj ne {
/upd true def
exit
} if
} for
} {
/upd true def
} ifelse
} {
v type /dicttype eq {
v {
/dv exch def
/dk exch def
/cpddv cpdv dk get def
dv cpddv ne {
/upd true def
exit
} if
} forall
} {
/upd true def
} ifelse
} ifelse
} if
} ifelse
upd true eq {
d k v put
} if
} if
} if
} forall
d length 0 gt {
d setpagedevice
} if
} bd
/RE { % /NewFontName [NewEncodingArray] /FontName RE -
  findfont dup length dict begin
  {
    1 index /FID ne
    {def} {pop pop} ifelse
  } forall
  /Encoding exch def
  /FontName 1 index def
  currentdict definefont pop
  end
} bind def
%%EndResource
%%BeginResource: procset (Apache XML Graphics EPS ProcSet) 1.0 0
%%Version: 1.0 0
%%Copyright: (Copyright 2002-2003 The Apache Software Foundation. License terms: http://www.apache.org/licenses/LICENSE-2.0)
/BeginEPSF { %def
/b4_Inc_state save def         % Save state for cleanup
/dict_count countdictstack def % Count objects on dict stack
/op_count count 1 sub def      % Count objects on operand stack
userdict begin                 % Push userdict on dict stack
/showpage { } def              % Redefine showpage, { } = null proc
0 setgray 0 setlinecap         % Prepare graphics state
1 setlinewidth 0 setlinejoin
10 setmiterlimit [ ] 0 setdash newpath
/languagelevel where           % If level not equal to 1 then
{pop languagelevel             % set strokeadjust and
1 ne                           % overprint to their defaults.
{false setstrokeadjust false setoverprint
} if
} if
} bd
/EndEPSF { %def
count op_count sub {pop} repeat            % Clean up stacks
countdictstack dict_count sub {end} repeat
b4_Inc_state restore
} bd
%%EndResource
%FOPBeginFontDict
%%IncludeResource: font Courier-Bold
%%IncludeResource: font Helvetica
%%IncludeResource: font Courier-BoldOblique
%%IncludeResource: font Courier-Oblique
%%IncludeResource: font Times-Roman
%%IncludeResource: font Helvetica-BoldOblique
%%IncludeResource: font Helvetica-Bold
%%IncludeResource: font Helvetica-Oblique
%%IncludeResource: font Times-BoldItalic
%%IncludeResource: font Courier
%%IncludeResource: font Times-Italic
%%IncludeResource: font Times-Bold
%%IncludeResource: font Symbol
%%IncludeResource: font ZapfDingbats
%FOPEndFontDict
%%BeginResource: encoding WinAnsiEncoding
/WinAnsiEncoding [
/.notdef /.notdef /.notdef /.notdef /.notdef
/.notdef /.notdef /.notdef /.notdef /.notdef
/.notdef /.notdef /.notdef /.notdef /.notdef
/.notdef /.notdef /.notdef /.notdef /.notdef
/.notdef /.notdef /.notdef /.notdef /.notdef
/.notdef /.notdef /.notdef /.notdef /.notdef
/.notdef /.notdef /space /exclam /quotedbl
/numbersign /dollar /percent /ampersand /quotesingle
/parenleft /parenright /asterisk /plus /comma
/hyphen /period /slash /zero /one
/two /three /four /five /six
/seven /eight /nine /colon /semicolon
/less /equal /greater /question /at
/A /B /C /D /E
/F /G /H /I /J
/K /L /M /N /O
/P /Q /R /S /T
/U /V /W /X /Y
/Z /bracketleft /backslash /bracketright /asciicircum
/underscore /quoteleft /a /b /c
/d /e /f /g /h
/i /j /k /l /m
/n /o /p /q /r
/s /t /u /v /w
/x /y /z /braceleft /bar
/braceright /asciitilde /bullet /Euro /bullet
/quotesinglbase /florin /quotedblbase /ellipsis /dagger
/daggerdbl /circumflex /perthousand /Scaron /guilsinglleft
/OE /bullet /Zcaron /bullet /bullet
/quoteleft /quoteright /quotedblleft /quotedblright /bullet
/endash /emdash /asciitilde /trademark /scaron
/guilsinglright /oe /bullet /zcaron /Ydieresis
/space /exclamdown /cent /sterling /currency
/yen /brokenbar /section /dieresis /copyright
/ordfeminine /guillemotleft /logicalnot /sfthyphen /registered
/macron /degree /plusminus /twosuperior /threesuperior
/acute /mu /paragraph /middot /cedilla
/onesuperior /ordmasculine /guillemotright /onequarter /onehalf
/threequarters /questiondown /Agrave /Aacute /Acircumflex
/Atilde /Adieresis /Aring /AE /Ccedilla
/Egrave /Eacute /Ecircumflex /Edieresis /Igrave
/Iacute /Icircumflex /Idieresis /Eth /Ntilde
/Ograve /Oacute /Ocircumflex /Otilde /Odieresis
/multiply /Oslash /Ugrave /Uacute /Ucircumflex
/Udieresis /Yacute /Thorn /germandbls /agrave
/aacute /acircumflex /atilde /adieresis /aring
/ae /ccedilla /egrave /eacute /ecircumflex
/edieresis /igrave /iacute /icircumflex /idieresis
/eth /ntilde /ograve /oacute /ocircumflex
/otilde /odieresis /divide /oslash /ugrave
/uacute /ucircumflex /udieresis /yacute /thorn
/ydieresis
] def
%%EndResource
%FOPBeginFontReencode
/Courier-Bold findfont
dup length dict begin
  {1 index /FID ne {def} {pop pop} ifelse} forall
  /Encoding WinAnsiEncoding def
  currentdict
end
/Courier-Bold exch definefont pop
/Helvetica findfont
dup length dict begin
  {1 index /FID ne {def} {pop pop} ifelse} forall
  /Encoding WinAnsiEncoding def
  currentdict
end
/Helvetica exch definefont pop
/Courier-BoldOblique findfont
dup length dict begin
  {1 index /FID ne {def} {pop pop} ifelse} forall
  /Encoding WinAnsiEncoding def
  currentdict
end
/Courier-BoldOblique exch definefont pop
/Courier-Oblique findfont
dup length dict begin
  {1 index /FID ne {def} {pop pop} ifelse} forall
  /Encoding WinAnsiEncoding def
  currentdict
end
/Courier-Oblique exch definefont pop
/Times-Roman findfont
dup length dict begin
  {1 index /FID ne {def} {pop pop} ifelse} forall
  /Encoding WinAnsiEncoding def
  currentdict
end
/Times-Roman exch definefont pop
/Helvetica-BoldOblique findfont
dup length dict begin
  {1 index /FID ne {def} {pop pop} ifelse} forall
  /Encoding WinAnsiEncoding def
  currentdict
end
/Helvetica-BoldOblique exch definefont pop
/Helvetica-Bold findfont
dup length dict begin
  {1 index /FID ne {def} {pop pop} ifelse} forall
  /Encoding WinAnsiEncoding def
  currentdict
end
/Helvetica-Bold exch definefont pop
/Helvetica-Oblique findfont
dup length dict begin
  {1 index /FID ne {def} {pop pop} ifelse} forall
  /Encoding WinAnsiEncoding def
  currentdict
end
/Helvetica-Oblique exch definefont pop
/Times-BoldItalic findfont
dup length dict begin
  {1 index /FID ne {def} {pop pop} ifelse} forall
  /Encoding WinAnsiEncoding def
  currentdict
end
/Times-BoldItalic exch definefont pop
/Courier findfont
dup length dict begin
  {1 index /FID ne {def} {pop pop} ifelse} forall
  /Encoding WinAnsiEncoding def
  currentdict
end
/Courier exch definefont pop
/Times-Italic findfont
dup length dict begin
  {1 index /FID ne {def} {pop pop} ifelse} forall
  /Encoding WinAnsiEncoding def
  currentdict
end
/Times-Italic exch definefont pop
/Times-Bold findfont
dup length dict begin
  {1 index /FID ne {def} {pop pop} ifelse} forall
  /Encoding WinAnsiEncoding def
  currentdict
end
/Times-Bold exch definefont pop
%FOPEndFontReencode
%%EndProlog
%%Page: 1 1
%%PageBoundingBox: 0 0 731 458
%%BeginPageSetup
[1 0 0 -1 0 458] CT
%%EndPageSetup
GS
[0.75 0 0 0.75 0 -0.25] CT
1 GC
N
0 0 975 611 re
f
GR
GS
[0.75 0 0 0.75 0 -0.25] CT
1 GC
N
0 0 975 611 re
f
GR
GS
[0.75 0 0 0.75 0 -0.25] CT
1 GC
N
127 544 M
882 544 L
882 46 L
127 46 L
cp
f
GR
GS
[0.75 0 0 0.75 0 -0.25] CT
0.149 GC
2 setlinecap
1 LJ
0.667 LW
N
127 544 M
882 544 L
S
GR
GS
[0.75 0 0 0.75 0 -0.25] CT
0.149 GC
2 setlinecap
1 LJ
0.667 LW
N
127 46 M
882 46 L
S
GR
GS
[0.75 0 0 0.75 0 -0.25] CT
0.149 GC
2 setlinecap
1 LJ
0.667 LW
N
127 544 M
127 536.45 L
S
GR
GS
[0.75 0 0 0.75 0 -0.25] CT
0.149 GC
2 setlinecap
1 LJ
0.667 LW
N
210.889 544 M
210.889 536.45 L
S
GR
GS
[0.75 0 0 0.75 0 -0.25] CT
0.149 GC
2 setlinecap
1 LJ
0.667 LW
N
294.778 544 M
294.778 536.45 L
S
GR
GS
[0.75 0 0 0.75 0 -0.25] CT
0.149 GC
2 setlinecap
1 LJ
0.667 LW
N
378.667 544 M
378.667 536.45 L
S
GR
GS
[0.75 0 0 0.75 0 -0.25] CT
0.149 GC
2 setlinecap
1 LJ
0.667 LW
N
462.556 544 M
462.556 536.45 L
S
GR
GS
[0.75 0 0 0.75 0 -0.25] CT
0.149 GC
2 setlinecap
1 LJ
0.667 LW
N
546.444 544 M
546.444 536.45 L
S
GR
GS
[0.75 0 0 0.75 0 -0.25] CT
0.149 GC
2 setlinecap
1 LJ
0.667 LW
N
630.333 544 M
630.333 536.45 L
S
GR
GS
[0.75 0 0 0.75 0 -0.25] CT
0.149 GC
2 setlinecap
1 LJ
0.667 LW
N
714.222 544 M
714.222 536.45 L
S
GR
GS
[0.75 0 0 0.75 0 -0.25] CT
0.149 GC
2 setlinecap
1 LJ
0.667 LW
N
798.111 544 M
798.111 536.45 L
S
GR
GS
[0.75 0 0 0.75 0 -0.25] CT
0.149 GC
2 setlinecap
1 LJ
0.667 LW
N
882 544 M
882 536.45 L
S
GR
GS
[0.75 0 0 0.75 0 -0.25] CT
0.149 GC
2 setlinecap
1 LJ
0.667 LW
N
127 46 M
127 53.55 L
S
GR
GS
[0.75 0 0 0.75 0 -0.25] CT
0.149 GC
2 setlinecap
1 LJ
0.667 LW
N
210.889 46 M
210.889 53.55 L
S
GR
GS
[0.75 0 0 0.75 0 -0.25] CT
0.149 GC
2 setlinecap
1 LJ
0.667 LW
N
294.778 46 M
294.778 53.55 L
S
GR
GS
[0.75 0 0 0.75 0 -0.25] CT
0.149 GC
2 setlinecap
1 LJ
0.667 LW
N
378.667 46 M
378.667 53.55 L
S
GR
GS
[0.75 0 0 0.75 0 -0.25] CT
0.149 GC
2 setlinecap
1 LJ
0.667 LW
N
462.556 46 M
462.556 53.55 L
S
GR
GS
[0.75 0 0 0.75 0 -0.25] CT
0.149 GC
2 setlinecap
1 LJ
0.667 LW
N
546.444 46 M
546.444 53.55 L
S
GR
GS
[0.75 0 0 0.75 0 -0.25] CT
0.149 GC
2 setlinecap
1 LJ
0.667 LW
N
630.333 46 M
630.333 53.55 L
S
GR
GS
[0.75 0 0 0.75 0 -0.25] CT
0.149 GC
2 setlinecap
1 LJ
0.667 LW
N
714.222 46 M
714.222 53.55 L
S
GR
GS
[0.75 0 0 0.75 0 -0.25] CT
0.149 GC
2 setlinecap
1 LJ
0.667 LW
N
798.111 46 M
798.111 53.55 L
S
GR
GS
[0.75 0 0 0.75 0 -0.25] CT
0.149 GC
2 setlinecap
1 LJ
0.667 LW
N
882 46 M
882 53.55 L
S
GR
GS
[0.75 0 0 0.75 95.25 411.74998] CT
0.149 GC
/Helvetica 13.333 F
GS
[1 0 0 1 0 0] CT
-4.5 13 moveto 
1 -1 scale
(0) t 
GR
GR
GS
[0.75 0 0 0.75 158.16666 411.74998] CT
0.149 GC
/Helvetica 13.333 F
GS
[1 0 0 1 0 0] CT
-8.5 13 moveto 
1 -1 scale
(50) t 
GR
GR
GS
[0.75 0 0 0.75 221.08333 411.74998] CT
0.149 GC
/Helvetica 13.333 F
GS
[1 0 0 1 0 0] CT
-12.5 13 moveto 
1 -1 scale
(100) t 
GR
GR
GS
[0.75 0 0 0.75 283.99999 411.74998] CT
0.149 GC
/Helvetica 13.333 F
GS
[1 0 0 1 0 0] CT
-12.5 13 moveto 
1 -1 scale
(150) t 
GR
GR
GS
[0.75 0 0 0.75 346.91666 411.74998] CT
0.149 GC
/Helvetica 13.333 F
GS
[1 0 0 1 0 0] CT
-12.5 13 moveto 
1 -1 scale
(200) t 
GR
GR
GS
[0.75 0 0 0.75 409.83334 411.74998] CT
0.149 GC
/Helvetica 13.333 F
GS
[1 0 0 1 0 0] CT
-12.5 13 moveto 
1 -1 scale
(250) t 
GR
GR
GS
[0.75 0 0 0.75 472.74998 411.74998] CT
0.149 GC
/Helvetica 13.333 F
GS
[1 0 0 1 0 0] CT
-12.5 13 moveto 
1 -1 scale
(300) t 
GR
GR
GS
[0.75 0 0 0.75 535.66667 411.74998] CT
0.149 GC
/Helvetica 13.333 F
GS
[1 0 0 1 0 0] CT
-12.5 13 moveto 
1 -1 scale
(350) t 
GR
GR
GS
[0.75 0 0 0.75 598.58331 411.74998] CT
0.149 GC
/Helvetica 13.333 F
GS
[1 0 0 1 0 0] CT
-12.5 13 moveto 
1 -1 scale
(400) t 
GR
GR
GS
[0.75 0 0 0.75 661.5 411.74998] CT
0.149 GC
/Helvetica 13.333 F
GS
[1 0 0 1 0 0] CT
-12.5 13 moveto 
1 -1 scale
(450) t 
GR
GR
GS
[0.75 0 0 0.75 378.37527 425.50002] CT
0.149 GC
/Helvetica 14.667 F
GS
[1 0 0 1 0 0] CT
-57.5 14 moveto 
1 -1 scale
(Time \(seconds\)) t 
GR
GR
GS
[0.75 0 0 0.75 0 -0.25] CT
0.149 GC
2 setlinecap
1 LJ
0.667 LW
N
127 544 M
127 46 L
S
GR
GS
[0.75 0 0 0.75 0 -0.25] CT
0.149 GC
2 setlinecap
1 LJ
0.667 LW
N
882 544 M
882 46 L
S
GR
GS
[0.75 0 0 0.75 0 -0.25] CT
0.149 GC
2 setlinecap
1 LJ
0.667 LW
N
127 544 M
134.55 544 L
S
GR
GS
[0.75 0 0 0.75 0 -0.25] CT
0.149 GC
2 setlinecap
1 LJ
0.667 LW
N
127 488.667 M
134.55 488.667 L
S
GR
GS
[0.75 0 0 0.75 0 -0.25] CT
0.149 GC
2 setlinecap
1 LJ
0.667 LW
N
127 433.333 M
134.55 433.333 L
S
GR
GS
[0.75 0 0 0.75 0 -0.25] CT
0.149 GC
2 setlinecap
1 LJ
0.667 LW
N
127 378 M
134.55 378 L
S
GR
GS
[0.75 0 0 0.75 0 -0.25] CT
0.149 GC
2 setlinecap
1 LJ
0.667 LW
N
127 322.667 M
134.55 322.667 L
S
GR
GS
[0.75 0 0 0.75 0 -0.25] CT
0.149 GC
2 setlinecap
1 LJ
0.667 LW
N
127 267.333 M
134.55 267.333 L
S
GR
GS
[0.75 0 0 0.75 0 -0.25] CT
0.149 GC
2 setlinecap
1 LJ
0.667 LW
N
127 212 M
134.55 212 L
S
GR
GS
[0.75 0 0 0.75 0 -0.25] CT
0.149 GC
2 setlinecap
1 LJ
0.667 LW
N
127 156.667 M
134.55 156.667 L
S
GR
GS
[0.75 0 0 0.75 0 -0.25] CT
0.149 GC
2 setlinecap
1 LJ
0.667 LW
N
127 101.333 M
134.55 101.333 L
S
GR
GS
[0.75 0 0 0.75 0 -0.25] CT
0.149 GC
2 setlinecap
1 LJ
0.667 LW
N
127 46 M
134.55 46 L
S
GR
GS
[0.75 0 0 0.75 0 -0.25] CT
0.149 GC
2 setlinecap
1 LJ
0.667 LW
N
882 544 M
874.45 544 L
S
GR
GS
[0.75 0 0 0.75 0 -0.25] CT
0.149 GC
2 setlinecap
1 LJ
0.667 LW
N
882 488.667 M
874.45 488.667 L
S
GR
GS
[0.75 0 0 0.75 0 -0.25] CT
0.149 GC
2 setlinecap
1 LJ
0.667 LW
N
882 433.333 M
874.45 433.333 L
S
GR
GS
[0.75 0 0 0.75 0 -0.25] CT
0.149 GC
2 setlinecap
1 LJ
0.667 LW
N
882 378 M
874.45 378 L
S
GR
GS
[0.75 0 0 0.75 0 -0.25] CT
0.149 GC
2 setlinecap
1 LJ
0.667 LW
N
882 322.667 M
874.45 322.667 L
S
GR
GS
[0.75 0 0 0.75 0 -0.25] CT
0.149 GC
2 setlinecap
1 LJ
0.667 LW
N
882 267.333 M
874.45 267.333 L
S
GR
GS
[0.75 0 0 0.75 0 -0.25] CT
0.149 GC
2 setlinecap
1 LJ
0.667 LW
N
882 212 M
874.45 212 L
S
GR
GS
[0.75 0 0 0.75 0 -0.25] CT
0.149 GC
2 setlinecap
1 LJ
0.667 LW
N
882 156.667 M
874.45 156.667 L
S
GR
GS
[0.75 0 0 0.75 0 -0.25] CT
0.149 GC
2 setlinecap
1 LJ
0.667 LW
N
882 101.333 M
874.45 101.333 L
S
GR
GS
[0.75 0 0 0.75 0 -0.25] CT
0.149 GC
2 setlinecap
1 LJ
0.667 LW
N
882 46 M
874.45 46 L
S
GR
GS
[0.75 0 0 0.75 91.25 407.75] CT
0.149 GC
/Helvetica 13.333 F
GS
[1 0 0 1 0 0] CT
-26 4.5 moveto 
1 -1 scale
(-0.2) t 
GR
GR
GS
[0.75 0 0 0.75 91.25 366.24999] CT
0.149 GC
/Helvetica 13.333 F
GS
[1 0 0 1 0 0] CT
-9 4.5 moveto 
1 -1 scale
(0) t 
GR
GR
GS
[0.75 0 0 0.75 91.25 324.75001] CT
0.149 GC
/Helvetica 13.333 F
GS
[1 0 0 1 0 0] CT
-21 4.5 moveto 
1 -1 scale
(0.2) t 
GR
GR
GS
[0.75 0 0 0.75 91.25 283.25] CT
0.149 GC
/Helvetica 13.333 F
GS
[1 0 0 1 0 0] CT
-21 4.5 moveto 
1 -1 scale
(0.4) t 
GR
GR
GS
[0.75 0 0 0.75 91.25 241.74999] CT
0.149 GC
/Helvetica 13.333 F
GS
[1 0 0 1 0 0] CT
-21 4.5 moveto 
1 -1 scale
(0.6) t 
GR
GR
GS
[0.75 0 0 0.75 91.25 200.25001] CT
0.149 GC
/Helvetica 13.333 F
GS
[1 0 0 1 0 0] CT
-21 4.5 moveto 
1 -1 scale
(0.8) t 
GR
GR
GS
[0.75 0 0 0.75 91.25 158.75] CT
0.149 GC
/Helvetica 13.333 F
GS
[1 0 0 1 0 0] CT
-9 4.5 moveto 
1 -1 scale
(1) t 
GR
GR
GS
[0.75 0 0 0.75 91.25 117.24999] CT
0.149 GC
/Helvetica 13.333 F
GS
[1 0 0 1 0 0] CT
-21 4.5 moveto 
1 -1 scale
(1.2) t 
GR
GR
GS
[0.75 0 0 0.75 91.25 75.75001] CT
0.149 GC
/Helvetica 13.333 F
GS
[1 0 0 1 0 0] CT
-21 4.5 moveto 
1 -1 scale
(1.4) t 
GR
GR
GS
[0.75 0 0 0.75 91.25 34.24999] CT
0.149 GC
/Helvetica 13.333 F
GS
[1 0 0 1 0 0] CT
-21 4.5 moveto 
1 -1 scale
(1.6) t 
GR
GR
GS
[0.75 0 0 0.75 378.37537 32.18749] CT
/Helvetica-Bold 14.667 F
GS
[1 0 0 1 0 0] CT
-172.5 -4 moveto 
1 -1 scale
(Rekonstrukce stavu s v\375stupn\355 poruchou) t 
GR
GR
GS
[0.75 0 0 0.75 0 -0.25] CT
0 0.447 0.741 RC
1 LJ
0.667 LW
N
127 461 M
127.003 460.994 L
127.02 460.962 L
127.105 460.804 L
127.526 460.067 L
129.633 457.494 L
133.083 456.054 L
137.345 456.863 L
142.281 459.424 L
148.121 463.287 L
148.811 463.765 L
148.811 463.765 L
148.811 463.765 L
151.749 465.985 L
154.688 467.381 L
158.201 466.515 L
162.197 462.045 L
165.589 455.897 L
165.589 455.897 L
165.589 455.897 L
168.566 446.549 L
171.544 433.817 L
174.958 418.359 L
178.996 401.07 L
183.664 383.435 L
189.292 365.445 L
196.384 346.69 L
205.59 326.676 L
210.889 316.669 L
210.889 316.669 L
215.767 308.304 L
220.645 301.725 L
226.693 296.407 L
233.535 293.3 L
241.577 291.941 L
251.262 291.672 L
263.404 291.69 L
278.169 291.22 L
292.933 290.086 L
294.778 289.907 L
294.778 289.907 L
294.778 289.907 L
299.655 288.8 L
304.532 287.4 L
311.28 285.863 L
319.384 284.622 L
330.108 283.439 L
344.872 281.994 L
359.636 280.542 L
374.401 279.1 L
389.165 277.714 L
403.93 276.416 L
418.694 275.226 L
433.459 274.152 L
448.223 273.194 L
462.987 272.349 L
477.752 271.609 L
492.516 270.965 L
507.281 270.409 L
522.045 269.931 L
536.81 269.522 L
551.574 269.173 L
566.339 268.877 L
581.103 268.626 L
595.867 268.413 L
610.632 268.235 L
625.396 268.084 L
640.161 267.958 L
654.925 267.853 L
669.69 267.765 L
684.454 267.691 L
699.219 267.63 L
713.983 267.578 L
728.747 267.536 L
743.512 267.501 L
758.276 267.472 L
773.041 267.447 L
787.805 267.427 L
802.57 267.411 L
817.334 267.397 L
832.099 267.386 L
846.863 267.376 L
861.628 267.369 L
865.222 267.367 L
S
GR
GS
[0.75 0 0 0.75 0 -0.25] CT
0.851 0.325 0.098 RC
1 LJ
0.667 LW
N
127 461 M
127.003 460.996 L
127.02 460.977 L
127.105 460.88 L
127.526 460.416 L
129.633 458.582 L
133.083 457.122 L
137.345 457.35 L
142.281 459.42 L
148.121 463.138 L
148.811 463.62 L
148.811 463.62 L
148.811 463.62 L
151.749 464.571 L
154.688 464.26 L
158.201 463.502 L
162.197 462.982 L
165.589 463.074 L
165.589 463.074 L
165.589 463.074 L
168.566 463.844 L
171.544 464.21 L
174.958 462.342 L
178.996 456.409 L
183.664 445.226 L
189.292 427.61 L
196.384 402.349 L
205.59 368.917 L
210.889 350.531 L
210.889 350.531 L
215.767 335.142 L
220.645 321.365 L
226.693 305.491 L
233.535 288.484 L
241.577 269.605 L
251.262 248.679 L
263.404 225.541 L
278.169 201.954 L
292.933 182.758 L
294.778 180.63 L
294.778 180.63 L
294.778 180.63 L
299.655 175.325 L
304.532 169.912 L
311.28 161.959 L
319.384 152.273 L
330.108 140.308 L
344.872 126.328 L
359.636 115.169 L
374.401 106.348 L
389.165 99.39 L
403.93 93.906 L
418.694 89.584 L
433.459 86.18 L
448.223 83.499 L
462.987 81.39 L
477.752 79.73 L
492.516 78.424 L
507.281 77.398 L
522.045 76.591 L
536.81 75.958 L
551.574 75.461 L
566.339 75.07 L
581.103 74.764 L
595.867 74.524 L
610.632 74.336 L
625.396 74.189 L
640.161 74.074 L
654.925 73.984 L
669.69 73.914 L
684.454 73.859 L
699.219 73.816 L
713.983 73.782 L
728.747 73.756 L
743.512 73.736 L
758.276 73.72 L
773.041 73.708 L
787.805 73.699 L
802.57 73.691 L
817.334 73.685 L
832.099 73.681 L
846.863 73.678 L
861.628 73.675 L
865.222 73.675 L
S
GR
GS
[0.75 0 0 0.75 0 -0.25] CT
0.929 0.694 0.125 RC
1 LJ
0.667 LW
N
127 461 M
127.003 461.018 L
127.02 461.107 L
127.105 461.55 L
127.526 463.658 L
129.633 471.97 L
133.083 480.165 L
137.345 485.422 L
142.281 488.486 L
148.121 490.303 L
148.811 490.445 L
148.811 490.445 L
148.811 490.445 L
151.749 484.973 L
154.688 473.447 L
158.201 458.823 L
162.197 444.974 L
165.589 436.298 L
165.589 436.298 L
165.589 436.298 L
168.566 434.798 L
171.544 440.48 L
174.958 449.578 L
178.996 459.797 L
183.664 468.896 L
189.292 475.979 L
196.384 480.664 L
205.59 483.025 L
210.889 483.499 L
210.889 483.499 L
215.767 487.185 L
220.645 493.338 L
226.693 499.865 L
233.535 504.395 L
241.577 506.609 L
251.262 506.793 L
263.404 505.565 L
278.169 503.707 L
292.933 502.092 L
294.778 501.914 L
294.778 501.914 L
294.778 501.914 L
299.655 502.657 L
304.532 503.981 L
311.28 505.095 L
319.384 505.333 L
330.108 504.808 L
344.872 503.787 L
359.636 502.9 L
374.401 502.204 L
389.165 501.668 L
403.93 501.258 L
418.694 500.946 L
433.459 500.708 L
448.223 500.528 L
462.987 500.392 L
477.752 500.289 L
492.516 500.212 L
507.281 500.155 L
522.045 500.112 L
536.81 500.081 L
551.574 500.058 L
566.339 500.041 L
581.103 500.029 L
595.867 500.021 L
610.632 500.015 L
625.396 500.011 L
640.161 500.009 L
654.925 500.007 L
669.69 500.006 L
684.454 500.006 L
699.219 500.006 L
713.983 500.006 L
728.747 500.007 L
743.512 500.007 L
758.276 500.007 L
773.041 500.008 L
787.805 500.008 L
802.57 500.008 L
817.334 500.009 L
832.099 500.009 L
846.863 500.009 L
861.628 500.01 L
865.222 500.01 L
S
GR
GS
[0.75 0 0 0.75 0 -0.25] CT
0.494 0.184 0.557 RC
1 LJ
0.667 LW
N
127 461 M
127.003 461.012 L
127.02 461.071 L
127.105 461.367 L
127.526 462.829 L
129.633 469.625 L
133.083 478.742 L
137.345 486.678 L
142.281 492.175 L
148.121 495.262 L
148.811 495.461 L
148.811 495.461 L
148.811 495.461 L
151.749 498.26 L
154.688 504.244 L
158.201 512.478 L
162.197 521.015 L
165.589 526.808 L
165.589 526.808 L
165.589 526.808 L
168.566 521.057 L
171.544 504.058 L
174.958 481.036 L
178.996 456.091 L
183.664 433.934 L
189.292 416.622 L
196.384 405.357 L
205.59 400.374 L
210.889 399.88 L
210.889 399.88 L
215.767 398.964 L
220.645 396.766 L
226.693 393.795 L
233.535 391.436 L
241.577 390.432 L
251.262 391.043 L
263.404 393.07 L
278.169 395.85 L
292.933 398.297 L
294.778 398.57 L
294.778 398.57 L
294.778 398.57 L
299.655 396.923 L
304.532 393.92 L
311.28 391.03 L
319.384 389.892 L
330.108 390.467 L
344.872 392.288 L
359.636 394.022 L
374.401 395.428 L
389.165 396.538 L
403.93 397.408 L
418.694 398.09 L
433.459 398.623 L
448.223 399.04 L
462.987 399.366 L
477.752 399.62 L
492.516 399.819 L
507.281 399.974 L
522.045 400.094 L
536.81 400.188 L
551.574 400.261 L
566.339 400.318 L
581.103 400.362 L
595.867 400.396 L
610.632 400.422 L
625.396 400.443 L
640.161 400.458 L
654.925 400.471 L
669.69 400.48 L
684.454 400.487 L
699.219 400.493 L
713.983 400.497 L
728.747 400.5 L
743.512 400.502 L
758.276 400.504 L
773.041 400.506 L
787.805 400.507 L
802.57 400.507 L
817.334 400.508 L
832.099 400.508 L
846.863 400.509 L
861.628 400.509 L
865.222 400.509 L
S
GR
GS
[0.75 0 0 0.75 0 -0.25] CT
0.467 0.675 0.188 RC
1 LJ
0.667 LW
N
127 488.667 M
127.003 488.672 L
127.02 488.701 L
127.105 488.846 L
127.526 489.562 L
129.633 492.957 L
133.083 497.644 L
137.345 501.904 L
142.281 505.178 L
148.121 507.578 L
148.811 507.792 L
148.811 507.792 L
148.811 507.792 L
151.749 508.757 L
154.688 508.759 L
158.201 506.13 L
162.197 499.618 L
165.589 491.75 L
165.589 491.75 L
165.589 491.75 L
168.566 480.924 L
171.544 466.754 L
174.958 449.705 L
178.996 430.616 L
183.664 411.016 L
189.292 390.82 L
196.384 369.528 L
205.59 346.59 L
210.889 335.072 L
210.889 335.072 L
215.767 343.483 L
220.645 344.274 L
226.693 341.465 L
233.535 337.152 L
241.577 332.361 L
251.262 327.34 L
263.404 321.775 L
278.169 315.57 L
292.933 309.8 L
294.778 309.109 L
294.778 309.109 L
294.778 309.109 L
299.655 306.715 L
304.532 304.118 L
311.28 301.063 L
319.384 298.187 L
330.108 295.124 L
344.872 291.536 L
359.636 288.365 L
374.401 285.543 L
389.165 283.048 L
403.93 280.862 L
418.694 278.958 L
433.459 277.312 L
448.223 275.895 L
462.987 274.68 L
477.752 273.645 L
492.516 272.764 L
507.281 272.017 L
522.045 271.386 L
536.81 270.854 L
551.574 270.407 L
566.339 270.031 L
581.103 269.717 L
595.867 269.454 L
610.632 269.234 L
625.396 269.051 L
640.161 268.899 L
654.925 268.772 L
669.69 268.667 L
684.454 268.58 L
699.219 268.507 L
713.983 268.448 L
728.747 268.398 L
743.512 268.357 L
758.276 268.323 L
773.041 268.296 L
787.805 268.273 L
802.57 268.254 L
817.334 268.238 L
832.099 268.225 L
846.863 268.215 L
861.628 268.206 L
865.222 268.204 L
S
GR
GS
[0.75 0 0 0.75 0 -0.25] CT
0.302 0.745 0.933 RC
1 LJ
0.667 LW
N
127 488.667 M
127.003 488.664 L
127.02 488.652 L
127.105 488.59 L
127.526 488.29 L
129.633 486.978 L
133.083 485.585 L
137.345 485.095 L
142.281 485.802 L
148.121 487.641 L
148.811 487.896 L
148.811 487.896 L
148.811 487.896 L
151.749 487.883 L
154.688 486.622 L
158.201 484.76 L
162.197 483.035 L
165.589 482.15 L
165.589 482.15 L
165.589 482.15 L
168.566 482.098 L
171.544 481.676 L
174.958 478.945 L
178.996 472.044 L
183.664 459.812 L
189.292 441.023 L
196.384 414.417 L
205.59 379.439 L
210.889 360.254 L
210.889 360.254 L
215.767 344.183 L
220.645 329.772 L
226.693 313.174 L
233.535 295.422 L
241.577 275.76 L
251.262 254.006 L
263.404 229.986 L
278.169 205.522 L
292.933 185.621 L
294.778 183.416 L
294.778 183.416 L
294.778 183.416 L
299.655 180.589 L
304.532 176.519 L
311.28 169.566 L
319.384 160.541 L
330.108 149.133 L
344.872 135.711 L
359.636 124.988 L
374.401 116.515 L
389.165 109.836 L
403.93 104.575 L
418.694 100.432 L
433.459 97.172 L
448.223 94.607 L
462.987 92.59 L
477.752 91.005 L
492.516 89.759 L
507.281 88.781 L
522.045 88.012 L
536.81 87.41 L
551.574 86.937 L
566.339 86.567 L
581.103 86.277 L
595.867 86.05 L
610.632 85.872 L
625.396 85.733 L
640.161 85.624 L
654.925 85.54 L
669.69 85.474 L
684.454 85.422 L
699.219 85.382 L
713.983 85.351 L
728.747 85.326 L
743.512 85.308 L
758.276 85.293 L
773.041 85.282 L
787.805 85.273 L
802.57 85.266 L
817.334 85.261 L
832.099 85.257 L
846.863 85.254 L
861.628 85.251 L
865.222 85.251 L
S
GR
GS
[0.75 0 0 0.75 0 -0.25] CT
0.635 0.078 0.184 RC
1 LJ
0.667 LW
N
127 488.667 M
127.003 488.653 L
127.02 488.582 L
127.105 488.23 L
127.526 486.499 L
129.633 478.592 L
133.083 468.631 L
137.345 461.045 L
142.281 457.029 L
148.121 456.167 L
148.811 456.233 L
148.811 456.233 L
148.811 456.233 L
151.749 450.802 L
154.688 439.754 L
158.201 426.062 L
162.197 413.549 L
165.589 406.123 L
165.589 406.123 L
165.589 406.123 L
168.566 405.757 L
171.544 412.577 L
174.958 422.966 L
178.996 434.67 L
183.664 445.411 L
189.292 454.354 L
196.384 461.192 L
205.59 466.041 L
210.889 467.802 L
210.889 467.802 L
215.767 427.357 L
220.645 411.028 L
226.693 405.198 L
233.535 405.565 L
241.577 408.273 L
251.262 411.527 L
263.404 414.737 L
278.169 417.692 L
292.933 420.019 L
294.778 420.277 L
294.778 420.277 L
294.778 420.277 L
299.655 422.116 L
304.532 424.461 L
311.28 426.87 L
319.384 428.502 L
330.108 429.581 L
344.872 430.388 L
359.636 430.968 L
374.401 431.449 L
389.165 431.858 L
403.93 432.207 L
418.694 432.502 L
433.459 432.753 L
448.223 432.965 L
462.987 433.143 L
477.752 433.293 L
492.516 433.418 L
507.281 433.524 L
522.045 433.611 L
536.81 433.685 L
551.574 433.746 L
566.339 433.797 L
581.103 433.839 L
595.867 433.874 L
610.632 433.903 L
625.396 433.927 L
640.161 433.947 L
654.925 433.964 L
669.69 433.977 L
684.454 433.988 L
699.219 433.998 L
713.983 434.005 L
728.747 434.012 L
743.512 434.017 L
758.276 434.021 L
773.041 434.024 L
787.805 434.027 L
802.57 434.03 L
817.334 434.032 L
832.099 434.033 L
846.863 434.035 L
861.628 434.036 L
865.222 434.036 L
S
GR
GS
[0.75 0 0 0.75 0 -0.25] CT
0 0.447 0.741 RC
1 LJ
0.667 LW
N
127 488.667 M
127.003 488.671 L
127.02 488.693 L
127.105 488.803 L
127.526 489.365 L
129.633 492.356 L
133.083 497.12 L
137.345 501.691 L
142.281 504.821 L
148.121 506.163 L
148.811 506.2 L
148.811 506.2 L
148.811 506.2 L
151.749 508.375 L
154.688 513.82 L
158.201 521.488 L
162.197 529.454 L
165.589 534.806 L
165.589 534.806 L
165.589 534.806 L
168.566 528.694 L
171.544 511.355 L
174.958 487.965 L
178.996 462.611 L
183.664 440.013 L
189.292 422.211 L
196.384 410.385 L
205.59 404.757 L
210.889 403.93 L
210.889 403.93 L
215.767 402.73 L
220.645 400.268 L
226.693 396.996 L
233.535 394.327 L
241.577 392.996 L
251.262 393.262 L
263.404 394.922 L
278.169 397.336 L
292.933 399.49 L
294.778 399.731 L
294.778 399.731 L
294.778 399.731 L
299.655 393.568 L
304.532 388.443 L
311.28 384.378 L
319.384 382.872 L
330.108 383.461 L
344.872 385.467 L
359.636 387.373 L
374.401 388.923 L
389.165 390.148 L
403.93 391.111 L
418.694 391.868 L
433.459 392.461 L
448.223 392.926 L
462.987 393.291 L
477.752 393.576 L
492.516 393.8 L
507.281 393.975 L
522.045 394.111 L
536.81 394.218 L
551.574 394.301 L
566.339 394.366 L
581.103 394.417 L
595.867 394.456 L
610.632 394.487 L
625.396 394.511 L
640.161 394.529 L
654.925 394.544 L
669.69 394.555 L
684.454 394.563 L
699.219 394.57 L
713.983 394.575 L
728.747 394.579 L
743.512 394.582 L
758.276 394.584 L
773.041 394.586 L
787.805 394.587 L
802.57 394.588 L
817.334 394.589 L
832.099 394.59 L
846.863 394.59 L
861.628 394.591 L
865.222 394.591 L
S
GR
%%Trailer
%%Pages: 1
%%EOF
