%!PS-Adobe-3.0 EPSF-3.0
%%Creator: (MATLAB, The Mathworks, Inc. Version 9.1.0.441655 \(R2016b\). Operating System: Windows 7)
%%Title: C:/Users/June/Documents/GitKraken/rls-2017/sp6/figures/rp_ukol5.eps
%%CreationDate: 2018-03-04T21:36:46
%%Pages: (atend)
%%BoundingBox: 0 0 420 315
%%LanguageLevel: 3
%%EndComments
%%BeginProlog
%%BeginResource: procset (Apache XML Graphics Std ProcSet) 1.2 0
%%Version: 1.2 0
%%Copyright: (Copyright 2001-2003,2010 The Apache Software Foundation. License terms: http://www.apache.org/licenses/LICENSE-2.0)
/bd{bind def}bind def
/ld{load def}bd
/GR/grestore ld
/M/moveto ld
/LJ/setlinejoin ld
/C/curveto ld
/f/fill ld
/LW/setlinewidth ld
/GC/setgray ld
/t/show ld
/N/newpath ld
/CT/concat ld
/cp/closepath ld
/S/stroke ld
/L/lineto ld
/CC/setcmykcolor ld
/A/ashow ld
/GS/gsave ld
/RC/setrgbcolor ld
/RM/rmoveto ld
/ML/setmiterlimit ld
/re {4 2 roll M
1 index 0 rlineto
0 exch rlineto
neg 0 rlineto
cp } bd
/_ctm matrix def
/_tm matrix def
/BT { _ctm currentmatrix pop matrix _tm copy pop 0 0 moveto } bd
/ET { _ctm setmatrix } bd
/iTm { _ctm setmatrix _tm concat } bd
/Tm { _tm astore pop iTm 0 0 moveto } bd
/ux 0.0 def
/uy 0.0 def
/F {
  /Tp exch def
  /Tf exch def
  Tf findfont Tp scalefont setfont
  /cf Tf def  /cs Tp def
} bd
/ULS {currentpoint /uy exch def /ux exch def} bd
/ULE {
  /Tcx currentpoint pop def
  gsave
  newpath
  cf findfont cs scalefont dup
  /FontMatrix get 0 get /Ts exch def /FontInfo get dup
  /UnderlinePosition get Ts mul /To exch def
  /UnderlineThickness get Ts mul /Tt exch def
  ux uy To add moveto  Tcx uy To add lineto
  Tt setlinewidth stroke
  grestore
} bd
/OLE {
  /Tcx currentpoint pop def
  gsave
  newpath
  cf findfont cs scalefont dup
  /FontMatrix get 0 get /Ts exch def /FontInfo get dup
  /UnderlinePosition get Ts mul /To exch def
  /UnderlineThickness get Ts mul /Tt exch def
  ux uy To add cs add moveto Tcx uy To add cs add lineto
  Tt setlinewidth stroke
  grestore
} bd
/SOE {
  /Tcx currentpoint pop def
  gsave
  newpath
  cf findfont cs scalefont dup
  /FontMatrix get 0 get /Ts exch def /FontInfo get dup
  /UnderlinePosition get Ts mul /To exch def
  /UnderlineThickness get Ts mul /Tt exch def
  ux uy To add cs 10 mul 26 idiv add moveto Tcx uy To add cs 10 mul 26 idiv add lineto
  Tt setlinewidth stroke
  grestore
} bd
/QT {
/Y22 exch store
/X22 exch store
/Y21 exch store
/X21 exch store
currentpoint
/Y21 load 2 mul add 3 div exch
/X21 load 2 mul add 3 div exch
/X21 load 2 mul /X22 load add 3 div
/Y21 load 2 mul /Y22 load add 3 div
/X22 load /Y22 load curveto
} bd
/SSPD {
dup length /d exch dict def
{
/v exch def
/k exch def
currentpagedevice k known {
/cpdv currentpagedevice k get def
v cpdv ne {
/upd false def
/nullv v type /nulltype eq def
/nullcpdv cpdv type /nulltype eq def
nullv nullcpdv or
{
/upd true def
} {
/sametype v type cpdv type eq def
sametype {
v type /arraytype eq {
/vlen v length def
/cpdvlen cpdv length def
vlen cpdvlen eq {
0 1 vlen 1 sub {
/i exch def
/obj v i get def
/cpdobj cpdv i get def
obj cpdobj ne {
/upd true def
exit
} if
} for
} {
/upd true def
} ifelse
} {
v type /dicttype eq {
v {
/dv exch def
/dk exch def
/cpddv cpdv dk get def
dv cpddv ne {
/upd true def
exit
} if
} forall
} {
/upd true def
} ifelse
} ifelse
} if
} ifelse
upd true eq {
d k v put
} if
} if
} if
} forall
d length 0 gt {
d setpagedevice
} if
} bd
/RE { % /NewFontName [NewEncodingArray] /FontName RE -
  findfont dup length dict begin
  {
    1 index /FID ne
    {def} {pop pop} ifelse
  } forall
  /Encoding exch def
  /FontName 1 index def
  currentdict definefont pop
  end
} bind def
%%EndResource
%%BeginResource: procset (Apache XML Graphics EPS ProcSet) 1.0 0
%%Version: 1.0 0
%%Copyright: (Copyright 2002-2003 The Apache Software Foundation. License terms: http://www.apache.org/licenses/LICENSE-2.0)
/BeginEPSF { %def
/b4_Inc_state save def         % Save state for cleanup
/dict_count countdictstack def % Count objects on dict stack
/op_count count 1 sub def      % Count objects on operand stack
userdict begin                 % Push userdict on dict stack
/showpage { } def              % Redefine showpage, { } = null proc
0 setgray 0 setlinecap         % Prepare graphics state
1 setlinewidth 0 setlinejoin
10 setmiterlimit [ ] 0 setdash newpath
/languagelevel where           % If level not equal to 1 then
{pop languagelevel             % set strokeadjust and
1 ne                           % overprint to their defaults.
{false setstrokeadjust false setoverprint
} if
} if
} bd
/EndEPSF { %def
count op_count sub {pop} repeat            % Clean up stacks
countdictstack dict_count sub {end} repeat
b4_Inc_state restore
} bd
%%EndResource
%FOPBeginFontDict
%%IncludeResource: font Courier-Bold
%%IncludeResource: font Helvetica
%%IncludeResource: font Courier-BoldOblique
%%IncludeResource: font Courier-Oblique
%%IncludeResource: font Times-Roman
%%IncludeResource: font Helvetica-BoldOblique
%%IncludeResource: font Helvetica-Bold
%%IncludeResource: font Helvetica-Oblique
%%IncludeResource: font Times-BoldItalic
%%IncludeResource: font Courier
%%IncludeResource: font Times-Italic
%%IncludeResource: font Times-Bold
%%IncludeResource: font Symbol
%%IncludeResource: font ZapfDingbats
%FOPEndFontDict
%%BeginResource: encoding WinAnsiEncoding
/WinAnsiEncoding [
/.notdef /.notdef /.notdef /.notdef /.notdef
/.notdef /.notdef /.notdef /.notdef /.notdef
/.notdef /.notdef /.notdef /.notdef /.notdef
/.notdef /.notdef /.notdef /.notdef /.notdef
/.notdef /.notdef /.notdef /.notdef /.notdef
/.notdef /.notdef /.notdef /.notdef /.notdef
/.notdef /.notdef /space /exclam /quotedbl
/numbersign /dollar /percent /ampersand /quotesingle
/parenleft /parenright /asterisk /plus /comma
/hyphen /period /slash /zero /one
/two /three /four /five /six
/seven /eight /nine /colon /semicolon
/less /equal /greater /question /at
/A /B /C /D /E
/F /G /H /I /J
/K /L /M /N /O
/P /Q /R /S /T
/U /V /W /X /Y
/Z /bracketleft /backslash /bracketright /asciicircum
/underscore /quoteleft /a /b /c
/d /e /f /g /h
/i /j /k /l /m
/n /o /p /q /r
/s /t /u /v /w
/x /y /z /braceleft /bar
/braceright /asciitilde /bullet /Euro /bullet
/quotesinglbase /florin /quotedblbase /ellipsis /dagger
/daggerdbl /circumflex /perthousand /Scaron /guilsinglleft
/OE /bullet /Zcaron /bullet /bullet
/quoteleft /quoteright /quotedblleft /quotedblright /bullet
/endash /emdash /asciitilde /trademark /scaron
/guilsinglright /oe /bullet /zcaron /Ydieresis
/space /exclamdown /cent /sterling /currency
/yen /brokenbar /section /dieresis /copyright
/ordfeminine /guillemotleft /logicalnot /sfthyphen /registered
/macron /degree /plusminus /twosuperior /threesuperior
/acute /mu /paragraph /middot /cedilla
/onesuperior /ordmasculine /guillemotright /onequarter /onehalf
/threequarters /questiondown /Agrave /Aacute /Acircumflex
/Atilde /Adieresis /Aring /AE /Ccedilla
/Egrave /Eacute /Ecircumflex /Edieresis /Igrave
/Iacute /Icircumflex /Idieresis /Eth /Ntilde
/Ograve /Oacute /Ocircumflex /Otilde /Odieresis
/multiply /Oslash /Ugrave /Uacute /Ucircumflex
/Udieresis /Yacute /Thorn /germandbls /agrave
/aacute /acircumflex /atilde /adieresis /aring
/ae /ccedilla /egrave /eacute /ecircumflex
/edieresis /igrave /iacute /icircumflex /idieresis
/eth /ntilde /ograve /oacute /ocircumflex
/otilde /odieresis /divide /oslash /ugrave
/uacute /ucircumflex /udieresis /yacute /thorn
/ydieresis
] def
%%EndResource
%FOPBeginFontReencode
/Courier-Bold findfont
dup length dict begin
  {1 index /FID ne {def} {pop pop} ifelse} forall
  /Encoding WinAnsiEncoding def
  currentdict
end
/Courier-Bold exch definefont pop
/Helvetica findfont
dup length dict begin
  {1 index /FID ne {def} {pop pop} ifelse} forall
  /Encoding WinAnsiEncoding def
  currentdict
end
/Helvetica exch definefont pop
/Courier-BoldOblique findfont
dup length dict begin
  {1 index /FID ne {def} {pop pop} ifelse} forall
  /Encoding WinAnsiEncoding def
  currentdict
end
/Courier-BoldOblique exch definefont pop
/Courier-Oblique findfont
dup length dict begin
  {1 index /FID ne {def} {pop pop} ifelse} forall
  /Encoding WinAnsiEncoding def
  currentdict
end
/Courier-Oblique exch definefont pop
/Times-Roman findfont
dup length dict begin
  {1 index /FID ne {def} {pop pop} ifelse} forall
  /Encoding WinAnsiEncoding def
  currentdict
end
/Times-Roman exch definefont pop
/Helvetica-BoldOblique findfont
dup length dict begin
  {1 index /FID ne {def} {pop pop} ifelse} forall
  /Encoding WinAnsiEncoding def
  currentdict
end
/Helvetica-BoldOblique exch definefont pop
/Helvetica-Bold findfont
dup length dict begin
  {1 index /FID ne {def} {pop pop} ifelse} forall
  /Encoding WinAnsiEncoding def
  currentdict
end
/Helvetica-Bold exch definefont pop
/Helvetica-Oblique findfont
dup length dict begin
  {1 index /FID ne {def} {pop pop} ifelse} forall
  /Encoding WinAnsiEncoding def
  currentdict
end
/Helvetica-Oblique exch definefont pop
/Times-BoldItalic findfont
dup length dict begin
  {1 index /FID ne {def} {pop pop} ifelse} forall
  /Encoding WinAnsiEncoding def
  currentdict
end
/Times-BoldItalic exch definefont pop
/Courier findfont
dup length dict begin
  {1 index /FID ne {def} {pop pop} ifelse} forall
  /Encoding WinAnsiEncoding def
  currentdict
end
/Courier exch definefont pop
/Times-Italic findfont
dup length dict begin
  {1 index /FID ne {def} {pop pop} ifelse} forall
  /Encoding WinAnsiEncoding def
  currentdict
end
/Times-Italic exch definefont pop
/Times-Bold findfont
dup length dict begin
  {1 index /FID ne {def} {pop pop} ifelse} forall
  /Encoding WinAnsiEncoding def
  currentdict
end
/Times-Bold exch definefont pop
%FOPEndFontReencode
%%EndProlog
%%Page: 1 1
%%PageBoundingBox: 0 0 420 315
%%BeginPageSetup
[1 0 0 -1 0 315] CT
%%EndPageSetup
GS
[0.75 0 0 0.75 0 0] CT
1 GC
N
0 0 560 420 re
f
GR
GS
[0.75 0 0 0.75 0 0] CT
1 GC
N
0 0 560 420 re
f
GR
GS
[0.75 0 0 0.75 0 0] CT
1 GC
N
73 374 M
507 374 L
507 31 L
73 31 L
cp
f
GR
GS
[0.75 0 0 0.75 0 0] CT
0.873 GC
1 LJ
0.667 LW
N
73 374 M
73 31 L
S
GR
GS
[0.75 0 0 0.75 0 0] CT
0.873 GC
1 LJ
0.667 LW
N
116.4 374 M
116.4 31 L
S
GR
GS
[0.75 0 0 0.75 0 0] CT
0.873 GC
1 LJ
0.667 LW
N
159.8 374 M
159.8 31 L
S
GR
GS
[0.75 0 0 0.75 0 0] CT
0.873 GC
1 LJ
0.667 LW
N
203.2 374 M
203.2 31 L
S
GR
GS
[0.75 0 0 0.75 0 0] CT
0.873 GC
1 LJ
0.667 LW
N
246.6 374 M
246.6 31 L
S
GR
GS
[0.75 0 0 0.75 0 0] CT
0.873 GC
1 LJ
0.667 LW
N
290 374 M
290 31 L
S
GR
GS
[0.75 0 0 0.75 0 0] CT
0.873 GC
1 LJ
0.667 LW
N
333.4 374 M
333.4 31 L
S
GR
GS
[0.75 0 0 0.75 0 0] CT
0.873 GC
1 LJ
0.667 LW
N
376.8 374 M
376.8 31 L
S
GR
GS
[0.75 0 0 0.75 0 0] CT
0.873 GC
1 LJ
0.667 LW
N
420.2 374 M
420.2 31 L
S
GR
GS
[0.75 0 0 0.75 0 0] CT
0.873 GC
1 LJ
0.667 LW
N
463.6 374 M
463.6 31 L
S
GR
GS
[0.75 0 0 0.75 0 0] CT
0.873 GC
1 LJ
0.667 LW
N
507 374 M
507 31 L
S
GR
GS
[0.75 0 0 0.75 0 0] CT
0.873 GC
1 LJ
0.667 LW
N
507 374 M
73 374 L
S
GR
GS
[0.75 0 0 0.75 0 0] CT
0.873 GC
1 LJ
0.667 LW
N
507 331.125 M
73 331.125 L
S
GR
GS
[0.75 0 0 0.75 0 0] CT
0.873 GC
1 LJ
0.667 LW
N
507 288.25 M
73 288.25 L
S
GR
GS
[0.75 0 0 0.75 0 0] CT
0.873 GC
1 LJ
0.667 LW
N
507 245.375 M
73 245.375 L
S
GR
GS
[0.75 0 0 0.75 0 0] CT
0.873 GC
1 LJ
0.667 LW
N
507 202.5 M
73 202.5 L
S
GR
GS
[0.75 0 0 0.75 0 0] CT
0.873 GC
1 LJ
0.667 LW
N
507 159.625 M
73 159.625 L
S
GR
GS
[0.75 0 0 0.75 0 0] CT
0.873 GC
1 LJ
0.667 LW
N
507 116.75 M
73 116.75 L
S
GR
GS
[0.75 0 0 0.75 0 0] CT
0.873 GC
1 LJ
0.667 LW
N
507 73.875 M
73 73.875 L
S
GR
GS
[0.75 0 0 0.75 0 0] CT
0.873 GC
1 LJ
0.667 LW
N
507 31 M
73 31 L
S
GR
GS
[0.75 0 0 0.75 0 0] CT
0.149 GC
2 setlinecap
1 LJ
0.667 LW
N
73 374 M
507 374 L
S
GR
GS
[0.75 0 0 0.75 0 0] CT
0.149 GC
2 setlinecap
1 LJ
0.667 LW
N
73 31 M
507 31 L
S
GR
GS
[0.75 0 0 0.75 0 0] CT
0.149 GC
2 setlinecap
1 LJ
0.667 LW
N
73 374 M
73 369.66 L
S
GR
GS
[0.75 0 0 0.75 0 0] CT
0.149 GC
2 setlinecap
1 LJ
0.667 LW
N
116.4 374 M
116.4 369.66 L
S
GR
GS
[0.75 0 0 0.75 0 0] CT
0.149 GC
2 setlinecap
1 LJ
0.667 LW
N
159.8 374 M
159.8 369.66 L
S
GR
GS
[0.75 0 0 0.75 0 0] CT
0.149 GC
2 setlinecap
1 LJ
0.667 LW
N
203.2 374 M
203.2 369.66 L
S
GR
GS
[0.75 0 0 0.75 0 0] CT
0.149 GC
2 setlinecap
1 LJ
0.667 LW
N
246.6 374 M
246.6 369.66 L
S
GR
GS
[0.75 0 0 0.75 0 0] CT
0.149 GC
2 setlinecap
1 LJ
0.667 LW
N
290 374 M
290 369.66 L
S
GR
GS
[0.75 0 0 0.75 0 0] CT
0.149 GC
2 setlinecap
1 LJ
0.667 LW
N
333.4 374 M
333.4 369.66 L
S
GR
GS
[0.75 0 0 0.75 0 0] CT
0.149 GC
2 setlinecap
1 LJ
0.667 LW
N
376.8 374 M
376.8 369.66 L
S
GR
GS
[0.75 0 0 0.75 0 0] CT
0.149 GC
2 setlinecap
1 LJ
0.667 LW
N
420.2 374 M
420.2 369.66 L
S
GR
GS
[0.75 0 0 0.75 0 0] CT
0.149 GC
2 setlinecap
1 LJ
0.667 LW
N
463.6 374 M
463.6 369.66 L
S
GR
GS
[0.75 0 0 0.75 0 0] CT
0.149 GC
2 setlinecap
1 LJ
0.667 LW
N
507 374 M
507 369.66 L
S
GR
GS
[0.75 0 0 0.75 0 0] CT
0.149 GC
2 setlinecap
1 LJ
0.667 LW
N
73 31 M
73 35.34 L
S
GR
GS
[0.75 0 0 0.75 0 0] CT
0.149 GC
2 setlinecap
1 LJ
0.667 LW
N
116.4 31 M
116.4 35.34 L
S
GR
GS
[0.75 0 0 0.75 0 0] CT
0.149 GC
2 setlinecap
1 LJ
0.667 LW
N
159.8 31 M
159.8 35.34 L
S
GR
GS
[0.75 0 0 0.75 0 0] CT
0.149 GC
2 setlinecap
1 LJ
0.667 LW
N
203.2 31 M
203.2 35.34 L
S
GR
GS
[0.75 0 0 0.75 0 0] CT
0.149 GC
2 setlinecap
1 LJ
0.667 LW
N
246.6 31 M
246.6 35.34 L
S
GR
GS
[0.75 0 0 0.75 0 0] CT
0.149 GC
2 setlinecap
1 LJ
0.667 LW
N
290 31 M
290 35.34 L
S
GR
GS
[0.75 0 0 0.75 0 0] CT
0.149 GC
2 setlinecap
1 LJ
0.667 LW
N
333.4 31 M
333.4 35.34 L
S
GR
GS
[0.75 0 0 0.75 0 0] CT
0.149 GC
2 setlinecap
1 LJ
0.667 LW
N
376.8 31 M
376.8 35.34 L
S
GR
GS
[0.75 0 0 0.75 0 0] CT
0.149 GC
2 setlinecap
1 LJ
0.667 LW
N
420.2 31 M
420.2 35.34 L
S
GR
GS
[0.75 0 0 0.75 0 0] CT
0.149 GC
2 setlinecap
1 LJ
0.667 LW
N
463.6 31 M
463.6 35.34 L
S
GR
GS
[0.75 0 0 0.75 0 0] CT
0.149 GC
2 setlinecap
1 LJ
0.667 LW
N
507 31 M
507 35.34 L
S
GR
GS
[0.75 0 0 0.75 54.75 284.50001] CT
0.149 GC
/Helvetica 13.333 F
GS
[1 0 0 1 0 0] CT
-4 14 moveto 
1 -1 scale
(0) t 
GR
GR
GS
[0.75 0 0 0.75 87.3 284.50001] CT
0.149 GC
/Helvetica 13.333 F
GS
[1 0 0 1 0 0] CT
-11 14 moveto 
1 -1 scale
(200) t 
GR
GR
GS
[0.75 0 0 0.75 119.85 284.50001] CT
0.149 GC
/Helvetica 13.333 F
GS
[1 0 0 1 0 0] CT
-11 14 moveto 
1 -1 scale
(400) t 
GR
GR
GS
[0.75 0 0 0.75 152.4 284.50001] CT
0.149 GC
/Helvetica 13.333 F
GS
[1 0 0 1 0 0] CT
-11 14 moveto 
1 -1 scale
(600) t 
GR
GR
GS
[0.75 0 0 0.75 184.95 284.50001] CT
0.149 GC
/Helvetica 13.333 F
GS
[1 0 0 1 0 0] CT
-11 14 moveto 
1 -1 scale
(800) t 
GR
GR
GS
[0.75 0 0 0.75 217.5 284.50001] CT
0.149 GC
/Helvetica 13.333 F
GS
[1 0 0 1 0 0] CT
-14.5 14 moveto 
1 -1 scale
(1000) t 
GR
GR
GS
[0.75 0 0 0.75 250.05 284.50001] CT
0.149 GC
/Helvetica 13.333 F
GS
[1 0 0 1 0 0] CT
-14.5 14 moveto 
1 -1 scale
(1200) t 
GR
GR
GS
[0.75 0 0 0.75 282.59999 284.50001] CT
0.149 GC
/Helvetica 13.333 F
GS
[1 0 0 1 0 0] CT
-14.5 14 moveto 
1 -1 scale
(1400) t 
GR
GR
GS
[0.75 0 0 0.75 315.15001 284.50001] CT
0.149 GC
/Helvetica 13.333 F
GS
[1 0 0 1 0 0] CT
-14.5 14 moveto 
1 -1 scale
(1600) t 
GR
GR
GS
[0.75 0 0 0.75 347.7 284.50001] CT
0.149 GC
/Helvetica 13.333 F
GS
[1 0 0 1 0 0] CT
-14.5 14 moveto 
1 -1 scale
(1800) t 
GR
GR
GS
[0.75 0 0 0.75 380.25 284.50001] CT
0.149 GC
/Helvetica 13.333 F
GS
[1 0 0 1 0 0] CT
-14.5 14 moveto 
1 -1 scale
(2000) t 
GR
GR
GS
[0.75 0 0 0.75 0 0] CT
0.149 GC
2 setlinecap
1 LJ
0.667 LW
N
73 374 M
73 31 L
S
GR
GS
[0.75 0 0 0.75 0 0] CT
0.149 GC
2 setlinecap
1 LJ
0.667 LW
N
507 374 M
507 31 L
S
GR
GS
[0.75 0 0 0.75 0 0] CT
0.149 GC
2 setlinecap
1 LJ
0.667 LW
N
73 374 M
77.34 374 L
S
GR
GS
[0.75 0 0 0.75 0 0] CT
0.149 GC
2 setlinecap
1 LJ
0.667 LW
N
73 331.125 M
77.34 331.125 L
S
GR
GS
[0.75 0 0 0.75 0 0] CT
0.149 GC
2 setlinecap
1 LJ
0.667 LW
N
73 288.25 M
77.34 288.25 L
S
GR
GS
[0.75 0 0 0.75 0 0] CT
0.149 GC
2 setlinecap
1 LJ
0.667 LW
N
73 245.375 M
77.34 245.375 L
S
GR
GS
[0.75 0 0 0.75 0 0] CT
0.149 GC
2 setlinecap
1 LJ
0.667 LW
N
73 202.5 M
77.34 202.5 L
S
GR
GS
[0.75 0 0 0.75 0 0] CT
0.149 GC
2 setlinecap
1 LJ
0.667 LW
N
73 159.625 M
77.34 159.625 L
S
GR
GS
[0.75 0 0 0.75 0 0] CT
0.149 GC
2 setlinecap
1 LJ
0.667 LW
N
73 116.75 M
77.34 116.75 L
S
GR
GS
[0.75 0 0 0.75 0 0] CT
0.149 GC
2 setlinecap
1 LJ
0.667 LW
N
73 73.875 M
77.34 73.875 L
S
GR
GS
[0.75 0 0 0.75 0 0] CT
0.149 GC
2 setlinecap
1 LJ
0.667 LW
N
73 31 M
77.34 31 L
S
GR
GS
[0.75 0 0 0.75 0 0] CT
0.149 GC
2 setlinecap
1 LJ
0.667 LW
N
507 374 M
502.66 374 L
S
GR
GS
[0.75 0 0 0.75 0 0] CT
0.149 GC
2 setlinecap
1 LJ
0.667 LW
N
507 331.125 M
502.66 331.125 L
S
GR
GS
[0.75 0 0 0.75 0 0] CT
0.149 GC
2 setlinecap
1 LJ
0.667 LW
N
507 288.25 M
502.66 288.25 L
S
GR
GS
[0.75 0 0 0.75 0 0] CT
0.149 GC
2 setlinecap
1 LJ
0.667 LW
N
507 245.375 M
502.66 245.375 L
S
GR
GS
[0.75 0 0 0.75 0 0] CT
0.149 GC
2 setlinecap
1 LJ
0.667 LW
N
507 202.5 M
502.66 202.5 L
S
GR
GS
[0.75 0 0 0.75 0 0] CT
0.149 GC
2 setlinecap
1 LJ
0.667 LW
N
507 159.625 M
502.66 159.625 L
S
GR
GS
[0.75 0 0 0.75 0 0] CT
0.149 GC
2 setlinecap
1 LJ
0.667 LW
N
507 116.75 M
502.66 116.75 L
S
GR
GS
[0.75 0 0 0.75 0 0] CT
0.149 GC
2 setlinecap
1 LJ
0.667 LW
N
507 73.875 M
502.66 73.875 L
S
GR
GS
[0.75 0 0 0.75 0 0] CT
0.149 GC
2 setlinecap
1 LJ
0.667 LW
N
507 31 M
502.66 31 L
S
GR
GS
[0.75 0 0 0.75 50.75 280.5] CT
0.149 GC
/Helvetica 13.333 F
GS
[1 0 0 1 0 0] CT
-8 5.5 moveto 
1 -1 scale
(0) t 
GR
GR
GS
[0.75 0 0 0.75 50.75 248.34375] CT
0.149 GC
/Helvetica 13.333 F
GS
[1 0 0 1 0 0] CT
-19 5.5 moveto 
1 -1 scale
(0.1) t 
GR
GR
GS
[0.75 0 0 0.75 50.75 216.1875] CT
0.149 GC
/Helvetica 13.333 F
GS
[1 0 0 1 0 0] CT
-19 5.5 moveto 
1 -1 scale
(0.2) t 
GR
GR
GS
[0.75 0 0 0.75 50.75 184.03125] CT
0.149 GC
/Helvetica 13.333 F
GS
[1 0 0 1 0 0] CT
-19 5.5 moveto 
1 -1 scale
(0.3) t 
GR
GR
GS
[0.75 0 0 0.75 50.75 151.875] CT
0.149 GC
/Helvetica 13.333 F
GS
[1 0 0 1 0 0] CT
-19 5.5 moveto 
1 -1 scale
(0.4) t 
GR
GR
GS
[0.75 0 0 0.75 50.75 119.71875] CT
0.149 GC
/Helvetica 13.333 F
GS
[1 0 0 1 0 0] CT
-19 5.5 moveto 
1 -1 scale
(0.5) t 
GR
GR
GS
[0.75 0 0 0.75 50.75 87.56249] CT
0.149 GC
/Helvetica 13.333 F
GS
[1 0 0 1 0 0] CT
-19 5.5 moveto 
1 -1 scale
(0.6) t 
GR
GR
GS
[0.75 0 0 0.75 50.75 55.40626] CT
0.149 GC
/Helvetica 13.333 F
GS
[1 0 0 1 0 0] CT
-19 5.5 moveto 
1 -1 scale
(0.7) t 
GR
GR
GS
[0.75 0 0 0.75 50.75 23.25] CT
0.149 GC
/Helvetica 13.333 F
GS
[1 0 0 1 0 0] CT
-19 5.5 moveto 
1 -1 scale
(0.8) t 
GR
GR
GS
[0.75 0 0 0.75 217.50021 21.1875] CT
/Helvetica-Bold 14.667 F
GS
[1 0 0 1 0 0] CT
-48.5 -4 moveto 
1 -1 scale
(Podminka RP) t 
GR
GR
GS
[0.75 0 0 0.75 0 0] CT
0 0.447 0.741 RC
1 LJ
0.667 LW
N
73.217 73.833 M
73.434 73.832 L
73.651 73.832 L
73.868 73.831 L
74.085 73.83 L
74.302 73.83 L
74.519 73.829 L
74.736 73.828 L
74.953 73.828 L
75.17 73.827 L
75.387 73.826 L
75.604 73.826 L
75.821 73.825 L
76.038 73.824 L
76.255 73.823 L
76.472 73.823 L
76.689 73.822 L
76.906 73.821 L
77.123 73.82 L
77.34 73.82 L
77.557 73.819 L
77.774 73.818 L
77.991 73.817 L
78.208 73.816 L
78.425 73.816 L
78.642 73.815 L
78.859 73.814 L
79.076 73.813 L
79.293 73.812 L
79.51 73.811 L
79.727 73.81 L
79.944 73.809 L
80.161 73.808 L
80.378 73.808 L
80.595 73.807 L
80.812 73.806 L
81.029 73.805 L
81.246 73.804 L
81.463 73.803 L
81.68 73.802 L
81.897 73.801 L
82.114 73.8 L
82.331 73.798 L
82.548 73.797 L
82.765 73.796 L
82.982 73.795 L
83.199 73.794 L
83.416 73.793 L
83.633 73.792 L
83.85 73.791 L
84.067 73.789 L
84.284 73.788 L
84.501 73.787 L
84.718 73.786 L
84.935 73.784 L
85.152 73.783 L
85.369 73.782 L
85.586 73.781 L
85.803 73.779 L
86.02 73.778 L
86.237 73.777 L
86.454 73.775 L
86.671 73.774 L
86.888 73.772 L
87.105 73.771 L
87.322 73.769 L
87.539 73.768 L
87.756 73.766 L
87.973 73.765 L
88.19 73.763 L
88.407 73.762 L
88.624 73.76 L
88.841 73.759 L
89.058 73.757 L
89.275 73.755 L
89.492 73.754 L
89.709 73.752 L
89.926 73.75 L
90.143 73.749 L
90.36 73.747 L
90.577 73.745 L
90.794 73.743 L
91.011 73.742 L
91.228 73.74 L
91.445 73.738 L
91.662 73.736 L
91.879 73.734 L
92.096 73.732 L
92.313 73.73 L
92.53 73.728 L
92.747 73.726 L
92.964 73.724 L
93.181 73.722 L
93.398 73.72 L
93.615 73.718 L
93.832 73.715 L
94.049 73.713 L
94.266 73.711 L
94.483 73.709 L
94.7 73.706 L
94.917 73.704 L
95.134 73.702 L
95.351 73.699 L
95.568 73.697 L
95.785 73.694 L
96.002 73.692 L
96.219 73.689 L
96.436 73.687 L
96.653 73.684 L
96.87 73.682 L
97.087 73.679 L
97.304 73.676 L
97.521 73.674 L
97.738 73.671 L
97.955 73.668 L
98.172 73.665 L
98.389 73.662 L
98.606 73.659 L
98.823 73.657 L
99.04 73.654 L
99.257 73.651 L
99.474 73.647 L
99.691 73.644 L
99.908 73.641 L
100.125 73.638 L
100.342 73.635 L
100.559 73.632 L
100.776 73.628 L
100.993 73.625 L
101.21 73.621 L
101.427 73.618 L
101.644 73.615 L
101.861 73.611 L
102.078 73.607 L
102.295 73.604 L
102.512 73.6 L
102.729 73.596 L
102.946 73.593 L
103.163 73.589 L
103.38 73.585 L
103.597 73.581 L
103.814 73.577 L
104.031 73.573 L
104.248 73.569 L
104.465 73.565 L
104.682 73.561 L
104.899 73.556 L
105.116 73.552 L
105.333 73.548 L
105.55 73.543 L
105.767 73.539 L
105.984 73.534 L
106.201 73.53 L
106.418 73.525 L
106.635 73.521 L
106.852 73.516 L
107.069 73.511 L
107.286 73.506 L
107.503 73.501 L
107.72 73.496 L
107.937 73.491 L
108.154 73.486 L
108.371 73.481 L
108.588 73.476 L
108.805 73.47 L
109.022 73.465 L
109.239 73.46 L
109.456 73.454 L
109.673 73.448 L
109.89 73.443 L
110.107 73.437 L
110.324 73.431 L
110.541 73.425 L
110.758 73.42 L
110.975 73.414 L
111.192 73.407 L
111.409 73.401 L
111.626 73.395 L
111.843 73.389 L
112.06 73.382 L
112.277 73.376 L
112.494 73.369 L
112.711 73.363 L
112.928 73.356 L
113.145 73.349 L
113.362 73.342 L
113.579 73.336 L
113.796 73.328 L
114.013 73.321 L
114.23 73.314 L
114.447 73.307 L
114.664 73.3 L
114.881 73.292 L
115.098 73.285 L
115.315 73.277 L
115.532 73.269 L
115.749 73.261 L
115.966 73.253 L
116.183 73.245 L
116.4 73.237 L
116.617 73.229 L
116.834 73.221 L
117.051 73.212 L
117.268 73.204 L
117.485 73.195 L
117.702 73.187 L
117.919 73.178 L
118.136 73.169 L
118.353 73.16 L
118.57 73.151 L
118.787 73.142 L
119.004 73.133 L
119.221 73.123 L
119.438 73.114 L
119.655 73.104 L
119.872 73.094 L
120.089 73.085 L
120.306 73.075 L
120.523 73.065 L
120.74 73.055 L
120.957 73.044 L
121.174 73.034 L
121.391 73.023 L
121.608 73.013 L
121.825 73.002 L
122.042 72.991 L
122.259 72.98 L
122.476 72.969 L
122.693 72.958 L
122.91 72.947 L
123.127 72.935 L
123.344 72.924 L
123.561 72.912 L
123.778 72.9 L
123.995 72.889 L
124.212 72.877 L
124.429 72.864 L
124.646 72.852 L
124.863 72.84 L
125.08 72.827 L
125.297 72.815 L
125.514 72.802 L
125.731 72.789 L
125.948 72.776 L
126.165 72.763 L
126.382 72.75 L
126.599 72.736 L
126.816 72.723 L
127.033 72.709 L
127.25 72.695 L
127.467 72.681 L
127.684 72.667 L
127.901 72.653 L
128.118 72.639 L
128.335 72.624 L
128.552 72.61 L
128.769 72.595 L
128.986 72.58 L
129.203 72.565 L
129.42 72.55 L
129.637 72.535 L
129.854 72.519 L
130.071 72.504 L
130.288 72.488 L
130.505 72.472 L
130.722 72.456 L
130.939 72.44 L
131.156 72.424 L
131.373 72.408 L
131.59 72.391 L
131.807 72.375 L
132.024 72.358 L
132.241 72.341 L
132.458 72.324 L
132.675 72.307 L
132.892 72.29 L
133.109 72.272 L
133.326 72.255 L
133.543 72.237 L
133.76 72.219 L
133.977 72.202 L
134.194 72.183 L
134.411 72.165 L
134.628 72.147 L
134.845 72.129 L
135.062 72.11 L
135.279 72.091 L
135.496 72.073 L
135.713 72.054 L
135.93 72.035 L
136.147 72.015 L
136.364 71.996 L
136.581 71.977 L
136.798 71.957 L
137.015 71.937 L
137.232 71.918 L
137.449 71.898 L
137.666 71.878 L
137.883 71.858 L
138.1 71.838 L
138.317 71.817 L
138.534 71.797 L
138.751 71.776 L
138.968 71.756 L
139.185 71.735 L
139.402 71.714 L
139.619 71.693 L
139.836 71.672 L
140.053 71.651 L
140.27 71.63 L
140.487 71.609 L
140.704 71.587 L
140.921 71.566 L
141.138 71.545 L
141.355 71.523 L
141.572 71.501 L
141.789 71.48 L
142.006 71.458 L
142.223 71.436 L
142.44 71.414 L
142.657 71.392 L
142.874 71.37 L
143.091 71.348 L
143.308 71.326 L
143.525 71.304 L
143.742 71.282 L
143.959 71.26 L
144.176 71.238 L
144.393 71.216 L
144.61 71.193 L
144.827 71.171 L
145.044 71.149 L
145.261 71.127 L
145.478 71.104 L
145.695 71.082 L
145.912 71.06 L
146.129 71.038 L
146.346 71.015 L
146.563 70.993 L
146.78 70.971 L
146.997 70.949 L
147.214 70.927 L
147.431 70.905 L
147.648 70.883 L
147.865 70.861 L
148.082 70.839 L
148.299 70.817 L
148.516 70.796 L
148.733 70.774 L
148.95 70.753 L
149.167 70.731 L
149.384 70.71 L
149.601 70.689 L
149.818 70.668 L
150.035 70.647 L
150.252 70.626 L
150.469 70.605 L
150.686 70.585 L
150.903 70.564 L
151.12 70.544 L
151.337 70.524 L
151.554 70.504 L
151.771 70.485 L
151.988 70.465 L
152.205 70.446 L
152.422 70.427 L
152.639 70.408 L
152.856 70.389 L
153.073 70.371 L
153.29 70.353 L
153.507 70.335 L
153.724 70.317 L
153.941 70.3 L
154.158 70.283 L
154.375 70.266 L
154.592 70.249 L
154.809 70.233 L
155.026 70.217 L
155.243 70.202 L
155.46 70.186 L
155.677 70.171 L
155.894 70.157 L
156.111 70.143 L
156.328 70.129 L
156.545 70.115 L
156.762 70.102 L
156.979 70.09 L
157.196 70.077 L
157.413 70.066 L
157.63 70.054 L
157.847 70.043 L
158.064 70.033 L
158.281 70.023 L
158.498 70.013 L
158.715 70.004 L
158.932 69.996 L
159.149 69.988 L
159.366 69.98 L
159.583 69.973 L
159.8 69.967 L
160.017 69.961 L
160.234 69.956 L
160.451 69.951 L
160.668 69.947 L
160.885 69.943 L
161.102 69.94 L
161.319 69.938 L
161.536 69.936 L
161.753 69.935 L
161.97 69.935 L
162.187 69.935 L
162.404 69.936 L
162.621 69.938 L
162.838 69.94 L
163.055 69.943 L
163.272 69.947 L
163.489 69.951 L
163.706 69.957 L
163.923 69.963 L
164.14 69.97 L
164.357 69.977 L
164.574 69.986 L
164.791 69.995 L
165.008 70.005 L
165.225 70.016 L
165.442 70.028 L
165.659 70.041 L
165.876 70.054 L
166.093 70.069 L
166.31 70.084 L
166.527 70.1 L
166.744 70.118 L
166.961 70.136 L
167.178 70.155 L
167.395 70.175 L
167.612 70.196 L
167.829 70.218 L
168.046 70.241 L
168.263 70.265 L
168.48 70.29 L
168.697 70.317 L
168.914 70.344 L
169.131 70.372 L
169.348 70.402 L
169.565 70.432 L
169.782 70.464 L
169.999 70.497 L
170.216 70.531 L
170.433 70.566 L
170.65 70.602 L
170.867 70.64 L
171.084 70.678 L
171.301 70.718 L
171.518 70.759 L
171.735 70.802 L
171.952 70.845 L
172.169 70.89 L
172.386 70.936 L
172.603 70.984 L
172.82 71.032 L
173.037 71.082 L
173.254 71.134 L
173.471 71.187 L
173.688 71.241 L
173.905 71.296 L
174.122 71.353 L
174.339 71.412 L
174.556 71.471 L
174.773 71.533 L
174.99 71.595 L
175.207 71.659 L
175.424 71.725 L
175.641 71.792 L
175.858 71.861 L
176.075 71.931 L
176.292 72.002 L
176.509 72.076 L
176.726 72.15 L
176.943 72.227 L
177.16 72.305 L
177.377 72.384 L
177.594 72.465 L
177.811 72.548 L
178.028 72.633 L
178.245 72.719 L
178.462 72.807 L
178.679 72.896 L
178.896 72.988 L
179.113 73.081 L
179.33 73.175 L
179.547 73.272 L
179.764 73.37 L
179.981 73.47 L
180.198 73.572 L
180.415 73.676 L
180.632 73.781 L
180.849 73.889 L
181.066 73.998 L
181.283 74.109 L
181.5 74.222 L
181.717 74.337 L
181.934 74.454 L
182.151 74.572 L
182.368 74.693 L
182.585 74.816 L
182.802 74.941 L
183.019 75.067 L
183.236 75.196 L
183.453 75.327 L
183.67 75.46 L
183.887 75.595 L
184.104 75.731 L
184.321 75.871 L
184.538 76.012 L
184.755 76.155 L
184.972 76.3 L
185.189 76.448 L
185.406 76.598 L
185.623 76.75 L
185.84 76.904 L
186.057 77.06 L
186.274 77.219 L
186.491 77.38 L
186.708 77.543 L
186.925 77.708 L
187.142 77.876 L
187.359 78.046 L
187.576 78.218 L
187.793 78.393 L
188.01 78.57 L
188.227 78.75 L
188.444 78.932 L
188.661 79.116 L
188.878 79.303 L
189.095 79.492 L
189.312 79.683 L
189.529 79.877 L
189.746 80.074 L
189.963 80.273 L
190.18 80.474 L
190.397 80.678 L
190.614 80.885 L
190.831 81.094 L
191.048 81.306 L
191.265 81.52 L
191.482 81.737 L
191.699 81.957 L
191.916 82.179 L
192.133 82.404 L
192.35 82.632 L
192.567 82.862 L
192.784 83.095 L
193.001 83.33 L
193.218 83.569 L
193.435 83.81 L
193.652 84.054 L
193.869 84.3 L
194.086 84.55 L
194.303 84.802 L
194.52 85.057 L
194.737 85.315 L
194.954 85.576 L
195.171 85.839 L
195.388 86.106 L
195.605 86.375 L
195.822 86.647 L
196.039 86.922 L
196.256 87.2 L
196.473 87.481 L
196.69 87.765 L
196.907 88.052 L
197.124 88.342 L
197.341 88.635 L
197.558 88.93 L
197.775 89.229 L
197.992 89.531 L
198.209 89.836 L
198.426 90.144 L
198.643 90.455 L
198.86 90.769 L
199.077 91.086 L
199.294 91.406 L
199.511 91.73 L
199.728 92.056 L
199.945 92.386 L
200.162 92.718 L
200.379 93.054 L
200.596 93.393 L
200.813 93.735 L
201.03 94.081 L
201.247 94.429 L
201.464 94.781 L
201.681 95.136 L
201.898 95.494 L
202.115 95.855 L
202.332 96.22 L
202.549 96.588 L
202.766 96.959 L
202.983 97.333 L
203.2 97.711 L
203.417 98.092 L
203.634 98.476 L
203.851 98.863 L
204.068 99.254 L
204.285 99.648 L
204.502 100.046 L
204.719 100.446 L
204.936 100.85 L
205.153 101.258 L
205.37 101.668 L
205.587 102.083 L
205.804 102.5 L
206.021 102.921 L
206.238 103.345 L
206.455 103.772 L
206.672 104.203 L
206.889 104.638 L
207.106 105.075 L
207.323 105.516 L
207.54 105.961 L
207.757 106.409 L
207.974 106.86 L
208.191 107.315 L
208.408 107.773 L
208.625 108.234 L
208.842 108.699 L
209.059 109.168 L
209.276 109.64 L
209.493 110.115 L
209.71 110.594 L
209.927 111.076 L
210.144 111.562 L
210.361 112.051 L
210.578 112.543 L
210.795 113.039 L
211.012 113.539 L
211.229 114.042 L
211.446 114.549 L
211.663 115.058 L
211.88 115.572 L
212.097 116.089 L
212.314 116.609 L
212.531 117.133 L
212.748 117.661 L
212.965 118.192 L
213.182 118.726 L
213.399 119.264 L
213.616 119.805 L
213.833 120.35 L
214.05 120.899 L
214.267 121.451 L
214.484 122.006 L
214.701 122.565 L
214.918 123.128 L
215.135 123.694 L
215.352 124.264 L
215.569 124.837 L
215.786 125.413 L
216.003 125.994 L
216.22 126.577 L
216.437 127.165 L
216.654 127.755 L
216.871 128.35 L
217.088 128.948 L
217.305 129.549 L
217.522 130.154 L
217.739 130.762 L
217.956 131.374 L
218.173 131.99 L
218.39 132.609 L
218.607 133.232 L
218.824 133.858 L
219.041 134.488 L
219.258 135.121 L
219.475 135.758 L
219.692 136.398 L
219.909 137.042 L
220.126 137.689 L
220.343 138.34 L
220.56 138.995 L
220.777 139.653 L
220.994 140.314 L
221.211 140.98 L
221.428 141.648 L
221.645 142.32 L
221.862 142.996 L
222.079 143.675 L
222.296 144.358 L
222.513 145.044 L
222.73 145.733 L
222.947 146.427 L
223.164 147.123 L
223.381 147.823 L
223.598 148.527 L
223.815 149.234 L
224.032 149.944 L
224.249 150.658 L
224.466 151.375 L
224.683 152.096 L
224.9 152.82 L
225.117 153.548 L
225.334 154.279 L
225.551 155.013 L
225.768 155.751 L
225.985 156.492 L
226.202 157.236 L
226.419 157.984 L
226.636 158.735 L
226.853 159.489 L
227.07 160.246 L
227.287 161.007 L
227.504 161.771 L
227.721 162.538 L
227.938 163.309 L
228.155 164.082 L
228.372 164.859 L
228.589 165.638 L
228.806 166.421 L
229.023 167.207 L
229.24 167.996 L
229.457 168.788 L
229.674 169.582 L
229.891 170.38 L
230.108 171.181 L
230.325 171.984 L
230.542 172.791 L
230.759 173.6 L
230.976 174.412 L
231.193 175.226 L
231.41 176.044 L
231.627 176.864 L
231.844 177.686 L
232.061 178.511 L
232.278 179.339 L
232.495 180.169 L
232.712 181.002 L
232.929 181.837 L
233.146 182.674 L
233.363 183.514 L
233.58 184.356 L
233.797 185.2 L
234.014 186.046 L
234.231 186.894 L
234.448 187.745 L
234.665 188.597 L
234.882 189.451 L
235.099 190.307 L
235.316 191.165 L
235.533 192.025 L
235.75 192.886 L
235.967 193.749 L
236.184 194.614 L
236.401 195.48 L
236.618 196.347 L
236.835 197.216 L
237.052 198.087 L
237.269 198.958 L
237.486 199.831 L
237.703 200.704 L
237.92 201.579 L
238.137 202.455 L
238.354 203.332 L
238.571 204.209 L
238.788 205.088 L
239.005 205.967 L
239.222 206.846 L
239.439 207.727 L
239.656 208.607 L
239.873 209.488 L
240.09 210.37 L
240.307 211.251 L
240.524 212.133 L
240.741 213.015 L
240.958 213.897 L
241.175 214.779 L
241.392 215.661 L
241.609 216.543 L
241.826 217.424 L
242.043 218.305 L
242.26 219.186 L
242.477 220.066 L
242.694 220.946 L
242.911 221.825 L
243.128 222.703 L
243.345 223.581 L
243.562 224.457 L
243.779 225.333 L
243.996 226.208 L
244.213 227.081 L
244.43 227.954 L
244.647 228.825 L
244.864 229.695 L
245.081 230.564 L
245.298 231.431 L
245.515 232.296 L
245.732 233.16 L
245.949 234.023 L
246.166 234.883 L
246.383 235.742 L
246.6 236.599 L
246.817 237.454 L
247.034 238.308 L
247.251 239.159 L
247.468 240.008 L
247.685 240.855 L
247.902 241.699 L
248.119 242.541 L
248.336 243.381 L
248.553 244.219 L
248.77 245.054 L
248.987 245.886 L
249.204 246.716 L
249.421 247.543 L
249.638 248.368 L
249.855 249.19 L
250.072 250.009 L
250.289 250.825 L
250.506 251.638 L
250.723 252.449 L
250.94 253.256 L
251.157 254.06 L
251.374 254.861 L
251.591 255.659 L
251.808 256.454 L
252.025 257.246 L
252.242 258.034 L
252.459 258.819 L
252.676 259.601 L
252.893 260.38 L
253.11 261.155 L
253.327 261.926 L
253.544 262.694 L
253.761 263.459 L
253.978 264.22 L
254.195 264.977 L
254.412 265.731 L
254.629 266.481 L
254.846 267.228 L
255.063 267.971 L
255.28 268.71 L
255.497 269.445 L
255.714 270.177 L
255.931 270.905 L
256.148 271.629 L
256.365 272.349 L
256.582 273.065 L
256.799 273.778 L
257.016 274.486 L
257.233 275.191 L
257.45 275.892 L
257.667 276.589 L
257.884 277.282 L
258.101 277.971 L
258.318 278.656 L
258.535 279.338 L
258.752 280.015 L
258.969 280.688 L
259.186 281.357 L
259.403 282.022 L
259.62 282.684 L
259.837 283.341 L
260.054 283.994 L
260.271 284.643 L
260.488 285.289 L
260.705 285.93 L
260.922 286.567 L
261.139 287.2 L
261.356 287.829 L
261.573 288.454 L
261.79 289.075 L
262.007 289.692 L
262.224 290.305 L
262.441 290.914 L
262.658 291.519 L
262.875 292.12 L
263.092 292.717 L
263.309 293.31 L
263.526 293.899 L
263.743 294.484 L
263.96 295.065 L
264.177 295.642 L
264.394 296.215 L
264.611 296.784 L
264.828 297.349 L
265.045 297.91 L
265.262 298.468 L
265.479 299.021 L
265.696 299.57 L
265.913 300.115 L
266.13 300.657 L
266.347 301.194 L
266.564 301.728 L
266.781 302.257 L
266.998 302.783 L
267.215 303.305 L
267.432 303.823 L
267.649 304.337 L
267.866 304.847 L
268.083 305.353 L
268.3 305.856 L
268.517 306.354 L
268.734 306.849 L
268.951 307.34 L
269.168 307.827 L
269.385 308.309 L
269.602 308.789 L
269.819 309.264 L
270.036 309.735 L
270.253 310.202 L
270.47 310.666 L
270.687 311.126 L
270.904 311.581 L
271.121 312.033 L
271.338 312.48 L
271.555 312.924 L
271.772 313.364 L
271.989 313.799 L
272.206 314.231 L
272.423 314.658 L
272.64 315.082 L
272.857 315.501 L
273.074 315.916 L
273.291 316.327 L
273.508 316.733 L
273.725 317.136 L
273.942 317.534 L
274.159 317.928 L
274.376 318.318 L
274.593 318.703 L
274.81 319.084 L
275.027 319.461 L
275.244 319.834 L
275.461 320.202 L
275.678 320.567 L
275.895 320.927 L
276.112 321.284 L
276.329 321.636 L
276.546 321.985 L
276.763 322.33 L
276.98 322.672 L
277.197 323.01 L
277.414 323.345 L
277.631 323.676 L
277.848 324.005 L
278.065 324.33 L
278.282 324.652 L
278.499 324.971 L
278.716 325.288 L
278.933 325.602 L
279.15 325.913 L
279.367 326.221 L
279.584 326.527 L
279.801 326.831 L
280.018 327.132 L
280.235 327.431 L
280.452 327.728 L
280.669 328.023 L
280.886 328.315 L
281.103 328.605 L
281.32 328.893 L
281.537 329.18 L
281.754 329.464 L
281.971 329.746 L
282.188 330.026 L
282.405 330.305 L
282.622 330.581 L
282.839 330.856 L
283.056 331.129 L
283.273 331.4 L
283.49 331.67 L
283.707 331.937 L
283.924 332.203 L
284.141 332.467 L
284.358 332.73 L
284.575 332.991 L
284.792 333.25 L
285.009 333.508 L
285.226 333.764 L
285.443 334.019 L
285.66 334.272 L
285.877 334.523 L
286.094 334.773 L
286.311 335.021 L
286.528 335.268 L
286.745 335.513 L
286.962 335.757 L
287.179 336 L
287.396 336.241 L
287.613 336.48 L
287.83 336.718 L
288.047 336.955 L
288.264 337.19 L
288.481 337.424 L
288.698 337.657 L
288.915 337.888 L
289.132 338.118 L
289.349 338.346 L
289.566 338.573 L
289.783 338.799 L
290 339.023 L
290.217 339.246 L
290.434 339.468 L
290.651 339.689 L
290.868 339.908 L
291.085 340.126 L
291.302 340.342 L
291.519 340.558 L
291.736 340.772 L
291.953 340.985 L
292.17 341.197 L
292.387 341.407 L
292.604 341.616 L
292.821 341.824 L
293.038 342.031 L
293.255 342.237 L
293.472 342.441 L
293.689 342.645 L
293.906 342.847 L
294.123 343.048 L
294.34 343.248 L
294.557 343.446 L
294.774 343.644 L
294.991 343.84 L
295.208 344.035 L
295.425 344.229 L
295.642 344.422 L
295.859 344.614 L
296.076 344.805 L
296.293 344.995 L
296.51 345.183 L
296.727 345.371 L
296.944 345.557 L
297.161 345.743 L
297.378 345.927 L
297.595 346.11 L
297.812 346.292 L
298.029 346.473 L
298.246 346.654 L
298.463 346.833 L
298.68 347.011 L
298.897 347.188 L
299.114 347.364 L
299.331 347.539 L
299.548 347.712 L
299.765 347.885 L
299.982 348.057 L
300.199 348.228 L
300.416 348.398 L
300.633 348.567 L
300.85 348.735 L
301.067 348.902 L
301.284 349.068 L
301.501 349.233 L
301.718 349.398 L
301.935 349.561 L
302.152 349.723 L
302.369 349.884 L
302.586 350.045 L
302.803 350.204 L
303.02 350.363 L
303.237 350.52 L
303.454 350.677 L
303.671 350.832 L
303.888 350.987 L
304.105 351.141 L
304.322 351.294 L
304.539 351.446 L
304.756 351.597 L
304.973 351.748 L
305.19 351.897 L
305.407 352.046 L
305.624 352.193 L
305.841 352.34 L
306.058 352.486 L
306.275 352.631 L
306.492 352.775 L
306.709 352.919 L
306.926 353.061 L
307.143 353.203 L
307.36 353.344 L
307.577 353.483 L
307.794 353.623 L
308.011 353.761 L
308.228 353.898 L
308.445 354.035 L
308.662 354.171 L
308.879 354.306 L
309.096 354.44 L
309.313 354.573 L
309.53 354.706 L
309.747 354.837 L
309.964 354.968 L
310.181 355.098 L
310.398 355.228 L
310.615 355.356 L
310.832 355.484 L
311.049 355.611 L
311.266 355.737 L
311.483 355.862 L
311.7 355.987 L
311.917 356.111 L
312.134 356.234 L
312.351 356.356 L
312.568 356.478 L
312.785 356.599 L
313.002 356.719 L
313.219 356.838 L
313.436 356.957 L
313.653 357.074 L
313.87 357.191 L
314.087 357.308 L
314.304 357.423 L
314.521 357.538 L
314.738 357.652 L
314.955 357.766 L
315.172 357.879 L
315.389 357.991 L
315.606 358.102 L
315.823 358.212 L
316.04 358.322 L
316.257 358.432 L
316.474 358.54 L
316.691 358.648 L
316.908 358.755 L
317.125 358.861 L
317.342 358.967 L
317.559 359.072 L
317.776 359.177 L
317.993 359.28 L
318.21 359.383 L
318.427 359.486 L
318.644 359.587 L
318.861 359.688 L
319.078 359.789 L
319.295 359.889 L
319.512 359.988 L
319.729 360.086 L
319.946 360.184 L
320.163 360.281 L
320.38 360.377 L
320.597 360.473 L
320.814 360.569 L
321.031 360.663 L
321.248 360.757 L
321.465 360.851 L
321.682 360.943 L
321.899 361.035 L
322.116 361.127 L
322.333 361.218 L
322.55 361.308 L
322.767 361.398 L
322.984 361.487 L
323.201 361.576 L
323.418 361.663 L
323.635 361.751 L
323.852 361.838 L
324.069 361.924 L
324.286 362.009 L
324.503 362.094 L
324.72 362.179 L
324.937 362.263 L
325.154 362.346 L
325.371 362.429 L
325.588 362.511 L
325.805 362.593 L
326.022 362.674 L
326.239 362.754 L
326.456 362.834 L
326.673 362.914 L
326.89 362.993 L
327.107 363.071 L
327.324 363.149 L
327.541 363.226 L
327.758 363.303 L
327.975 363.379 L
328.192 363.455 L
328.409 363.53 L
328.626 363.605 L
328.843 363.679 L
329.06 363.753 L
329.277 363.826 L
329.494 363.898 L
329.711 363.971 L
329.928 364.042 L
330.145 364.113 L
330.362 364.184 L
330.579 364.254 L
330.796 364.324 L
331.013 364.393 L
331.23 364.462 L
331.447 364.53 L
331.664 364.598 L
331.881 364.665 L
332.098 364.732 L
332.315 364.799 L
332.532 364.865 L
332.749 364.93 L
332.966 364.995 L
333.183 365.06 L
333.4 365.124 L
333.617 365.188 L
333.834 365.251 L
334.051 365.314 L
334.268 365.376 L
334.485 365.438 L
334.702 365.499 L
334.919 365.56 L
335.136 365.621 L
335.353 365.681 L
335.57 365.741 L
335.787 365.8 L
336.004 365.859 L
336.221 365.918 L
336.438 365.976 L
336.655 366.034 L
336.872 366.091 L
337.089 366.148 L
337.306 366.205 L
337.523 366.261 L
337.74 366.317 L
337.957 366.372 L
338.174 366.427 L
338.391 366.482 L
338.608 366.536 L
338.825 366.59 L
339.042 366.643 L
339.259 366.696 L
339.476 366.749 L
339.693 366.801 L
339.91 366.853 L
340.127 366.905 L
340.344 366.956 L
340.561 367.007 L
340.778 367.057 L
340.995 367.107 L
341.212 367.157 L
341.429 367.207 L
341.646 367.256 L
341.863 367.305 L
342.08 367.353 L
342.297 367.401 L
342.514 367.449 L
342.731 367.496 L
342.948 367.543 L
343.165 367.59 L
343.382 367.637 L
343.599 367.683 L
343.816 367.729 L
344.033 367.774 L
344.25 367.819 L
344.467 367.864 L
344.684 367.908 L
344.901 367.953 L
345.118 367.997 L
345.335 368.04 L
345.552 368.083 L
345.769 368.126 L
345.986 368.169 L
346.203 368.211 L
346.42 368.254 L
346.637 368.295 L
346.854 368.337 L
347.071 368.378 L
347.288 368.419 L
347.505 368.46 L
347.722 368.5 L
347.939 368.54 L
348.156 368.58 L
348.373 368.619 L
348.59 368.659 L
348.807 368.697 L
349.024 368.736 L
349.241 368.775 L
349.458 368.813 L
349.675 368.851 L
349.892 368.888 L
350.109 368.926 L
350.326 368.963 L
350.543 368.999 L
350.76 369.036 L
350.977 369.072 L
351.194 369.108 L
351.411 369.144 L
351.628 369.18 L
351.845 369.215 L
352.062 369.25 L
352.279 369.285 L
352.496 369.32 L
352.713 369.354 L
352.93 369.388 L
353.147 369.422 L
353.364 369.456 L
353.581 369.489 L
353.798 369.522 L
354.015 369.555 L
354.232 369.588 L
354.449 369.62 L
354.666 369.653 L
354.883 369.685 L
355.1 369.717 L
355.317 369.748 L
355.534 369.78 L
355.751 369.811 L
355.968 369.842 L
356.185 369.872 L
356.402 369.903 L
356.619 369.933 L
356.836 369.963 L
357.053 369.993 L
357.27 370.023 L
357.487 370.052 L
357.704 370.082 L
357.921 370.111 L
358.138 370.14 L
358.355 370.168 L
358.572 370.197 L
358.789 370.225 L
359.006 370.253 L
359.223 370.281 L
359.44 370.309 L
359.657 370.337 L
359.874 370.364 L
360.091 370.391 L
360.308 370.418 L
360.525 370.445 L
360.742 370.471 L
360.959 370.498 L
361.176 370.524 L
361.393 370.55 L
361.61 370.576 L
361.827 370.602 L
362.044 370.627 L
362.261 370.653 L
362.478 370.678 L
362.695 370.703 L
362.912 370.728 L
363.129 370.752 L
363.346 370.777 L
363.563 370.801 L
363.78 370.825 L
363.997 370.849 L
364.214 370.873 L
364.431 370.897 L
364.648 370.92 L
364.865 370.944 L
365.082 370.967 L
365.299 370.99 L
365.516 371.013 L
365.733 371.036 L
365.95 371.058 L
366.167 371.081 L
366.384 371.103 L
366.601 371.125 L
366.818 371.147 L
367.035 371.169 L
367.252 371.19 L
367.469 371.212 L
367.686 371.233 L
367.903 371.255 L
368.12 371.276 L
368.337 371.297 L
368.554 371.317 L
368.771 371.338 L
368.988 371.359 L
369.205 371.379 L
369.422 371.399 L
369.639 371.419 L
369.856 371.439 L
370.073 371.459 L
370.29 371.479 L
370.507 371.499 L
370.724 371.518 L
370.941 371.537 L
371.158 371.557 L
371.375 371.576 L
371.592 371.595 L
371.809 371.613 L
372.026 371.632 L
372.243 371.651 L
372.46 371.669 L
372.677 371.687 L
372.894 371.706 L
373.111 371.724 L
373.328 371.742 L
373.545 371.759 L
373.762 371.777 L
373.979 371.795 L
374.196 371.812 L
374.413 371.829 L
374.63 371.847 L
374.847 371.864 L
375.064 371.881 L
375.281 371.898 L
375.498 371.914 L
375.715 371.931 L
375.932 371.948 L
376.149 371.964 L
376.366 371.98 L
376.583 371.997 L
376.8 372.013 L
377.017 372.029 L
377.234 372.045 L
377.451 372.06 L
377.668 372.076 L
377.885 372.092 L
378.102 372.107 L
378.319 372.122 L
378.536 372.138 L
378.753 372.153 L
378.97 372.168 L
379.187 372.183 L
379.404 372.198 L
379.621 372.213 L
379.838 372.227 L
380.055 372.242 L
380.272 372.256 L
380.489 372.271 L
380.706 372.285 L
380.923 372.299 L
381.14 372.313 L
381.357 372.327 L
381.574 372.341 L
381.791 372.355 L
382.008 372.369 L
382.225 372.382 L
382.442 372.396 L
382.659 372.409 L
382.876 372.422 L
383.093 372.436 L
383.31 372.449 L
383.527 372.462 L
383.744 372.475 L
383.961 372.488 L
384.178 372.501 L
384.395 372.513 L
384.612 372.526 L
384.829 372.539 L
385.046 372.551 L
385.263 372.564 L
385.48 372.576 L
385.697 372.588 L
385.914 372.6 L
386.131 372.612 L
386.348 372.624 L
386.565 372.636 L
386.782 372.648 L
386.999 372.66 L
387.216 372.671 L
387.433 372.683 L
387.65 372.695 L
387.867 372.706 L
388.084 372.717 L
388.301 372.729 L
388.518 372.74 L
388.735 372.751 L
388.952 372.762 L
389.169 372.773 L
389.386 372.784 L
389.603 372.795 L
389.82 372.806 L
390.037 372.816 L
390.254 372.827 L
390.471 372.837 L
390.688 372.848 L
390.905 372.858 L
391.122 372.868 L
391.339 372.879 L
391.556 372.889 L
391.773 372.899 L
391.99 372.909 L
392.207 372.919 L
392.424 372.929 L
392.641 372.939 L
392.858 372.949 L
393.075 372.958 L
393.292 372.968 L
393.509 372.977 L
393.726 372.987 L
393.943 372.996 L
394.16 373.006 L
394.377 373.015 L
394.594 373.024 L
394.811 373.033 L
395.028 373.042 L
395.245 373.051 L
395.462 373.06 L
395.679 373.069 L
395.896 373.078 L
396.113 373.087 L
396.33 373.096 L
396.547 373.104 L
396.764 373.113 L
396.981 373.121 L
397.198 373.13 L
397.415 373.138 L
397.632 373.147 L
397.849 373.155 L
398.066 373.163 L
398.283 373.171 L
398.5 373.179 L
398.717 373.187 L
398.934 373.195 L
399.151 373.203 L
399.368 373.211 L
399.585 373.219 L
399.802 373.226 L
400.019 373.234 L
400.236 373.242 L
400.453 373.249 L
400.67 373.257 L
400.887 373.264 L
401.104 373.272 L
401.321 373.279 L
401.538 373.286 L
401.755 373.293 L
401.972 373.301 L
402.189 373.308 L
402.406 373.315 L
402.623 373.322 L
402.84 373.329 L
403.057 373.336 L
403.274 373.342 L
403.491 373.349 L
403.708 373.356 L
403.925 373.362 L
404.142 373.369 L
404.359 373.376 L
404.576 373.382 L
404.793 373.389 L
405.01 373.395 L
405.227 373.401 L
405.444 373.408 L
405.661 373.414 L
405.878 373.42 L
406.095 373.426 L
406.312 373.432 L
406.529 373.438 L
406.746 373.444 L
406.963 373.45 L
407.18 373.456 L
407.397 373.462 L
407.614 373.468 L
407.831 373.473 L
408.048 373.479 L
408.265 373.485 L
408.482 373.49 L
408.699 373.496 L
408.916 373.501 L
409.133 373.507 L
409.35 373.512 L
409.567 373.517 L
409.784 373.523 L
410.001 373.528 L
410.218 373.533 L
410.435 373.538 L
410.652 373.543 L
410.869 373.548 L
411.086 373.553 L
411.303 373.558 L
411.52 373.563 L
411.737 373.568 L
411.954 373.573 L
412.171 373.578 L
412.388 373.583 L
412.605 373.587 L
412.822 373.592 L
413.039 373.596 L
413.256 373.601 L
413.473 373.606 L
413.69 373.61 L
413.907 373.615 L
414.124 373.619 L
414.341 373.623 L
414.558 373.628 L
414.775 373.632 L
414.992 373.636 L
415.209 373.64 L
415.426 373.644 L
415.643 373.648 L
415.86 373.653 L
416.077 373.657 L
416.294 373.661 L
416.511 373.665 L
416.728 373.668 L
416.945 373.672 L
417.162 373.676 L
417.379 373.68 L
417.596 373.684 L
417.813 373.687 L
418.03 373.691 L
418.247 373.695 L
418.464 373.698 L
418.681 373.702 L
418.898 373.705 L
419.115 373.709 L
419.332 373.712 L
419.549 373.716 L
419.766 373.719 L
419.983 373.723 L
420.2 373.726 L
420.417 373.729 L
420.634 373.732 L
420.851 373.736 L
421.068 373.739 L
421.285 373.742 L
421.502 373.745 L
421.719 373.748 L
421.936 373.751 L
422.153 373.754 L
422.37 373.757 L
422.587 373.76 L
422.804 373.763 L
423.021 373.766 L
423.238 373.769 L
423.455 373.772 L
423.672 373.774 L
423.889 373.777 L
424.106 373.78 L
424.323 373.783 L
424.54 373.785 L
424.757 373.788 L
424.974 373.79 L
425.191 373.793 L
425.408 373.796 L
425.625 373.798 L
425.842 373.801 L
426.059 373.803 L
426.276 373.806 L
426.493 373.808 L
426.71 373.81 L
426.927 373.813 L
427.144 373.815 L
427.361 373.817 L
427.578 373.82 L
427.795 373.822 L
428.012 373.824 L
428.229 373.826 L
428.446 373.829 L
428.663 373.831 L
428.88 373.833 L
429.097 373.835 L
429.314 373.837 L
429.531 373.839 L
429.748 373.841 L
429.965 373.843 L
430.182 373.845 L
430.399 373.847 L
430.616 373.849 L
430.833 373.851 L
431.05 373.853 L
431.267 373.855 L
431.484 373.857 L
431.701 373.858 L
431.918 373.86 L
432.135 373.862 L
432.352 373.864 L
432.569 373.865 L
432.786 373.867 L
433.003 373.869 L
433.22 373.871 L
433.437 373.872 L
433.654 373.874 L
433.871 373.875 L
434.088 373.877 L
434.305 373.879 L
434.522 373.88 L
434.739 373.882 L
434.956 373.883 L
435.173 373.885 L
435.39 373.886 L
435.607 373.888 L
435.824 373.889 L
436.041 373.891 L
436.258 373.892 L
436.475 373.893 L
436.692 373.895 L
436.909 373.896 L
437.126 373.898 L
437.343 373.899 L
437.56 373.9 L
437.777 373.901 L
437.994 373.903 L
438.211 373.904 L
438.428 373.905 L
438.645 373.907 L
438.862 373.908 L
439.079 373.909 L
439.296 373.91 L
439.513 373.911 L
439.73 373.913 L
439.947 373.914 L
440.164 373.915 L
440.381 373.916 L
440.598 373.917 L
440.815 373.918 L
441.032 373.919 L
441.249 373.92 L
441.466 373.921 L
441.683 373.922 L
441.9 373.923 L
442.117 373.924 L
442.334 373.925 L
442.551 373.926 L
442.768 373.927 L
442.985 373.928 L
443.202 373.929 L
443.419 373.93 L
443.636 373.931 L
443.853 373.932 L
444.07 373.933 L
444.287 373.934 L
444.504 373.935 L
444.721 373.936 L
444.938 373.936 L
445.155 373.937 L
445.372 373.938 L
445.589 373.939 L
445.806 373.94 L
446.023 373.94 L
446.24 373.941 L
446.457 373.942 L
446.674 373.943 L
446.891 373.944 L
447.108 373.944 L
447.325 373.945 L
447.542 373.946 L
447.759 373.947 L
447.976 373.947 L
448.193 373.948 L
448.41 373.949 L
448.627 373.949 L
448.844 373.95 L
449.061 373.951 L
449.278 373.951 L
449.495 373.952 L
449.712 373.953 L
449.929 373.953 L
450.146 373.954 L
450.363 373.955 L
450.58 373.955 L
450.797 373.956 L
451.014 373.956 L
451.231 373.957 L
451.448 373.957 L
451.665 373.958 L
451.882 373.959 L
452.099 373.959 L
452.316 373.96 L
452.533 373.96 L
452.75 373.961 L
452.967 373.961 L
453.184 373.962 L
453.401 373.962 L
453.618 373.963 L
453.835 373.963 L
454.052 373.964 L
454.269 373.964 L
454.486 373.965 L
454.703 373.965 L
454.92 373.966 L
455.137 373.966 L
455.354 373.967 L
455.571 373.967 L
455.788 373.968 L
456.005 373.968 L
456.222 373.968 L
456.439 373.969 L
456.656 373.969 L
456.873 373.97 L
457.09 373.97 L
457.307 373.971 L
457.524 373.971 L
457.741 373.971 L
457.958 373.972 L
458.175 373.972 L
458.392 373.972 L
458.609 373.973 L
458.826 373.973 L
459.043 373.974 L
459.26 373.974 L
459.477 373.974 L
459.694 373.975 L
459.911 373.975 L
460.128 373.975 L
460.345 373.976 L
460.562 373.976 L
460.779 373.976 L
460.996 373.977 L
461.213 373.977 L
461.43 373.977 L
461.647 373.978 L
461.864 373.978 L
462.081 373.978 L
462.298 373.978 L
462.515 373.979 L
462.732 373.979 L
462.949 373.979 L
463.166 373.98 L
463.383 373.98 L
463.6 373.98 L
463.817 373.98 L
464.034 373.981 L
464.251 373.981 L
464.468 373.981 L
464.685 373.981 L
464.902 373.982 L
465.119 373.982 L
465.336 373.982 L
465.553 373.982 L
465.77 373.983 L
465.987 373.983 L
466.204 373.983 L
466.421 373.983 L
466.638 373.984 L
466.855 373.984 L
467.072 373.984 L
467.289 373.984 L
467.506 373.984 L
467.723 373.985 L
467.94 373.985 L
468.157 373.985 L
468.374 373.985 L
468.591 373.986 L
468.808 373.986 L
469.025 373.986 L
469.242 373.986 L
469.459 373.986 L
469.676 373.986 L
469.893 373.987 L
470.11 373.987 L
470.327 373.987 L
470.544 373.987 L
470.761 373.987 L
470.978 373.988 L
471.195 373.988 L
471.412 373.988 L
471.629 373.988 L
471.846 373.988 L
472.063 373.988 L
472.28 373.989 L
472.497 373.989 L
472.714 373.989 L
472.931 373.989 L
473.148 373.989 L
473.365 373.989 L
473.582 373.989 L
473.799 373.99 L
474.016 373.99 L
474.233 373.99 L
474.45 373.99 L
474.667 373.99 L
474.884 373.99 L
475.101 373.99 L
475.318 373.991 L
475.535 373.991 L
475.752 373.991 L
475.969 373.991 L
476.186 373.991 L
476.403 373.991 L
476.62 373.991 L
476.837 373.991 L
477.054 373.992 L
477.271 373.992 L
477.488 373.992 L
477.705 373.992 L
477.922 373.992 L
478.139 373.992 L
478.356 373.992 L
478.573 373.992 L
478.79 373.992 L
479.007 373.993 L
479.224 373.993 L
479.441 373.993 L
479.658 373.993 L
479.875 373.993 L
480.092 373.993 L
480.309 373.993 L
480.526 373.993 L
480.743 373.993 L
480.96 373.993 L
481.177 373.993 L
481.394 373.994 L
481.611 373.994 L
481.828 373.994 L
482.045 373.994 L
482.262 373.994 L
482.479 373.994 L
482.696 373.994 L
482.913 373.994 L
483.13 373.994 L
483.347 373.994 L
483.564 373.994 L
483.781 373.994 L
483.998 373.995 L
484.215 373.995 L
484.432 373.995 L
484.649 373.995 L
484.866 373.995 L
485.083 373.995 L
485.3 373.995 L
485.517 373.995 L
485.734 373.995 L
485.951 373.995 L
486.168 373.995 L
486.385 373.995 L
486.602 373.995 L
486.819 373.995 L
487.036 373.996 L
487.253 373.996 L
487.47 373.996 L
487.687 373.996 L
487.904 373.996 L
488.121 373.996 L
488.338 373.996 L
488.555 373.996 L
488.772 373.996 L
488.989 373.996 L
489.206 373.996 L
489.423 373.996 L
489.64 373.996 L
489.857 373.996 L
490.074 373.996 L
490.291 373.996 L
490.508 373.996 L
490.725 373.996 L
490.942 373.996 L
491.159 373.997 L
491.376 373.997 L
491.593 373.997 L
491.81 373.997 L
492.027 373.997 L
492.244 373.997 L
492.461 373.997 L
492.678 373.997 L
492.895 373.997 L
493.112 373.997 L
493.329 373.997 L
493.546 373.997 L
493.763 373.997 L
493.98 373.997 L
494.197 373.997 L
494.414 373.997 L
494.631 373.997 L
494.848 373.997 L
495.065 373.997 L
495.282 373.997 L
495.499 373.997 L
495.716 373.997 L
495.933 373.997 L
496.15 373.997 L
496.367 373.998 L
496.584 373.998 L
496.801 373.998 L
497.018 373.998 L
497.235 373.998 L
497.452 373.998 L
497.669 373.998 L
497.886 373.998 L
498.103 373.998 L
498.32 373.998 L
498.537 373.998 L
498.754 373.998 L
498.971 373.998 L
499.188 373.998 L
499.405 373.998 L
499.622 373.998 L
499.839 373.998 L
500.056 373.998 L
500.273 373.998 L
500.49 373.998 L
500.707 373.998 L
500.924 373.998 L
501.141 373.998 L
501.358 373.998 L
501.575 373.998 L
501.792 373.998 L
502.009 373.998 L
502.226 373.998 L
502.443 373.998 L
502.66 373.998 L
502.877 373.998 L
503.094 373.998 L
503.311 373.998 L
503.528 373.998 L
503.745 373.998 L
503.962 373.998 L
504.179 373.998 L
504.396 373.999 L
504.613 373.999 L
504.83 373.999 L
505.047 373.999 L
505.264 373.999 L
505.481 373.999 L
505.698 373.999 L
505.915 373.999 L
506.132 373.999 L
506.349 373.999 L
506.566 373.999 L
506.783 373.999 L
507 373.999 L
S
GR
%%Trailer
%%Pages: 1
%%EOF
