%!PS-Adobe-3.0 EPSF-3.0
%%Creator: (MATLAB, The Mathworks, Inc. Version 9.1.0.441655 \(R2016b\). Operating System: Windows 7)
%%Title: C:/Users/June/Documents/GitKraken/rls-2017/sp6/figures/hsvd.eps
%%CreationDate: 2018-03-04T23:19:18
%%Pages: (atend)
%%BoundingBox: 0 0 420 315
%%LanguageLevel: 3
%%EndComments
%%BeginProlog
%%BeginResource: procset (Apache XML Graphics Std ProcSet) 1.2 0
%%Version: 1.2 0
%%Copyright: (Copyright 2001-2003,2010 The Apache Software Foundation. License terms: http://www.apache.org/licenses/LICENSE-2.0)
/bd{bind def}bind def
/ld{load def}bd
/GR/grestore ld
/M/moveto ld
/LJ/setlinejoin ld
/C/curveto ld
/f/fill ld
/LW/setlinewidth ld
/GC/setgray ld
/t/show ld
/N/newpath ld
/CT/concat ld
/cp/closepath ld
/S/stroke ld
/L/lineto ld
/CC/setcmykcolor ld
/A/ashow ld
/GS/gsave ld
/RC/setrgbcolor ld
/RM/rmoveto ld
/ML/setmiterlimit ld
/re {4 2 roll M
1 index 0 rlineto
0 exch rlineto
neg 0 rlineto
cp } bd
/_ctm matrix def
/_tm matrix def
/BT { _ctm currentmatrix pop matrix _tm copy pop 0 0 moveto } bd
/ET { _ctm setmatrix } bd
/iTm { _ctm setmatrix _tm concat } bd
/Tm { _tm astore pop iTm 0 0 moveto } bd
/ux 0.0 def
/uy 0.0 def
/F {
  /Tp exch def
  /Tf exch def
  Tf findfont Tp scalefont setfont
  /cf Tf def  /cs Tp def
} bd
/ULS {currentpoint /uy exch def /ux exch def} bd
/ULE {
  /Tcx currentpoint pop def
  gsave
  newpath
  cf findfont cs scalefont dup
  /FontMatrix get 0 get /Ts exch def /FontInfo get dup
  /UnderlinePosition get Ts mul /To exch def
  /UnderlineThickness get Ts mul /Tt exch def
  ux uy To add moveto  Tcx uy To add lineto
  Tt setlinewidth stroke
  grestore
} bd
/OLE {
  /Tcx currentpoint pop def
  gsave
  newpath
  cf findfont cs scalefont dup
  /FontMatrix get 0 get /Ts exch def /FontInfo get dup
  /UnderlinePosition get Ts mul /To exch def
  /UnderlineThickness get Ts mul /Tt exch def
  ux uy To add cs add moveto Tcx uy To add cs add lineto
  Tt setlinewidth stroke
  grestore
} bd
/SOE {
  /Tcx currentpoint pop def
  gsave
  newpath
  cf findfont cs scalefont dup
  /FontMatrix get 0 get /Ts exch def /FontInfo get dup
  /UnderlinePosition get Ts mul /To exch def
  /UnderlineThickness get Ts mul /Tt exch def
  ux uy To add cs 10 mul 26 idiv add moveto Tcx uy To add cs 10 mul 26 idiv add lineto
  Tt setlinewidth stroke
  grestore
} bd
/QT {
/Y22 exch store
/X22 exch store
/Y21 exch store
/X21 exch store
currentpoint
/Y21 load 2 mul add 3 div exch
/X21 load 2 mul add 3 div exch
/X21 load 2 mul /X22 load add 3 div
/Y21 load 2 mul /Y22 load add 3 div
/X22 load /Y22 load curveto
} bd
/SSPD {
dup length /d exch dict def
{
/v exch def
/k exch def
currentpagedevice k known {
/cpdv currentpagedevice k get def
v cpdv ne {
/upd false def
/nullv v type /nulltype eq def
/nullcpdv cpdv type /nulltype eq def
nullv nullcpdv or
{
/upd true def
} {
/sametype v type cpdv type eq def
sametype {
v type /arraytype eq {
/vlen v length def
/cpdvlen cpdv length def
vlen cpdvlen eq {
0 1 vlen 1 sub {
/i exch def
/obj v i get def
/cpdobj cpdv i get def
obj cpdobj ne {
/upd true def
exit
} if
} for
} {
/upd true def
} ifelse
} {
v type /dicttype eq {
v {
/dv exch def
/dk exch def
/cpddv cpdv dk get def
dv cpddv ne {
/upd true def
exit
} if
} forall
} {
/upd true def
} ifelse
} ifelse
} if
} ifelse
upd true eq {
d k v put
} if
} if
} if
} forall
d length 0 gt {
d setpagedevice
} if
} bd
/RE { % /NewFontName [NewEncodingArray] /FontName RE -
  findfont dup length dict begin
  {
    1 index /FID ne
    {def} {pop pop} ifelse
  } forall
  /Encoding exch def
  /FontName 1 index def
  currentdict definefont pop
  end
} bind def
%%EndResource
%%BeginResource: procset (Apache XML Graphics EPS ProcSet) 1.0 0
%%Version: 1.0 0
%%Copyright: (Copyright 2002-2003 The Apache Software Foundation. License terms: http://www.apache.org/licenses/LICENSE-2.0)
/BeginEPSF { %def
/b4_Inc_state save def         % Save state for cleanup
/dict_count countdictstack def % Count objects on dict stack
/op_count count 1 sub def      % Count objects on operand stack
userdict begin                 % Push userdict on dict stack
/showpage { } def              % Redefine showpage, { } = null proc
0 setgray 0 setlinecap         % Prepare graphics state
1 setlinewidth 0 setlinejoin
10 setmiterlimit [ ] 0 setdash newpath
/languagelevel where           % If level not equal to 1 then
{pop languagelevel             % set strokeadjust and
1 ne                           % overprint to their defaults.
{false setstrokeadjust false setoverprint
} if
} if
} bd
/EndEPSF { %def
count op_count sub {pop} repeat            % Clean up stacks
countdictstack dict_count sub {end} repeat
b4_Inc_state restore
} bd
%%EndResource
%FOPBeginFontDict
%%IncludeResource: font Courier-Bold
%%IncludeResource: font Helvetica
%%IncludeResource: font Courier-BoldOblique
%%IncludeResource: font Courier-Oblique
%%IncludeResource: font Times-Roman
%%IncludeResource: font Helvetica-BoldOblique
%%IncludeResource: font Helvetica-Bold
%%IncludeResource: font Helvetica-Oblique
%%IncludeResource: font Times-BoldItalic
%%IncludeResource: font Courier
%%IncludeResource: font Times-Italic
%%IncludeResource: font Times-Bold
%%IncludeResource: font Symbol
%%IncludeResource: font ZapfDingbats
%FOPEndFontDict
%%BeginResource: encoding WinAnsiEncoding
/WinAnsiEncoding [
/.notdef /.notdef /.notdef /.notdef /.notdef
/.notdef /.notdef /.notdef /.notdef /.notdef
/.notdef /.notdef /.notdef /.notdef /.notdef
/.notdef /.notdef /.notdef /.notdef /.notdef
/.notdef /.notdef /.notdef /.notdef /.notdef
/.notdef /.notdef /.notdef /.notdef /.notdef
/.notdef /.notdef /space /exclam /quotedbl
/numbersign /dollar /percent /ampersand /quotesingle
/parenleft /parenright /asterisk /plus /comma
/hyphen /period /slash /zero /one
/two /three /four /five /six
/seven /eight /nine /colon /semicolon
/less /equal /greater /question /at
/A /B /C /D /E
/F /G /H /I /J
/K /L /M /N /O
/P /Q /R /S /T
/U /V /W /X /Y
/Z /bracketleft /backslash /bracketright /asciicircum
/underscore /quoteleft /a /b /c
/d /e /f /g /h
/i /j /k /l /m
/n /o /p /q /r
/s /t /u /v /w
/x /y /z /braceleft /bar
/braceright /asciitilde /bullet /Euro /bullet
/quotesinglbase /florin /quotedblbase /ellipsis /dagger
/daggerdbl /circumflex /perthousand /Scaron /guilsinglleft
/OE /bullet /Zcaron /bullet /bullet
/quoteleft /quoteright /quotedblleft /quotedblright /bullet
/endash /emdash /asciitilde /trademark /scaron
/guilsinglright /oe /bullet /zcaron /Ydieresis
/space /exclamdown /cent /sterling /currency
/yen /brokenbar /section /dieresis /copyright
/ordfeminine /guillemotleft /logicalnot /sfthyphen /registered
/macron /degree /plusminus /twosuperior /threesuperior
/acute /mu /paragraph /middot /cedilla
/onesuperior /ordmasculine /guillemotright /onequarter /onehalf
/threequarters /questiondown /Agrave /Aacute /Acircumflex
/Atilde /Adieresis /Aring /AE /Ccedilla
/Egrave /Eacute /Ecircumflex /Edieresis /Igrave
/Iacute /Icircumflex /Idieresis /Eth /Ntilde
/Ograve /Oacute /Ocircumflex /Otilde /Odieresis
/multiply /Oslash /Ugrave /Uacute /Ucircumflex
/Udieresis /Yacute /Thorn /germandbls /agrave
/aacute /acircumflex /atilde /adieresis /aring
/ae /ccedilla /egrave /eacute /ecircumflex
/edieresis /igrave /iacute /icircumflex /idieresis
/eth /ntilde /ograve /oacute /ocircumflex
/otilde /odieresis /divide /oslash /ugrave
/uacute /ucircumflex /udieresis /yacute /thorn
/ydieresis
] def
%%EndResource
%FOPBeginFontReencode
/Courier-Bold findfont
dup length dict begin
  {1 index /FID ne {def} {pop pop} ifelse} forall
  /Encoding WinAnsiEncoding def
  currentdict
end
/Courier-Bold exch definefont pop
/Helvetica findfont
dup length dict begin
  {1 index /FID ne {def} {pop pop} ifelse} forall
  /Encoding WinAnsiEncoding def
  currentdict
end
/Helvetica exch definefont pop
/Courier-BoldOblique findfont
dup length dict begin
  {1 index /FID ne {def} {pop pop} ifelse} forall
  /Encoding WinAnsiEncoding def
  currentdict
end
/Courier-BoldOblique exch definefont pop
/Courier-Oblique findfont
dup length dict begin
  {1 index /FID ne {def} {pop pop} ifelse} forall
  /Encoding WinAnsiEncoding def
  currentdict
end
/Courier-Oblique exch definefont pop
/Times-Roman findfont
dup length dict begin
  {1 index /FID ne {def} {pop pop} ifelse} forall
  /Encoding WinAnsiEncoding def
  currentdict
end
/Times-Roman exch definefont pop
/Helvetica-BoldOblique findfont
dup length dict begin
  {1 index /FID ne {def} {pop pop} ifelse} forall
  /Encoding WinAnsiEncoding def
  currentdict
end
/Helvetica-BoldOblique exch definefont pop
/Helvetica-Bold findfont
dup length dict begin
  {1 index /FID ne {def} {pop pop} ifelse} forall
  /Encoding WinAnsiEncoding def
  currentdict
end
/Helvetica-Bold exch definefont pop
/Helvetica-Oblique findfont
dup length dict begin
  {1 index /FID ne {def} {pop pop} ifelse} forall
  /Encoding WinAnsiEncoding def
  currentdict
end
/Helvetica-Oblique exch definefont pop
/Times-BoldItalic findfont
dup length dict begin
  {1 index /FID ne {def} {pop pop} ifelse} forall
  /Encoding WinAnsiEncoding def
  currentdict
end
/Times-BoldItalic exch definefont pop
/Courier findfont
dup length dict begin
  {1 index /FID ne {def} {pop pop} ifelse} forall
  /Encoding WinAnsiEncoding def
  currentdict
end
/Courier exch definefont pop
/Times-Italic findfont
dup length dict begin
  {1 index /FID ne {def} {pop pop} ifelse} forall
  /Encoding WinAnsiEncoding def
  currentdict
end
/Times-Italic exch definefont pop
/Times-Bold findfont
dup length dict begin
  {1 index /FID ne {def} {pop pop} ifelse} forall
  /Encoding WinAnsiEncoding def
  currentdict
end
/Times-Bold exch definefont pop
%FOPEndFontReencode
%%EndProlog
%%Page: 1 1
%%PageBoundingBox: 0 0 420 315
%%BeginPageSetup
[1 0 0 -1 0 315] CT
%%EndPageSetup
GS
[0.75 0 0 0.75 0 0] CT
1 GC
N
0 0 560 420 re
f
GR
GS
[0.75 0 0 0.75 0 0] CT
1 GC
N
0 0 560 420 re
f
GR
GS
[0.75 0 0 0.75 0 0] CT
1 GC
N
73 374 M
507 374 L
507 31 L
73 31 L
cp
f
GR
GS
[0.75 0 0 0.75 0 0] CT
0.873 GC
1 LJ
0.667 LW
N
73 374 M
73 31 L
S
GR
GS
[0.75 0 0 0.75 0 0] CT
0.873 GC
1 LJ
0.667 LW
N
114.333 374 M
114.333 31 L
S
GR
GS
[0.75 0 0 0.75 0 0] CT
0.873 GC
1 LJ
0.667 LW
N
155.667 374 M
155.667 31 L
S
GR
GS
[0.75 0 0 0.75 0 0] CT
0.873 GC
1 LJ
0.667 LW
N
197 374 M
197 31 L
S
GR
GS
[0.75 0 0 0.75 0 0] CT
0.873 GC
1 LJ
0.667 LW
N
238.333 374 M
238.333 31 L
S
GR
GS
[0.75 0 0 0.75 0 0] CT
0.873 GC
1 LJ
0.667 LW
N
279.667 374 M
279.667 31 L
S
GR
GS
[0.75 0 0 0.75 0 0] CT
0.873 GC
1 LJ
0.667 LW
N
321 374 M
321 31 L
S
GR
GS
[0.75 0 0 0.75 0 0] CT
0.873 GC
1 LJ
0.667 LW
N
362.333 374 M
362.333 31 L
S
GR
GS
[0.75 0 0 0.75 0 0] CT
0.873 GC
1 LJ
0.667 LW
N
403.667 374 M
403.667 31 L
S
GR
GS
[0.75 0 0 0.75 0 0] CT
0.873 GC
1 LJ
0.667 LW
N
445 374 M
445 31 L
S
GR
GS
[0.75 0 0 0.75 0 0] CT
0.873 GC
1 LJ
0.667 LW
N
486.333 374 M
486.333 31 L
S
GR
GS
[0.75 0 0 0.75 0 0] CT
0.873 GC
1 LJ
0.667 LW
N
507 374 M
73 374 L
S
GR
GS
[0.75 0 0 0.75 0 0] CT
0.873 GC
1 LJ
0.667 LW
N
507 316.833 M
73 316.833 L
S
GR
GS
[0.75 0 0 0.75 0 0] CT
0.873 GC
1 LJ
0.667 LW
N
507 259.667 M
73 259.667 L
S
GR
GS
[0.75 0 0 0.75 0 0] CT
0.873 GC
1 LJ
0.667 LW
N
507 202.5 M
73 202.5 L
S
GR
GS
[0.75 0 0 0.75 0 0] CT
0.873 GC
1 LJ
0.667 LW
N
507 145.333 M
73 145.333 L
S
GR
GS
[0.75 0 0 0.75 0 0] CT
0.873 GC
1 LJ
0.667 LW
N
507 88.167 M
73 88.167 L
S
GR
GS
[0.75 0 0 0.75 0 0] CT
0.873 GC
1 LJ
0.667 LW
N
507 31 M
73 31 L
S
GR
GS
[0.75 0 0 0.75 0 0] CT
2 setlinecap
1 LJ
0.667 LW
N
73 374 M
507 374 L
S
GR
GS
[0.75 0 0 0.75 0 0] CT
2 setlinecap
1 LJ
0.667 LW
N
73 31 M
507 31 L
S
GR
GS
[0.75 0 0 0.75 0 0] CT
2 setlinecap
1 LJ
0.667 LW
N
73 374 M
73 369.66 L
S
GR
GS
[0.75 0 0 0.75 0 0] CT
2 setlinecap
1 LJ
0.667 LW
N
114.333 374 M
114.333 369.66 L
S
GR
GS
[0.75 0 0 0.75 0 0] CT
2 setlinecap
1 LJ
0.667 LW
N
155.667 374 M
155.667 369.66 L
S
GR
GS
[0.75 0 0 0.75 0 0] CT
2 setlinecap
1 LJ
0.667 LW
N
197 374 M
197 369.66 L
S
GR
GS
[0.75 0 0 0.75 0 0] CT
2 setlinecap
1 LJ
0.667 LW
N
238.333 374 M
238.333 369.66 L
S
GR
GS
[0.75 0 0 0.75 0 0] CT
2 setlinecap
1 LJ
0.667 LW
N
279.667 374 M
279.667 369.66 L
S
GR
GS
[0.75 0 0 0.75 0 0] CT
2 setlinecap
1 LJ
0.667 LW
N
321 374 M
321 369.66 L
S
GR
GS
[0.75 0 0 0.75 0 0] CT
2 setlinecap
1 LJ
0.667 LW
N
362.333 374 M
362.333 369.66 L
S
GR
GS
[0.75 0 0 0.75 0 0] CT
2 setlinecap
1 LJ
0.667 LW
N
403.667 374 M
403.667 369.66 L
S
GR
GS
[0.75 0 0 0.75 0 0] CT
2 setlinecap
1 LJ
0.667 LW
N
445 374 M
445 369.66 L
S
GR
GS
[0.75 0 0 0.75 0 0] CT
2 setlinecap
1 LJ
0.667 LW
N
486.333 374 M
486.333 369.66 L
S
GR
GS
[0.75 0 0 0.75 0 0] CT
2 setlinecap
1 LJ
0.667 LW
N
73 31 M
73 35.34 L
S
GR
GS
[0.75 0 0 0.75 0 0] CT
2 setlinecap
1 LJ
0.667 LW
N
114.333 31 M
114.333 35.34 L
S
GR
GS
[0.75 0 0 0.75 0 0] CT
2 setlinecap
1 LJ
0.667 LW
N
155.667 31 M
155.667 35.34 L
S
GR
GS
[0.75 0 0 0.75 0 0] CT
2 setlinecap
1 LJ
0.667 LW
N
197 31 M
197 35.34 L
S
GR
GS
[0.75 0 0 0.75 0 0] CT
2 setlinecap
1 LJ
0.667 LW
N
238.333 31 M
238.333 35.34 L
S
GR
GS
[0.75 0 0 0.75 0 0] CT
2 setlinecap
1 LJ
0.667 LW
N
279.667 31 M
279.667 35.34 L
S
GR
GS
[0.75 0 0 0.75 0 0] CT
2 setlinecap
1 LJ
0.667 LW
N
321 31 M
321 35.34 L
S
GR
GS
[0.75 0 0 0.75 0 0] CT
2 setlinecap
1 LJ
0.667 LW
N
362.333 31 M
362.333 35.34 L
S
GR
GS
[0.75 0 0 0.75 0 0] CT
2 setlinecap
1 LJ
0.667 LW
N
403.667 31 M
403.667 35.34 L
S
GR
GS
[0.75 0 0 0.75 0 0] CT
2 setlinecap
1 LJ
0.667 LW
N
445 31 M
445 35.34 L
S
GR
GS
[0.75 0 0 0.75 0 0] CT
2 setlinecap
1 LJ
0.667 LW
N
486.333 31 M
486.333 35.34 L
S
GR
GS
[0.75 0 0 0.75 54.75 284.09999] CT
/Helvetica 10.667 F
GS
[1 0 0 1 0 0] CT
-3.5 12 moveto 
1 -1 scale
(0) t 
GR
GR
GS
[0.75 0 0 0.75 85.75 284.09999] CT
/Helvetica 10.667 F
GS
[1 0 0 1 0 0] CT
-3.5 12 moveto 
1 -1 scale
(2) t 
GR
GR
GS
[0.75 0 0 0.75 116.75 284.09999] CT
/Helvetica 10.667 F
GS
[1 0 0 1 0 0] CT
-3.5 12 moveto 
1 -1 scale
(4) t 
GR
GR
GS
[0.75 0 0 0.75 147.75 284.09999] CT
/Helvetica 10.667 F
GS
[1 0 0 1 0 0] CT
-3.5 12 moveto 
1 -1 scale
(6) t 
GR
GR
GS
[0.75 0 0 0.75 178.75 284.09999] CT
/Helvetica 10.667 F
GS
[1 0 0 1 0 0] CT
-3.5 12 moveto 
1 -1 scale
(8) t 
GR
GR
GS
[0.75 0 0 0.75 209.74999 284.09999] CT
/Helvetica 10.667 F
GS
[1 0 0 1 0 0] CT
-6.5 12 moveto 
1 -1 scale
(10) t 
GR
GR
GS
[0.75 0 0 0.75 240.75 284.09999] CT
/Helvetica 10.667 F
GS
[1 0 0 1 0 0] CT
-6.5 12 moveto 
1 -1 scale
(12) t 
GR
GR
GS
[0.75 0 0 0.75 271.75001 284.09999] CT
/Helvetica 10.667 F
GS
[1 0 0 1 0 0] CT
-6.5 12 moveto 
1 -1 scale
(14) t 
GR
GR
GS
[0.75 0 0 0.75 302.74999 284.09999] CT
/Helvetica 10.667 F
GS
[1 0 0 1 0 0] CT
-6.5 12 moveto 
1 -1 scale
(16) t 
GR
GR
GS
[0.75 0 0 0.75 333.75 284.09999] CT
/Helvetica 10.667 F
GS
[1 0 0 1 0 0] CT
-6.5 12 moveto 
1 -1 scale
(18) t 
GR
GR
GS
[0.75 0 0 0.75 364.75001 284.09999] CT
/Helvetica 10.667 F
GS
[1 0 0 1 0 0] CT
-6.5 12 moveto 
1 -1 scale
(20) t 
GR
GR
GS
[0.75 0 0 0.75 217.50016 296.35] CT
/Helvetica 10.667 F
GS
[1 0 0 1 0 0] CT
-13 12 moveto 
1 -1 scale
(State) t 
GR
GR
GS
[0.75 0 0 0.75 0 0] CT
2 setlinecap
1 LJ
0.667 LW
N
73 374 M
73 31 L
S
GR
GS
[0.75 0 0 0.75 0 0] CT
2 setlinecap
1 LJ
0.667 LW
N
507 374 M
507 31 L
S
GR
GS
[0.75 0 0 0.75 0 0] CT
2 setlinecap
1 LJ
0.667 LW
N
73 374 M
77.34 374 L
S
GR
GS
[0.75 0 0 0.75 0 0] CT
2 setlinecap
1 LJ
0.667 LW
N
73 316.833 M
77.34 316.833 L
S
GR
GS
[0.75 0 0 0.75 0 0] CT
2 setlinecap
1 LJ
0.667 LW
N
73 259.667 M
77.34 259.667 L
S
GR
GS
[0.75 0 0 0.75 0 0] CT
2 setlinecap
1 LJ
0.667 LW
N
73 202.5 M
77.34 202.5 L
S
GR
GS
[0.75 0 0 0.75 0 0] CT
2 setlinecap
1 LJ
0.667 LW
N
73 145.333 M
77.34 145.333 L
S
GR
GS
[0.75 0 0 0.75 0 0] CT
2 setlinecap
1 LJ
0.667 LW
N
73 88.167 M
77.34 88.167 L
S
GR
GS
[0.75 0 0 0.75 0 0] CT
2 setlinecap
1 LJ
0.667 LW
N
73 31 M
77.34 31 L
S
GR
GS
[0.75 0 0 0.75 0 0] CT
2 setlinecap
1 LJ
0.667 LW
N
507 374 M
502.66 374 L
S
GR
GS
[0.75 0 0 0.75 0 0] CT
2 setlinecap
1 LJ
0.667 LW
N
507 316.833 M
502.66 316.833 L
S
GR
GS
[0.75 0 0 0.75 0 0] CT
2 setlinecap
1 LJ
0.667 LW
N
507 259.667 M
502.66 259.667 L
S
GR
GS
[0.75 0 0 0.75 0 0] CT
2 setlinecap
1 LJ
0.667 LW
N
507 202.5 M
502.66 202.5 L
S
GR
GS
[0.75 0 0 0.75 0 0] CT
2 setlinecap
1 LJ
0.667 LW
N
507 145.333 M
502.66 145.333 L
S
GR
GS
[0.75 0 0 0.75 0 0] CT
2 setlinecap
1 LJ
0.667 LW
N
507 88.167 M
502.66 88.167 L
S
GR
GS
[0.75 0 0 0.75 0 0] CT
2 setlinecap
1 LJ
0.667 LW
N
507 31 M
502.66 31 L
S
GR
GS
[0.75 0 0 0.75 51.15 280.5] CT
/Helvetica 10.667 F
GS
[1 0 0 1 0 0] CT
-7 4.5 moveto 
1 -1 scale
(0) t 
GR
GR
GS
[0.75 0 0 0.75 51.15 237.62501] CT
/Helvetica 10.667 F
GS
[1 0 0 1 0 0] CT
-16 4.5 moveto 
1 -1 scale
(0.5) t 
GR
GR
GS
[0.75 0 0 0.75 51.15 194.74999] CT
/Helvetica 10.667 F
GS
[1 0 0 1 0 0] CT
-7 4.5 moveto 
1 -1 scale
(1) t 
GR
GR
GS
[0.75 0 0 0.75 51.15 151.875] CT
/Helvetica 10.667 F
GS
[1 0 0 1 0 0] CT
-16 4.5 moveto 
1 -1 scale
(1.5) t 
GR
GR
GS
[0.75 0 0 0.75 51.15 109] CT
/Helvetica 10.667 F
GS
[1 0 0 1 0 0] CT
-7 4.5 moveto 
1 -1 scale
(2) t 
GR
GR
GS
[0.75 0 0 0.75 51.15 66.125] CT
/Helvetica 10.667 F
GS
[1 0 0 1 0 0] CT
-16 4.5 moveto 
1 -1 scale
(2.5) t 
GR
GR
GS
[0.75 0 0 0.75 51.15 23.25] CT
/Helvetica 10.667 F
GS
[1 0 0 1 0 0] CT
-7 4.5 moveto 
1 -1 scale
(3) t 
GR
GR
GS
[0 -0.75 0.75 0 36.15 151.87489] CT
/Helvetica 10.667 F
GS
[1 0 0 1 0 0] CT
-32 -3 moveto 
1 -1 scale
(State Energy) t 
GR
GR
GS
[0.75 0 0 0.75 54.75 21] CT
N
1.609 -0.313 M
1.609 -0.406 1.672 -0.469 QT
3.953 -2.75 L
1.672 -5.031 L
1.609 -5.094 1.609 -5.188 QT
1.609 -5.266 1.68 -5.336 QT
1.75 -5.406 1.844 -5.406 QT
1.906 -5.406 2 -5.328 QT
4.281 -3.063 L
6.547 -5.328 L
6.641 -5.406 6.703 -5.406 QT
6.797 -5.406 6.859 -5.344 QT
6.922 -5.281 6.922 -5.188 QT
6.922 -5.094 6.875 -5.031 QT
4.594 -2.75 L
6.875 -0.469 L
6.922 -0.406 6.922 -0.313 QT
6.922 -0.219 6.859 -0.156 QT
6.797 -0.094 6.703 -0.094 QT
6.625 -0.094 6.547 -0.172 QT
4.281 -2.438 L
2 -0.172 L
1.922 -0.094 1.844 -0.094 QT
1.75 -0.094 1.68 -0.164 QT
1.609 -0.234 1.609 -0.313 QT
cp
f
GR
GS
[0.75 0 0 0.75 61.5 21] CT
/Helvetica 10.667 F
GS
[1 0 0 1 0 0] CT
0 0 moveto 
1 -1 scale
(10) t 
GR
GR
GS
[0.75 0 0 0.75 71.25 17.25] CT
/Helvetica 8.533 F
GS
[1 0 0 1 0 0] CT
0 0 moveto 
1 -1 scale
(6) t 
GR
GR
GS
[0.75 0 0 0.75 217.50021 21.75] CT
/Helvetica 10.667 F
GS
[1 0 0 1 0 0] CT
-109.5 -3 moveto 
1 -1 scale
(Hankel Singular Values \(State Contributions\)) t 
GR
GR
GS
[0.75 0 0 0.75 0 0] CT
1 LJ
0.667 LW
N
73 374 M
507 374 L
S
GR
GS
[0.75 0 0 0.75 0 0] CT
0 0 0.6 RC
N
85.4 374 M
101.933 374 L
101.933 84.889 L
85.4 84.889 L
cp
f
GR
GS
[0.75 0 0 0.75 0 0] CT
0 0 0.6 RC
N
106.067 374 M
122.6 374 L
122.6 342.065 L
106.067 342.065 L
cp
f
GR
GS
[0.75 0 0 0.75 0 0] CT
0 0 0.6 RC
N
126.733 374 M
143.267 374 L
143.267 372.524 L
126.733 372.524 L
cp
f
GR
GS
[0.75 0 0 0.75 0 0] CT
0 0 0.6 RC
N
147.4 374 M
163.933 374 L
163.933 373.318 L
147.4 373.318 L
cp
f
GR
GS
[0.75 0 0 0.75 0 0] CT
0 0 0.6 RC
N
168.067 374 M
184.6 374 L
184.6 373.985 L
168.067 373.985 L
cp
f
GR
GS
[0.75 0 0 0.75 0 0] CT
0 0 0.6 RC
N
188.733 374 M
205.267 374 L
205.267 373.995 L
188.733 373.995 L
cp
f
GR
GS
[0.75 0 0 0.75 0 0] CT
0 0 0.6 RC
N
209.4 374 M
225.933 374 L
225.933 373.997 L
209.4 373.997 L
cp
f
GR
GS
[0.75 0 0 0.75 0 0] CT
0 0 0.6 RC
N
230.067 374 M
246.6 374 L
246.6 373.997 L
230.067 373.997 L
cp
f
GR
GS
[0.75 0 0 0.75 0 0] CT
0 0 0.6 RC
N
250.733 374 M
267.267 374 L
267.267 373.999 L
250.733 373.999 L
cp
f
GR
GS
[0.75 0 0 0.75 0 0] CT
0 0 0.6 RC
N
271.4 374 M
287.933 374 L
287.933 374 L
271.4 374 L
cp
f
GR
GS
[0.75 0 0 0.75 0 0] CT
0 0 0.6 RC
N
292.067 374 M
308.6 374 L
308.6 374 L
292.067 374 L
cp
f
GR
GS
[0.75 0 0 0.75 0 0] CT
0 0 0.6 RC
N
312.733 374 M
329.267 374 L
329.267 374 L
312.733 374 L
cp
f
GR
GS
[0.75 0 0 0.75 0 0] CT
0 0 0.6 RC
N
333.4 374 M
349.933 374 L
349.933 374 L
333.4 374 L
cp
f
GR
GS
[0.75 0 0 0.75 0 0] CT
0 0 0.6 RC
N
354.067 374 M
370.6 374 L
370.6 374 L
354.067 374 L
cp
f
GR
GS
[0.75 0 0 0.75 0 0] CT
0 0 0.6 RC
N
374.733 374 M
391.267 374 L
391.267 374 L
374.733 374 L
cp
f
GR
GS
[0.75 0 0 0.75 0 0] CT
0 0 0.6 RC
N
395.4 374 M
411.933 374 L
411.933 374 L
395.4 374 L
cp
f
GR
GS
[0.75 0 0 0.75 0 0] CT
0 0 0.6 RC
N
416.067 374 M
432.6 374 L
432.6 374 L
416.067 374 L
cp
f
GR
GS
[0.75 0 0 0.75 0 0] CT
0 0 0.6 RC
N
436.733 374 M
453.267 374 L
453.267 374 L
436.733 374 L
cp
f
GR
GS
[0.75 0 0 0.75 0 0] CT
0 0 0.6 RC
N
457.4 374 M
473.933 374 L
473.933 374 L
457.4 374 L
cp
f
GR
GS
[0.75 0 0 0.75 0 0] CT
0 0 0.6 RC
N
478.067 374 M
494.6 374 L
494.6 374 L
478.067 374 L
cp
f
GR
GS
[0.75 0 0 0.75 0 0] CT
0 0 0.6 RC
10.0 ML
0.667 LW
N
85.4 374 M
85.4 84.889 L
101.933 84.889 L
101.933 374 L
cp
S
GR
GS
[0.75 0 0 0.75 0 0] CT
0 0 0.6 RC
10.0 ML
0.667 LW
N
106.067 374 M
106.067 342.065 L
122.6 342.065 L
122.6 374 L
cp
S
GR
GS
[0.75 0 0 0.75 0 0] CT
0 0 0.6 RC
10.0 ML
0.667 LW
N
126.733 374 M
126.733 372.524 L
143.267 372.524 L
143.267 374 L
cp
S
GR
GS
[0.75 0 0 0.75 0 0] CT
0 0 0.6 RC
10.0 ML
0.667 LW
N
147.4 374 M
147.4 373.318 L
163.933 373.318 L
163.933 374 L
cp
S
GR
GS
[0.75 0 0 0.75 0 0] CT
0 0 0.6 RC
10.0 ML
0.667 LW
N
168.067 374 M
168.067 373.985 L
184.6 373.985 L
184.6 374 L
cp
S
GR
GS
[0.75 0 0 0.75 0 0] CT
0 0 0.6 RC
10.0 ML
0.667 LW
N
188.733 374 M
188.733 373.995 L
205.267 373.995 L
205.267 374 L
cp
S
GR
GS
[0.75 0 0 0.75 0 0] CT
0 0 0.6 RC
10.0 ML
0.667 LW
N
209.4 374 M
209.4 373.997 L
225.933 373.997 L
225.933 374 L
cp
S
GR
GS
[0.75 0 0 0.75 0 0] CT
0 0 0.6 RC
10.0 ML
0.667 LW
N
230.067 374 M
230.067 373.997 L
246.6 373.997 L
246.6 374 L
cp
S
GR
GS
[0.75 0 0 0.75 0 0] CT
0 0 0.6 RC
10.0 ML
0.667 LW
N
250.733 374 M
250.733 373.999 L
267.267 373.999 L
267.267 374 L
cp
S
GR
GS
[0.75 0 0 0.75 0 0] CT
0 0 0.6 RC
10.0 ML
0.667 LW
N
271.4 374 M
271.4 374 L
287.933 374 L
287.933 374 L
cp
S
GR
GS
[0.75 0 0 0.75 0 0] CT
0 0 0.6 RC
10.0 ML
0.667 LW
N
292.067 374 M
292.067 374 L
308.6 374 L
308.6 374 L
cp
S
GR
GS
[0.75 0 0 0.75 0 0] CT
0 0 0.6 RC
10.0 ML
0.667 LW
N
312.733 374 M
312.733 374 L
329.267 374 L
329.267 374 L
cp
S
GR
GS
[0.75 0 0 0.75 0 0] CT
0 0 0.6 RC
10.0 ML
0.667 LW
N
333.4 374 M
333.4 374 L
349.933 374 L
349.933 374 L
cp
S
GR
GS
[0.75 0 0 0.75 0 0] CT
0 0 0.6 RC
10.0 ML
0.667 LW
N
354.067 374 M
354.067 374 L
370.6 374 L
370.6 374 L
cp
S
GR
GS
[0.75 0 0 0.75 0 0] CT
0 0 0.6 RC
10.0 ML
0.667 LW
N
374.733 374 M
374.733 374 L
391.267 374 L
391.267 374 L
cp
S
GR
GS
[0.75 0 0 0.75 0 0] CT
0 0 0.6 RC
10.0 ML
0.667 LW
N
395.4 374 M
395.4 374 L
411.933 374 L
411.933 374 L
cp
S
GR
GS
[0.75 0 0 0.75 0 0] CT
0 0 0.6 RC
10.0 ML
0.667 LW
N
416.067 374 M
416.067 374 L
432.6 374 L
432.6 374 L
cp
S
GR
GS
[0.75 0 0 0.75 0 0] CT
0 0 0.6 RC
10.0 ML
0.667 LW
N
436.733 374 M
436.733 374 L
453.267 374 L
453.267 374 L
cp
S
GR
GS
[0.75 0 0 0.75 0 0] CT
0 0 0.6 RC
10.0 ML
0.667 LW
N
457.4 374 M
457.4 374 L
473.933 374 L
473.933 374 L
cp
S
GR
GS
[0.75 0 0 0.75 0 0] CT
0 0 0.6 RC
10.0 ML
0.667 LW
N
478.067 374 M
478.067 374 L
494.6 374 L
494.6 374 L
cp
S
GR
GS
[0.75 0 0 0.75 0 0] CT
1 GC
N
385 63 M
385 44 L
494 44 L
494 63 L
cp
f
GR
GS
[0.75 0 0 0.75 316.5 40.125] CT
/Helvetica 10.667 F
GS
[1 0 0 1 0 0] CT
0 4.5 moveto 
1 -1 scale
(Stable modes) t 
GR
GR
GS
[0.75 0 0 0.75 0 0] CT
0 0 0.6 RC
N
389 59.25 M
389 47.75 L
419 47.75 L
419 59.25 L
cp
f
GR
GS
[0.75 0 0 0.75 0 0] CT
0 0 0.6 RC
10.0 ML
0.667 LW
N
389 59.25 M
389 47.75 L
419 47.75 L
419 59.25 L
cp
S
GR
GS
[0.75 0 0 0.75 0 0] CT
0.149 GC
10.0 ML
0.667 LW
N
385 63 M
385 44 L
494 44 L
494 63 L
cp
S
GR
%%Trailer
%%Pages: 1
%%EOF
