%!PS-Adobe-3.0 EPSF-3.0
%%Creator: MATLAB, The MathWorks, Inc. Version 8.3.0.532 (R2014a). Operating System: Microsoft Windows 7 Professional .
%%Title: C:\Users\Julie\Documents\GitKraken\rls-2017\sp3\figures\sigmaT.eps
%%CreationDate: 11/07/2017  21:56:22
%%DocumentNeededFonts: Helvetica
%%DocumentProcessColors: Cyan Magenta Yellow Black
%%LanguageLevel: 2
%%Pages: 1
%%BoundingBox:    87   262   507   578
%%EndComments

%%BeginProlog
% MathWorks dictionary
/MathWorks 160 dict begin
% definition operators
/bdef {bind def} bind def
/ldef {load def} bind def
/xdef {exch def} bdef
/xstore {exch store} bdef
% operator abbreviations
/c  /clip ldef
/cc /concat ldef
/cp /closepath ldef
/gr /grestore ldef
/gs /gsave ldef
/mt /moveto ldef
/np /newpath ldef
/cm /currentmatrix ldef
/sm /setmatrix ldef
/rm /rmoveto ldef
/rl /rlineto ldef
/s {show newpath} bdef
/sc {setcmykcolor} bdef
/sr /setrgbcolor ldef
/sg /setgray ldef
/w /setlinewidth ldef
/j /setlinejoin ldef
/cap /setlinecap ldef
/rc {rectclip} bdef
/rf {rectfill} bdef
% page state control
/pgsv () def
/bpage {/pgsv save def} bdef
/epage {pgsv restore} bdef
/bplot /gsave ldef
/eplot {stroke grestore} bdef
% orientation switch
/portraitMode 0 def /landscapeMode 1 def /rotateMode 2 def
% coordinate system mappings
/dpi2point 0 def
% font control
/FontSize 0 def
/FMS {/FontSize xstore findfont [FontSize 0 0 FontSize neg 0 0]
  makefont setfont} bdef
/ISOLatin1Encoding where {pop /WindowsLatin1Encoding 256 array bdef
ISOLatin1Encoding WindowsLatin1Encoding copy pop
/.notdef/.notdef/quotesinglbase/florin/quotedblbase/ellipsis/dagger
/daggerdbl/circumflex/perthousand/Scaron/guilsinglleft/OE/.notdef/.notdef
/.notdef/.notdef/quoteleft/quoteright/quotedblleft/quotedblright/bullet
/endash/emdash/tilde/trademark/scaron/guilsinglright/oe/.notdef/.notdef
/Ydieresis WindowsLatin1Encoding 128 32 getinterval astore pop}
{/WindowsLatin1Encoding StandardEncoding bdef} ifelse
/reencode {exch dup where {pop load} {pop StandardEncoding} ifelse
  exch dup 3 1 roll findfont dup length dict begin
  { 1 index /FID ne {def}{pop pop} ifelse } forall
  /Encoding exch def currentdict end definefont pop} bdef
/isroman {findfont /CharStrings get /Agrave known} bdef
/FMSR {3 1 roll 1 index dup isroman {reencode} {pop pop} ifelse
  exch FMS} bdef
/csm {1 dpi2point div -1 dpi2point div scale neg translate
 dup landscapeMode eq {pop -90 rotate}
  {rotateMode eq {90 rotate} if} ifelse} bdef
% line types: solid, dotted, dashed, dotdash
/SO { [] 0 setdash } bdef
/DO { [.5 dpi2point mul 4 dpi2point mul] 0 setdash } bdef
/DA { [6 dpi2point mul] 0 setdash } bdef
/DD { [.5 dpi2point mul 4 dpi2point mul 6 dpi2point mul 4
  dpi2point mul] 0 setdash } bdef
% macros for lines and objects
/L {lineto stroke} bdef
/MP {3 1 roll moveto 1 sub {rlineto} repeat} bdef
/AP {{rlineto} repeat} bdef
/PDlw -1 def
/W {/PDlw currentlinewidth def setlinewidth} def
/PP {closepath eofill} bdef
/DP {closepath stroke} bdef
/MR {4 -2 roll moveto dup  0 exch rlineto exch 0 rlineto
  neg 0 exch rlineto closepath} bdef
/FR {MR stroke} bdef
/PR {MR fill} bdef
/L1i {{currentfile picstr readhexstring pop} image} bdef
/tMatrix matrix def
/MakeOval {newpath tMatrix currentmatrix pop translate scale
0 0 1 0 360 arc tMatrix setmatrix} bdef
/FO {MakeOval stroke} bdef
/PO {MakeOval fill} bdef
/PD {currentlinewidth 2 div 0 360 arc fill
   PDlw -1 eq not {PDlw w /PDlw -1 def} if} def
/FA {newpath tMatrix currentmatrix pop translate scale
  0 0 1 5 -2 roll arc tMatrix setmatrix stroke} bdef
/PA {newpath tMatrix currentmatrix pop	translate 0 0 moveto scale
  0 0 1 5 -2 roll arc closepath tMatrix setmatrix fill} bdef
/FAn {newpath tMatrix currentmatrix pop translate scale
  0 0 1 5 -2 roll arcn tMatrix setmatrix stroke} bdef
/PAn {newpath tMatrix currentmatrix pop translate 0 0 moveto scale
  0 0 1 5 -2 roll arcn closepath tMatrix setmatrix fill} bdef
/vradius 0 def /hradius 0 def /lry 0 def
/lrx 0 def /uly 0 def /ulx 0 def /rad 0 def
/MRR {/vradius xdef /hradius xdef /lry xdef /lrx xdef /uly xdef
  /ulx xdef newpath tMatrix currentmatrix pop ulx hradius add uly
  vradius add translate hradius vradius scale 0 0 1 180 270 arc 
  tMatrix setmatrix lrx hradius sub uly vradius add translate
  hradius vradius scale 0 0 1 270 360 arc tMatrix setmatrix
  lrx hradius sub lry vradius sub translate hradius vradius scale
  0 0 1 0 90 arc tMatrix setmatrix ulx hradius add lry vradius sub
  translate hradius vradius scale 0 0 1 90 180 arc tMatrix setmatrix
  closepath} bdef
/FRR {MRR stroke } bdef
/PRR {MRR fill } bdef
/MlrRR {/lry xdef /lrx xdef /uly xdef /ulx xdef /rad lry uly sub 2 div def
  newpath tMatrix currentmatrix pop ulx rad add uly rad add translate
  rad rad scale 0 0 1 90 270 arc tMatrix setmatrix lrx rad sub lry rad
  sub translate rad rad scale 0 0 1 270 90 arc tMatrix setmatrix
  closepath} bdef
/FlrRR {MlrRR stroke } bdef
/PlrRR {MlrRR fill } bdef
/MtbRR {/lry xdef /lrx xdef /uly xdef /ulx xdef /rad lrx ulx sub 2 div def
  newpath tMatrix currentmatrix pop ulx rad add uly rad add translate
  rad rad scale 0 0 1 180 360 arc tMatrix setmatrix lrx rad sub lry rad
  sub translate rad rad scale 0 0 1 0 180 arc tMatrix setmatrix
  closepath} bdef
/FtbRR {MtbRR stroke } bdef
/PtbRR {MtbRR fill } bdef
/stri 6 array def /dtri 6 array def
/smat 6 array def /dmat 6 array def
/tmat1 6 array def /tmat2 6 array def /dif 3 array def
/asub {/ind2 exch def /ind1 exch def dup dup
  ind1 get exch ind2 get sub exch } bdef
/tri_to_matrix {
  2 0 asub 3 1 asub 4 0 asub 5 1 asub
  dup 0 get exch 1 get 7 -1 roll astore } bdef
/compute_transform {
  dmat dtri tri_to_matrix tmat1 invertmatrix 
  smat stri tri_to_matrix tmat2 concatmatrix } bdef
/ds {stri astore pop} bdef
/dt {dtri astore pop} bdef
/db {2 copy /cols xdef /rows xdef mul dup 3 mul string
  currentfile 
  3 index 0 eq {/ASCIIHexDecode filter}
  {/ASCII85Decode filter 3 index 2 eq {/RunLengthDecode filter} if }
  ifelse exch readstring pop
  dup 0 3 index getinterval /rbmap xdef
  dup 2 index dup getinterval /gbmap xdef
  1 index dup 2 mul exch getinterval /bbmap xdef pop pop}bdef
/it {gs np dtri aload pop moveto lineto lineto cp c
  cols rows 8 compute_transform 
  rbmap gbmap bbmap true 3 colorimage gr}bdef
/il {newpath moveto lineto stroke}bdef
currentdict end def
%%EndProlog

%%BeginSetup
MathWorks begin

0 cap

end
%%EndSetup

%%Page: 1 1
%%BeginPageSetup
%%PageBoundingBox:    87   262   507   578
MathWorks begin
bpage
%%EndPageSetup

%%BeginObject: obj1
bplot

/dpi2point 12 def
portraitMode 1044 6936 csm

    0     0  5045  3782 rc
87 dict begin %Colortable dictionary
/c0 { 0.000000 0.000000 0.000000 sr} bdef
/c1 { 1.000000 1.000000 1.000000 sr} bdef
/c2 { 0.900000 0.000000 0.000000 sr} bdef
/c3 { 0.000000 0.820000 0.000000 sr} bdef
/c4 { 0.000000 0.000000 0.800000 sr} bdef
/c5 { 0.910000 0.820000 0.320000 sr} bdef
/c6 { 1.000000 0.260000 0.820000 sr} bdef
/c7 { 0.000000 0.820000 0.820000 sr} bdef
c0
1 j
1 sg
   0    0 5046 3783 rf
6 w
0 2902 3802 0 0 -2902 764 3366 4 MP
PP
-3802 0 0 2902 3802 0 0 -2902 764 3366 5 MP stroke
4 w
DO
SO
6 w
0.4 sg
 764  464 mt 4566  464 L
 764 3366 mt 4566 3366 L
4566 3366 mt 4566  464 L
 764 3366 mt  764  464 L
 764 3366 mt 4566 3366 L
 764 3366 mt  764  464 L
 764 3366 mt  764 3346 L
 764  464 mt  764  483 L
 764 3366 mt  764 3327 L
 764  464 mt  764  502 L
%%IncludeResource: font Helvetica
/Helvetica /WindowsLatin1Encoding 120 FMSR

 652 3548 mt 
(10) s
%%IncludeResource: font Helvetica
/Helvetica /WindowsLatin1Encoding 80 FMSR

 785 3474 mt 
(-3) s
1145 3366 mt 1145 3346 L
1145  464 mt 1145  483 L
1368 3366 mt 1368 3346 L
1368  464 mt 1368  483 L
1527 3366 mt 1527 3346 L
1527  464 mt 1527  483 L
1649 3366 mt 1649 3346 L
1649  464 mt 1649  483 L
1750 3366 mt 1750 3346 L
1750  464 mt 1750  483 L
1835 3366 mt 1835 3346 L
1835  464 mt 1835  483 L
1908 3366 mt 1908 3346 L
1908  464 mt 1908  483 L
1973 3366 mt 1973 3346 L
1973  464 mt 1973  483 L
2031 3366 mt 2031 3346 L
2031  464 mt 2031  483 L
2031 3366 mt 2031 3327 L
2031  464 mt 2031  502 L
%%IncludeResource: font Helvetica
/Helvetica /WindowsLatin1Encoding 120 FMSR

1919 3548 mt 
(10) s
%%IncludeResource: font Helvetica
/Helvetica /WindowsLatin1Encoding 80 FMSR

2052 3474 mt 
(-2) s
2412 3366 mt 2412 3346 L
2412  464 mt 2412  483 L
2636 3366 mt 2636 3346 L
2636  464 mt 2636  483 L
2794 3366 mt 2794 3346 L
2794  464 mt 2794  483 L
2917 3366 mt 2917 3346 L
2917  464 mt 2917  483 L
3017 3366 mt 3017 3346 L
3017  464 mt 3017  483 L
3102 3366 mt 3102 3346 L
3102  464 mt 3102  483 L
3175 3366 mt 3175 3346 L
3175  464 mt 3175  483 L
3240 3366 mt 3240 3346 L
3240  464 mt 3240  483 L
3298 3366 mt 3298 3346 L
3298  464 mt 3298  483 L
3298 3366 mt 3298 3327 L
3298  464 mt 3298  502 L
%%IncludeResource: font Helvetica
/Helvetica /WindowsLatin1Encoding 120 FMSR

3186 3548 mt 
(10) s
%%IncludeResource: font Helvetica
/Helvetica /WindowsLatin1Encoding 80 FMSR

3319 3474 mt 
(-1) s
3680 3366 mt 3680 3346 L
3680  464 mt 3680  483 L
3903 3366 mt 3903 3346 L
3903  464 mt 3903  483 L
4061 3366 mt 4061 3346 L
4061  464 mt 4061  483 L
4184 3366 mt 4184 3346 L
4184  464 mt 4184  483 L
4284 3366 mt 4284 3346 L
4284  464 mt 4284  483 L
4369 3366 mt 4369 3346 L
4369  464 mt 4369  483 L
4443 3366 mt 4443 3346 L
4443  464 mt 4443  483 L
4508 3366 mt 4508 3346 L
4508  464 mt 4508  483 L
4566 3366 mt 4566 3346 L
4566  464 mt 4566  483 L
4566 3366 mt 4566 3327 L
4566  464 mt 4566  502 L
%%IncludeResource: font Helvetica
/Helvetica /WindowsLatin1Encoding 120 FMSR

4478 3548 mt 
(10) s
%%IncludeResource: font Helvetica
/Helvetica /WindowsLatin1Encoding 80 FMSR

4611 3474 mt 
(0) s
 764 3366 mt  802 3366 L
4566 3366 mt 4527 3366 L
%%IncludeResource: font Helvetica
/Helvetica /WindowsLatin1Encoding 120 FMSR

 526 3410 mt 
(-60) s
 764 2882 mt  802 2882 L
4566 2882 mt 4527 2882 L
 526 2926 mt 
(-50) s
 764 2398 mt  802 2398 L
4566 2398 mt 4527 2398 L
 526 2442 mt 
(-40) s
 764 1915 mt  802 1915 L
4566 1915 mt 4527 1915 L
 526 1959 mt 
(-30) s
 764 1431 mt  802 1431 L
4566 1431 mt 4527 1431 L
 526 1475 mt 
(-20) s
 764  947 mt  802  947 L
4566  947 mt 4527  947 L
 526  991 mt 
(-10) s
 764  464 mt  802  464 L
4566  464 mt 4527  464 L
 663  508 mt 
(0) s
 764  464 mt 4566  464 L
 764 3366 mt 4566 3366 L
4566 3366 mt 4566  464 L
 764 3366 mt  764  464 L
gs 764 464 3803 2903 rc
/c8 { 0.000000 0.000000 1.000000 sr} bdef
c8
11 8 86 65 86 66 86 66 86 65 86 66 86 65 87 66 
86 65 86 66 86 65 86 64 86 65 86 64 86 63 87 63 
86 61 86 60 86 58 86 56 86 53 86 49 86 45 87 40 
86 36 86 30 86 26 86 20 86 17 86 13 86 10 87 7 
86 6 86 4 86 4 86 2 86 2 86 1 87 1 86 1 
86 0 86 0 86 1 86 0 86 0 3 0 764 464 47 MP stroke
11 8 86 65 86 66 86 66 86 65 86 66 86 65 87 66 
86 65 86 66 86 65 86 64 86 65 86 64 86 63 87 63 
86 61 86 60 86 58 86 56 86 53 86 49 86 45 87 40 
86 36 86 30 86 26 86 20 86 17 86 13 86 10 87 7 
86 6 86 4 86 4 86 2 86 2 86 1 87 1 86 1 
86 0 86 0 86 1 86 0 86 0 3 0 764 464 47 MP stroke
/c9 { 0.000000 0.650000 0.000000 sr} bdef
c9
82 125 86 132 87 131 86 131 86 131 86 131 86 131 86 131 
86 131 86 130 87 129 86 129 86 127 86 126 86 122 86 118 
86 111 86 102 87 89 86 74 86 58 86 42 86 30 86 20 
86 14 86 9 87 6 86 4 86 3 86 2 86 1 86 1 
86 1 86 0 87 1 86 0 86 0 86 0 86 0 86 0 
86 0 86 0 87 0 86 0 17 0 764 464 46 MP stroke
82 125 86 132 87 131 86 131 86 131 86 131 86 131 86 131 
86 131 86 130 87 129 86 129 86 127 86 126 86 122 86 118 
86 111 86 102 87 89 86 74 86 58 86 42 86 30 86 20 
86 14 86 9 87 6 86 4 86 3 86 2 86 1 86 1 
86 1 86 0 87 1 86 0 86 0 86 0 86 0 86 0 
86 0 86 0 87 0 86 0 17 0 764 464 46 MP stroke
gr

c9
0 sg
 747 3409 mt 
( ) s
4550  506 mt 
( ) s
2203  271 mt 
(Singular Values) s
2146 3694 mt 
(Frequency \(rad/s\)) s
 347 2380 mt  -90 rotate
(Singular Values \(dB\)) s
90 rotate
1 sg
0 442 633 0 0 -442 3874 966 4 MP
PP
-633 0 0 442 633 0 0 -442 3874 966 5 MP stroke
4 w
DO
SO
6 w
0 sg
3874  524 mt 4507  524 L
3874  966 mt 4507  966 L
4507  966 mt 4507  524 L
3874  966 mt 3874  524 L
3874  966 mt 4507  966 L
3874  966 mt 3874  524 L
3874  524 mt 4507  524 L
3874  966 mt 4507  966 L
4507  966 mt 4507  524 L
3874  966 mt 3874  524 L
4338  659 mt 
(T) s
%%IncludeResource: font Helvetica
/Helvetica /WindowsLatin1Encoding 96 FMSR

4411  719 mt 
(1) s
gs 3874 524 634 443 rc
c8
356 0 3945 644 2 MP stroke
gr

c8
0 sg
%%IncludeResource: font Helvetica
/Helvetica /WindowsLatin1Encoding 120 FMSR

4338  862 mt 
(T) s
%%IncludeResource: font Helvetica
/Helvetica /WindowsLatin1Encoding 96 FMSR

4411  922 mt 
(2) s
gs 3874 524 634 443 rc
c9
356 0 3945 845 2 MP stroke
gr

c9

end %%Color Dict

eplot
%%EndObject

epage
end

showpage

%%Trailer
%%EOF
