%!PS-Adobe-3.0 EPSF-3.0
%%Creator: (MATLAB, The Mathworks, Inc. Version 9.1.0.441655 \(R2016b\). Operating System: Windows 7)
%%Title: C:/Users/June/Documents/GitKraken/rls-2017/sp6/figures/wO_est.eps
%%CreationDate: 2018-03-04T20:03:01
%%Pages: (atend)
%%BoundingBox: 0 0 420 315
%%LanguageLevel: 3
%%EndComments
%%BeginProlog
%%BeginResource: procset (Apache XML Graphics Std ProcSet) 1.2 0
%%Version: 1.2 0
%%Copyright: (Copyright 2001-2003,2010 The Apache Software Foundation. License terms: http://www.apache.org/licenses/LICENSE-2.0)
/bd{bind def}bind def
/ld{load def}bd
/GR/grestore ld
/M/moveto ld
/LJ/setlinejoin ld
/C/curveto ld
/f/fill ld
/LW/setlinewidth ld
/GC/setgray ld
/t/show ld
/N/newpath ld
/CT/concat ld
/cp/closepath ld
/S/stroke ld
/L/lineto ld
/CC/setcmykcolor ld
/A/ashow ld
/GS/gsave ld
/RC/setrgbcolor ld
/RM/rmoveto ld
/ML/setmiterlimit ld
/re {4 2 roll M
1 index 0 rlineto
0 exch rlineto
neg 0 rlineto
cp } bd
/_ctm matrix def
/_tm matrix def
/BT { _ctm currentmatrix pop matrix _tm copy pop 0 0 moveto } bd
/ET { _ctm setmatrix } bd
/iTm { _ctm setmatrix _tm concat } bd
/Tm { _tm astore pop iTm 0 0 moveto } bd
/ux 0.0 def
/uy 0.0 def
/F {
  /Tp exch def
  /Tf exch def
  Tf findfont Tp scalefont setfont
  /cf Tf def  /cs Tp def
} bd
/ULS {currentpoint /uy exch def /ux exch def} bd
/ULE {
  /Tcx currentpoint pop def
  gsave
  newpath
  cf findfont cs scalefont dup
  /FontMatrix get 0 get /Ts exch def /FontInfo get dup
  /UnderlinePosition get Ts mul /To exch def
  /UnderlineThickness get Ts mul /Tt exch def
  ux uy To add moveto  Tcx uy To add lineto
  Tt setlinewidth stroke
  grestore
} bd
/OLE {
  /Tcx currentpoint pop def
  gsave
  newpath
  cf findfont cs scalefont dup
  /FontMatrix get 0 get /Ts exch def /FontInfo get dup
  /UnderlinePosition get Ts mul /To exch def
  /UnderlineThickness get Ts mul /Tt exch def
  ux uy To add cs add moveto Tcx uy To add cs add lineto
  Tt setlinewidth stroke
  grestore
} bd
/SOE {
  /Tcx currentpoint pop def
  gsave
  newpath
  cf findfont cs scalefont dup
  /FontMatrix get 0 get /Ts exch def /FontInfo get dup
  /UnderlinePosition get Ts mul /To exch def
  /UnderlineThickness get Ts mul /Tt exch def
  ux uy To add cs 10 mul 26 idiv add moveto Tcx uy To add cs 10 mul 26 idiv add lineto
  Tt setlinewidth stroke
  grestore
} bd
/QT {
/Y22 exch store
/X22 exch store
/Y21 exch store
/X21 exch store
currentpoint
/Y21 load 2 mul add 3 div exch
/X21 load 2 mul add 3 div exch
/X21 load 2 mul /X22 load add 3 div
/Y21 load 2 mul /Y22 load add 3 div
/X22 load /Y22 load curveto
} bd
/SSPD {
dup length /d exch dict def
{
/v exch def
/k exch def
currentpagedevice k known {
/cpdv currentpagedevice k get def
v cpdv ne {
/upd false def
/nullv v type /nulltype eq def
/nullcpdv cpdv type /nulltype eq def
nullv nullcpdv or
{
/upd true def
} {
/sametype v type cpdv type eq def
sametype {
v type /arraytype eq {
/vlen v length def
/cpdvlen cpdv length def
vlen cpdvlen eq {
0 1 vlen 1 sub {
/i exch def
/obj v i get def
/cpdobj cpdv i get def
obj cpdobj ne {
/upd true def
exit
} if
} for
} {
/upd true def
} ifelse
} {
v type /dicttype eq {
v {
/dv exch def
/dk exch def
/cpddv cpdv dk get def
dv cpddv ne {
/upd true def
exit
} if
} forall
} {
/upd true def
} ifelse
} ifelse
} if
} ifelse
upd true eq {
d k v put
} if
} if
} if
} forall
d length 0 gt {
d setpagedevice
} if
} bd
/RE { % /NewFontName [NewEncodingArray] /FontName RE -
  findfont dup length dict begin
  {
    1 index /FID ne
    {def} {pop pop} ifelse
  } forall
  /Encoding exch def
  /FontName 1 index def
  currentdict definefont pop
  end
} bind def
%%EndResource
%%BeginResource: procset (Apache XML Graphics EPS ProcSet) 1.0 0
%%Version: 1.0 0
%%Copyright: (Copyright 2002-2003 The Apache Software Foundation. License terms: http://www.apache.org/licenses/LICENSE-2.0)
/BeginEPSF { %def
/b4_Inc_state save def         % Save state for cleanup
/dict_count countdictstack def % Count objects on dict stack
/op_count count 1 sub def      % Count objects on operand stack
userdict begin                 % Push userdict on dict stack
/showpage { } def              % Redefine showpage, { } = null proc
0 setgray 0 setlinecap         % Prepare graphics state
1 setlinewidth 0 setlinejoin
10 setmiterlimit [ ] 0 setdash newpath
/languagelevel where           % If level not equal to 1 then
{pop languagelevel             % set strokeadjust and
1 ne                           % overprint to their defaults.
{false setstrokeadjust false setoverprint
} if
} if
} bd
/EndEPSF { %def
count op_count sub {pop} repeat            % Clean up stacks
countdictstack dict_count sub {end} repeat
b4_Inc_state restore
} bd
%%EndResource
%FOPBeginFontDict
%%IncludeResource: font Courier-Bold
%%IncludeResource: font Helvetica
%%IncludeResource: font Courier-BoldOblique
%%IncludeResource: font Courier-Oblique
%%IncludeResource: font Times-Roman
%%IncludeResource: font Helvetica-BoldOblique
%%IncludeResource: font Helvetica-Bold
%%IncludeResource: font Helvetica-Oblique
%%IncludeResource: font Times-BoldItalic
%%IncludeResource: font Courier
%%IncludeResource: font Times-Italic
%%IncludeResource: font Times-Bold
%%IncludeResource: font Symbol
%%IncludeResource: font ZapfDingbats
%FOPEndFontDict
%%BeginResource: encoding WinAnsiEncoding
/WinAnsiEncoding [
/.notdef /.notdef /.notdef /.notdef /.notdef
/.notdef /.notdef /.notdef /.notdef /.notdef
/.notdef /.notdef /.notdef /.notdef /.notdef
/.notdef /.notdef /.notdef /.notdef /.notdef
/.notdef /.notdef /.notdef /.notdef /.notdef
/.notdef /.notdef /.notdef /.notdef /.notdef
/.notdef /.notdef /space /exclam /quotedbl
/numbersign /dollar /percent /ampersand /quotesingle
/parenleft /parenright /asterisk /plus /comma
/hyphen /period /slash /zero /one
/two /three /four /five /six
/seven /eight /nine /colon /semicolon
/less /equal /greater /question /at
/A /B /C /D /E
/F /G /H /I /J
/K /L /M /N /O
/P /Q /R /S /T
/U /V /W /X /Y
/Z /bracketleft /backslash /bracketright /asciicircum
/underscore /quoteleft /a /b /c
/d /e /f /g /h
/i /j /k /l /m
/n /o /p /q /r
/s /t /u /v /w
/x /y /z /braceleft /bar
/braceright /asciitilde /bullet /Euro /bullet
/quotesinglbase /florin /quotedblbase /ellipsis /dagger
/daggerdbl /circumflex /perthousand /Scaron /guilsinglleft
/OE /bullet /Zcaron /bullet /bullet
/quoteleft /quoteright /quotedblleft /quotedblright /bullet
/endash /emdash /asciitilde /trademark /scaron
/guilsinglright /oe /bullet /zcaron /Ydieresis
/space /exclamdown /cent /sterling /currency
/yen /brokenbar /section /dieresis /copyright
/ordfeminine /guillemotleft /logicalnot /sfthyphen /registered
/macron /degree /plusminus /twosuperior /threesuperior
/acute /mu /paragraph /middot /cedilla
/onesuperior /ordmasculine /guillemotright /onequarter /onehalf
/threequarters /questiondown /Agrave /Aacute /Acircumflex
/Atilde /Adieresis /Aring /AE /Ccedilla
/Egrave /Eacute /Ecircumflex /Edieresis /Igrave
/Iacute /Icircumflex /Idieresis /Eth /Ntilde
/Ograve /Oacute /Ocircumflex /Otilde /Odieresis
/multiply /Oslash /Ugrave /Uacute /Ucircumflex
/Udieresis /Yacute /Thorn /germandbls /agrave
/aacute /acircumflex /atilde /adieresis /aring
/ae /ccedilla /egrave /eacute /ecircumflex
/edieresis /igrave /iacute /icircumflex /idieresis
/eth /ntilde /ograve /oacute /ocircumflex
/otilde /odieresis /divide /oslash /ugrave
/uacute /ucircumflex /udieresis /yacute /thorn
/ydieresis
] def
%%EndResource
%FOPBeginFontReencode
/Courier-Bold findfont
dup length dict begin
  {1 index /FID ne {def} {pop pop} ifelse} forall
  /Encoding WinAnsiEncoding def
  currentdict
end
/Courier-Bold exch definefont pop
/Helvetica findfont
dup length dict begin
  {1 index /FID ne {def} {pop pop} ifelse} forall
  /Encoding WinAnsiEncoding def
  currentdict
end
/Helvetica exch definefont pop
/Courier-BoldOblique findfont
dup length dict begin
  {1 index /FID ne {def} {pop pop} ifelse} forall
  /Encoding WinAnsiEncoding def
  currentdict
end
/Courier-BoldOblique exch definefont pop
/Courier-Oblique findfont
dup length dict begin
  {1 index /FID ne {def} {pop pop} ifelse} forall
  /Encoding WinAnsiEncoding def
  currentdict
end
/Courier-Oblique exch definefont pop
/Times-Roman findfont
dup length dict begin
  {1 index /FID ne {def} {pop pop} ifelse} forall
  /Encoding WinAnsiEncoding def
  currentdict
end
/Times-Roman exch definefont pop
/Helvetica-BoldOblique findfont
dup length dict begin
  {1 index /FID ne {def} {pop pop} ifelse} forall
  /Encoding WinAnsiEncoding def
  currentdict
end
/Helvetica-BoldOblique exch definefont pop
/Helvetica-Bold findfont
dup length dict begin
  {1 index /FID ne {def} {pop pop} ifelse} forall
  /Encoding WinAnsiEncoding def
  currentdict
end
/Helvetica-Bold exch definefont pop
/Helvetica-Oblique findfont
dup length dict begin
  {1 index /FID ne {def} {pop pop} ifelse} forall
  /Encoding WinAnsiEncoding def
  currentdict
end
/Helvetica-Oblique exch definefont pop
/Times-BoldItalic findfont
dup length dict begin
  {1 index /FID ne {def} {pop pop} ifelse} forall
  /Encoding WinAnsiEncoding def
  currentdict
end
/Times-BoldItalic exch definefont pop
/Courier findfont
dup length dict begin
  {1 index /FID ne {def} {pop pop} ifelse} forall
  /Encoding WinAnsiEncoding def
  currentdict
end
/Courier exch definefont pop
/Times-Italic findfont
dup length dict begin
  {1 index /FID ne {def} {pop pop} ifelse} forall
  /Encoding WinAnsiEncoding def
  currentdict
end
/Times-Italic exch definefont pop
/Times-Bold findfont
dup length dict begin
  {1 index /FID ne {def} {pop pop} ifelse} forall
  /Encoding WinAnsiEncoding def
  currentdict
end
/Times-Bold exch definefont pop
%FOPEndFontReencode
%%EndProlog
%%Page: 1 1
%%PageBoundingBox: 0 0 420 315
%%BeginPageSetup
[1 0 0 -1 0 315] CT
%%EndPageSetup
GS
[0.75 0 0 0.75 0 0] CT
1 GC
N
0 0 560 420 re
f
GR
GS
[0.75 0 0 0.75 0 0] CT
1 GC
N
0 0 560 420 re
f
GR
GS
[0.75 0 0 0.75 0 0] CT
1 GC
N
73 374 M
507 374 L
507 31 L
73 31 L
cp
f
GR
GS
[0.75 0 0 0.75 0 0] CT
0.775 GC
[1 3] 0 setdash
2 LJ
0.667 LW
N
94.775 374 M
94.775 31 L
S
GR
GS
[0.75 0 0 0.75 0 0] CT
0.775 GC
[1 3] 0 setdash
2 LJ
0.667 LW
N
107.512 374 M
107.512 31 L
S
GR
GS
[0.75 0 0 0.75 0 0] CT
0.775 GC
[1 3] 0 setdash
2 LJ
0.667 LW
N
116.549 374 M
116.549 31 L
S
GR
GS
[0.75 0 0 0.75 0 0] CT
0.775 GC
[1 3] 0 setdash
2 LJ
0.667 LW
N
123.559 374 M
123.559 31 L
S
GR
GS
[0.75 0 0 0.75 0 0] CT
0.775 GC
[1 3] 0 setdash
2 LJ
0.667 LW
N
129.286 374 M
129.286 31 L
S
GR
GS
[0.75 0 0 0.75 0 0] CT
0.775 GC
[1 3] 0 setdash
2 LJ
0.667 LW
N
134.129 374 M
134.129 31 L
S
GR
GS
[0.75 0 0 0.75 0 0] CT
0.775 GC
[1 3] 0 setdash
2 LJ
0.667 LW
N
138.324 374 M
138.324 31 L
S
GR
GS
[0.75 0 0 0.75 0 0] CT
0.775 GC
[1 3] 0 setdash
2 LJ
0.667 LW
N
142.024 374 M
142.024 31 L
S
GR
GS
[0.75 0 0 0.75 0 0] CT
0.775 GC
[1 3] 0 setdash
2 LJ
0.667 LW
N
167.108 374 M
167.108 31 L
S
GR
GS
[0.75 0 0 0.75 0 0] CT
0.775 GC
[1 3] 0 setdash
2 LJ
0.667 LW
N
179.845 374 M
179.845 31 L
S
GR
GS
[0.75 0 0 0.75 0 0] CT
0.775 GC
[1 3] 0 setdash
2 LJ
0.667 LW
N
188.882 374 M
188.882 31 L
S
GR
GS
[0.75 0 0 0.75 0 0] CT
0.775 GC
[1 3] 0 setdash
2 LJ
0.667 LW
N
195.892 374 M
195.892 31 L
S
GR
GS
[0.75 0 0 0.75 0 0] CT
0.775 GC
[1 3] 0 setdash
2 LJ
0.667 LW
N
201.62 374 M
201.62 31 L
S
GR
GS
[0.75 0 0 0.75 0 0] CT
0.775 GC
[1 3] 0 setdash
2 LJ
0.667 LW
N
206.462 374 M
206.462 31 L
S
GR
GS
[0.75 0 0 0.75 0 0] CT
0.775 GC
[1 3] 0 setdash
2 LJ
0.667 LW
N
210.657 374 M
210.657 31 L
S
GR
GS
[0.75 0 0 0.75 0 0] CT
0.775 GC
[1 3] 0 setdash
2 LJ
0.667 LW
N
214.357 374 M
214.357 31 L
S
GR
GS
[0.75 0 0 0.75 0 0] CT
0.775 GC
[1 3] 0 setdash
2 LJ
0.667 LW
N
239.441 374 M
239.441 31 L
S
GR
GS
[0.75 0 0 0.75 0 0] CT
0.775 GC
[1 3] 0 setdash
2 LJ
0.667 LW
N
252.178 374 M
252.178 31 L
S
GR
GS
[0.75 0 0 0.75 0 0] CT
0.775 GC
[1 3] 0 setdash
2 LJ
0.667 LW
N
261.216 374 M
261.216 31 L
S
GR
GS
[0.75 0 0 0.75 0 0] CT
0.775 GC
[1 3] 0 setdash
2 LJ
0.667 LW
N
268.225 374 M
268.225 31 L
S
GR
GS
[0.75 0 0 0.75 0 0] CT
0.775 GC
[1 3] 0 setdash
2 LJ
0.667 LW
N
273.953 374 M
273.953 31 L
S
GR
GS
[0.75 0 0 0.75 0 0] CT
0.775 GC
[1 3] 0 setdash
2 LJ
0.667 LW
N
278.795 374 M
278.795 31 L
S
GR
GS
[0.75 0 0 0.75 0 0] CT
0.775 GC
[1 3] 0 setdash
2 LJ
0.667 LW
N
282.99 374 M
282.99 31 L
S
GR
GS
[0.75 0 0 0.75 0 0] CT
0.775 GC
[1 3] 0 setdash
2 LJ
0.667 LW
N
286.69 374 M
286.69 31 L
S
GR
GS
[0.75 0 0 0.75 0 0] CT
0.775 GC
[1 3] 0 setdash
2 LJ
0.667 LW
N
311.775 374 M
311.775 31 L
S
GR
GS
[0.75 0 0 0.75 0 0] CT
0.775 GC
[1 3] 0 setdash
2 LJ
0.667 LW
N
324.512 374 M
324.512 31 L
S
GR
GS
[0.75 0 0 0.75 0 0] CT
0.775 GC
[1 3] 0 setdash
2 LJ
0.667 LW
N
333.549 374 M
333.549 31 L
S
GR
GS
[0.75 0 0 0.75 0 0] CT
0.775 GC
[1 3] 0 setdash
2 LJ
0.667 LW
N
340.559 374 M
340.559 31 L
S
GR
GS
[0.75 0 0 0.75 0 0] CT
0.775 GC
[1 3] 0 setdash
2 LJ
0.667 LW
N
346.286 374 M
346.286 31 L
S
GR
GS
[0.75 0 0 0.75 0 0] CT
0.775 GC
[1 3] 0 setdash
2 LJ
0.667 LW
N
351.129 374 M
351.129 31 L
S
GR
GS
[0.75 0 0 0.75 0 0] CT
0.775 GC
[1 3] 0 setdash
2 LJ
0.667 LW
N
355.324 374 M
355.324 31 L
S
GR
GS
[0.75 0 0 0.75 0 0] CT
0.775 GC
[1 3] 0 setdash
2 LJ
0.667 LW
N
359.024 374 M
359.024 31 L
S
GR
GS
[0.75 0 0 0.75 0 0] CT
0.775 GC
[1 3] 0 setdash
2 LJ
0.667 LW
N
384.108 374 M
384.108 31 L
S
GR
GS
[0.75 0 0 0.75 0 0] CT
0.775 GC
[1 3] 0 setdash
2 LJ
0.667 LW
N
396.845 374 M
396.845 31 L
S
GR
GS
[0.75 0 0 0.75 0 0] CT
0.775 GC
[1 3] 0 setdash
2 LJ
0.667 LW
N
405.882 374 M
405.882 31 L
S
GR
GS
[0.75 0 0 0.75 0 0] CT
0.775 GC
[1 3] 0 setdash
2 LJ
0.667 LW
N
412.892 374 M
412.892 31 L
S
GR
GS
[0.75 0 0 0.75 0 0] CT
0.775 GC
[1 3] 0 setdash
2 LJ
0.667 LW
N
418.62 374 M
418.62 31 L
S
GR
GS
[0.75 0 0 0.75 0 0] CT
0.775 GC
[1 3] 0 setdash
2 LJ
0.667 LW
N
423.462 374 M
423.462 31 L
S
GR
GS
[0.75 0 0 0.75 0 0] CT
0.775 GC
[1 3] 0 setdash
2 LJ
0.667 LW
N
427.657 374 M
427.657 31 L
S
GR
GS
[0.75 0 0 0.75 0 0] CT
0.775 GC
[1 3] 0 setdash
2 LJ
0.667 LW
N
431.357 374 M
431.357 31 L
S
GR
GS
[0.75 0 0 0.75 0 0] CT
0.775 GC
[1 3] 0 setdash
2 LJ
0.667 LW
N
456.441 374 M
456.441 31 L
S
GR
GS
[0.75 0 0 0.75 0 0] CT
0.775 GC
[1 3] 0 setdash
2 LJ
0.667 LW
N
469.178 374 M
469.178 31 L
S
GR
GS
[0.75 0 0 0.75 0 0] CT
0.775 GC
[1 3] 0 setdash
2 LJ
0.667 LW
N
478.216 374 M
478.216 31 L
S
GR
GS
[0.75 0 0 0.75 0 0] CT
0.775 GC
[1 3] 0 setdash
2 LJ
0.667 LW
N
485.225 374 M
485.225 31 L
S
GR
GS
[0.75 0 0 0.75 0 0] CT
0.775 GC
[1 3] 0 setdash
2 LJ
0.667 LW
N
490.953 374 M
490.953 31 L
S
GR
GS
[0.75 0 0 0.75 0 0] CT
0.775 GC
[1 3] 0 setdash
2 LJ
0.667 LW
N
495.795 374 M
495.795 31 L
S
GR
GS
[0.75 0 0 0.75 0 0] CT
0.775 GC
[1 3] 0 setdash
2 LJ
0.667 LW
N
499.99 374 M
499.99 31 L
S
GR
GS
[0.75 0 0 0.75 0 0] CT
0.775 GC
[1 3] 0 setdash
2 LJ
0.667 LW
N
503.69 374 M
503.69 31 L
S
GR
GS
[0.75 0 0 0.75 0 0] CT
0.873 GC
1 LJ
0.667 LW
N
73 374 M
73 31 L
S
GR
GS
[0.75 0 0 0.75 0 0] CT
0.873 GC
1 LJ
0.667 LW
N
145.333 374 M
145.333 31 L
S
GR
GS
[0.75 0 0 0.75 0 0] CT
0.873 GC
1 LJ
0.667 LW
N
217.667 374 M
217.667 31 L
S
GR
GS
[0.75 0 0 0.75 0 0] CT
0.873 GC
1 LJ
0.667 LW
N
290 374 M
290 31 L
S
GR
GS
[0.75 0 0 0.75 0 0] CT
0.873 GC
1 LJ
0.667 LW
N
362.333 374 M
362.333 31 L
S
GR
GS
[0.75 0 0 0.75 0 0] CT
0.873 GC
1 LJ
0.667 LW
N
434.667 374 M
434.667 31 L
S
GR
GS
[0.75 0 0 0.75 0 0] CT
0.873 GC
1 LJ
0.667 LW
N
507 374 M
507 31 L
S
GR
GS
[0.75 0 0 0.75 0 0] CT
0.873 GC
1 LJ
0.667 LW
N
507 374 M
73 374 L
S
GR
GS
[0.75 0 0 0.75 0 0] CT
0.873 GC
1 LJ
0.667 LW
N
507 316.833 M
73 316.833 L
S
GR
GS
[0.75 0 0 0.75 0 0] CT
0.873 GC
1 LJ
0.667 LW
N
507 259.667 M
73 259.667 L
S
GR
GS
[0.75 0 0 0.75 0 0] CT
0.873 GC
1 LJ
0.667 LW
N
507 202.5 M
73 202.5 L
S
GR
GS
[0.75 0 0 0.75 0 0] CT
0.873 GC
1 LJ
0.667 LW
N
507 145.333 M
73 145.333 L
S
GR
GS
[0.75 0 0 0.75 0 0] CT
0.873 GC
1 LJ
0.667 LW
N
507 88.167 M
73 88.167 L
S
GR
GS
[0.75 0 0 0.75 0 0] CT
0.873 GC
1 LJ
0.667 LW
N
507 31 M
73 31 L
S
GR
GS
[0.75 0 0 0.75 0 0] CT
0.149 GC
2 setlinecap
1 LJ
0.667 LW
N
73 374 M
507 374 L
S
GR
GS
[0.75 0 0 0.75 0 0] CT
0.149 GC
2 setlinecap
1 LJ
0.667 LW
N
73 31 M
507 31 L
S
GR
GS
[0.75 0 0 0.75 0 0] CT
0.149 GC
2 setlinecap
1 LJ
0.667 LW
N
73 374 M
73 369.66 L
S
GR
GS
[0.75 0 0 0.75 0 0] CT
0.149 GC
2 setlinecap
1 LJ
0.667 LW
N
145.333 374 M
145.333 369.66 L
S
GR
GS
[0.75 0 0 0.75 0 0] CT
0.149 GC
2 setlinecap
1 LJ
0.667 LW
N
217.667 374 M
217.667 369.66 L
S
GR
GS
[0.75 0 0 0.75 0 0] CT
0.149 GC
2 setlinecap
1 LJ
0.667 LW
N
290 374 M
290 369.66 L
S
GR
GS
[0.75 0 0 0.75 0 0] CT
0.149 GC
2 setlinecap
1 LJ
0.667 LW
N
362.333 374 M
362.333 369.66 L
S
GR
GS
[0.75 0 0 0.75 0 0] CT
0.149 GC
2 setlinecap
1 LJ
0.667 LW
N
434.667 374 M
434.667 369.66 L
S
GR
GS
[0.75 0 0 0.75 0 0] CT
0.149 GC
2 setlinecap
1 LJ
0.667 LW
N
507 374 M
507 369.66 L
S
GR
GS
[0.75 0 0 0.75 0 0] CT
0.149 GC
2 setlinecap
1 LJ
0.667 LW
N
73 31 M
73 35.34 L
S
GR
GS
[0.75 0 0 0.75 0 0] CT
0.149 GC
2 setlinecap
1 LJ
0.667 LW
N
145.333 31 M
145.333 35.34 L
S
GR
GS
[0.75 0 0 0.75 0 0] CT
0.149 GC
2 setlinecap
1 LJ
0.667 LW
N
217.667 31 M
217.667 35.34 L
S
GR
GS
[0.75 0 0 0.75 0 0] CT
0.149 GC
2 setlinecap
1 LJ
0.667 LW
N
290 31 M
290 35.34 L
S
GR
GS
[0.75 0 0 0.75 0 0] CT
0.149 GC
2 setlinecap
1 LJ
0.667 LW
N
362.333 31 M
362.333 35.34 L
S
GR
GS
[0.75 0 0 0.75 0 0] CT
0.149 GC
2 setlinecap
1 LJ
0.667 LW
N
434.667 31 M
434.667 35.34 L
S
GR
GS
[0.75 0 0 0.75 0 0] CT
0.149 GC
2 setlinecap
1 LJ
0.667 LW
N
507 31 M
507 35.34 L
S
GR
GS
[0.75 0 0 0.75 0 0] CT
0.149 GC
2 setlinecap
1 LJ
0.667 LW
N
73 374 M
73 371.83 L
S
GR
GS
[0.75 0 0 0.75 0 0] CT
0.149 GC
2 setlinecap
1 LJ
0.667 LW
N
94.775 374 M
94.775 371.83 L
S
GR
GS
[0.75 0 0 0.75 0 0] CT
0.149 GC
2 setlinecap
1 LJ
0.667 LW
N
107.512 374 M
107.512 371.83 L
S
GR
GS
[0.75 0 0 0.75 0 0] CT
0.149 GC
2 setlinecap
1 LJ
0.667 LW
N
116.549 374 M
116.549 371.83 L
S
GR
GS
[0.75 0 0 0.75 0 0] CT
0.149 GC
2 setlinecap
1 LJ
0.667 LW
N
123.559 374 M
123.559 371.83 L
S
GR
GS
[0.75 0 0 0.75 0 0] CT
0.149 GC
2 setlinecap
1 LJ
0.667 LW
N
129.286 374 M
129.286 371.83 L
S
GR
GS
[0.75 0 0 0.75 0 0] CT
0.149 GC
2 setlinecap
1 LJ
0.667 LW
N
134.129 374 M
134.129 371.83 L
S
GR
GS
[0.75 0 0 0.75 0 0] CT
0.149 GC
2 setlinecap
1 LJ
0.667 LW
N
138.324 374 M
138.324 371.83 L
S
GR
GS
[0.75 0 0 0.75 0 0] CT
0.149 GC
2 setlinecap
1 LJ
0.667 LW
N
142.024 374 M
142.024 371.83 L
S
GR
GS
[0.75 0 0 0.75 0 0] CT
0.149 GC
2 setlinecap
1 LJ
0.667 LW
N
145.333 374 M
145.333 371.83 L
S
GR
GS
[0.75 0 0 0.75 0 0] CT
0.149 GC
2 setlinecap
1 LJ
0.667 LW
N
167.108 374 M
167.108 371.83 L
S
GR
GS
[0.75 0 0 0.75 0 0] CT
0.149 GC
2 setlinecap
1 LJ
0.667 LW
N
179.845 374 M
179.845 371.83 L
S
GR
GS
[0.75 0 0 0.75 0 0] CT
0.149 GC
2 setlinecap
1 LJ
0.667 LW
N
188.882 374 M
188.882 371.83 L
S
GR
GS
[0.75 0 0 0.75 0 0] CT
0.149 GC
2 setlinecap
1 LJ
0.667 LW
N
195.892 374 M
195.892 371.83 L
S
GR
GS
[0.75 0 0 0.75 0 0] CT
0.149 GC
2 setlinecap
1 LJ
0.667 LW
N
201.62 374 M
201.62 371.83 L
S
GR
GS
[0.75 0 0 0.75 0 0] CT
0.149 GC
2 setlinecap
1 LJ
0.667 LW
N
206.462 374 M
206.462 371.83 L
S
GR
GS
[0.75 0 0 0.75 0 0] CT
0.149 GC
2 setlinecap
1 LJ
0.667 LW
N
210.657 374 M
210.657 371.83 L
S
GR
GS
[0.75 0 0 0.75 0 0] CT
0.149 GC
2 setlinecap
1 LJ
0.667 LW
N
214.357 374 M
214.357 371.83 L
S
GR
GS
[0.75 0 0 0.75 0 0] CT
0.149 GC
2 setlinecap
1 LJ
0.667 LW
N
217.667 374 M
217.667 371.83 L
S
GR
GS
[0.75 0 0 0.75 0 0] CT
0.149 GC
2 setlinecap
1 LJ
0.667 LW
N
239.441 374 M
239.441 371.83 L
S
GR
GS
[0.75 0 0 0.75 0 0] CT
0.149 GC
2 setlinecap
1 LJ
0.667 LW
N
252.178 374 M
252.178 371.83 L
S
GR
GS
[0.75 0 0 0.75 0 0] CT
0.149 GC
2 setlinecap
1 LJ
0.667 LW
N
261.216 374 M
261.216 371.83 L
S
GR
GS
[0.75 0 0 0.75 0 0] CT
0.149 GC
2 setlinecap
1 LJ
0.667 LW
N
268.225 374 M
268.225 371.83 L
S
GR
GS
[0.75 0 0 0.75 0 0] CT
0.149 GC
2 setlinecap
1 LJ
0.667 LW
N
273.953 374 M
273.953 371.83 L
S
GR
GS
[0.75 0 0 0.75 0 0] CT
0.149 GC
2 setlinecap
1 LJ
0.667 LW
N
278.795 374 M
278.795 371.83 L
S
GR
GS
[0.75 0 0 0.75 0 0] CT
0.149 GC
2 setlinecap
1 LJ
0.667 LW
N
282.99 374 M
282.99 371.83 L
S
GR
GS
[0.75 0 0 0.75 0 0] CT
0.149 GC
2 setlinecap
1 LJ
0.667 LW
N
286.69 374 M
286.69 371.83 L
S
GR
GS
[0.75 0 0 0.75 0 0] CT
0.149 GC
2 setlinecap
1 LJ
0.667 LW
N
290 374 M
290 371.83 L
S
GR
GS
[0.75 0 0 0.75 0 0] CT
0.149 GC
2 setlinecap
1 LJ
0.667 LW
N
311.775 374 M
311.775 371.83 L
S
GR
GS
[0.75 0 0 0.75 0 0] CT
0.149 GC
2 setlinecap
1 LJ
0.667 LW
N
324.512 374 M
324.512 371.83 L
S
GR
GS
[0.75 0 0 0.75 0 0] CT
0.149 GC
2 setlinecap
1 LJ
0.667 LW
N
333.549 374 M
333.549 371.83 L
S
GR
GS
[0.75 0 0 0.75 0 0] CT
0.149 GC
2 setlinecap
1 LJ
0.667 LW
N
340.559 374 M
340.559 371.83 L
S
GR
GS
[0.75 0 0 0.75 0 0] CT
0.149 GC
2 setlinecap
1 LJ
0.667 LW
N
346.286 374 M
346.286 371.83 L
S
GR
GS
[0.75 0 0 0.75 0 0] CT
0.149 GC
2 setlinecap
1 LJ
0.667 LW
N
351.129 374 M
351.129 371.83 L
S
GR
GS
[0.75 0 0 0.75 0 0] CT
0.149 GC
2 setlinecap
1 LJ
0.667 LW
N
355.324 374 M
355.324 371.83 L
S
GR
GS
[0.75 0 0 0.75 0 0] CT
0.149 GC
2 setlinecap
1 LJ
0.667 LW
N
359.024 374 M
359.024 371.83 L
S
GR
GS
[0.75 0 0 0.75 0 0] CT
0.149 GC
2 setlinecap
1 LJ
0.667 LW
N
362.333 374 M
362.333 371.83 L
S
GR
GS
[0.75 0 0 0.75 0 0] CT
0.149 GC
2 setlinecap
1 LJ
0.667 LW
N
384.108 374 M
384.108 371.83 L
S
GR
GS
[0.75 0 0 0.75 0 0] CT
0.149 GC
2 setlinecap
1 LJ
0.667 LW
N
396.845 374 M
396.845 371.83 L
S
GR
GS
[0.75 0 0 0.75 0 0] CT
0.149 GC
2 setlinecap
1 LJ
0.667 LW
N
405.882 374 M
405.882 371.83 L
S
GR
GS
[0.75 0 0 0.75 0 0] CT
0.149 GC
2 setlinecap
1 LJ
0.667 LW
N
412.892 374 M
412.892 371.83 L
S
GR
GS
[0.75 0 0 0.75 0 0] CT
0.149 GC
2 setlinecap
1 LJ
0.667 LW
N
418.62 374 M
418.62 371.83 L
S
GR
GS
[0.75 0 0 0.75 0 0] CT
0.149 GC
2 setlinecap
1 LJ
0.667 LW
N
423.462 374 M
423.462 371.83 L
S
GR
GS
[0.75 0 0 0.75 0 0] CT
0.149 GC
2 setlinecap
1 LJ
0.667 LW
N
427.657 374 M
427.657 371.83 L
S
GR
GS
[0.75 0 0 0.75 0 0] CT
0.149 GC
2 setlinecap
1 LJ
0.667 LW
N
431.357 374 M
431.357 371.83 L
S
GR
GS
[0.75 0 0 0.75 0 0] CT
0.149 GC
2 setlinecap
1 LJ
0.667 LW
N
434.667 374 M
434.667 371.83 L
S
GR
GS
[0.75 0 0 0.75 0 0] CT
0.149 GC
2 setlinecap
1 LJ
0.667 LW
N
456.441 374 M
456.441 371.83 L
S
GR
GS
[0.75 0 0 0.75 0 0] CT
0.149 GC
2 setlinecap
1 LJ
0.667 LW
N
469.178 374 M
469.178 371.83 L
S
GR
GS
[0.75 0 0 0.75 0 0] CT
0.149 GC
2 setlinecap
1 LJ
0.667 LW
N
478.216 374 M
478.216 371.83 L
S
GR
GS
[0.75 0 0 0.75 0 0] CT
0.149 GC
2 setlinecap
1 LJ
0.667 LW
N
485.225 374 M
485.225 371.83 L
S
GR
GS
[0.75 0 0 0.75 0 0] CT
0.149 GC
2 setlinecap
1 LJ
0.667 LW
N
490.953 374 M
490.953 371.83 L
S
GR
GS
[0.75 0 0 0.75 0 0] CT
0.149 GC
2 setlinecap
1 LJ
0.667 LW
N
495.795 374 M
495.795 371.83 L
S
GR
GS
[0.75 0 0 0.75 0 0] CT
0.149 GC
2 setlinecap
1 LJ
0.667 LW
N
499.99 374 M
499.99 371.83 L
S
GR
GS
[0.75 0 0 0.75 0 0] CT
0.149 GC
2 setlinecap
1 LJ
0.667 LW
N
503.69 374 M
503.69 371.83 L
S
GR
GS
[0.75 0 0 0.75 0 0] CT
0.149 GC
2 setlinecap
1 LJ
0.667 LW
N
507 374 M
507 371.83 L
S
GR
GS
[0.75 0 0 0.75 0 0] CT
0.149 GC
2 setlinecap
1 LJ
0.667 LW
N
73 31 M
73 33.17 L
S
GR
GS
[0.75 0 0 0.75 0 0] CT
0.149 GC
2 setlinecap
1 LJ
0.667 LW
N
94.775 31 M
94.775 33.17 L
S
GR
GS
[0.75 0 0 0.75 0 0] CT
0.149 GC
2 setlinecap
1 LJ
0.667 LW
N
107.512 31 M
107.512 33.17 L
S
GR
GS
[0.75 0 0 0.75 0 0] CT
0.149 GC
2 setlinecap
1 LJ
0.667 LW
N
116.549 31 M
116.549 33.17 L
S
GR
GS
[0.75 0 0 0.75 0 0] CT
0.149 GC
2 setlinecap
1 LJ
0.667 LW
N
123.559 31 M
123.559 33.17 L
S
GR
GS
[0.75 0 0 0.75 0 0] CT
0.149 GC
2 setlinecap
1 LJ
0.667 LW
N
129.286 31 M
129.286 33.17 L
S
GR
GS
[0.75 0 0 0.75 0 0] CT
0.149 GC
2 setlinecap
1 LJ
0.667 LW
N
134.129 31 M
134.129 33.17 L
S
GR
GS
[0.75 0 0 0.75 0 0] CT
0.149 GC
2 setlinecap
1 LJ
0.667 LW
N
138.324 31 M
138.324 33.17 L
S
GR
GS
[0.75 0 0 0.75 0 0] CT
0.149 GC
2 setlinecap
1 LJ
0.667 LW
N
142.024 31 M
142.024 33.17 L
S
GR
GS
[0.75 0 0 0.75 0 0] CT
0.149 GC
2 setlinecap
1 LJ
0.667 LW
N
145.333 31 M
145.333 33.17 L
S
GR
GS
[0.75 0 0 0.75 0 0] CT
0.149 GC
2 setlinecap
1 LJ
0.667 LW
N
167.108 31 M
167.108 33.17 L
S
GR
GS
[0.75 0 0 0.75 0 0] CT
0.149 GC
2 setlinecap
1 LJ
0.667 LW
N
179.845 31 M
179.845 33.17 L
S
GR
GS
[0.75 0 0 0.75 0 0] CT
0.149 GC
2 setlinecap
1 LJ
0.667 LW
N
188.882 31 M
188.882 33.17 L
S
GR
GS
[0.75 0 0 0.75 0 0] CT
0.149 GC
2 setlinecap
1 LJ
0.667 LW
N
195.892 31 M
195.892 33.17 L
S
GR
GS
[0.75 0 0 0.75 0 0] CT
0.149 GC
2 setlinecap
1 LJ
0.667 LW
N
201.62 31 M
201.62 33.17 L
S
GR
GS
[0.75 0 0 0.75 0 0] CT
0.149 GC
2 setlinecap
1 LJ
0.667 LW
N
206.462 31 M
206.462 33.17 L
S
GR
GS
[0.75 0 0 0.75 0 0] CT
0.149 GC
2 setlinecap
1 LJ
0.667 LW
N
210.657 31 M
210.657 33.17 L
S
GR
GS
[0.75 0 0 0.75 0 0] CT
0.149 GC
2 setlinecap
1 LJ
0.667 LW
N
214.357 31 M
214.357 33.17 L
S
GR
GS
[0.75 0 0 0.75 0 0] CT
0.149 GC
2 setlinecap
1 LJ
0.667 LW
N
217.667 31 M
217.667 33.17 L
S
GR
GS
[0.75 0 0 0.75 0 0] CT
0.149 GC
2 setlinecap
1 LJ
0.667 LW
N
239.441 31 M
239.441 33.17 L
S
GR
GS
[0.75 0 0 0.75 0 0] CT
0.149 GC
2 setlinecap
1 LJ
0.667 LW
N
252.178 31 M
252.178 33.17 L
S
GR
GS
[0.75 0 0 0.75 0 0] CT
0.149 GC
2 setlinecap
1 LJ
0.667 LW
N
261.216 31 M
261.216 33.17 L
S
GR
GS
[0.75 0 0 0.75 0 0] CT
0.149 GC
2 setlinecap
1 LJ
0.667 LW
N
268.225 31 M
268.225 33.17 L
S
GR
GS
[0.75 0 0 0.75 0 0] CT
0.149 GC
2 setlinecap
1 LJ
0.667 LW
N
273.953 31 M
273.953 33.17 L
S
GR
GS
[0.75 0 0 0.75 0 0] CT
0.149 GC
2 setlinecap
1 LJ
0.667 LW
N
278.795 31 M
278.795 33.17 L
S
GR
GS
[0.75 0 0 0.75 0 0] CT
0.149 GC
2 setlinecap
1 LJ
0.667 LW
N
282.99 31 M
282.99 33.17 L
S
GR
GS
[0.75 0 0 0.75 0 0] CT
0.149 GC
2 setlinecap
1 LJ
0.667 LW
N
286.69 31 M
286.69 33.17 L
S
GR
GS
[0.75 0 0 0.75 0 0] CT
0.149 GC
2 setlinecap
1 LJ
0.667 LW
N
290 31 M
290 33.17 L
S
GR
GS
[0.75 0 0 0.75 0 0] CT
0.149 GC
2 setlinecap
1 LJ
0.667 LW
N
311.775 31 M
311.775 33.17 L
S
GR
GS
[0.75 0 0 0.75 0 0] CT
0.149 GC
2 setlinecap
1 LJ
0.667 LW
N
324.512 31 M
324.512 33.17 L
S
GR
GS
[0.75 0 0 0.75 0 0] CT
0.149 GC
2 setlinecap
1 LJ
0.667 LW
N
333.549 31 M
333.549 33.17 L
S
GR
GS
[0.75 0 0 0.75 0 0] CT
0.149 GC
2 setlinecap
1 LJ
0.667 LW
N
340.559 31 M
340.559 33.17 L
S
GR
GS
[0.75 0 0 0.75 0 0] CT
0.149 GC
2 setlinecap
1 LJ
0.667 LW
N
346.286 31 M
346.286 33.17 L
S
GR
GS
[0.75 0 0 0.75 0 0] CT
0.149 GC
2 setlinecap
1 LJ
0.667 LW
N
351.129 31 M
351.129 33.17 L
S
GR
GS
[0.75 0 0 0.75 0 0] CT
0.149 GC
2 setlinecap
1 LJ
0.667 LW
N
355.324 31 M
355.324 33.17 L
S
GR
GS
[0.75 0 0 0.75 0 0] CT
0.149 GC
2 setlinecap
1 LJ
0.667 LW
N
359.024 31 M
359.024 33.17 L
S
GR
GS
[0.75 0 0 0.75 0 0] CT
0.149 GC
2 setlinecap
1 LJ
0.667 LW
N
362.333 31 M
362.333 33.17 L
S
GR
GS
[0.75 0 0 0.75 0 0] CT
0.149 GC
2 setlinecap
1 LJ
0.667 LW
N
384.108 31 M
384.108 33.17 L
S
GR
GS
[0.75 0 0 0.75 0 0] CT
0.149 GC
2 setlinecap
1 LJ
0.667 LW
N
396.845 31 M
396.845 33.17 L
S
GR
GS
[0.75 0 0 0.75 0 0] CT
0.149 GC
2 setlinecap
1 LJ
0.667 LW
N
405.882 31 M
405.882 33.17 L
S
GR
GS
[0.75 0 0 0.75 0 0] CT
0.149 GC
2 setlinecap
1 LJ
0.667 LW
N
412.892 31 M
412.892 33.17 L
S
GR
GS
[0.75 0 0 0.75 0 0] CT
0.149 GC
2 setlinecap
1 LJ
0.667 LW
N
418.62 31 M
418.62 33.17 L
S
GR
GS
[0.75 0 0 0.75 0 0] CT
0.149 GC
2 setlinecap
1 LJ
0.667 LW
N
423.462 31 M
423.462 33.17 L
S
GR
GS
[0.75 0 0 0.75 0 0] CT
0.149 GC
2 setlinecap
1 LJ
0.667 LW
N
427.657 31 M
427.657 33.17 L
S
GR
GS
[0.75 0 0 0.75 0 0] CT
0.149 GC
2 setlinecap
1 LJ
0.667 LW
N
431.357 31 M
431.357 33.17 L
S
GR
GS
[0.75 0 0 0.75 0 0] CT
0.149 GC
2 setlinecap
1 LJ
0.667 LW
N
434.667 31 M
434.667 33.17 L
S
GR
GS
[0.75 0 0 0.75 0 0] CT
0.149 GC
2 setlinecap
1 LJ
0.667 LW
N
456.441 31 M
456.441 33.17 L
S
GR
GS
[0.75 0 0 0.75 0 0] CT
0.149 GC
2 setlinecap
1 LJ
0.667 LW
N
469.178 31 M
469.178 33.17 L
S
GR
GS
[0.75 0 0 0.75 0 0] CT
0.149 GC
2 setlinecap
1 LJ
0.667 LW
N
478.216 31 M
478.216 33.17 L
S
GR
GS
[0.75 0 0 0.75 0 0] CT
0.149 GC
2 setlinecap
1 LJ
0.667 LW
N
485.225 31 M
485.225 33.17 L
S
GR
GS
[0.75 0 0 0.75 0 0] CT
0.149 GC
2 setlinecap
1 LJ
0.667 LW
N
490.953 31 M
490.953 33.17 L
S
GR
GS
[0.75 0 0 0.75 0 0] CT
0.149 GC
2 setlinecap
1 LJ
0.667 LW
N
495.795 31 M
495.795 33.17 L
S
GR
GS
[0.75 0 0 0.75 0 0] CT
0.149 GC
2 setlinecap
1 LJ
0.667 LW
N
499.99 31 M
499.99 33.17 L
S
GR
GS
[0.75 0 0 0.75 0 0] CT
0.149 GC
2 setlinecap
1 LJ
0.667 LW
N
503.69 31 M
503.69 33.17 L
S
GR
GS
[0.75 0 0 0.75 0 0] CT
0.149 GC
2 setlinecap
1 LJ
0.667 LW
N
507 31 M
507 33.17 L
S
GR
GS
[0.75 0 0 0.75 45 297.75] CT
0.149 GC
/Helvetica 13.333 F
GS
[1 0 0 1 0 0] CT
0 0 moveto 
1 -1 scale
(10) t 
GR
GR
GS
[0.75 0 0 0.75 56.25 293.25] CT
0.149 GC
/Helvetica 10.667 F
GS
[1 0 0 1 0 0] CT
0 0 moveto 
1 -1 scale
(-3) t 
GR
GR
GS
[0.75 0 0 0.75 99 297.75] CT
0.149 GC
/Helvetica 13.333 F
GS
[1 0 0 1 0 0] CT
0 0 moveto 
1 -1 scale
(10) t 
GR
GR
GS
[0.75 0 0 0.75 110.25 293.25] CT
0.149 GC
/Helvetica 10.667 F
GS
[1 0 0 1 0 0] CT
0 0 moveto 
1 -1 scale
(-2) t 
GR
GR
GS
[0.75 0 0 0.75 153.75 297.75] CT
0.149 GC
/Helvetica 13.333 F
GS
[1 0 0 1 0 0] CT
0 0 moveto 
1 -1 scale
(10) t 
GR
GR
GS
[0.75 0 0 0.75 165 293.25] CT
0.149 GC
/Helvetica 10.667 F
GS
[1 0 0 1 0 0] CT
0 0 moveto 
1 -1 scale
(-1) t 
GR
GR
GS
[0.75 0 0 0.75 209.25 297.75] CT
0.149 GC
/Helvetica 13.333 F
GS
[1 0 0 1 0 0] CT
0 0 moveto 
1 -1 scale
(10) t 
GR
GR
GS
[0.75 0 0 0.75 220.5 293.25] CT
0.149 GC
/Helvetica 10.667 F
GS
[1 0 0 1 0 0] CT
0 0 moveto 
1 -1 scale
(0) t 
GR
GR
GS
[0.75 0 0 0.75 263.25 297.75] CT
0.149 GC
/Helvetica 13.333 F
GS
[1 0 0 1 0 0] CT
0 0 moveto 
1 -1 scale
(10) t 
GR
GR
GS
[0.75 0 0 0.75 274.5 293.25] CT
0.149 GC
/Helvetica 10.667 F
GS
[1 0 0 1 0 0] CT
0 0 moveto 
1 -1 scale
(1) t 
GR
GR
GS
[0.75 0 0 0.75 318 297.75] CT
0.149 GC
/Helvetica 13.333 F
GS
[1 0 0 1 0 0] CT
0 0 moveto 
1 -1 scale
(10) t 
GR
GR
GS
[0.75 0 0 0.75 329.25 293.25] CT
0.149 GC
/Helvetica 10.667 F
GS
[1 0 0 1 0 0] CT
0 0 moveto 
1 -1 scale
(2) t 
GR
GR
GS
[0.75 0 0 0.75 372 297.75] CT
0.149 GC
/Helvetica 13.333 F
GS
[1 0 0 1 0 0] CT
0 0 moveto 
1 -1 scale
(10) t 
GR
GR
GS
[0.75 0 0 0.75 383.25 293.25] CT
0.149 GC
/Helvetica 10.667 F
GS
[1 0 0 1 0 0] CT
0 0 moveto 
1 -1 scale
(3) t 
GR
GR
GS
[0.75 0 0 0.75 0 0] CT
0.149 GC
2 setlinecap
1 LJ
0.667 LW
N
73 374 M
73 31 L
S
GR
GS
[0.75 0 0 0.75 0 0] CT
0.149 GC
2 setlinecap
1 LJ
0.667 LW
N
507 374 M
507 31 L
S
GR
GS
[0.75 0 0 0.75 0 0] CT
0.149 GC
2 setlinecap
1 LJ
0.667 LW
N
73 374 M
77.34 374 L
S
GR
GS
[0.75 0 0 0.75 0 0] CT
0.149 GC
2 setlinecap
1 LJ
0.667 LW
N
73 316.833 M
77.34 316.833 L
S
GR
GS
[0.75 0 0 0.75 0 0] CT
0.149 GC
2 setlinecap
1 LJ
0.667 LW
N
73 259.667 M
77.34 259.667 L
S
GR
GS
[0.75 0 0 0.75 0 0] CT
0.149 GC
2 setlinecap
1 LJ
0.667 LW
N
73 202.5 M
77.34 202.5 L
S
GR
GS
[0.75 0 0 0.75 0 0] CT
0.149 GC
2 setlinecap
1 LJ
0.667 LW
N
73 145.333 M
77.34 145.333 L
S
GR
GS
[0.75 0 0 0.75 0 0] CT
0.149 GC
2 setlinecap
1 LJ
0.667 LW
N
73 88.167 M
77.34 88.167 L
S
GR
GS
[0.75 0 0 0.75 0 0] CT
0.149 GC
2 setlinecap
1 LJ
0.667 LW
N
73 31 M
77.34 31 L
S
GR
GS
[0.75 0 0 0.75 0 0] CT
0.149 GC
2 setlinecap
1 LJ
0.667 LW
N
507 374 M
502.66 374 L
S
GR
GS
[0.75 0 0 0.75 0 0] CT
0.149 GC
2 setlinecap
1 LJ
0.667 LW
N
507 316.833 M
502.66 316.833 L
S
GR
GS
[0.75 0 0 0.75 0 0] CT
0.149 GC
2 setlinecap
1 LJ
0.667 LW
N
507 259.667 M
502.66 259.667 L
S
GR
GS
[0.75 0 0 0.75 0 0] CT
0.149 GC
2 setlinecap
1 LJ
0.667 LW
N
507 202.5 M
502.66 202.5 L
S
GR
GS
[0.75 0 0 0.75 0 0] CT
0.149 GC
2 setlinecap
1 LJ
0.667 LW
N
507 145.333 M
502.66 145.333 L
S
GR
GS
[0.75 0 0 0.75 0 0] CT
0.149 GC
2 setlinecap
1 LJ
0.667 LW
N
507 88.167 M
502.66 88.167 L
S
GR
GS
[0.75 0 0 0.75 0 0] CT
0.149 GC
2 setlinecap
1 LJ
0.667 LW
N
507 31 M
502.66 31 L
S
GR
GS
[0.75 0 0 0.75 50.75 280.5] CT
0.149 GC
/Helvetica 13.333 F
GS
[1 0 0 1 0 0] CT
-19 5.5 moveto 
1 -1 scale
(0.1) t 
GR
GR
GS
[0.75 0 0 0.75 50.75 237.62501] CT
0.149 GC
/Helvetica 13.333 F
GS
[1 0 0 1 0 0] CT
-19 5.5 moveto 
1 -1 scale
(0.2) t 
GR
GR
GS
[0.75 0 0 0.75 50.75 194.74999] CT
0.149 GC
/Helvetica 13.333 F
GS
[1 0 0 1 0 0] CT
-19 5.5 moveto 
1 -1 scale
(0.3) t 
GR
GR
GS
[0.75 0 0 0.75 50.75 151.875] CT
0.149 GC
/Helvetica 13.333 F
GS
[1 0 0 1 0 0] CT
-19 5.5 moveto 
1 -1 scale
(0.4) t 
GR
GR
GS
[0.75 0 0 0.75 50.75 109] CT
0.149 GC
/Helvetica 13.333 F
GS
[1 0 0 1 0 0] CT
-19 5.5 moveto 
1 -1 scale
(0.5) t 
GR
GR
GS
[0.75 0 0 0.75 50.75 66.125] CT
0.149 GC
/Helvetica 13.333 F
GS
[1 0 0 1 0 0] CT
-19 5.5 moveto 
1 -1 scale
(0.6) t 
GR
GR
GS
[0.75 0 0 0.75 50.75 23.25] CT
0.149 GC
/Helvetica 13.333 F
GS
[1 0 0 1 0 0] CT
-19 5.5 moveto 
1 -1 scale
(0.7) t 
GR
GR
GS
[0.75 0 0 0.75 189.75 13.5] CT
/Helvetica-Bold 14.667 F
GS
[1 0 0 1 0 0] CT
0 0 moveto 
1 -1 scale
(Odhad w) t 
GR
GR
GS
[0.75 0 0 0.75 237.75 18.75] CT
/Helvetica-Bold 11.733 F
GS
[1 0 0 1 0 0] CT
0 0 moveto 
1 -1 scale
(O) t 
GR
GR
GS
[0.75 0 0 0.75 0 0] CT
0 0.447 0.741 RC
1 LJ
0.667 LW
N
73 71.421 M
73.217 71.423 L
73.434 71.424 L
73.651 71.425 L
73.868 71.427 L
74.086 71.428 L
74.303 71.43 L
74.52 71.431 L
74.737 71.433 L
74.954 71.434 L
75.171 71.436 L
75.388 71.438 L
75.605 71.439 L
75.822 71.441 L
76.04 71.443 L
76.257 71.444 L
76.474 71.446 L
76.691 71.448 L
76.908 71.45 L
77.125 71.451 L
77.342 71.453 L
77.559 71.455 L
77.776 71.457 L
77.993 71.459 L
78.211 71.461 L
78.428 71.463 L
78.645 71.465 L
78.862 71.466 L
79.079 71.469 L
79.296 71.471 L
79.513 71.473 L
79.73 71.475 L
79.947 71.477 L
80.165 71.479 L
80.382 71.481 L
80.599 71.483 L
80.816 71.486 L
81.033 71.488 L
81.25 71.49 L
81.467 71.493 L
81.684 71.495 L
81.901 71.497 L
82.119 71.5 L
82.336 71.502 L
82.553 71.505 L
82.77 71.508 L
82.987 71.51 L
83.204 71.513 L
83.421 71.515 L
83.638 71.518 L
83.855 71.521 L
84.073 71.524 L
84.29 71.526 L
84.507 71.529 L
84.724 71.532 L
84.941 71.535 L
85.158 71.538 L
85.375 71.541 L
85.592 71.544 L
85.809 71.547 L
86.027 71.55 L
86.244 71.554 L
86.461 71.557 L
86.678 71.56 L
86.895 71.563 L
87.112 71.567 L
87.329 71.57 L
87.546 71.574 L
87.763 71.577 L
87.98 71.581 L
88.198 71.584 L
88.415 71.588 L
88.632 71.592 L
88.849 71.596 L
89.066 71.599 L
89.283 71.603 L
89.5 71.607 L
89.717 71.611 L
89.934 71.615 L
90.152 71.619 L
90.369 71.623 L
90.586 71.628 L
90.803 71.632 L
91.02 71.636 L
91.237 71.641 L
91.454 71.645 L
91.671 71.649 L
91.888 71.654 L
92.106 71.659 L
92.323 71.663 L
92.54 71.668 L
92.757 71.673 L
92.974 71.678 L
93.191 71.683 L
93.408 71.688 L
93.625 71.693 L
93.842 71.698 L
94.06 71.703 L
94.277 71.709 L
94.494 71.714 L
94.711 71.719 L
94.928 71.725 L
95.145 71.731 L
95.362 71.736 L
95.579 71.742 L
95.796 71.748 L
96.014 71.754 L
96.231 71.76 L
96.448 71.766 L
96.665 71.772 L
96.882 71.778 L
97.099 71.785 L
97.316 71.791 L
97.533 71.798 L
97.75 71.804 L
97.967 71.811 L
98.185 71.818 L
98.402 71.825 L
98.619 71.832 L
98.836 71.839 L
99.053 71.846 L
99.27 71.853 L
99.487 71.861 L
99.704 71.868 L
99.921 71.876 L
100.139 71.883 L
100.356 71.891 L
100.573 71.899 L
100.79 71.907 L
101.007 71.915 L
101.224 71.924 L
101.441 71.932 L
101.658 71.94 L
101.875 71.949 L
102.093 71.958 L
102.31 71.967 L
102.527 71.976 L
102.744 71.985 L
102.961 71.994 L
103.178 72.003 L
103.395 72.013 L
103.612 72.022 L
103.829 72.032 L
104.047 72.042 L
104.264 72.052 L
104.481 72.062 L
104.698 72.072 L
104.915 72.083 L
105.132 72.093 L
105.349 72.104 L
105.566 72.115 L
105.783 72.126 L
106.001 72.137 L
106.218 72.148 L
106.435 72.16 L
106.652 72.172 L
106.869 72.183 L
107.086 72.195 L
107.303 72.207 L
107.52 72.22 L
107.737 72.232 L
107.954 72.245 L
108.172 72.258 L
108.389 72.271 L
108.606 72.284 L
108.823 72.297 L
109.04 72.311 L
109.257 72.324 L
109.474 72.338 L
109.691 72.352 L
109.908 72.367 L
110.126 72.381 L
110.343 72.396 L
110.56 72.411 L
110.777 72.426 L
110.994 72.441 L
111.211 72.457 L
111.428 72.473 L
111.645 72.488 L
111.862 72.505 L
112.08 72.521 L
112.297 72.538 L
112.514 72.555 L
112.731 72.572 L
112.948 72.589 L
113.165 72.607 L
113.382 72.624 L
113.599 72.642 L
113.816 72.661 L
114.034 72.679 L
114.251 72.698 L
114.468 72.717 L
114.685 72.736 L
114.902 72.756 L
115.119 72.776 L
115.336 72.796 L
115.553 72.816 L
115.77 72.837 L
115.987 72.858 L
116.205 72.879 L
116.422 72.901 L
116.639 72.923 L
116.856 72.945 L
117.073 72.967 L
117.29 72.99 L
117.507 73.013 L
117.724 73.037 L
117.941 73.06 L
118.159 73.084 L
118.376 73.109 L
118.593 73.133 L
118.81 73.159 L
119.027 73.184 L
119.244 73.21 L
119.461 73.236 L
119.678 73.262 L
119.895 73.289 L
120.113 73.316 L
120.33 73.344 L
120.547 73.372 L
120.764 73.4 L
120.981 73.429 L
121.198 73.458 L
121.415 73.487 L
121.632 73.517 L
121.849 73.548 L
122.067 73.578 L
122.284 73.609 L
122.501 73.641 L
122.718 73.673 L
122.935 73.705 L
123.152 73.738 L
123.369 73.772 L
123.586 73.805 L
123.803 73.84 L
124.021 73.874 L
124.238 73.909 L
124.455 73.945 L
124.672 73.981 L
124.889 74.018 L
125.106 74.055 L
125.323 74.093 L
125.54 74.131 L
125.757 74.17 L
125.974 74.209 L
126.192 74.248 L
126.409 74.289 L
126.626 74.33 L
126.843 74.371 L
127.06 74.413 L
127.277 74.455 L
127.494 74.498 L
127.711 74.542 L
127.928 74.586 L
128.146 74.631 L
128.363 74.677 L
128.58 74.723 L
128.797 74.769 L
129.014 74.817 L
129.231 74.865 L
129.448 74.913 L
129.665 74.963 L
129.882 75.013 L
130.1 75.063 L
130.317 75.114 L
130.534 75.166 L
130.751 75.219 L
130.968 75.273 L
131.185 75.327 L
131.402 75.382 L
131.619 75.437 L
131.836 75.493 L
132.054 75.55 L
132.271 75.608 L
132.488 75.667 L
132.705 75.726 L
132.922 75.787 L
133.139 75.848 L
133.356 75.909 L
133.573 75.972 L
133.79 76.036 L
134.008 76.1 L
134.225 76.165 L
134.442 76.231 L
134.659 76.298 L
134.876 76.366 L
135.093 76.435 L
135.31 76.504 L
135.527 76.575 L
135.744 76.647 L
135.961 76.719 L
136.179 76.792 L
136.396 76.867 L
136.613 76.942 L
136.83 77.019 L
137.047 77.096 L
137.264 77.174 L
137.481 77.254 L
137.698 77.334 L
137.915 77.416 L
138.133 77.499 L
138.35 77.582 L
138.567 77.667 L
138.784 77.753 L
139.001 77.84 L
139.218 77.929 L
139.435 78.018 L
139.652 78.109 L
139.869 78.2 L
140.087 78.293 L
140.304 78.387 L
140.521 78.483 L
140.738 78.579 L
140.955 78.677 L
141.172 78.776 L
141.389 78.877 L
141.606 78.979 L
141.823 79.082 L
142.041 79.186 L
142.258 79.292 L
142.475 79.399 L
142.692 79.507 L
142.909 79.617 L
143.126 79.729 L
143.343 79.841 L
143.56 79.956 L
143.777 80.071 L
143.994 80.188 L
144.212 80.307 L
144.429 80.427 L
144.646 80.549 L
144.863 80.672 L
145.08 80.797 L
145.297 80.923 L
145.514 81.051 L
145.731 81.181 L
145.948 81.312 L
146.166 81.445 L
146.383 81.58 L
146.6 81.716 L
146.817 81.854 L
147.034 81.994 L
147.251 82.136 L
147.468 82.279 L
147.685 82.424 L
147.902 82.571 L
148.12 82.72 L
148.337 82.87 L
148.554 83.023 L
148.771 83.177 L
148.988 83.333 L
149.205 83.492 L
149.422 83.652 L
149.639 83.814 L
149.856 83.978 L
150.074 84.144 L
150.291 84.313 L
150.508 84.483 L
150.725 84.655 L
150.942 84.83 L
151.159 85.006 L
151.376 85.185 L
151.593 85.366 L
151.81 85.549 L
152.028 85.734 L
152.245 85.922 L
152.462 86.111 L
152.679 86.304 L
152.896 86.498 L
153.113 86.695 L
153.33 86.894 L
153.547 87.095 L
153.764 87.299 L
153.981 87.505 L
154.199 87.714 L
154.416 87.925 L
154.633 88.138 L
154.85 88.354 L
155.067 88.573 L
155.284 88.794 L
155.501 89.018 L
155.718 89.244 L
155.935 89.473 L
156.153 89.705 L
156.37 89.939 L
156.587 90.176 L
156.804 90.415 L
157.021 90.658 L
157.238 90.903 L
157.455 91.151 L
157.672 91.402 L
157.889 91.655 L
158.107 91.912 L
158.324 92.171 L
158.541 92.433 L
158.758 92.698 L
158.975 92.966 L
159.192 93.237 L
159.409 93.511 L
159.626 93.788 L
159.843 94.068 L
160.061 94.352 L
160.278 94.638 L
160.495 94.927 L
160.712 95.22 L
160.929 95.515 L
161.146 95.814 L
161.363 96.116 L
161.58 96.421 L
161.797 96.729 L
162.015 97.041 L
162.232 97.356 L
162.449 97.674 L
162.666 97.996 L
162.883 98.321 L
163.1 98.649 L
163.317 98.981 L
163.534 99.316 L
163.751 99.654 L
163.968 99.996 L
164.186 100.342 L
164.403 100.69 L
164.62 101.043 L
164.837 101.399 L
165.054 101.758 L
165.271 102.121 L
165.488 102.488 L
165.705 102.858 L
165.922 103.232 L
166.14 103.609 L
166.357 103.99 L
166.574 104.375 L
166.791 104.763 L
167.008 105.155 L
167.225 105.551 L
167.442 105.95 L
167.659 106.353 L
167.876 106.76 L
168.094 107.171 L
168.311 107.585 L
168.528 108.003 L
168.745 108.425 L
168.962 108.851 L
169.179 109.28 L
169.396 109.714 L
169.613 110.151 L
169.83 110.592 L
170.048 111.036 L
170.265 111.485 L
170.482 111.938 L
170.699 112.394 L
170.916 112.854 L
171.133 113.318 L
171.35 113.786 L
171.567 114.258 L
171.784 114.733 L
172.001 115.213 L
172.219 115.696 L
172.436 116.183 L
172.653 116.674 L
172.87 117.169 L
173.087 117.668 L
173.304 118.171 L
173.521 118.677 L
173.738 119.187 L
173.955 119.702 L
174.173 120.22 L
174.39 120.741 L
174.607 121.267 L
174.824 121.796 L
175.041 122.329 L
175.258 122.866 L
175.475 123.407 L
175.692 123.952 L
175.909 124.5 L
176.127 125.052 L
176.344 125.607 L
176.561 126.166 L
176.778 126.729 L
176.995 127.296 L
177.212 127.866 L
177.429 128.44 L
177.646 129.017 L
177.863 129.598 L
178.081 130.182 L
178.298 130.77 L
178.515 131.361 L
178.732 131.956 L
178.949 132.554 L
179.166 133.155 L
179.383 133.76 L
179.6 134.368 L
179.817 134.979 L
180.035 135.594 L
180.252 136.212 L
180.469 136.832 L
180.686 137.456 L
180.903 138.083 L
181.12 138.713 L
181.337 139.346 L
181.554 139.982 L
181.771 140.621 L
181.988 141.262 L
182.206 141.907 L
182.423 142.554 L
182.64 143.204 L
182.857 143.856 L
183.074 144.511 L
183.291 145.168 L
183.508 145.828 L
183.725 146.49 L
183.942 147.154 L
184.16 147.821 L
184.377 148.49 L
184.594 149.161 L
184.811 149.834 L
185.028 150.509 L
185.245 151.186 L
185.462 151.865 L
185.679 152.546 L
185.896 153.228 L
186.114 153.912 L
186.331 154.598 L
186.548 155.285 L
186.765 155.973 L
186.982 156.663 L
187.199 157.354 L
187.416 158.046 L
187.633 158.739 L
187.85 159.433 L
188.068 160.128 L
188.285 160.824 L
188.502 161.521 L
188.719 162.218 L
188.936 162.916 L
189.153 163.614 L
189.37 164.313 L
189.587 165.011 L
189.804 165.71 L
190.022 166.409 L
190.239 167.108 L
190.456 167.807 L
190.673 168.506 L
190.89 169.204 L
191.107 169.902 L
191.324 170.599 L
191.541 171.296 L
191.758 171.992 L
191.975 172.687 L
192.193 173.381 L
192.41 174.074 L
192.627 174.766 L
192.844 175.456 L
193.061 176.145 L
193.278 176.833 L
193.495 177.519 L
193.712 178.203 L
193.929 178.885 L
194.147 179.566 L
194.364 180.244 L
194.581 180.92 L
194.798 181.593 L
195.015 182.265 L
195.232 182.933 L
195.449 183.599 L
195.666 184.262 L
195.883 184.922 L
196.101 185.579 L
196.318 186.233 L
196.535 186.884 L
196.752 187.531 L
196.969 188.175 L
197.186 188.815 L
197.403 189.451 L
197.62 190.083 L
197.837 190.712 L
198.055 191.336 L
198.272 191.956 L
198.489 192.571 L
198.706 193.182 L
198.923 193.788 L
199.14 194.39 L
199.357 194.986 L
199.574 195.578 L
199.791 196.164 L
200.008 196.745 L
200.226 197.321 L
200.443 197.891 L
200.66 198.456 L
200.877 199.015 L
201.094 199.568 L
201.311 200.115 L
201.528 200.656 L
201.745 201.191 L
201.962 201.719 L
202.18 202.241 L
202.397 202.757 L
202.614 203.266 L
202.831 203.768 L
203.048 204.263 L
203.265 204.751 L
203.482 205.13 L
203.699 205.205 L
203.916 205.271 L
204.134 205.328 L
204.351 205.376 L
204.568 205.414 L
204.785 205.444 L
205.002 205.463 L
205.219 205.474 L
205.436 205.475 L
205.653 205.467 L
205.87 205.449 L
206.088 205.422 L
206.305 205.386 L
206.522 205.34 L
206.739 205.285 L
206.956 205.221 L
207.173 205.147 L
207.39 205.063 L
207.607 204.971 L
207.824 204.868 L
208.042 204.757 L
208.259 204.636 L
208.476 204.506 L
208.693 204.367 L
208.91 204.218 L
209.127 204.06 L
209.344 203.893 L
209.561 203.717 L
209.778 203.531 L
209.995 203.337 L
210.213 203.133 L
210.43 202.92 L
210.647 202.699 L
210.864 202.468 L
211.081 202.229 L
211.298 201.981 L
211.515 201.723 L
211.732 201.458 L
211.949 201.183 L
212.167 200.9 L
212.384 200.609 L
212.601 200.309 L
212.818 200 L
213.035 199.683 L
213.252 199.358 L
213.469 199.025 L
213.686 198.683 L
213.903 198.334 L
214.121 197.976 L
214.338 197.61 L
214.555 197.237 L
214.772 196.856 L
214.989 196.467 L
215.206 196.071 L
215.423 195.667 L
215.64 195.255 L
215.857 194.837 L
216.075 194.411 L
216.292 193.978 L
216.509 193.537 L
216.726 193.09 L
216.943 192.636 L
217.16 192.123 L
217.377 191.414 L
217.594 190.701 L
217.811 189.984 L
218.029 189.265 L
218.246 188.542 L
218.463 187.817 L
218.68 187.089 L
218.897 186.358 L
219.114 185.624 L
219.331 184.887 L
219.548 184.148 L
219.765 183.407 L
219.982 182.663 L
220.2 181.916 L
220.417 181.168 L
220.634 180.417 L
220.851 179.664 L
221.068 178.909 L
221.285 178.152 L
221.502 177.393 L
221.719 176.632 L
221.936 175.87 L
222.154 175.106 L
222.371 174.34 L
222.588 173.573 L
222.805 172.805 L
223.022 172.035 L
223.239 171.264 L
223.456 170.492 L
223.673 169.719 L
223.89 168.945 L
224.108 168.17 L
224.325 167.394 L
224.542 166.617 L
224.759 165.84 L
224.976 165.062 L
225.193 164.284 L
225.41 163.506 L
225.627 162.727 L
225.844 161.948 L
226.062 161.168 L
226.279 160.389 L
226.496 159.61 L
226.713 158.831 L
226.93 158.052 L
227.147 157.273 L
227.364 156.495 L
227.581 155.717 L
227.798 154.94 L
228.016 154.163 L
228.233 153.387 L
228.45 152.612 L
228.667 151.838 L
228.884 151.065 L
229.101 150.292 L
229.318 149.521 L
229.535 148.751 L
229.752 147.982 L
229.969 147.215 L
230.187 146.449 L
230.404 145.684 L
230.621 144.922 L
230.838 144.16 L
231.055 143.401 L
231.272 142.643 L
231.489 141.887 L
231.706 141.134 L
231.923 140.382 L
232.141 139.632 L
232.358 138.885 L
232.575 138.139 L
232.792 137.396 L
233.009 136.656 L
233.226 135.918 L
233.443 135.182 L
233.66 134.449 L
233.877 133.719 L
234.095 132.992 L
234.312 132.267 L
234.529 131.545 L
234.746 130.826 L
234.963 130.11 L
235.18 129.397 L
235.397 128.687 L
235.614 127.98 L
235.831 127.277 L
236.049 126.577 L
236.266 125.88 L
236.483 125.187 L
236.7 124.497 L
236.917 123.81 L
237.134 123.127 L
237.351 122.448 L
237.568 121.772 L
237.785 121.1 L
238.003 120.432 L
238.22 119.767 L
238.437 119.107 L
238.654 118.45 L
238.871 117.797 L
239.088 117.148 L
239.305 116.504 L
239.522 115.863 L
239.739 115.226 L
239.956 114.593 L
240.174 113.965 L
240.391 113.341 L
240.608 112.721 L
240.825 112.105 L
241.042 111.493 L
241.259 110.886 L
241.476 110.283 L
241.693 109.685 L
241.91 109.091 L
242.128 108.501 L
242.345 107.916 L
242.562 107.335 L
242.779 106.759 L
242.996 106.187 L
243.213 105.619 L
243.43 105.057 L
243.647 104.498 L
243.864 103.945 L
244.082 103.396 L
244.299 102.851 L
244.516 102.312 L
244.733 101.776 L
244.95 101.246 L
245.167 100.72 L
245.384 100.199 L
245.601 99.682 L
245.818 99.17 L
246.036 98.662 L
246.253 98.16 L
246.47 97.662 L
246.687 97.168 L
246.904 96.68 L
247.121 96.196 L
247.338 95.716 L
247.555 95.242 L
247.772 94.772 L
247.99 94.306 L
248.207 93.845 L
248.424 93.389 L
248.641 92.938 L
248.858 92.491 L
249.075 92.048 L
249.292 91.611 L
249.509 91.177 L
249.726 90.749 L
249.943 90.325 L
250.161 89.905 L
250.378 89.49 L
250.595 89.08 L
250.812 88.674 L
251.029 88.273 L
251.246 87.876 L
251.463 87.483 L
251.68 87.095 L
251.897 86.711 L
252.115 86.332 L
252.332 85.957 L
252.549 85.586 L
252.766 85.22 L
252.983 84.858 L
253.2 84.5 L
253.417 84.146 L
253.634 83.797 L
253.851 83.452 L
254.069 83.111 L
254.286 82.774 L
254.503 82.441 L
254.72 82.113 L
254.937 81.781 L
255.154 81.436 L
255.371 81.096 L
255.588 80.76 L
255.805 80.428 L
256.023 80.099 L
256.24 79.775 L
256.457 79.455 L
256.674 79.138 L
256.891 78.825 L
257.108 78.516 L
257.325 78.211 L
257.542 77.91 L
257.759 77.612 L
257.977 77.318 L
258.194 77.028 L
258.411 76.741 L
258.628 76.458 L
258.845 76.179 L
259.062 75.903 L
259.279 75.63 L
259.496 75.361 L
259.713 75.096 L
259.93 74.834 L
260.148 74.575 L
260.365 74.32 L
260.582 74.068 L
260.799 73.82 L
261.016 73.574 L
261.233 73.332 L
261.45 73.093 L
261.667 72.858 L
261.884 72.625 L
262.102 72.396 L
262.319 72.17 L
262.536 71.946 L
262.753 71.726 L
262.97 71.509 L
263.187 71.295 L
263.404 71.084 L
263.621 70.875 L
263.838 70.67 L
264.056 70.467 L
264.273 70.267 L
264.49 70.07 L
264.707 69.876 L
264.924 69.684 L
265.141 69.495 L
265.358 69.309 L
265.575 69.126 L
265.792 68.945 L
266.009 68.766 L
266.227 68.591 L
266.444 68.417 L
266.661 68.246 L
266.878 68.078 L
267.095 67.912 L
267.312 67.748 L
267.529 67.587 L
267.746 67.428 L
267.963 67.272 L
268.181 67.118 L
268.398 66.966 L
268.615 66.816 L
268.832 66.668 L
269.049 66.523 L
269.266 66.38 L
269.483 66.238 L
269.7 66.099 L
269.917 65.962 L
270.135 65.827 L
270.352 65.695 L
270.569 65.564 L
270.786 65.435 L
271.003 65.308 L
271.22 65.182 L
271.437 65.059 L
271.654 64.938 L
271.871 64.818 L
272.089 64.701 L
272.306 64.585 L
272.523 64.471 L
272.74 64.358 L
272.957 64.248 L
273.174 64.139 L
273.391 64.031 L
273.608 63.926 L
273.825 63.822 L
274.043 63.719 L
274.26 63.618 L
274.477 63.519 L
274.694 63.422 L
274.911 63.325 L
275.128 63.231 L
275.345 63.138 L
275.562 63.046 L
275.779 62.956 L
275.996 62.867 L
276.214 62.779 L
276.431 62.693 L
276.648 62.609 L
276.865 62.525 L
277.082 62.443 L
277.299 62.363 L
277.516 62.283 L
277.733 62.205 L
277.95 62.128 L
278.168 62.053 L
278.385 61.978 L
278.602 61.905 L
278.819 61.833 L
279.036 61.763 L
279.253 61.693 L
279.47 61.625 L
279.687 61.557 L
279.904 61.491 L
280.122 61.426 L
280.339 61.362 L
280.556 61.299 L
280.773 61.237 L
280.99 61.176 L
281.207 61.117 L
281.424 61.058 L
281.641 61 L
281.858 60.943 L
282.076 60.888 L
282.293 60.833 L
282.51 60.779 L
282.727 60.726 L
282.944 60.674 L
283.161 60.623 L
283.378 60.573 L
283.595 60.524 L
283.812 60.475 L
284.03 60.428 L
284.247 60.381 L
284.464 60.336 L
284.681 60.291 L
284.898 60.247 L
285.115 60.203 L
285.332 60.161 L
285.549 60.119 L
285.766 60.079 L
285.983 60.039 L
286.201 59.999 L
286.418 59.961 L
286.635 59.923 L
286.852 59.886 L
287.069 59.85 L
287.286 59.814 L
287.503 59.78 L
287.72 59.746 L
287.937 59.712 L
288.155 59.68 L
288.372 59.648 L
288.589 59.616 L
288.806 59.586 L
289.023 59.556 L
289.24 59.527 L
289.457 59.498 L
289.674 59.47 L
289.891 59.443 L
290.109 59.417 L
290.326 59.391 L
290.543 59.365 L
290.76 59.341 L
290.977 59.317 L
291.194 59.293 L
291.411 59.27 L
291.628 59.248 L
291.845 59.227 L
292.063 59.206 L
292.28 59.185 L
292.497 59.165 L
292.714 59.146 L
292.931 59.128 L
293.148 59.11 L
293.365 59.092 L
293.582 59.075 L
293.799 59.059 L
294.017 59.043 L
294.234 59.028 L
294.451 59.013 L
294.668 58.999 L
294.885 58.986 L
295.102 58.973 L
295.319 58.96 L
295.536 58.948 L
295.753 58.937 L
295.97 58.926 L
296.188 58.916 L
296.405 58.906 L
296.622 58.897 L
296.839 58.888 L
297.056 58.88 L
297.273 58.872 L
297.49 58.865 L
297.707 58.858 L
297.924 58.852 L
298.142 58.847 L
298.359 58.842 L
298.576 58.837 L
298.793 58.833 L
299.01 58.83 L
299.227 58.827 L
299.444 58.824 L
299.661 58.822 L
299.878 58.821 L
300.096 58.82 L
300.313 58.82 L
300.53 58.82 L
300.747 58.82 L
300.964 58.822 L
301.181 58.823 L
301.398 58.825 L
301.615 58.828 L
301.832 58.831 L
302.05 58.835 L
302.267 58.839 L
302.484 58.844 L
302.701 58.849 L
302.918 58.855 L
303.135 58.862 L
303.352 58.868 L
303.569 58.876 L
303.786 58.884 L
304.004 58.892 L
304.221 58.901 L
304.438 58.911 L
304.655 58.921 L
304.872 58.931 L
305.089 58.942 L
305.306 58.954 L
305.523 58.966 L
305.74 58.979 L
305.957 58.992 L
306.175 59.006 L
306.392 59.02 L
306.609 59.035 L
306.826 59.051 L
307.043 59.067 L
307.26 59.083 L
307.477 59.1 L
307.694 59.118 L
307.911 59.136 L
308.129 59.155 L
308.346 59.175 L
308.563 59.195 L
308.78 59.215 L
308.997 59.237 L
309.214 59.258 L
309.431 59.281 L
309.648 59.304 L
309.865 59.327 L
310.083 59.352 L
310.3 59.376 L
310.517 59.402 L
310.734 59.428 L
310.951 59.455 L
311.168 59.482 L
311.385 59.51 L
311.602 59.539 L
311.819 59.568 L
312.037 59.598 L
312.254 59.628 L
312.471 59.66 L
312.688 59.691 L
312.905 59.724 L
313.122 59.757 L
313.339 59.791 L
313.556 59.826 L
313.773 59.861 L
313.991 59.897 L
314.208 59.934 L
314.425 59.972 L
314.642 60.01 L
314.859 60.049 L
315.076 60.088 L
315.293 60.129 L
315.51 60.17 L
315.727 60.212 L
315.944 60.255 L
316.162 60.298 L
316.379 60.342 L
316.596 60.387 L
316.813 60.433 L
317.03 60.48 L
317.247 60.527 L
317.464 60.576 L
317.681 60.625 L
317.898 60.675 L
318.116 60.726 L
318.333 60.777 L
318.55 60.83 L
318.767 60.883 L
318.984 60.938 L
319.201 60.993 L
319.418 61.049 L
319.635 61.106 L
319.852 61.164 L
320.07 61.223 L
320.287 61.283 L
320.504 61.343 L
320.721 61.405 L
320.938 61.468 L
321.155 61.531 L
321.372 61.596 L
321.589 61.662 L
321.806 61.728 L
322.024 61.796 L
322.241 61.865 L
322.458 61.935 L
322.675 62.006 L
322.892 62.078 L
323.109 62.151 L
323.326 62.225 L
323.543 62.3 L
323.76 62.376 L
323.977 62.454 L
324.195 62.532 L
324.412 62.612 L
324.629 62.693 L
324.846 62.775 L
325.063 62.859 L
325.28 62.943 L
325.497 63.029 L
325.714 63.116 L
325.931 63.204 L
326.149 63.294 L
326.366 63.385 L
326.583 63.477 L
326.8 63.571 L
327.017 63.665 L
327.234 63.761 L
327.451 63.859 L
327.668 63.958 L
327.885 64.058 L
328.103 64.16 L
328.32 64.263 L
328.537 64.367 L
328.754 64.473 L
328.971 64.581 L
329.188 64.689 L
329.405 64.8 L
329.622 64.912 L
329.839 65.025 L
330.057 65.14 L
330.274 65.257 L
330.491 65.375 L
330.708 65.495 L
330.925 65.616 L
331.142 65.739 L
331.359 65.864 L
331.576 65.99 L
331.793 66.118 L
332.011 66.248 L
332.228 66.38 L
332.445 66.513 L
332.662 66.648 L
332.879 66.785 L
333.096 66.924 L
333.313 67.064 L
333.53 67.206 L
333.747 67.351 L
333.964 67.497 L
334.182 67.645 L
334.399 67.795 L
334.616 67.947 L
334.833 68.101 L
335.05 68.256 L
335.267 68.414 L
335.484 68.574 L
335.701 68.736 L
335.918 68.901 L
336.136 69.067 L
336.353 69.235 L
336.57 69.406 L
336.787 69.578 L
337.004 69.753 L
337.221 69.93 L
337.438 70.11 L
337.655 70.292 L
337.872 70.475 L
338.09 70.662 L
338.307 70.85 L
338.524 71.041 L
338.741 71.235 L
338.958 71.431 L
339.175 71.629 L
339.392 71.829 L
339.609 72.033 L
339.826 72.238 L
340.044 72.447 L
340.261 72.658 L
340.478 72.871 L
340.695 73.087 L
340.912 73.306 L
341.129 73.527 L
341.346 73.751 L
341.563 73.978 L
341.78 74.208 L
341.997 74.44 L
342.215 74.675 L
342.432 74.913 L
342.649 75.154 L
342.866 75.397 L
343.083 75.644 L
343.3 75.894 L
343.517 76.146 L
343.734 76.402 L
343.951 76.66 L
344.169 76.922 L
344.386 77.187 L
344.603 77.455 L
344.82 77.725 L
345.037 78 L
345.254 78.277 L
345.471 78.557 L
345.688 78.841 L
345.905 79.128 L
346.123 79.419 L
346.34 79.712 L
346.557 80.009 L
346.774 80.31 L
346.991 80.614 L
347.208 80.921 L
347.425 81.232 L
347.642 81.546 L
347.859 81.864 L
348.077 82.185 L
348.294 82.51 L
348.511 82.839 L
348.728 83.171 L
348.945 83.507 L
349.162 83.847 L
349.379 84.19 L
349.596 84.537 L
349.813 84.888 L
350.031 85.243 L
350.248 85.602 L
350.465 85.964 L
350.682 86.331 L
350.899 86.701 L
351.116 87.075 L
351.333 87.453 L
351.55 87.836 L
351.767 88.222 L
351.984 88.612 L
352.202 89.007 L
352.419 89.405 L
352.636 89.808 L
352.853 90.215 L
353.07 90.626 L
353.287 91.041 L
353.504 91.461 L
353.721 91.885 L
353.938 92.313 L
354.156 92.745 L
354.373 93.182 L
354.59 93.623 L
354.807 94.069 L
355.024 94.519 L
355.241 94.973 L
355.458 95.432 L
355.675 95.896 L
355.892 96.363 L
356.11 96.836 L
356.327 97.313 L
356.544 97.794 L
356.761 98.28 L
356.978 98.771 L
357.195 99.267 L
357.412 99.767 L
357.629 100.271 L
357.846 100.781 L
358.064 101.295 L
358.281 101.814 L
358.498 102.337 L
358.715 102.865 L
358.932 103.398 L
359.149 103.936 L
359.366 104.479 L
359.583 105.026 L
359.8 105.579 L
360.017 106.136 L
360.235 106.698 L
360.452 107.265 L
360.669 107.837 L
360.886 108.413 L
361.103 108.995 L
361.32 109.581 L
361.537 110.172 L
361.754 110.769 L
361.971 111.37 L
362.189 111.976 L
362.406 112.587 L
362.623 113.203 L
362.84 113.824 L
363.057 114.45 L
363.274 115.081 L
363.491 115.717 L
363.708 116.357 L
363.925 117.003 L
364.143 117.654 L
364.36 118.309 L
364.577 118.97 L
364.794 119.635 L
365.011 120.306 L
365.228 120.981 L
365.445 121.661 L
365.662 122.347 L
365.879 123.037 L
366.097 123.732 L
366.314 124.432 L
366.531 125.137 L
366.748 125.847 L
366.965 126.561 L
367.182 127.281 L
367.399 128.005 L
367.616 128.734 L
367.833 129.468 L
368.051 130.207 L
368.268 130.95 L
368.485 131.698 L
368.702 132.451 L
368.919 133.209 L
369.136 133.971 L
369.353 134.738 L
369.57 135.51 L
369.787 136.286 L
370.004 137.067 L
370.222 137.853 L
370.439 138.643 L
370.656 139.437 L
370.873 140.236 L
371.09 141.04 L
371.307 141.848 L
371.524 142.66 L
371.741 143.477 L
371.958 144.298 L
372.176 145.123 L
372.393 145.953 L
372.61 146.786 L
372.827 147.624 L
373.044 148.467 L
373.261 149.313 L
373.478 150.163 L
373.695 151.017 L
373.912 151.876 L
374.13 152.738 L
374.347 153.604 L
374.564 154.474 L
374.781 155.348 L
374.998 156.226 L
375.215 157.107 L
375.432 157.992 L
375.649 158.88 L
375.866 159.773 L
376.084 160.668 L
376.301 161.567 L
376.518 162.47 L
376.735 163.376 L
376.952 164.285 L
377.169 165.198 L
377.386 166.114 L
377.603 167.033 L
377.82 167.955 L
378.038 168.88 L
378.255 169.808 L
378.472 170.739 L
378.689 171.673 L
378.906 172.609 L
379.123 173.549 L
379.34 174.491 L
379.557 175.436 L
379.774 176.383 L
379.991 177.333 L
380.209 178.285 L
380.426 179.24 L
380.643 180.197 L
380.86 181.156 L
381.077 182.118 L
381.294 183.081 L
381.511 184.047 L
381.728 185.015 L
381.945 185.985 L
382.163 186.956 L
382.38 187.533 L
382.597 187.531 L
382.814 187.529 L
383.031 187.527 L
383.248 187.526 L
383.465 187.525 L
383.682 187.523 L
383.899 187.522 L
384.117 187.521 L
384.334 187.521 L
384.551 187.52 L
384.768 187.519 L
384.985 187.519 L
385.202 187.519 L
385.419 187.518 L
385.636 187.518 L
385.853 187.518 L
386.071 187.519 L
386.288 187.519 L
386.505 187.52 L
386.722 187.52 L
386.939 187.521 L
387.156 187.522 L
387.373 187.523 L
387.59 187.524 L
387.807 187.525 L
388.025 187.527 L
388.242 187.528 L
388.459 187.53 L
388.676 187.532 L
388.893 187.534 L
389.11 187.536 L
389.327 187.538 L
389.544 187.54 L
389.761 187.543 L
389.978 187.546 L
390.196 187.548 L
390.413 187.551 L
390.63 187.554 L
390.847 187.558 L
391.064 187.561 L
391.281 187.564 L
391.498 187.568 L
391.715 187.572 L
391.932 187.576 L
392.15 187.58 L
392.367 187.584 L
392.584 187.588 L
392.801 187.592 L
393.018 187.597 L
393.235 187.602 L
393.452 187.607 L
393.669 187.612 L
393.886 187.617 L
394.104 187.622 L
394.321 187.628 L
394.538 187.633 L
394.755 187.639 L
394.972 187.645 L
395.189 187.651 L
395.406 187.658 L
395.623 187.664 L
395.84 187.671 L
396.058 187.677 L
396.275 187.684 L
396.492 187.691 L
396.709 187.698 L
396.926 187.706 L
397.143 187.713 L
397.36 187.721 L
397.577 187.729 L
397.794 187.737 L
398.012 187.745 L
398.229 187.754 L
398.446 187.762 L
398.663 187.771 L
398.88 187.78 L
399.097 187.789 L
399.314 187.798 L
399.531 187.808 L
399.748 187.818 L
399.965 187.827 L
400.183 187.837 L
400.4 187.848 L
400.617 187.858 L
400.834 187.869 L
401.051 187.88 L
401.268 187.891 L
401.485 187.902 L
401.702 187.913 L
401.919 187.925 L
402.137 187.937 L
402.354 187.949 L
402.571 187.961 L
402.788 187.973 L
403.005 187.986 L
403.222 187.999 L
403.439 188.012 L
403.656 188.025 L
403.873 188.039 L
404.091 188.053 L
404.308 188.067 L
404.525 188.081 L
404.742 188.096 L
404.959 188.11 L
405.176 188.125 L
405.393 188.14 L
405.61 188.156 L
405.827 188.172 L
406.045 188.188 L
406.262 188.204 L
406.479 188.22 L
406.696 188.237 L
406.913 188.254 L
407.13 188.271 L
407.347 188.289 L
407.564 188.307 L
407.781 188.325 L
407.999 188.343 L
408.216 188.362 L
408.433 188.381 L
408.65 188.4 L
408.867 188.419 L
409.084 188.439 L
409.301 188.459 L
409.518 188.48 L
409.735 188.5 L
409.952 188.521 L
410.17 188.543 L
410.387 188.564 L
410.604 188.586 L
410.821 188.609 L
411.038 188.631 L
411.255 188.654 L
411.472 188.678 L
411.689 188.701 L
411.906 188.725 L
412.124 188.75 L
412.341 188.774 L
412.558 188.799 L
412.775 188.825 L
412.992 188.851 L
413.209 188.877 L
413.426 188.903 L
413.643 188.93 L
413.86 188.958 L
414.078 188.985 L
414.295 189.013 L
414.512 189.042 L
414.729 189.071 L
414.946 189.1 L
415.163 189.13 L
415.38 189.16 L
415.597 189.191 L
415.814 189.222 L
416.032 189.253 L
416.249 189.285 L
416.466 189.317 L
416.683 189.35 L
416.9 189.384 L
417.117 189.417 L
417.334 189.452 L
417.551 189.486 L
417.768 189.521 L
417.985 189.557 L
418.203 189.593 L
418.42 189.63 L
418.637 189.667 L
418.854 189.705 L
419.071 189.743 L
419.288 189.782 L
419.505 189.821 L
419.722 189.861 L
419.939 189.901 L
420.157 189.942 L
420.374 189.984 L
420.591 190.026 L
420.808 190.069 L
421.025 190.112 L
421.242 190.156 L
421.459 190.2 L
421.676 190.245 L
421.893 190.291 L
422.111 190.337 L
422.328 190.384 L
422.545 190.431 L
422.762 190.479 L
422.979 190.528 L
423.196 190.578 L
423.413 190.628 L
423.63 190.679 L
423.847 190.73 L
424.065 190.783 L
424.282 190.835 L
424.499 190.889 L
424.716 190.943 L
424.933 190.998 L
425.15 191.054 L
425.367 191.111 L
425.584 191.168 L
425.801 191.226 L
426.019 191.285 L
426.236 191.345 L
426.453 191.405 L
426.67 191.466 L
426.887 191.529 L
427.104 191.591 L
427.321 191.655 L
427.538 191.72 L
427.755 191.785 L
427.972 191.851 L
428.19 191.919 L
428.407 191.987 L
428.624 192.055 L
428.841 192.125 L
429.058 192.196 L
429.275 192.268 L
429.492 192.34 L
429.709 192.414 L
429.926 192.489 L
430.144 192.564 L
430.361 192.641 L
430.578 192.718 L
430.795 192.796 L
431.012 192.876 L
431.229 192.957 L
431.446 193.038 L
431.663 193.121 L
431.88 193.205 L
432.098 193.289 L
432.315 193.375 L
432.532 193.462 L
432.749 193.55 L
432.966 193.64 L
433.183 193.73 L
433.4 193.822 L
433.617 193.914 L
433.834 194.008 L
434.052 194.103 L
434.269 194.2 L
434.486 194.297 L
434.703 194.396 L
434.92 194.496 L
435.137 194.597 L
435.354 194.7 L
435.571 194.804 L
435.788 194.909 L
436.005 195.016 L
436.223 195.124 L
436.44 195.233 L
436.657 195.343 L
436.874 195.455 L
437.091 195.569 L
437.308 195.684 L
437.525 195.8 L
437.742 195.918 L
437.959 196.037 L
438.177 196.157 L
438.394 196.28 L
438.611 196.403 L
438.828 196.528 L
439.045 196.655 L
439.262 196.783 L
439.479 196.913 L
439.696 197.045 L
439.913 197.178 L
440.131 197.312 L
440.348 197.448 L
440.565 197.586 L
440.782 197.726 L
440.999 197.867 L
441.216 198.01 L
441.433 198.155 L
441.65 198.302 L
441.867 198.45 L
442.085 198.6 L
442.302 198.752 L
442.519 198.905 L
442.736 199.061 L
442.953 199.218 L
443.17 199.377 L
443.387 199.538 L
443.604 199.701 L
443.821 199.866 L
444.039 200.033 L
444.256 200.202 L
444.473 200.373 L
444.69 200.546 L
444.907 200.72 L
445.124 200.897 L
445.341 201.076 L
445.558 201.257 L
445.775 201.44 L
445.992 201.625 L
446.21 201.812 L
446.427 202.002 L
446.644 202.193 L
446.861 202.387 L
447.078 202.583 L
447.295 202.781 L
447.512 202.981 L
447.729 203.184 L
447.946 203.389 L
448.164 203.596 L
448.381 203.805 L
448.598 204.017 L
448.815 204.231 L
449.032 204.448 L
449.249 204.667 L
449.466 204.888 L
449.683 205.112 L
449.9 205.338 L
450.118 205.567 L
450.335 205.798 L
450.552 206.031 L
450.769 206.267 L
450.986 206.506 L
451.203 206.747 L
451.42 206.991 L
451.637 207.237 L
451.854 207.486 L
452.072 207.738 L
452.289 207.992 L
452.506 208.249 L
452.723 208.508 L
452.94 208.771 L
453.157 209.036 L
453.374 209.303 L
453.591 209.574 L
453.808 209.847 L
454.026 210.123 L
454.243 210.401 L
454.46 210.683 L
454.677 210.967 L
454.894 211.254 L
455.111 211.544 L
455.328 211.837 L
455.545 212.133 L
455.762 212.432 L
455.979 212.734 L
456.197 213.038 L
456.414 213.346 L
456.631 213.656 L
456.848 213.969 L
457.065 214.286 L
457.282 214.605 L
457.499 214.928 L
457.716 215.253 L
457.933 215.581 L
458.151 215.913 L
458.368 216.248 L
458.585 216.585 L
458.802 216.926 L
459.019 217.27 L
459.236 217.617 L
459.453 217.967 L
459.67 218.32 L
459.887 218.676 L
460.105 219.035 L
460.322 219.398 L
460.539 219.764 L
460.756 220.133 L
460.973 220.505 L
461.19 220.88 L
461.407 221.258 L
461.624 221.64 L
461.841 222.025 L
462.059 222.413 L
462.276 222.804 L
462.493 223.198 L
462.71 223.596 L
462.927 223.997 L
463.144 224.401 L
463.361 224.808 L
463.578 225.218 L
463.795 225.632 L
464.013 226.049 L
464.23 226.469 L
464.447 226.893 L
464.664 227.319 L
464.881 227.749 L
465.098 228.182 L
465.315 228.618 L
465.532 229.058 L
465.749 229.501 L
465.966 229.946 L
466.184 230.396 L
466.401 230.848 L
466.618 231.303 L
466.835 231.762 L
467.052 232.224 L
467.269 232.689 L
467.486 233.157 L
467.703 233.628 L
467.92 234.103 L
468.138 234.58 L
468.355 235.061 L
468.572 235.545 L
468.789 236.032 L
469.006 236.522 L
469.223 237.015 L
469.44 237.511 L
469.657 238.01 L
469.874 238.512 L
470.092 239.017 L
470.309 239.526 L
470.526 240.037 L
470.743 240.551 L
470.96 241.068 L
471.177 241.588 L
471.394 242.111 L
471.611 242.637 L
471.828 243.165 L
472.046 243.697 L
472.263 244.231 L
472.48 244.768 L
472.697 245.308 L
472.914 245.851 L
473.131 246.396 L
473.348 246.944 L
473.565 247.495 L
473.782 248.048 L
474 248.604 L
474.217 249.163 L
474.434 249.724 L
474.651 250.288 L
474.868 250.854 L
475.085 251.423 L
475.302 251.994 L
475.519 252.568 L
475.736 253.144 L
475.953 253.722 L
476.171 254.303 L
476.388 254.886 L
476.605 255.471 L
476.822 256.059 L
477.039 256.649 L
477.256 257.241 L
477.473 257.835 L
477.69 258.431 L
477.907 259.029 L
478.125 259.629 L
478.342 260.231 L
478.559 260.835 L
478.776 261.442 L
478.993 262.049 L
479.21 262.659 L
479.427 263.271 L
479.644 263.884 L
479.861 264.499 L
480.079 265.116 L
480.296 265.734 L
480.513 266.354 L
480.73 266.976 L
480.947 267.599 L
481.164 268.224 L
481.381 268.85 L
481.598 269.477 L
481.815 270.106 L
482.033 270.736 L
482.25 271.367 L
482.467 272 L
482.684 272.634 L
482.901 273.269 L
483.118 273.905 L
483.335 274.542 L
483.552 275.18 L
483.769 275.82 L
483.987 276.46 L
484.204 277.101 L
484.421 277.742 L
484.638 278.385 L
484.855 279.029 L
485.072 279.673 L
485.289 280.318 L
485.506 280.963 L
485.723 281.609 L
485.94 282.256 L
486.158 282.903 L
486.375 283.551 L
486.592 284.199 L
486.809 284.847 L
487.026 285.496 L
487.243 286.145 L
487.46 286.794 L
487.677 287.444 L
487.894 288.093 L
488.112 288.743 L
488.329 289.393 L
488.546 290.043 L
488.763 290.693 L
488.98 291.343 L
489.197 291.993 L
489.414 292.643 L
489.631 293.292 L
489.848 293.942 L
490.066 294.591 L
490.283 295.24 L
490.5 295.888 L
490.717 296.536 L
490.934 297.184 L
491.151 297.831 L
491.368 298.478 L
491.585 299.125 L
491.802 299.77 L
492.02 300.415 L
492.237 301.06 L
492.454 301.704 L
492.671 302.347 L
492.888 302.99 L
493.105 303.631 L
493.322 304.272 L
493.539 304.912 L
493.756 305.551 L
493.973 306.19 L
494.191 306.827 L
494.408 307.463 L
494.625 308.098 L
494.842 308.733 L
495.059 309.366 L
495.276 309.998 L
495.493 310.629 L
495.71 311.259 L
495.927 311.887 L
496.145 312.514 L
496.362 313.14 L
496.579 313.765 L
496.796 314.388 L
497.013 315.011 L
497.23 315.631 L
497.447 316.25 L
497.664 316.868 L
497.881 317.485 L
498.099 318.099 L
498.316 318.713 L
498.533 319.325 L
498.75 319.935 L
498.967 320.543 L
499.184 321.15 L
499.401 321.756 L
499.618 322.36 L
499.835 322.962 L
500.053 323.562 L
500.27 324.16 L
500.487 324.757 L
500.704 325.352 L
500.921 325.946 L
501.138 326.537 L
501.355 327.127 L
501.572 327.714 L
501.789 328.3 L
502.007 328.884 L
502.224 329.466 L
502.441 330.046 L
502.658 330.625 L
502.875 331.201 L
503.092 331.775 L
503.309 332.347 L
503.526 332.918 L
503.743 333.486 L
503.96 334.052 L
504.178 334.616 L
504.395 335.178 L
504.612 335.738 L
504.829 336.296 L
505.046 336.852 L
505.263 337.405 L
505.48 337.957 L
505.697 338.506 L
505.914 339.053 L
506.132 339.599 L
506.349 340.141 L
506.566 340.682 L
506.783 341.221 L
507 341.757 L
S
GR
%%Trailer
%%Pages: 1
%%EOF
