%!PS-Adobe-3.0 EPSF-3.0
%%Creator: (MATLAB, The Mathworks, Inc. Version 9.1.0.441655 \(R2016b\). Operating System: Linux)
%%Title: /home/frdm/Documents/RLS/rls-2017/sp2/figures/f5_noise.eps
%%CreationDate: 2017-11-14T06:01:26
%%Pages: (atend)
%%BoundingBox: 0 0 739 471
%%LanguageLevel: 3
%%EndComments
%%BeginProlog
%%BeginResource: procset (Apache XML Graphics Std ProcSet) 1.2 0
%%Version: 1.2 0
%%Copyright: (Copyright 2001-2003,2010 The Apache Software Foundation. License terms: http://www.apache.org/licenses/LICENSE-2.0)
/bd{bind def}bind def
/ld{load def}bd
/GR/grestore ld
/M/moveto ld
/LJ/setlinejoin ld
/C/curveto ld
/f/fill ld
/LW/setlinewidth ld
/GC/setgray ld
/t/show ld
/N/newpath ld
/CT/concat ld
/cp/closepath ld
/S/stroke ld
/L/lineto ld
/CC/setcmykcolor ld
/A/ashow ld
/GS/gsave ld
/RC/setrgbcolor ld
/RM/rmoveto ld
/ML/setmiterlimit ld
/re {4 2 roll M
1 index 0 rlineto
0 exch rlineto
neg 0 rlineto
cp } bd
/_ctm matrix def
/_tm matrix def
/BT { _ctm currentmatrix pop matrix _tm copy pop 0 0 moveto } bd
/ET { _ctm setmatrix } bd
/iTm { _ctm setmatrix _tm concat } bd
/Tm { _tm astore pop iTm 0 0 moveto } bd
/ux 0.0 def
/uy 0.0 def
/F {
  /Tp exch def
  /Tf exch def
  Tf findfont Tp scalefont setfont
  /cf Tf def  /cs Tp def
} bd
/ULS {currentpoint /uy exch def /ux exch def} bd
/ULE {
  /Tcx currentpoint pop def
  gsave
  newpath
  cf findfont cs scalefont dup
  /FontMatrix get 0 get /Ts exch def /FontInfo get dup
  /UnderlinePosition get Ts mul /To exch def
  /UnderlineThickness get Ts mul /Tt exch def
  ux uy To add moveto  Tcx uy To add lineto
  Tt setlinewidth stroke
  grestore
} bd
/OLE {
  /Tcx currentpoint pop def
  gsave
  newpath
  cf findfont cs scalefont dup
  /FontMatrix get 0 get /Ts exch def /FontInfo get dup
  /UnderlinePosition get Ts mul /To exch def
  /UnderlineThickness get Ts mul /Tt exch def
  ux uy To add cs add moveto Tcx uy To add cs add lineto
  Tt setlinewidth stroke
  grestore
} bd
/SOE {
  /Tcx currentpoint pop def
  gsave
  newpath
  cf findfont cs scalefont dup
  /FontMatrix get 0 get /Ts exch def /FontInfo get dup
  /UnderlinePosition get Ts mul /To exch def
  /UnderlineThickness get Ts mul /Tt exch def
  ux uy To add cs 10 mul 26 idiv add moveto Tcx uy To add cs 10 mul 26 idiv add lineto
  Tt setlinewidth stroke
  grestore
} bd
/QT {
/Y22 exch store
/X22 exch store
/Y21 exch store
/X21 exch store
currentpoint
/Y21 load 2 mul add 3 div exch
/X21 load 2 mul add 3 div exch
/X21 load 2 mul /X22 load add 3 div
/Y21 load 2 mul /Y22 load add 3 div
/X22 load /Y22 load curveto
} bd
/SSPD {
dup length /d exch dict def
{
/v exch def
/k exch def
currentpagedevice k known {
/cpdv currentpagedevice k get def
v cpdv ne {
/upd false def
/nullv v type /nulltype eq def
/nullcpdv cpdv type /nulltype eq def
nullv nullcpdv or
{
/upd true def
} {
/sametype v type cpdv type eq def
sametype {
v type /arraytype eq {
/vlen v length def
/cpdvlen cpdv length def
vlen cpdvlen eq {
0 1 vlen 1 sub {
/i exch def
/obj v i get def
/cpdobj cpdv i get def
obj cpdobj ne {
/upd true def
exit
} if
} for
} {
/upd true def
} ifelse
} {
v type /dicttype eq {
v {
/dv exch def
/dk exch def
/cpddv cpdv dk get def
dv cpddv ne {
/upd true def
exit
} if
} forall
} {
/upd true def
} ifelse
} ifelse
} if
} ifelse
upd true eq {
d k v put
} if
} if
} if
} forall
d length 0 gt {
d setpagedevice
} if
} bd
/RE { % /NewFontName [NewEncodingArray] /FontName RE -
  findfont dup length dict begin
  {
    1 index /FID ne
    {def} {pop pop} ifelse
  } forall
  /Encoding exch def
  /FontName 1 index def
  currentdict definefont pop
  end
} bind def
%%EndResource
%%BeginResource: procset (Apache XML Graphics EPS ProcSet) 1.0 0
%%Version: 1.0 0
%%Copyright: (Copyright 2002-2003 The Apache Software Foundation. License terms: http://www.apache.org/licenses/LICENSE-2.0)
/BeginEPSF { %def
/b4_Inc_state save def         % Save state for cleanup
/dict_count countdictstack def % Count objects on dict stack
/op_count count 1 sub def      % Count objects on operand stack
userdict begin                 % Push userdict on dict stack
/showpage { } def              % Redefine showpage, { } = null proc
0 setgray 0 setlinecap         % Prepare graphics state
1 setlinewidth 0 setlinejoin
10 setmiterlimit [ ] 0 setdash newpath
/languagelevel where           % If level not equal to 1 then
{pop languagelevel             % set strokeadjust and
1 ne                           % overprint to their defaults.
{false setstrokeadjust false setoverprint
} if
} if
} bd
/EndEPSF { %def
count op_count sub {pop} repeat            % Clean up stacks
countdictstack dict_count sub {end} repeat
b4_Inc_state restore
} bd
%%EndResource
%FOPBeginFontDict
%%IncludeResource: font Courier-Bold
%%IncludeResource: font Helvetica
%%IncludeResource: font Courier-BoldOblique
%%IncludeResource: font Courier-Oblique
%%IncludeResource: font Times-Roman
%%IncludeResource: font Helvetica-BoldOblique
%%IncludeResource: font Helvetica-Bold
%%IncludeResource: font Helvetica-Oblique
%%IncludeResource: font Times-BoldItalic
%%IncludeResource: font Courier
%%IncludeResource: font Times-Italic
%%IncludeResource: font Times-Bold
%%IncludeResource: font Symbol
%%IncludeResource: font ZapfDingbats
%FOPEndFontDict
%%BeginResource: encoding WinAnsiEncoding
/WinAnsiEncoding [
/.notdef /.notdef /.notdef /.notdef /.notdef
/.notdef /.notdef /.notdef /.notdef /.notdef
/.notdef /.notdef /.notdef /.notdef /.notdef
/.notdef /.notdef /.notdef /.notdef /.notdef
/.notdef /.notdef /.notdef /.notdef /.notdef
/.notdef /.notdef /.notdef /.notdef /.notdef
/.notdef /.notdef /space /exclam /quotedbl
/numbersign /dollar /percent /ampersand /quotesingle
/parenleft /parenright /asterisk /plus /comma
/hyphen /period /slash /zero /one
/two /three /four /five /six
/seven /eight /nine /colon /semicolon
/less /equal /greater /question /at
/A /B /C /D /E
/F /G /H /I /J
/K /L /M /N /O
/P /Q /R /S /T
/U /V /W /X /Y
/Z /bracketleft /backslash /bracketright /asciicircum
/underscore /quoteleft /a /b /c
/d /e /f /g /h
/i /j /k /l /m
/n /o /p /q /r
/s /t /u /v /w
/x /y /z /braceleft /bar
/braceright /asciitilde /bullet /Euro /bullet
/quotesinglbase /florin /quotedblbase /ellipsis /dagger
/daggerdbl /circumflex /perthousand /Scaron /guilsinglleft
/OE /bullet /Zcaron /bullet /bullet
/quoteleft /quoteright /quotedblleft /quotedblright /bullet
/endash /emdash /asciitilde /trademark /scaron
/guilsinglright /oe /bullet /zcaron /Ydieresis
/space /exclamdown /cent /sterling /currency
/yen /brokenbar /section /dieresis /copyright
/ordfeminine /guillemotleft /logicalnot /sfthyphen /registered
/macron /degree /plusminus /twosuperior /threesuperior
/acute /mu /paragraph /middot /cedilla
/onesuperior /ordmasculine /guillemotright /onequarter /onehalf
/threequarters /questiondown /Agrave /Aacute /Acircumflex
/Atilde /Adieresis /Aring /AE /Ccedilla
/Egrave /Eacute /Ecircumflex /Edieresis /Igrave
/Iacute /Icircumflex /Idieresis /Eth /Ntilde
/Ograve /Oacute /Ocircumflex /Otilde /Odieresis
/multiply /Oslash /Ugrave /Uacute /Ucircumflex
/Udieresis /Yacute /Thorn /germandbls /agrave
/aacute /acircumflex /atilde /adieresis /aring
/ae /ccedilla /egrave /eacute /ecircumflex
/edieresis /igrave /iacute /icircumflex /idieresis
/eth /ntilde /ograve /oacute /ocircumflex
/otilde /odieresis /divide /oslash /ugrave
/uacute /ucircumflex /udieresis /yacute /thorn
/ydieresis
] def
%%EndResource
%FOPBeginFontReencode
/Courier-Bold findfont
dup length dict begin
  {1 index /FID ne {def} {pop pop} ifelse} forall
  /Encoding WinAnsiEncoding def
  currentdict
end
/Courier-Bold exch definefont pop
/Helvetica findfont
dup length dict begin
  {1 index /FID ne {def} {pop pop} ifelse} forall
  /Encoding WinAnsiEncoding def
  currentdict
end
/Helvetica exch definefont pop
/Courier-BoldOblique findfont
dup length dict begin
  {1 index /FID ne {def} {pop pop} ifelse} forall
  /Encoding WinAnsiEncoding def
  currentdict
end
/Courier-BoldOblique exch definefont pop
/Courier-Oblique findfont
dup length dict begin
  {1 index /FID ne {def} {pop pop} ifelse} forall
  /Encoding WinAnsiEncoding def
  currentdict
end
/Courier-Oblique exch definefont pop
/Times-Roman findfont
dup length dict begin
  {1 index /FID ne {def} {pop pop} ifelse} forall
  /Encoding WinAnsiEncoding def
  currentdict
end
/Times-Roman exch definefont pop
/Helvetica-BoldOblique findfont
dup length dict begin
  {1 index /FID ne {def} {pop pop} ifelse} forall
  /Encoding WinAnsiEncoding def
  currentdict
end
/Helvetica-BoldOblique exch definefont pop
/Helvetica-Bold findfont
dup length dict begin
  {1 index /FID ne {def} {pop pop} ifelse} forall
  /Encoding WinAnsiEncoding def
  currentdict
end
/Helvetica-Bold exch definefont pop
/Helvetica-Oblique findfont
dup length dict begin
  {1 index /FID ne {def} {pop pop} ifelse} forall
  /Encoding WinAnsiEncoding def
  currentdict
end
/Helvetica-Oblique exch definefont pop
/Times-BoldItalic findfont
dup length dict begin
  {1 index /FID ne {def} {pop pop} ifelse} forall
  /Encoding WinAnsiEncoding def
  currentdict
end
/Times-BoldItalic exch definefont pop
/Courier findfont
dup length dict begin
  {1 index /FID ne {def} {pop pop} ifelse} forall
  /Encoding WinAnsiEncoding def
  currentdict
end
/Courier exch definefont pop
/Times-Italic findfont
dup length dict begin
  {1 index /FID ne {def} {pop pop} ifelse} forall
  /Encoding WinAnsiEncoding def
  currentdict
end
/Times-Italic exch definefont pop
/Times-Bold findfont
dup length dict begin
  {1 index /FID ne {def} {pop pop} ifelse} forall
  /Encoding WinAnsiEncoding def
  currentdict
end
/Times-Bold exch definefont pop
%FOPEndFontReencode
%%EndProlog
%%Page: 1 1
%%PageBoundingBox: 0 0 739 471
%%BeginPageSetup
[1 0 0 -1 0 471] CT
%%EndPageSetup
GS
[0.75 0 0 0.75 0 0] CT
1 GC
N
0 0 985 628 re
f
GR
GS
[0.75 0 0 0.75 0 0] CT
1 GC
N
0 0 985 628 re
f
GR
GS
[0.75 0 0 0.75 0 0] CT
1 GC
N
128 559 M
891 559 L
891 47 L
128 47 L
cp
f
GR
GS
[0.75 0 0 0.75 0 0] CT
0.149 GC
2 setlinecap
1 LJ
0.667 LW
N
128 559 M
891 559 L
S
GR
GS
[0.75 0 0 0.75 0 0] CT
0.149 GC
2 setlinecap
1 LJ
0.667 LW
N
128 47 M
891 47 L
S
GR
GS
[0.75 0 0 0.75 0 0] CT
0.149 GC
2 setlinecap
1 LJ
0.667 LW
N
128 559 M
128 551.37 L
S
GR
GS
[0.75 0 0 0.75 0 0] CT
0.149 GC
2 setlinecap
1 LJ
0.667 LW
N
204.3 559 M
204.3 551.37 L
S
GR
GS
[0.75 0 0 0.75 0 0] CT
0.149 GC
2 setlinecap
1 LJ
0.667 LW
N
280.6 559 M
280.6 551.37 L
S
GR
GS
[0.75 0 0 0.75 0 0] CT
0.149 GC
2 setlinecap
1 LJ
0.667 LW
N
356.9 559 M
356.9 551.37 L
S
GR
GS
[0.75 0 0 0.75 0 0] CT
0.149 GC
2 setlinecap
1 LJ
0.667 LW
N
433.2 559 M
433.2 551.37 L
S
GR
GS
[0.75 0 0 0.75 0 0] CT
0.149 GC
2 setlinecap
1 LJ
0.667 LW
N
509.5 559 M
509.5 551.37 L
S
GR
GS
[0.75 0 0 0.75 0 0] CT
0.149 GC
2 setlinecap
1 LJ
0.667 LW
N
585.8 559 M
585.8 551.37 L
S
GR
GS
[0.75 0 0 0.75 0 0] CT
0.149 GC
2 setlinecap
1 LJ
0.667 LW
N
662.1 559 M
662.1 551.37 L
S
GR
GS
[0.75 0 0 0.75 0 0] CT
0.149 GC
2 setlinecap
1 LJ
0.667 LW
N
738.4 559 M
738.4 551.37 L
S
GR
GS
[0.75 0 0 0.75 0 0] CT
0.149 GC
2 setlinecap
1 LJ
0.667 LW
N
814.7 559 M
814.7 551.37 L
S
GR
GS
[0.75 0 0 0.75 0 0] CT
0.149 GC
2 setlinecap
1 LJ
0.667 LW
N
891 559 M
891 551.37 L
S
GR
GS
[0.75 0 0 0.75 0 0] CT
0.149 GC
2 setlinecap
1 LJ
0.667 LW
N
128 47 M
128 54.63 L
S
GR
GS
[0.75 0 0 0.75 0 0] CT
0.149 GC
2 setlinecap
1 LJ
0.667 LW
N
204.3 47 M
204.3 54.63 L
S
GR
GS
[0.75 0 0 0.75 0 0] CT
0.149 GC
2 setlinecap
1 LJ
0.667 LW
N
280.6 47 M
280.6 54.63 L
S
GR
GS
[0.75 0 0 0.75 0 0] CT
0.149 GC
2 setlinecap
1 LJ
0.667 LW
N
356.9 47 M
356.9 54.63 L
S
GR
GS
[0.75 0 0 0.75 0 0] CT
0.149 GC
2 setlinecap
1 LJ
0.667 LW
N
433.2 47 M
433.2 54.63 L
S
GR
GS
[0.75 0 0 0.75 0 0] CT
0.149 GC
2 setlinecap
1 LJ
0.667 LW
N
509.5 47 M
509.5 54.63 L
S
GR
GS
[0.75 0 0 0.75 0 0] CT
0.149 GC
2 setlinecap
1 LJ
0.667 LW
N
585.8 47 M
585.8 54.63 L
S
GR
GS
[0.75 0 0 0.75 0 0] CT
0.149 GC
2 setlinecap
1 LJ
0.667 LW
N
662.1 47 M
662.1 54.63 L
S
GR
GS
[0.75 0 0 0.75 0 0] CT
0.149 GC
2 setlinecap
1 LJ
0.667 LW
N
738.4 47 M
738.4 54.63 L
S
GR
GS
[0.75 0 0 0.75 0 0] CT
0.149 GC
2 setlinecap
1 LJ
0.667 LW
N
814.7 47 M
814.7 54.63 L
S
GR
GS
[0.75 0 0 0.75 0 0] CT
0.149 GC
2 setlinecap
1 LJ
0.667 LW
N
891 47 M
891 54.63 L
S
GR
GS
[0.75 0 0 0.75 96 423.24998] CT
0.149 GC
/Helvetica 13.333 F
GS
[1 0 0 1 0 0] CT
-4.5 13 moveto 
1 -1 scale
(0) t 
GR
GR
GS
[0.75 0 0 0.75 153.225 423.24998] CT
0.149 GC
/Helvetica 13.333 F
GS
[1 0 0 1 0 0] CT
-8.5 13 moveto 
1 -1 scale
(10) t 
GR
GR
GS
[0.75 0 0 0.75 210.45 423.24998] CT
0.149 GC
/Helvetica 13.333 F
GS
[1 0 0 1 0 0] CT
-8.5 13 moveto 
1 -1 scale
(20) t 
GR
GR
GS
[0.75 0 0 0.75 267.675 423.24998] CT
0.149 GC
/Helvetica 13.333 F
GS
[1 0 0 1 0 0] CT
-8.5 13 moveto 
1 -1 scale
(30) t 
GR
GR
GS
[0.75 0 0 0.75 324.90001 423.24998] CT
0.149 GC
/Helvetica 13.333 F
GS
[1 0 0 1 0 0] CT
-8.5 13 moveto 
1 -1 scale
(40) t 
GR
GR
GS
[0.75 0 0 0.75 382.125 423.24998] CT
0.149 GC
/Helvetica 13.333 F
GS
[1 0 0 1 0 0] CT
-8.5 13 moveto 
1 -1 scale
(50) t 
GR
GR
GS
[0.75 0 0 0.75 439.34999 423.24998] CT
0.149 GC
/Helvetica 13.333 F
GS
[1 0 0 1 0 0] CT
-8.5 13 moveto 
1 -1 scale
(60) t 
GR
GR
GS
[0.75 0 0 0.75 496.57498 423.24998] CT
0.149 GC
/Helvetica 13.333 F
GS
[1 0 0 1 0 0] CT
-8.5 13 moveto 
1 -1 scale
(70) t 
GR
GR
GS
[0.75 0 0 0.75 553.80002 423.24998] CT
0.149 GC
/Helvetica 13.333 F
GS
[1 0 0 1 0 0] CT
-8.5 13 moveto 
1 -1 scale
(80) t 
GR
GR
GS
[0.75 0 0 0.75 611.02501 423.24998] CT
0.149 GC
/Helvetica 13.333 F
GS
[1 0 0 1 0 0] CT
-8.5 13 moveto 
1 -1 scale
(90) t 
GR
GR
GS
[0.75 0 0 0.75 668.25 423.24998] CT
0.149 GC
/Helvetica 13.333 F
GS
[1 0 0 1 0 0] CT
-12.5 13 moveto 
1 -1 scale
(100) t 
GR
GR
GS
[0.75 0 0 0.75 382.12525 437.00002] CT
0.149 GC
/Helvetica 14.667 F
GS
[1 0 0 1 0 0] CT
-57.5 14 moveto 
1 -1 scale
(Time \(seconds\)) t 
GR
GR
GS
[0.75 0 0 0.75 0 0] CT
0.149 GC
2 setlinecap
1 LJ
0.667 LW
N
128 559 M
128 47 L
S
GR
GS
[0.75 0 0 0.75 0 0] CT
0.149 GC
2 setlinecap
1 LJ
0.667 LW
N
891 559 M
891 47 L
S
GR
GS
[0.75 0 0 0.75 0 0] CT
0.149 GC
2 setlinecap
1 LJ
0.667 LW
N
128 559 M
135.63 559 L
S
GR
GS
[0.75 0 0 0.75 0 0] CT
0.149 GC
2 setlinecap
1 LJ
0.667 LW
N
128 473.667 M
135.63 473.667 L
S
GR
GS
[0.75 0 0 0.75 0 0] CT
0.149 GC
2 setlinecap
1 LJ
0.667 LW
N
128 388.333 M
135.63 388.333 L
S
GR
GS
[0.75 0 0 0.75 0 0] CT
0.149 GC
2 setlinecap
1 LJ
0.667 LW
N
128 303 M
135.63 303 L
S
GR
GS
[0.75 0 0 0.75 0 0] CT
0.149 GC
2 setlinecap
1 LJ
0.667 LW
N
128 217.667 M
135.63 217.667 L
S
GR
GS
[0.75 0 0 0.75 0 0] CT
0.149 GC
2 setlinecap
1 LJ
0.667 LW
N
128 132.333 M
135.63 132.333 L
S
GR
GS
[0.75 0 0 0.75 0 0] CT
0.149 GC
2 setlinecap
1 LJ
0.667 LW
N
128 47 M
135.63 47 L
S
GR
GS
[0.75 0 0 0.75 0 0] CT
0.149 GC
2 setlinecap
1 LJ
0.667 LW
N
891 559 M
883.37 559 L
S
GR
GS
[0.75 0 0 0.75 0 0] CT
0.149 GC
2 setlinecap
1 LJ
0.667 LW
N
891 473.667 M
883.37 473.667 L
S
GR
GS
[0.75 0 0 0.75 0 0] CT
0.149 GC
2 setlinecap
1 LJ
0.667 LW
N
891 388.333 M
883.37 388.333 L
S
GR
GS
[0.75 0 0 0.75 0 0] CT
0.149 GC
2 setlinecap
1 LJ
0.667 LW
N
891 303 M
883.37 303 L
S
GR
GS
[0.75 0 0 0.75 0 0] CT
0.149 GC
2 setlinecap
1 LJ
0.667 LW
N
891 217.667 M
883.37 217.667 L
S
GR
GS
[0.75 0 0 0.75 0 0] CT
0.149 GC
2 setlinecap
1 LJ
0.667 LW
N
891 132.333 M
883.37 132.333 L
S
GR
GS
[0.75 0 0 0.75 0 0] CT
0.149 GC
2 setlinecap
1 LJ
0.667 LW
N
891 47 M
883.37 47 L
S
GR
GS
[0.75 0 0 0.75 92 419.25] CT
0.149 GC
/Helvetica 13.333 F
GS
[1 0 0 1 0 0] CT
-34 4.5 moveto 
1 -1 scale
(-0.15) t 
GR
GR
GS
[0.75 0 0 0.75 92 355.24999] CT
0.149 GC
/Helvetica 13.333 F
GS
[1 0 0 1 0 0] CT
-26 4.5 moveto 
1 -1 scale
(-0.1) t 
GR
GR
GS
[0.75 0 0 0.75 92 291.25001] CT
0.149 GC
/Helvetica 13.333 F
GS
[1 0 0 1 0 0] CT
-34 4.5 moveto 
1 -1 scale
(-0.05) t 
GR
GR
GS
[0.75 0 0 0.75 92 227.25] CT
0.149 GC
/Helvetica 13.333 F
GS
[1 0 0 1 0 0] CT
-9 4.5 moveto 
1 -1 scale
(0) t 
GR
GR
GS
[0.75 0 0 0.75 92 163.25] CT
0.149 GC
/Helvetica 13.333 F
GS
[1 0 0 1 0 0] CT
-29 4.5 moveto 
1 -1 scale
(0.05) t 
GR
GR
GS
[0.75 0 0 0.75 92 99.25] CT
0.149 GC
/Helvetica 13.333 F
GS
[1 0 0 1 0 0] CT
-21 4.5 moveto 
1 -1 scale
(0.1) t 
GR
GR
GS
[0.75 0 0 0.75 92 35.24999] CT
0.149 GC
/Helvetica 13.333 F
GS
[1 0 0 1 0 0] CT
-29 4.5 moveto 
1 -1 scale
(0.15) t 
GR
GR
GS
[0.75 0 0 0.75 382.12537 33.1875] CT
/Helvetica-Bold 14.667 F
GS
[1 0 0 1 0 0] CT
-24 -4 moveto 
1 -1 scale
(Noise) t 
GR
GR
GS
[0.75 0 0 0.75 0 0] CT
0 0.447 0.741 RC
10.0 ML
0.667 LW
N
128 283.759 M
128.763 283.759 L
128.763 174.193 L
129.526 174.193 L
129.526 349.275 L
130.289 349.275 L
130.289 233.632 L
131.052 233.632 L
131.052 292.411 L
131.815 292.411 L
131.815 323.934 L
132.578 323.934 L
132.578 352.641 L
133.341 352.641 L
133.341 295.562 L
134.104 295.562 L
134.104 271.855 L
134.867 271.855 L
134.867 289.393 L
135.63 289.393 L
135.63 275.415 L
136.393 275.415 L
136.393 276.195 L
137.156 276.195 L
137.156 310.481 L
137.919 310.481 L
137.919 235.361 L
138.682 235.361 L
138.682 330.901 L
139.445 330.901 L
139.445 417.563 L
140.208 417.563 L
140.208 386.469 L
140.971 386.469 L
140.971 205.191 L
141.734 205.191 L
141.734 326.19 L
142.497 326.19 L
142.497 354.806 L
143.26 354.806 L
143.26 348.257 L
144.023 348.257 L
144.023 343.279 L
144.786 343.279 L
144.786 329.062 L
145.549 329.062 L
145.549 329.526 L
146.312 329.526 L
146.312 314.54 L
147.075 314.54 L
147.075 222.532 L
147.838 222.532 L
147.838 299.03 L
148.601 299.03 L
148.601 233.97 L
149.364 233.97 L
149.364 261.447 L
150.127 261.447 L
150.127 284.879 L
150.89 284.879 L
150.89 334.643 L
151.653 334.643 L
151.653 327.809 L
152.416 327.809 L
152.416 315.686 L
153.179 315.686 L
153.179 370.99 L
153.942 370.99 L
153.942 187.172 L
154.705 187.172 L
154.705 249.66 L
155.468 249.66 L
155.468 339.58 L
156.231 339.58 L
156.231 355.749 L
156.994 355.749 L
156.994 311.18 L
157.757 311.18 L
157.757 262.289 L
158.52 262.289 L
158.52 317.553 L
159.283 317.553 L
159.283 372.487 L
160.046 372.487 L
160.046 352.26 L
160.809 352.26 L
160.809 304.515 L
161.572 304.515 L
161.572 240.254 L
162.335 240.254 L
162.335 305.671 L
163.098 305.671 L
163.098 253.227 L
163.861 253.227 L
163.861 331.198 L
164.624 331.198 L
164.624 304.428 L
165.387 304.428 L
165.387 295.485 L
166.15 295.485 L
166.15 391.464 L
166.913 391.464 L
166.913 425.569 L
167.676 425.569 L
167.676 281.43 L
168.439 281.43 L
168.439 311.271 L
169.202 311.271 L
169.202 240.027 L
169.965 240.027 L
169.965 306.474 L
170.728 306.474 L
170.728 324.412 L
171.491 324.412 L
171.491 331.871 L
172.254 331.871 L
172.254 267.823 L
173.017 267.823 L
173.017 275.929 L
173.78 275.929 L
173.78 256.591 L
174.543 256.591 L
174.543 197.346 L
175.306 197.346 L
175.306 270.088 L
176.069 270.088 L
176.069 395.369 L
176.832 395.369 L
176.832 295.784 L
177.595 295.784 L
177.595 222.036 L
178.358 222.036 L
178.358 356.789 L
179.121 356.789 L
179.121 304.309 L
179.884 304.309 L
179.884 383.866 L
180.647 383.866 L
180.647 282.74 L
181.41 282.74 L
181.41 329.009 L
182.173 329.009 L
182.173 387.016 L
182.936 387.016 L
182.936 272.779 L
183.699 272.779 L
183.699 188.071 L
184.462 188.071 L
184.462 268.235 L
185.225 268.235 L
185.225 312.451 L
185.988 312.451 L
185.988 136.133 L
186.751 136.133 L
186.751 339.11 L
187.514 339.11 L
187.514 242.94 L
188.277 242.94 L
188.277 261.675 L
189.04 261.675 L
189.04 262.131 L
189.803 262.131 L
189.803 298.77 L
190.566 298.77 L
190.566 376.166 L
191.329 376.166 L
191.329 266.514 L
192.092 266.514 L
192.092 290.582 L
192.855 290.582 L
192.855 378.912 L
193.618 378.912 L
193.618 151.061 L
194.381 151.061 L
194.381 217.479 L
195.144 217.479 L
195.144 299.918 L
195.907 299.918 L
195.907 363.748 L
196.67 363.748 L
196.67 335.449 L
197.433 335.449 L
197.433 318.499 L
198.196 318.499 L
198.196 302.442 L
198.959 302.442 L
198.959 348.169 L
199.722 348.169 L
199.722 349.833 L
200.485 349.833 L
200.485 329.317 L
201.248 329.317 L
201.248 350.326 L
202.011 350.326 L
202.011 239.009 L
202.774 239.009 L
202.774 350.914 L
203.537 350.914 L
203.537 267.974 L
204.3 267.974 L
204.3 185.472 L
205.063 185.472 L
205.063 352.904 L
205.826 352.904 L
205.826 274.663 L
206.589 274.663 L
206.589 335.068 L
207.352 335.068 L
207.352 314.832 L
208.115 314.832 L
208.115 375.934 L
208.878 375.934 L
208.878 206.992 L
209.641 206.992 L
209.641 296.684 L
210.404 296.684 L
210.404 308.785 L
211.167 308.785 L
211.167 301.347 L
211.93 301.347 L
211.93 309.902 L
212.693 309.902 L
212.693 358.701 L
213.456 358.701 L
213.456 308.167 L
214.219 308.167 L
214.219 244.865 L
214.982 244.865 L
214.982 186.64 L
215.745 186.64 L
215.745 298.028 L
216.508 298.028 L
216.508 432.321 L
217.271 432.321 L
217.271 224.73 L
218.034 224.73 L
218.034 308.619 L
218.797 308.619 L
218.797 228.645 L
219.56 228.645 L
219.56 249.997 L
220.323 249.997 L
220.323 309.069 L
221.086 309.069 L
221.086 346.345 L
221.849 346.345 L
221.849 227.184 L
222.612 227.184 L
222.612 345.656 L
223.375 345.656 L
223.375 336.003 L
224.138 336.003 L
224.138 248.129 L
224.901 248.129 L
224.901 281.008 L
225.664 281.008 L
225.664 387.409 L
226.427 387.409 L
226.427 311.716 L
227.19 311.716 L
227.19 309.525 L
227.953 309.525 L
227.953 309.376 L
228.716 309.376 L
228.716 282.348 L
229.479 282.348 L
229.479 377.504 L
230.242 377.504 L
230.242 325.206 L
231.005 325.206 L
231.005 377.377 L
231.768 377.377 L
231.768 261.095 L
232.531 261.095 L
232.531 237.768 L
233.294 237.768 L
233.294 312.901 L
234.057 312.901 L
234.057 282.264 L
234.82 282.264 L
234.82 265.064 L
235.583 265.064 L
235.583 276.451 L
236.346 276.451 L
236.346 270.763 L
237.109 270.763 L
237.109 313.636 L
237.872 313.636 L
237.872 279.959 L
238.635 279.959 L
238.635 371.358 L
239.398 371.358 L
239.398 275.846 L
240.161 275.846 L
240.161 236.526 L
240.924 236.526 L
240.924 312.525 L
241.687 312.525 L
241.687 302.448 L
242.45 302.448 L
242.45 197.833 L
243.213 197.833 L
243.213 313.712 L
243.976 313.712 L
243.976 293.278 L
244.739 293.278 L
244.739 262.216 L
245.502 262.216 L
245.502 350.031 L
246.265 350.031 L
246.265 287.775 L
247.028 287.775 L
247.028 240.948 L
247.791 240.948 L
247.791 280.02 L
248.554 280.02 L
248.554 291.728 L
249.317 291.728 L
249.317 390.186 L
250.08 390.186 L
250.08 363.695 L
250.843 363.695 L
250.843 413.459 L
251.606 413.459 L
251.606 356.861 L
252.369 356.861 L
252.369 285.469 L
253.132 285.469 L
253.132 306.62 L
253.895 306.62 L
253.895 355.421 L
254.658 355.421 L
254.658 172.518 L
255.421 172.518 L
255.421 334.812 L
256.184 334.812 L
256.184 299.212 L
256.947 299.212 L
256.947 302.841 L
257.71 302.841 L
257.71 293.484 L
258.473 293.484 L
258.473 255.95 L
259.236 255.95 L
259.236 425.599 L
259.999 425.599 L
259.999 386.048 L
260.762 386.048 L
260.762 394.322 L
261.525 394.322 L
261.525 282.12 L
262.288 282.12 L
262.288 303.785 L
263.051 303.785 L
263.051 303.998 L
263.814 303.998 L
263.814 299.562 L
264.577 299.562 L
264.577 242.347 L
265.34 242.347 L
265.34 323.35 L
266.103 323.35 L
266.103 391.284 L
266.866 391.284 L
266.866 359.947 L
267.629 359.947 L
267.629 365.052 L
268.392 365.052 L
268.392 375.597 L
269.155 375.597 L
269.155 298.955 L
269.918 298.955 L
269.918 387.617 L
270.681 387.617 L
270.681 317.86 L
271.444 317.86 L
271.444 229.91 L
272.207 229.91 L
272.207 370.586 L
272.97 370.586 L
272.97 323.838 L
273.733 323.838 L
273.733 356.936 L
274.496 356.936 L
274.496 364.957 L
275.259 364.957 L
275.259 226.573 L
276.022 226.573 L
276.022 339.318 L
276.785 339.318 L
276.785 369.842 L
277.548 369.842 L
277.548 366.06 L
278.311 366.06 L
278.311 344.868 L
279.074 344.868 L
279.074 293.132 L
279.837 293.132 L
279.837 350.292 L
280.6 350.292 L
280.6 243.243 L
281.363 243.243 L
281.363 317.554 L
282.126 317.554 L
282.126 287.452 L
282.889 287.452 L
282.889 370.066 L
283.652 370.066 L
283.652 331.376 L
284.415 331.376 L
284.415 286.417 L
285.178 286.417 L
285.178 348.925 L
285.941 348.925 L
285.941 346.442 L
286.704 346.442 L
286.704 309.426 L
287.467 309.426 L
287.467 306.513 L
288.23 306.513 L
288.23 374.445 L
288.993 374.445 L
288.993 293.222 L
289.756 293.222 L
289.756 233.326 L
290.519 233.326 L
290.519 212.396 L
291.282 212.396 L
291.282 392.974 L
292.045 392.974 L
292.045 219.193 L
292.808 219.193 L
292.808 214.756 L
293.571 214.756 L
293.571 281.219 L
294.334 281.219 L
294.334 349.23 L
295.097 349.23 L
295.097 268.593 L
295.86 268.593 L
295.86 294.897 L
296.623 294.897 L
296.623 367.892 L
297.386 367.892 L
297.386 324.206 L
298.149 324.206 L
298.149 325.236 L
298.912 325.236 L
298.912 264.952 L
299.675 264.952 L
299.675 297.039 L
300.438 297.039 L
300.438 353.024 L
301.201 353.024 L
301.201 240.572 L
301.964 240.572 L
301.964 239.278 L
302.727 239.278 L
302.727 297.945 L
303.49 297.945 L
303.49 272.151 L
304.253 272.151 L
304.253 284.405 L
305.016 284.405 L
305.016 297.766 L
305.779 297.766 L
305.779 396.667 L
306.542 396.667 L
306.542 239.926 L
307.305 239.926 L
307.305 358.253 L
308.068 358.253 L
308.068 318.302 L
308.831 318.302 L
308.831 265.215 L
309.594 265.215 L
309.594 236.889 L
310.357 236.889 L
310.357 381.524 L
311.12 381.524 L
311.12 325.162 L
311.883 325.162 L
311.883 380.956 L
312.646 380.956 L
312.646 235.401 L
313.409 235.401 L
313.409 315.11 L
314.172 315.11 L
314.172 339.067 L
314.935 339.067 L
314.935 420.1 L
315.698 420.1 L
315.698 373.958 L
316.461 373.958 L
316.461 333.043 L
317.224 333.043 L
317.224 219.457 L
317.987 219.457 L
317.987 310.143 L
318.75 310.143 L
318.75 321.04 L
319.513 321.04 L
319.513 291.693 L
320.276 291.693 L
320.276 311.5 L
321.039 311.5 L
321.039 295.916 L
321.802 295.916 L
321.802 267.222 L
322.565 267.222 L
322.565 299.811 L
323.328 299.811 L
323.328 267.672 L
324.091 267.672 L
324.091 311.054 L
324.854 311.054 L
324.854 334.828 L
325.617 334.828 L
325.617 244.886 L
326.38 244.886 L
326.38 285.336 L
327.143 285.336 L
327.143 347.636 L
327.906 347.636 L
327.906 350.229 L
328.669 350.229 L
328.669 200.45 L
329.432 200.45 L
329.432 284.77 L
330.195 284.77 L
330.195 435.382 L
330.958 435.382 L
330.958 319.171 L
331.721 319.171 L
331.721 246.802 L
332.484 246.802 L
332.484 282.96 L
333.247 282.96 L
333.247 337.76 L
334.01 337.76 L
334.01 290.847 L
334.773 290.847 L
334.773 420.367 L
335.536 420.367 L
335.536 264.479 L
336.299 264.479 L
336.299 249.7 L
337.062 249.7 L
337.062 338.79 L
337.825 338.79 L
337.825 289.67 L
338.588 289.67 L
338.588 212.642 L
339.351 212.642 L
339.351 328.022 L
340.114 328.022 L
340.114 263.837 L
340.877 263.837 L
340.877 298.844 L
341.64 298.844 L
341.64 292.092 L
342.403 292.092 L
342.403 160.155 L
343.166 160.155 L
343.166 224.403 L
343.929 224.403 L
343.929 347.843 L
344.692 347.843 L
344.692 359.213 L
345.455 359.213 L
345.455 377.74 L
346.218 377.74 L
346.218 277.432 L
346.981 277.432 L
346.981 214.086 L
347.744 214.086 L
347.744 337.901 L
348.507 337.901 L
348.507 325.047 L
349.27 325.047 L
349.27 256.745 L
350.033 256.745 L
350.033 265.603 L
350.796 265.603 L
350.796 252.748 L
351.559 252.748 L
351.559 269.366 L
352.322 269.366 L
352.322 307.708 L
353.085 307.708 L
353.085 322.012 L
353.848 322.012 L
353.848 334.127 L
354.611 334.127 L
354.611 302.1 L
355.374 302.1 L
355.374 346.215 L
356.137 346.215 L
356.137 300.123 L
356.9 300.123 L
356.9 334.103 L
357.663 334.103 L
357.663 357.843 L
358.426 357.843 L
358.426 283.505 L
359.189 283.505 L
359.189 257.507 L
359.952 257.507 L
359.952 177.028 L
360.715 177.028 L
360.715 240.197 L
361.478 240.197 L
361.478 372.025 L
362.241 372.025 L
362.241 265.508 L
363.004 265.508 L
363.004 407.337 L
363.767 407.337 L
363.767 314.567 L
364.53 314.567 L
364.53 308.547 L
365.293 308.547 L
365.293 291.391 L
366.056 291.391 L
366.056 269.14 L
366.819 269.14 L
366.819 269.681 L
367.582 269.681 L
367.582 318.391 L
368.345 318.391 L
368.345 264.755 L
369.108 264.755 L
369.108 307.573 L
369.871 307.573 L
369.871 333.179 L
370.634 333.179 L
370.634 312.508 L
371.397 312.508 L
371.397 404.244 L
372.16 404.244 L
372.16 258.89 L
372.923 258.89 L
372.923 299.98 L
373.686 299.98 L
373.686 234.093 L
374.449 234.093 L
374.449 308.173 L
375.212 308.173 L
375.212 437.465 L
375.975 437.465 L
375.975 253.243 L
376.738 253.243 L
376.738 303.814 L
377.501 303.814 L
377.501 226.263 L
378.264 226.263 L
378.264 279.755 L
379.027 279.755 L
379.027 365.256 L
379.79 365.256 L
379.79 358.584 L
380.553 358.584 L
380.553 279.782 L
381.316 279.782 L
381.316 254.924 L
382.079 254.924 L
382.079 308.969 L
382.842 308.969 L
382.842 309.617 L
383.605 309.617 L
383.605 312.807 L
384.368 312.807 L
384.368 348.735 L
385.131 348.735 L
385.131 243.385 L
385.894 243.385 L
385.894 329.495 L
386.657 329.495 L
386.657 347.375 L
387.42 347.375 L
387.42 365.006 L
388.183 365.006 L
388.183 245.494 L
388.946 245.494 L
388.946 331.073 L
389.709 331.073 L
389.709 341.807 L
390.472 341.807 L
390.472 325.51 L
391.235 325.51 L
391.235 349.406 L
391.998 349.406 L
391.998 320.597 L
392.761 320.597 L
392.761 330.85 L
393.524 330.85 L
393.524 337.008 L
394.287 337.008 L
394.287 317.716 L
395.05 317.716 L
395.05 258.874 L
395.813 258.874 L
395.813 403.738 L
396.576 403.738 L
396.576 299.604 L
397.339 299.604 L
397.339 376.819 L
398.102 376.819 L
398.102 497.57 L
398.865 497.57 L
398.865 316.861 L
399.628 316.861 L
399.628 263.33 L
400.391 263.33 L
400.391 252.259 L
401.154 252.259 L
401.154 257.834 L
401.917 257.834 L
401.917 285.321 L
402.68 285.321 L
402.68 372.309 L
403.443 372.309 L
403.443 247.058 L
404.206 247.058 L
404.206 364.691 L
404.969 364.691 L
404.969 319.114 L
405.732 319.114 L
405.732 304.175 L
406.495 304.175 L
406.495 362.029 L
407.258 362.029 L
407.258 328.126 L
408.021 328.126 L
408.021 365.087 L
408.784 365.087 L
408.784 189.369 L
409.547 189.369 L
409.547 360.547 L
410.31 360.547 L
410.31 310.969 L
411.073 310.969 L
411.073 331.652 L
411.836 331.652 L
411.836 326.895 L
412.599 326.895 L
412.599 322.564 L
413.362 322.564 L
413.362 293.553 L
414.125 293.553 L
414.125 257.084 L
414.888 257.084 L
414.888 415.038 L
415.651 415.038 L
415.651 294.522 L
416.414 294.522 L
416.414 291.047 L
417.177 291.047 L
417.177 338.647 L
417.94 338.647 L
417.94 418.598 L
418.703 418.598 L
418.703 197.988 L
419.466 197.988 L
419.466 336.889 L
420.229 336.889 L
420.229 261.121 L
420.992 261.121 L
420.992 310.717 L
421.755 310.717 L
421.755 262.15 L
422.518 262.15 L
422.518 322.782 L
423.281 322.782 L
423.281 309.952 L
424.044 309.952 L
424.044 286.249 L
424.807 286.249 L
424.807 283.245 L
425.57 283.245 L
425.57 268.587 L
426.333 268.587 L
426.333 346.555 L
427.096 346.555 L
427.096 275.353 L
427.859 275.353 L
427.859 317.595 L
428.622 317.595 L
428.622 394.886 L
429.385 394.886 L
429.385 307.611 L
430.148 307.611 L
430.148 256.609 L
430.911 256.609 L
430.911 267.939 L
431.674 267.939 L
431.674 280.869 L
432.437 280.869 L
432.437 273.9 L
433.2 273.9 L
433.2 296.996 L
433.963 296.996 L
433.963 234.573 L
434.726 234.573 L
434.726 232.373 L
435.489 232.373 L
435.489 334.432 L
436.252 334.432 L
436.252 342.228 L
437.015 342.228 L
437.015 327.979 L
437.778 327.979 L
437.778 328.119 L
438.541 328.119 L
438.541 382.882 L
439.304 382.882 L
439.304 312.805 L
440.067 312.805 L
440.067 287.614 L
440.83 287.614 L
440.83 296.001 L
441.593 296.001 L
441.593 217.975 L
442.356 217.975 L
442.356 301.594 L
443.119 301.594 L
443.119 301.65 L
443.882 301.65 L
443.882 289.158 L
444.645 289.158 L
444.645 344.339 L
445.408 344.339 L
445.408 273.913 L
446.171 273.913 L
446.171 225.353 L
446.934 225.353 L
446.934 251.615 L
447.697 251.615 L
447.697 233.148 L
448.46 233.148 L
448.46 301.164 L
449.223 301.164 L
449.223 370.265 L
449.986 370.265 L
449.986 401.024 L
450.749 401.024 L
450.749 278.814 L
451.512 278.814 L
451.512 270.035 L
452.275 270.035 L
452.275 327.166 L
453.038 327.166 L
453.038 293.253 L
453.801 293.253 L
453.801 357.393 L
454.564 357.393 L
454.564 333.459 L
455.327 333.459 L
455.327 231.087 L
456.09 231.087 L
456.09 262.885 L
456.853 262.885 L
456.853 358.606 L
457.616 358.606 L
457.616 289.165 L
458.379 289.165 L
458.379 420.053 L
459.142 420.053 L
459.142 287.129 L
459.905 287.129 L
459.905 281.41 L
460.668 281.41 L
460.668 359.537 L
461.431 359.537 L
461.431 394.496 L
462.194 394.496 L
462.194 241.246 L
462.957 241.246 L
462.957 221.323 L
463.72 221.323 L
463.72 311.149 L
464.483 311.149 L
464.483 332.789 L
465.246 332.789 L
465.246 374.221 L
466.009 374.221 L
466.009 277.137 L
466.772 277.137 L
466.772 323.003 L
467.535 323.003 L
467.535 380.023 L
468.298 380.023 L
468.298 328.2 L
469.061 328.2 L
469.061 265.516 L
469.824 265.516 L
469.824 316.94 L
470.587 316.94 L
470.587 291.249 L
471.35 291.249 L
471.35 348.132 L
472.113 348.132 L
472.113 327.453 L
472.876 327.453 L
472.876 254.889 L
473.639 254.889 L
473.639 308.304 L
474.402 308.304 L
474.402 268.99 L
475.165 268.99 L
475.165 266.86 L
475.928 266.86 L
475.928 298.974 L
476.691 298.974 L
476.691 258.005 L
477.454 258.005 L
477.454 280.344 L
478.217 280.344 L
478.217 356.803 L
478.98 356.803 L
478.98 243.248 L
479.743 243.248 L
479.743 335.866 L
480.506 335.866 L
480.506 411.189 L
481.269 411.189 L
481.269 267.113 L
482.032 267.113 L
482.032 344.521 L
482.795 344.521 L
482.795 218.606 L
483.558 218.606 L
483.558 381.973 L
484.321 381.973 L
484.321 407.777 L
485.084 407.777 L
485.084 344.973 L
485.847 344.973 L
485.847 338.519 L
486.61 338.519 L
486.61 301.481 L
487.373 301.481 L
487.373 259.086 L
488.136 259.086 L
488.136 252.498 L
488.899 252.498 L
488.899 353.974 L
489.662 353.974 L
489.662 312.403 L
490.425 312.403 L
490.425 343.811 L
491.188 343.811 L
491.188 251.768 L
491.951 251.768 L
491.951 240.189 L
492.714 240.189 L
492.714 278.012 L
493.477 278.012 L
493.477 386.361 L
494.24 386.361 L
494.24 314.118 L
495.003 314.118 L
495.003 251.726 L
495.766 251.726 L
495.766 298.254 L
496.529 298.254 L
496.529 307.683 L
497.292 307.683 L
497.292 296.409 L
498.055 296.409 L
498.055 233.784 L
498.818 233.784 L
498.818 290.433 L
499.581 290.433 L
499.581 382.929 L
500.344 382.929 L
500.344 399.69 L
501.107 399.69 L
501.107 317.471 L
501.87 317.471 L
501.87 250.333 L
502.633 250.333 L
502.633 275.429 L
503.396 275.429 L
503.396 299.297 L
504.159 299.297 L
504.159 355.532 L
504.922 355.532 L
504.922 269.882 L
505.685 269.882 L
505.685 336.674 L
506.448 336.674 L
506.448 355.056 L
507.211 355.056 L
507.211 308.178 L
507.974 308.178 L
507.974 340.222 L
508.737 340.222 L
508.737 317.956 L
509.5 317.956 L
509.5 235.581 L
510.263 235.581 L
510.263 348.176 L
511.026 348.176 L
511.026 383.058 L
511.789 383.058 L
511.789 345.704 L
512.552 345.704 L
512.552 296.055 L
513.315 296.055 L
513.315 198.925 L
514.078 198.925 L
514.078 266.887 L
514.841 266.887 L
514.841 306.228 L
515.604 306.228 L
515.604 277.845 L
516.367 277.845 L
516.367 259.073 L
517.13 259.073 L
517.13 277.493 L
517.893 277.493 L
517.893 351.174 L
518.656 351.174 L
518.656 211.686 L
519.419 211.686 L
519.419 364.267 L
520.182 364.267 L
520.182 308.069 L
520.945 308.069 L
520.945 378.68 L
521.708 378.68 L
521.708 284.329 L
522.471 284.329 L
522.471 314.262 L
523.234 314.262 L
523.234 318.433 L
523.997 318.433 L
523.997 245.968 L
524.76 245.968 L
524.76 356.084 L
525.523 356.084 L
525.523 202.745 L
526.286 202.745 L
526.286 253.746 L
527.049 253.746 L
527.049 297.086 L
527.812 297.086 L
527.812 337.303 L
528.575 337.303 L
528.575 255.583 L
529.338 255.583 L
529.338 285.868 L
530.101 285.868 L
530.101 313.815 L
530.864 313.815 L
530.864 223.535 L
531.627 223.535 L
531.627 246.295 L
532.39 246.295 L
532.39 328.967 L
533.153 328.967 L
533.153 229.571 L
533.916 229.571 L
533.916 324.852 L
534.679 324.852 L
534.679 393.886 L
535.442 393.886 L
535.442 325.07 L
536.205 325.07 L
536.205 285.018 L
536.968 285.018 L
536.968 306.054 L
537.731 306.054 L
537.731 347.703 L
538.494 347.703 L
538.494 391.268 L
539.257 391.268 L
539.257 273.881 L
540.02 273.881 L
540.02 318.801 L
540.783 318.801 L
540.783 318.718 L
541.546 318.718 L
541.546 389.368 L
542.309 389.368 L
542.309 247.714 L
543.072 247.714 L
543.072 314.301 L
543.835 314.301 L
543.835 232.291 L
544.598 232.291 L
544.598 354.214 L
545.361 354.214 L
545.361 253.419 L
546.124 253.419 L
546.124 350.134 L
546.887 350.134 L
546.887 408.722 L
547.65 408.722 L
547.65 315.083 L
548.413 315.083 L
548.413 314.888 L
549.176 314.888 L
549.176 275.926 L
549.939 275.926 L
549.939 292.969 L
550.702 292.969 L
550.702 239.561 L
551.465 239.561 L
551.465 298.481 L
552.228 298.481 L
552.228 309.752 L
552.991 309.752 L
552.991 402.633 L
553.754 402.633 L
553.754 335.196 L
554.517 335.196 L
554.517 302.018 L
555.28 302.018 L
555.28 290.495 L
556.043 290.495 L
556.043 386.689 L
556.806 386.689 L
556.806 246.09 L
557.569 246.09 L
557.569 257.806 L
558.332 257.806 L
558.332 365.391 L
559.095 365.391 L
559.095 410.823 L
559.858 410.823 L
559.858 281.151 L
560.621 281.151 L
560.621 306.495 L
561.384 306.495 L
561.384 308.503 L
562.147 308.503 L
562.147 378.451 L
562.91 378.451 L
562.91 186.987 L
563.673 186.987 L
563.673 344.856 L
564.436 344.856 L
564.436 299.528 L
565.199 299.528 L
565.199 352.462 L
565.962 352.462 L
565.962 429.469 L
566.725 429.469 L
566.725 339.854 L
567.488 339.854 L
567.488 280.245 L
568.251 280.245 L
568.251 352.641 L
569.014 352.641 L
569.014 336.465 L
569.777 336.465 L
569.777 319.157 L
570.54 319.157 L
570.54 257.472 L
571.303 257.472 L
571.303 287.001 L
572.066 287.001 L
572.066 266.674 L
572.829 266.674 L
572.829 268.824 L
573.592 268.824 L
573.592 334.145 L
574.355 334.145 L
574.355 221.114 L
575.118 221.114 L
575.118 267.023 L
575.881 267.023 L
575.881 391.43 L
576.644 391.43 L
576.644 258.624 L
577.407 258.624 L
577.407 372.745 L
578.17 372.745 L
578.17 242.57 L
578.933 242.57 L
578.933 293.942 L
579.696 293.942 L
579.696 291.929 L
580.459 291.929 L
580.459 272.459 L
581.222 272.459 L
581.222 247.475 L
581.985 247.475 L
581.985 325.057 L
582.748 325.057 L
582.748 347.428 L
583.511 347.428 L
583.511 230.559 L
584.274 230.559 L
584.274 263.972 L
585.037 263.972 L
585.037 402.903 L
585.8 402.903 L
585.8 302.854 L
586.563 302.854 L
586.563 310.873 L
587.326 310.873 L
587.326 355.419 L
588.089 355.419 L
588.089 337.193 L
588.852 337.193 L
588.852 265.132 L
589.615 265.132 L
589.615 186.663 L
590.378 186.663 L
590.378 245.164 L
591.141 245.164 L
591.141 336.033 L
591.904 336.033 L
591.904 315.967 L
592.667 315.967 L
592.667 320.805 L
593.43 320.805 L
593.43 301.71 L
594.193 301.71 L
594.193 312.652 L
594.956 312.652 L
594.956 337.665 L
595.719 337.665 L
595.719 316.212 L
596.482 316.212 L
596.482 335.146 L
597.245 335.146 L
597.245 233.829 L
598.008 233.829 L
598.008 269.998 L
598.771 269.998 L
598.771 260.913 L
599.534 260.913 L
599.534 310.452 L
600.297 310.452 L
600.297 319.088 L
601.06 319.088 L
601.06 265.361 L
601.823 265.361 L
601.823 377.081 L
602.586 377.081 L
602.586 205.849 L
603.349 205.849 L
603.349 233.107 L
604.112 233.107 L
604.112 205.963 L
604.875 205.963 L
604.875 295.597 L
605.638 295.597 L
605.638 261.257 L
606.401 261.257 L
606.401 386.09 L
607.164 386.09 L
607.164 367.47 L
607.927 367.47 L
607.927 308.651 L
608.69 308.651 L
608.69 362.515 L
609.453 362.515 L
609.453 333.458 L
610.216 333.458 L
610.216 292.672 L
610.979 292.672 L
610.979 301.914 L
611.742 301.914 L
611.742 323.681 L
612.505 323.681 L
612.505 409.498 L
613.268 409.498 L
613.268 333.766 L
614.031 333.766 L
614.031 369.382 L
614.794 369.382 L
614.794 301.743 L
615.557 301.743 L
615.557 346.961 L
616.32 346.961 L
616.32 249.514 L
617.083 249.514 L
617.083 310.084 L
617.846 310.084 L
617.846 271.957 L
618.609 271.957 L
618.609 297.269 L
619.372 297.269 L
619.372 276.894 L
620.135 276.894 L
620.135 379.786 L
620.898 379.786 L
620.898 272.41 L
621.661 272.41 L
621.661 324.554 L
622.424 324.554 L
622.424 374.264 L
623.187 374.264 L
623.187 290.532 L
623.95 290.532 L
623.95 373.243 L
624.713 373.243 L
624.713 239.938 L
625.476 239.938 L
625.476 366.868 L
626.239 366.868 L
626.239 267.873 L
627.002 267.873 L
627.002 234.824 L
627.765 234.824 L
627.765 274.916 L
628.528 274.916 L
628.528 404.064 L
629.291 404.064 L
629.291 348.893 L
630.054 348.893 L
630.054 236.926 L
630.817 236.926 L
630.817 273.988 L
631.58 273.988 L
631.58 226.813 L
632.343 226.813 L
632.343 269.735 L
633.106 269.735 L
633.106 249.928 L
633.869 249.928 L
633.869 269.386 L
634.632 269.386 L
634.632 323.875 L
635.395 323.875 L
635.395 275.637 L
636.158 275.637 L
636.158 288.234 L
636.921 288.234 L
636.921 216.568 L
637.684 216.568 L
637.684 256.854 L
638.447 256.854 L
638.447 360.943 L
639.21 360.943 L
639.21 235.826 L
639.973 235.826 L
639.973 294.243 L
640.736 294.243 L
640.736 284.459 L
641.499 284.459 L
641.499 295.796 L
642.262 295.796 L
642.262 258.984 L
643.025 258.984 L
643.025 272.757 L
643.788 272.757 L
643.788 345.955 L
644.551 345.955 L
644.551 366.657 L
645.314 366.657 L
645.314 306.101 L
646.077 306.101 L
646.077 240.602 L
646.84 240.602 L
646.84 228.035 L
647.603 228.035 L
647.603 312.361 L
648.366 312.361 L
648.366 290.697 L
649.129 290.697 L
649.129 248.74 L
649.892 248.74 L
649.892 313.649 L
650.655 313.649 L
650.655 310.238 L
651.418 310.238 L
651.418 296.678 L
652.181 296.678 L
652.181 306.766 L
652.944 306.766 L
652.944 300.084 L
653.707 300.084 L
653.707 261.556 L
654.47 261.556 L
654.47 301.583 L
655.233 301.583 L
655.233 277.534 L
655.996 277.534 L
655.996 264.802 L
656.759 264.802 L
656.759 426.573 L
657.522 426.573 L
657.522 298.018 L
658.285 298.018 L
658.285 283.823 L
659.048 283.823 L
659.048 190.384 L
659.811 190.384 L
659.811 269.525 L
660.574 269.525 L
660.574 331.541 L
661.337 331.541 L
661.337 363.379 L
662.1 363.379 L
662.1 221.641 L
662.863 221.641 L
662.863 309.126 L
663.626 309.126 L
663.626 421.378 L
664.389 421.378 L
664.389 275.592 L
665.152 275.592 L
665.152 328.204 L
665.915 328.204 L
665.915 219.934 L
666.678 219.934 L
666.678 298.456 L
667.441 298.456 L
667.441 333.925 L
668.204 333.925 L
668.204 400.656 L
668.967 400.656 L
668.967 317.164 L
669.73 317.164 L
669.73 382.588 L
670.493 382.588 L
670.493 387.066 L
671.256 387.066 L
671.256 222.701 L
672.019 222.701 L
672.019 303.426 L
672.782 303.426 L
672.782 349.162 L
673.545 349.162 L
673.545 284.296 L
674.308 284.296 L
674.308 312.396 L
675.071 312.396 L
675.071 246.35 L
675.834 246.35 L
675.834 412.439 L
676.597 412.439 L
676.597 260.718 L
677.36 260.718 L
677.36 259.058 L
678.123 259.058 L
678.123 294.494 L
678.886 294.494 L
678.886 311.708 L
679.649 311.708 L
679.649 339.406 L
680.412 339.406 L
680.412 320.889 L
681.175 320.889 L
681.175 272.094 L
681.938 272.094 L
681.938 313.937 L
682.701 313.937 L
682.701 354.582 L
683.464 354.582 L
683.464 326.849 L
684.227 326.849 L
684.227 273.261 L
684.99 273.261 L
684.99 269.055 L
685.753 269.055 L
685.753 375.302 L
686.516 375.302 L
686.516 318.314 L
687.279 318.314 L
687.279 290.43 L
688.042 290.43 L
688.042 284.538 L
688.805 284.538 L
688.805 323.234 L
689.568 323.234 L
689.568 222.725 L
690.331 222.725 L
690.331 332.524 L
691.094 332.524 L
691.094 318.835 L
691.857 318.835 L
691.857 292.448 L
692.62 292.448 L
692.62 268.572 L
693.383 268.572 L
693.383 328.721 L
694.146 328.721 L
694.146 289.172 L
694.909 289.172 L
694.909 352.011 L
695.672 352.011 L
695.672 298.862 L
696.435 298.862 L
696.435 244.644 L
697.198 244.644 L
697.198 262.968 L
697.961 262.968 L
697.961 297.534 L
698.724 297.534 L
698.724 178.138 L
699.487 178.138 L
699.487 320.073 L
700.25 320.073 L
700.25 344.083 L
701.013 344.083 L
701.013 292.878 L
701.776 292.878 L
701.776 331.86 L
702.539 331.86 L
702.539 319.52 L
703.302 319.52 L
703.302 257.045 L
704.065 257.045 L
704.065 406.101 L
704.828 406.101 L
704.828 245.843 L
705.591 245.843 L
705.591 469.756 L
706.354 469.756 L
706.354 337.894 L
707.117 337.894 L
707.117 209.188 L
707.88 209.188 L
707.88 307.445 L
708.643 307.445 L
708.643 346.313 L
709.406 346.313 L
709.406 256.286 L
710.169 256.286 L
710.169 284.684 L
710.932 284.684 L
710.932 294.354 L
711.695 294.354 L
711.695 289.277 L
712.458 289.277 L
712.458 283.618 L
713.221 283.618 L
713.221 229.887 L
713.984 229.887 L
713.984 278.625 L
714.747 278.625 L
714.747 100.848 L
715.51 100.848 L
715.51 261.996 L
716.273 261.996 L
716.273 226.01 L
717.036 226.01 L
717.036 362.437 L
717.799 362.437 L
717.799 291.942 L
718.562 291.942 L
718.562 321.573 L
719.325 321.573 L
719.325 297.317 L
720.088 297.317 L
720.088 332.862 L
720.851 332.862 L
720.851 347.315 L
721.614 347.315 L
721.614 229.087 L
722.377 229.087 L
722.377 234.305 L
723.14 234.305 L
723.14 296.368 L
723.903 296.368 L
723.903 290.799 L
724.666 290.799 L
724.666 255.917 L
725.429 255.917 L
725.429 267.175 L
726.192 267.175 L
726.192 329.1 L
726.955 329.1 L
726.955 431.129 L
727.718 431.129 L
727.718 315.349 L
728.481 315.349 L
728.481 373.264 L
729.244 373.264 L
729.244 334.135 L
730.007 334.135 L
730.007 90.15 L
730.77 90.15 L
730.77 354.266 L
731.533 354.266 L
731.533 377.193 L
732.296 377.193 L
732.296 300.884 L
733.059 300.884 L
733.059 403.787 L
733.822 403.787 L
733.822 352.636 L
734.585 352.636 L
734.585 279.004 L
735.348 279.004 L
735.348 284.007 L
736.111 284.007 L
736.111 254.665 L
736.874 254.665 L
736.874 399.727 L
737.637 399.727 L
737.637 221.538 L
738.4 221.538 L
738.4 267.252 L
739.163 267.252 L
739.163 186.668 L
739.926 186.668 L
739.926 343.253 L
740.689 343.253 L
740.689 337.569 L
741.452 337.569 L
741.452 372.768 L
742.215 372.768 L
742.215 298.717 L
742.978 298.717 L
742.978 417.48 L
743.741 417.48 L
743.741 272.157 L
744.504 272.157 L
744.504 322.802 L
745.267 322.802 L
745.267 316.002 L
746.03 316.002 L
746.03 300.216 L
746.793 300.216 L
746.793 264.349 L
747.556 264.349 L
747.556 394.69 L
748.319 394.69 L
748.319 286.035 L
749.082 286.035 L
749.082 291.947 L
749.845 291.947 L
749.845 336.708 L
750.608 336.708 L
750.608 318.163 L
751.371 318.163 L
751.371 372.47 L
752.134 372.47 L
752.134 292.585 L
752.897 292.585 L
752.897 357.345 L
753.66 357.345 L
753.66 311.28 L
754.423 311.28 L
754.423 364.488 L
755.186 364.488 L
755.186 306.372 L
755.949 306.372 L
755.949 383.813 L
756.712 383.813 L
756.712 322.271 L
757.475 322.271 L
757.475 240.153 L
758.238 240.153 L
758.238 274.661 L
759.001 274.661 L
759.001 280.157 L
759.764 280.157 L
759.764 319.192 L
760.527 319.192 L
760.527 237.681 L
761.29 237.681 L
761.29 249.137 L
762.053 249.137 L
762.053 237.883 L
762.816 237.883 L
762.816 311.05 L
763.579 311.05 L
763.579 259.664 L
764.342 259.664 L
764.342 226.563 L
765.105 226.563 L
765.105 315.331 L
765.868 315.331 L
765.868 341.738 L
766.631 341.738 L
766.631 242.936 L
767.394 242.936 L
767.394 275.07 L
768.157 275.07 L
768.157 289.093 L
768.92 289.093 L
768.92 366.554 L
769.683 366.554 L
769.683 318.684 L
770.446 318.684 L
770.446 248.949 L
771.209 248.949 L
771.209 325.725 L
771.972 325.725 L
771.972 286.092 L
772.735 286.092 L
772.735 296.415 L
773.498 296.415 L
773.498 258.151 L
774.261 258.151 L
774.261 368.193 L
775.024 368.193 L
775.024 247.618 L
775.787 247.618 L
775.787 281.951 L
776.55 281.951 L
776.55 298.159 L
777.313 298.159 L
777.313 292.92 L
778.076 292.92 L
778.076 356.338 L
778.839 356.338 L
778.839 308.289 L
779.602 308.289 L
779.602 334.332 L
780.365 334.332 L
780.365 276.488 L
781.128 276.488 L
781.128 327.147 L
781.891 327.147 L
781.891 232.627 L
782.654 232.627 L
782.654 288.061 L
783.417 288.061 L
783.417 295.612 L
784.18 295.612 L
784.18 346.49 L
784.943 346.49 L
784.943 231.617 L
785.706 231.617 L
785.706 239.923 L
786.469 239.923 L
786.469 304.656 L
787.232 304.656 L
787.232 282.337 L
787.995 282.337 L
787.995 181.914 L
788.758 181.914 L
788.758 307.144 L
789.521 307.144 L
789.521 326.964 L
790.284 326.964 L
790.284 323.948 L
791.047 323.948 L
791.047 210.93 L
791.81 210.93 L
791.81 291.625 L
792.573 291.625 L
792.573 288.355 L
793.336 288.355 L
793.336 279.441 L
794.099 279.441 L
794.099 280.986 L
794.862 280.986 L
794.862 404.912 L
795.625 404.912 L
795.625 383.577 L
796.388 383.577 L
796.388 319.158 L
797.151 319.158 L
797.151 285.373 L
797.914 285.373 L
797.914 322.078 L
798.677 322.078 L
798.677 345.833 L
799.44 345.833 L
799.44 389.299 L
800.203 389.299 L
800.203 290.284 L
800.966 290.284 L
800.966 170.286 L
801.729 170.286 L
801.729 299.704 L
802.492 299.704 L
802.492 376.173 L
803.255 376.173 L
803.255 308.201 L
804.018 308.201 L
804.018 312.419 L
804.781 312.419 L
804.781 284.047 L
805.544 284.047 L
805.544 235.842 L
806.307 235.842 L
806.307 294.91 L
807.07 294.91 L
807.07 276.409 L
807.833 276.409 L
807.833 312.751 L
808.596 312.751 L
808.596 329.987 L
809.359 329.987 L
809.359 345.422 L
810.122 345.422 L
810.122 223.024 L
810.885 223.024 L
810.885 251.704 L
811.648 251.704 L
811.648 341.74 L
812.411 341.74 L
812.411 370.094 L
813.174 370.094 L
813.174 211.78 L
813.937 211.78 L
813.937 375.881 L
814.7 375.881 L
814.7 317.873 L
815.463 317.873 L
815.463 320.83 L
816.226 320.83 L
816.226 267.717 L
816.989 267.717 L
816.989 254.7 L
817.752 254.7 L
817.752 270.802 L
818.515 270.802 L
818.515 357.97 L
819.278 357.97 L
819.278 264.348 L
820.041 264.348 L
820.041 349.261 L
820.804 349.261 L
820.804 309.302 L
821.567 309.302 L
821.567 225.698 L
822.33 225.698 L
822.33 272.29 L
823.093 272.29 L
823.093 362.14 L
823.856 362.14 L
823.856 275.777 L
824.619 275.777 L
824.619 268.373 L
825.382 268.373 L
825.382 354.214 L
826.145 354.214 L
826.145 311.359 L
826.908 311.359 L
826.908 255.294 L
827.671 255.294 L
827.671 241.316 L
828.434 241.316 L
828.434 318.693 L
829.197 318.693 L
829.197 255.897 L
829.96 255.897 L
829.96 223.856 L
830.723 223.856 L
830.723 437.785 L
831.486 437.785 L
831.486 356.479 L
832.249 356.479 L
832.249 314.411 L
833.012 314.411 L
833.012 373.439 L
833.775 373.439 L
833.775 373.128 L
834.538 373.128 L
834.538 361.406 L
835.301 361.406 L
835.301 296.755 L
836.064 296.755 L
836.064 339.195 L
836.827 339.195 L
836.827 337.636 L
837.59 337.636 L
837.59 306.865 L
838.353 306.865 L
838.353 171.811 L
839.116 171.811 L
839.116 234.799 L
839.879 234.799 L
839.879 314.025 L
840.642 314.025 L
840.642 262.186 L
841.405 262.186 L
841.405 242.725 L
842.168 242.725 L
842.168 285.134 L
842.931 285.134 L
842.931 365.57 L
843.694 365.57 L
843.694 173.39 L
844.457 173.39 L
844.457 331.037 L
845.22 331.037 L
845.22 288.588 L
845.983 288.588 L
845.983 279.533 L
846.746 279.533 L
846.746 278.243 L
847.509 278.243 L
847.509 348.864 L
848.272 348.864 L
848.272 288.926 L
849.035 288.926 L
849.035 279.012 L
849.798 279.012 L
849.798 349.807 L
850.561 349.807 L
850.561 305.12 L
851.324 305.12 L
851.324 280.153 L
852.087 280.153 L
852.087 331.971 L
852.85 331.971 L
852.85 352.93 L
853.613 352.93 L
853.613 320.305 L
854.376 320.305 L
854.376 282.647 L
855.139 282.647 L
855.139 371.798 L
855.902 371.798 L
855.902 355.3 L
856.665 355.3 L
856.665 363.032 L
857.428 363.032 L
857.428 237.026 L
858.191 237.026 L
858.191 282.666 L
858.954 282.666 L
858.954 260.16 L
859.717 260.16 L
859.717 236.732 L
860.48 236.732 L
860.48 369.227 L
861.243 369.227 L
861.243 328.111 L
862.006 328.111 L
862.006 253.765 L
862.769 253.765 L
862.769 324.619 L
863.532 324.619 L
863.532 175.203 L
864.295 175.203 L
864.295 342.172 L
865.058 342.172 L
865.058 441.778 L
865.821 441.778 L
865.821 333.967 L
866.584 333.967 L
866.584 158.843 L
867.347 158.843 L
867.347 222.588 L
868.11 222.588 L
868.11 332.992 L
868.873 332.992 L
868.873 179.903 L
869.636 179.903 L
869.636 275.004 L
870.399 275.004 L
870.399 270.574 L
871.162 270.574 L
871.162 293.325 L
871.925 293.325 L
871.925 232.919 L
872.688 232.919 L
872.688 317.121 L
873.451 317.121 L
873.451 350.021 L
874.214 350.021 L
874.214 311.072 L
874.977 311.072 L
874.977 347.896 L
875.74 347.896 L
875.74 294.68 L
876.503 294.68 L
876.503 265.7 L
877.266 265.7 L
877.266 337.441 L
878.029 337.441 L
878.029 413.935 L
878.792 413.935 L
878.792 128.43 L
879.555 128.43 L
879.555 340.908 L
880.318 340.908 L
880.318 343.182 L
881.081 343.182 L
881.081 395.574 L
881.844 395.574 L
881.844 223.167 L
882.607 223.167 L
882.607 433.618 L
883.37 433.618 L
883.37 251.718 L
884.133 251.718 L
884.133 283.732 L
884.896 283.732 L
884.896 229.54 L
885.659 229.54 L
885.659 313.202 L
886.422 313.202 L
886.422 260.225 L
887.185 260.225 L
887.185 286.547 L
887.948 286.547 L
887.948 289.978 L
888.711 289.978 L
888.711 325.474 L
889.474 325.474 L
889.474 305.944 L
890.237 305.944 L
890.237 383.659 L
891 383.659 L
891 272.207 L
891.091 272.207 L
S
GR
GS
[0.75 0 0 0.75 0 0] CT
0.851 0.325 0.098 RC
10.0 ML
0.667 LW
N
128 283.759 M
128.763 283.759 L
128.763 174.193 L
129.526 174.193 L
129.526 349.275 L
130.289 349.275 L
130.289 233.632 L
131.052 233.632 L
131.052 292.411 L
131.815 292.411 L
131.815 323.934 L
132.578 323.934 L
132.578 352.641 L
133.341 352.641 L
133.341 295.562 L
134.104 295.562 L
134.104 271.855 L
134.867 271.855 L
134.867 289.393 L
135.63 289.393 L
135.63 275.415 L
136.393 275.415 L
136.393 276.195 L
137.156 276.195 L
137.156 310.481 L
137.919 310.481 L
137.919 235.361 L
138.682 235.361 L
138.682 330.901 L
139.445 330.901 L
139.445 417.563 L
140.208 417.563 L
140.208 386.469 L
140.971 386.469 L
140.971 205.191 L
141.734 205.191 L
141.734 326.19 L
142.497 326.19 L
142.497 354.806 L
143.26 354.806 L
143.26 348.257 L
144.023 348.257 L
144.023 343.279 L
144.786 343.279 L
144.786 329.062 L
145.549 329.062 L
145.549 329.526 L
146.312 329.526 L
146.312 314.54 L
147.075 314.54 L
147.075 222.532 L
147.838 222.532 L
147.838 299.03 L
148.601 299.03 L
148.601 233.97 L
149.364 233.97 L
149.364 261.447 L
150.127 261.447 L
150.127 284.879 L
150.89 284.879 L
150.89 334.643 L
151.653 334.643 L
151.653 327.809 L
152.416 327.809 L
152.416 315.686 L
153.179 315.686 L
153.179 370.99 L
153.942 370.99 L
153.942 187.172 L
154.705 187.172 L
154.705 249.66 L
155.468 249.66 L
155.468 339.58 L
156.231 339.58 L
156.231 355.749 L
156.994 355.749 L
156.994 311.18 L
157.757 311.18 L
157.757 262.289 L
158.52 262.289 L
158.52 317.553 L
159.283 317.553 L
159.283 372.487 L
160.046 372.487 L
160.046 352.26 L
160.809 352.26 L
160.809 304.515 L
161.572 304.515 L
161.572 240.254 L
162.335 240.254 L
162.335 305.671 L
163.098 305.671 L
163.098 253.227 L
163.861 253.227 L
163.861 331.198 L
164.624 331.198 L
164.624 304.428 L
165.387 304.428 L
165.387 295.485 L
166.15 295.485 L
166.15 391.464 L
166.913 391.464 L
166.913 425.569 L
167.676 425.569 L
167.676 281.43 L
168.439 281.43 L
168.439 311.271 L
169.202 311.271 L
169.202 240.027 L
169.965 240.027 L
169.965 306.474 L
170.728 306.474 L
170.728 324.412 L
171.491 324.412 L
171.491 331.871 L
172.254 331.871 L
172.254 267.823 L
173.017 267.823 L
173.017 275.929 L
173.78 275.929 L
173.78 256.591 L
174.543 256.591 L
174.543 197.346 L
175.306 197.346 L
175.306 270.088 L
176.069 270.088 L
176.069 395.369 L
176.832 395.369 L
176.832 295.784 L
177.595 295.784 L
177.595 222.036 L
178.358 222.036 L
178.358 356.789 L
179.121 356.789 L
179.121 304.309 L
179.884 304.309 L
179.884 383.866 L
180.647 383.866 L
180.647 282.74 L
181.41 282.74 L
181.41 329.009 L
182.173 329.009 L
182.173 387.016 L
182.936 387.016 L
182.936 272.779 L
183.699 272.779 L
183.699 188.071 L
184.462 188.071 L
184.462 268.235 L
185.225 268.235 L
185.225 312.451 L
185.988 312.451 L
185.988 136.133 L
186.751 136.133 L
186.751 339.11 L
187.514 339.11 L
187.514 242.94 L
188.277 242.94 L
188.277 261.675 L
189.04 261.675 L
189.04 262.131 L
189.803 262.131 L
189.803 298.77 L
190.566 298.77 L
190.566 376.166 L
191.329 376.166 L
191.329 266.514 L
192.092 266.514 L
192.092 290.582 L
192.855 290.582 L
192.855 378.912 L
193.618 378.912 L
193.618 151.061 L
194.381 151.061 L
194.381 217.479 L
195.144 217.479 L
195.144 299.918 L
195.907 299.918 L
195.907 363.748 L
196.67 363.748 L
196.67 335.449 L
197.433 335.449 L
197.433 318.499 L
198.196 318.499 L
198.196 302.442 L
198.959 302.442 L
198.959 348.169 L
199.722 348.169 L
199.722 349.833 L
200.485 349.833 L
200.485 329.317 L
201.248 329.317 L
201.248 350.326 L
202.011 350.326 L
202.011 239.009 L
202.774 239.009 L
202.774 350.914 L
203.537 350.914 L
203.537 267.974 L
204.3 267.974 L
204.3 185.472 L
205.063 185.472 L
205.063 352.904 L
205.826 352.904 L
205.826 274.663 L
206.589 274.663 L
206.589 335.068 L
207.352 335.068 L
207.352 314.832 L
208.115 314.832 L
208.115 375.934 L
208.878 375.934 L
208.878 206.992 L
209.641 206.992 L
209.641 296.684 L
210.404 296.684 L
210.404 308.785 L
211.167 308.785 L
211.167 301.347 L
211.93 301.347 L
211.93 309.902 L
212.693 309.902 L
212.693 358.701 L
213.456 358.701 L
213.456 308.167 L
214.219 308.167 L
214.219 244.865 L
214.982 244.865 L
214.982 186.64 L
215.745 186.64 L
215.745 298.028 L
216.508 298.028 L
216.508 432.321 L
217.271 432.321 L
217.271 224.73 L
218.034 224.73 L
218.034 308.619 L
218.797 308.619 L
218.797 228.645 L
219.56 228.645 L
219.56 249.997 L
220.323 249.997 L
220.323 309.069 L
221.086 309.069 L
221.086 346.345 L
221.849 346.345 L
221.849 227.184 L
222.612 227.184 L
222.612 345.656 L
223.375 345.656 L
223.375 336.003 L
224.138 336.003 L
224.138 248.129 L
224.901 248.129 L
224.901 281.008 L
225.664 281.008 L
225.664 387.409 L
226.427 387.409 L
226.427 311.716 L
227.19 311.716 L
227.19 309.525 L
227.953 309.525 L
227.953 309.376 L
228.716 309.376 L
228.716 282.348 L
229.479 282.348 L
229.479 377.504 L
230.242 377.504 L
230.242 325.206 L
231.005 325.206 L
231.005 377.377 L
231.768 377.377 L
231.768 261.095 L
232.531 261.095 L
232.531 237.768 L
233.294 237.768 L
233.294 312.901 L
234.057 312.901 L
234.057 282.264 L
234.82 282.264 L
234.82 265.064 L
235.583 265.064 L
235.583 276.451 L
236.346 276.451 L
236.346 270.763 L
237.109 270.763 L
237.109 313.636 L
237.872 313.636 L
237.872 279.959 L
238.635 279.959 L
238.635 371.358 L
239.398 371.358 L
239.398 275.846 L
240.161 275.846 L
240.161 236.526 L
240.924 236.526 L
240.924 312.525 L
241.687 312.525 L
241.687 302.448 L
242.45 302.448 L
242.45 197.833 L
243.213 197.833 L
243.213 313.712 L
243.976 313.712 L
243.976 293.278 L
244.739 293.278 L
244.739 262.216 L
245.502 262.216 L
245.502 350.031 L
246.265 350.031 L
246.265 287.775 L
247.028 287.775 L
247.028 240.948 L
247.791 240.948 L
247.791 280.02 L
248.554 280.02 L
248.554 291.728 L
249.317 291.728 L
249.317 390.186 L
250.08 390.186 L
250.08 363.695 L
250.843 363.695 L
250.843 413.459 L
251.606 413.459 L
251.606 356.861 L
252.369 356.861 L
252.369 285.469 L
253.132 285.469 L
253.132 306.62 L
253.895 306.62 L
253.895 355.421 L
254.658 355.421 L
254.658 172.518 L
255.421 172.518 L
255.421 334.812 L
256.184 334.812 L
256.184 299.212 L
256.947 299.212 L
256.947 302.841 L
257.71 302.841 L
257.71 293.484 L
258.473 293.484 L
258.473 255.95 L
259.236 255.95 L
259.236 425.599 L
259.999 425.599 L
259.999 386.048 L
260.762 386.048 L
260.762 394.322 L
261.525 394.322 L
261.525 282.12 L
262.288 282.12 L
262.288 303.785 L
263.051 303.785 L
263.051 303.998 L
263.814 303.998 L
263.814 299.562 L
264.577 299.562 L
264.577 242.347 L
265.34 242.347 L
265.34 323.35 L
266.103 323.35 L
266.103 391.284 L
266.866 391.284 L
266.866 359.947 L
267.629 359.947 L
267.629 365.052 L
268.392 365.052 L
268.392 375.597 L
269.155 375.597 L
269.155 298.955 L
269.918 298.955 L
269.918 387.617 L
270.681 387.617 L
270.681 317.86 L
271.444 317.86 L
271.444 229.91 L
272.207 229.91 L
272.207 370.586 L
272.97 370.586 L
272.97 323.838 L
273.733 323.838 L
273.733 356.936 L
274.496 356.936 L
274.496 364.957 L
275.259 364.957 L
275.259 226.573 L
276.022 226.573 L
276.022 339.318 L
276.785 339.318 L
276.785 369.842 L
277.548 369.842 L
277.548 366.06 L
278.311 366.06 L
278.311 344.868 L
279.074 344.868 L
279.074 293.132 L
279.837 293.132 L
279.837 350.292 L
280.6 350.292 L
280.6 243.243 L
281.363 243.243 L
281.363 317.554 L
282.126 317.554 L
282.126 287.452 L
282.889 287.452 L
282.889 370.066 L
283.652 370.066 L
283.652 331.376 L
284.415 331.376 L
284.415 286.417 L
285.178 286.417 L
285.178 348.925 L
285.941 348.925 L
285.941 346.442 L
286.704 346.442 L
286.704 309.426 L
287.467 309.426 L
287.467 306.513 L
288.23 306.513 L
288.23 374.445 L
288.993 374.445 L
288.993 293.222 L
289.756 293.222 L
289.756 233.326 L
290.519 233.326 L
290.519 212.396 L
291.282 212.396 L
291.282 392.974 L
292.045 392.974 L
292.045 219.193 L
292.808 219.193 L
292.808 214.756 L
293.571 214.756 L
293.571 281.219 L
294.334 281.219 L
294.334 349.23 L
295.097 349.23 L
295.097 268.593 L
295.86 268.593 L
295.86 294.897 L
296.623 294.897 L
296.623 367.892 L
297.386 367.892 L
297.386 324.206 L
298.149 324.206 L
298.149 325.236 L
298.912 325.236 L
298.912 264.952 L
299.675 264.952 L
299.675 297.039 L
300.438 297.039 L
300.438 353.024 L
301.201 353.024 L
301.201 240.572 L
301.964 240.572 L
301.964 239.278 L
302.727 239.278 L
302.727 297.945 L
303.49 297.945 L
303.49 272.151 L
304.253 272.151 L
304.253 284.405 L
305.016 284.405 L
305.016 297.766 L
305.779 297.766 L
305.779 396.667 L
306.542 396.667 L
306.542 239.926 L
307.305 239.926 L
307.305 358.253 L
308.068 358.253 L
308.068 318.302 L
308.831 318.302 L
308.831 265.215 L
309.594 265.215 L
309.594 236.889 L
310.357 236.889 L
310.357 381.524 L
311.12 381.524 L
311.12 325.162 L
311.883 325.162 L
311.883 380.956 L
312.646 380.956 L
312.646 235.401 L
313.409 235.401 L
313.409 315.11 L
314.172 315.11 L
314.172 339.067 L
314.935 339.067 L
314.935 420.1 L
315.698 420.1 L
315.698 373.958 L
316.461 373.958 L
316.461 333.043 L
317.224 333.043 L
317.224 219.457 L
317.987 219.457 L
317.987 310.143 L
318.75 310.143 L
318.75 321.04 L
319.513 321.04 L
319.513 291.693 L
320.276 291.693 L
320.276 311.5 L
321.039 311.5 L
321.039 295.916 L
321.802 295.916 L
321.802 267.222 L
322.565 267.222 L
322.565 299.811 L
323.328 299.811 L
323.328 267.672 L
324.091 267.672 L
324.091 311.054 L
324.854 311.054 L
324.854 334.828 L
325.617 334.828 L
325.617 244.886 L
326.38 244.886 L
326.38 285.336 L
327.143 285.336 L
327.143 347.636 L
327.906 347.636 L
327.906 350.229 L
328.669 350.229 L
328.669 200.45 L
329.432 200.45 L
329.432 284.77 L
330.195 284.77 L
330.195 435.382 L
330.958 435.382 L
330.958 319.171 L
331.721 319.171 L
331.721 246.802 L
332.484 246.802 L
332.484 282.96 L
333.247 282.96 L
333.247 337.76 L
334.01 337.76 L
334.01 290.847 L
334.773 290.847 L
334.773 420.367 L
335.536 420.367 L
335.536 264.479 L
336.299 264.479 L
336.299 249.7 L
337.062 249.7 L
337.062 338.79 L
337.825 338.79 L
337.825 289.67 L
338.588 289.67 L
338.588 212.642 L
339.351 212.642 L
339.351 328.022 L
340.114 328.022 L
340.114 263.837 L
340.877 263.837 L
340.877 298.844 L
341.64 298.844 L
341.64 292.092 L
342.403 292.092 L
342.403 160.155 L
343.166 160.155 L
343.166 224.403 L
343.929 224.403 L
343.929 347.843 L
344.692 347.843 L
344.692 359.213 L
345.455 359.213 L
345.455 377.74 L
346.218 377.74 L
346.218 277.432 L
346.981 277.432 L
346.981 214.086 L
347.744 214.086 L
347.744 337.901 L
348.507 337.901 L
348.507 325.047 L
349.27 325.047 L
349.27 256.745 L
350.033 256.745 L
350.033 265.603 L
350.796 265.603 L
350.796 252.748 L
351.559 252.748 L
351.559 269.366 L
352.322 269.366 L
352.322 307.708 L
353.085 307.708 L
353.085 322.012 L
353.848 322.012 L
353.848 334.127 L
354.611 334.127 L
354.611 302.1 L
355.374 302.1 L
355.374 346.215 L
356.137 346.215 L
356.137 300.123 L
356.9 300.123 L
356.9 334.103 L
357.663 334.103 L
357.663 357.843 L
358.426 357.843 L
358.426 283.505 L
359.189 283.505 L
359.189 257.507 L
359.952 257.507 L
359.952 177.028 L
360.715 177.028 L
360.715 240.197 L
361.478 240.197 L
361.478 372.025 L
362.241 372.025 L
362.241 265.508 L
363.004 265.508 L
363.004 407.337 L
363.767 407.337 L
363.767 314.567 L
364.53 314.567 L
364.53 308.547 L
365.293 308.547 L
365.293 291.391 L
366.056 291.391 L
366.056 269.14 L
366.819 269.14 L
366.819 269.681 L
367.582 269.681 L
367.582 318.391 L
368.345 318.391 L
368.345 264.755 L
369.108 264.755 L
369.108 307.573 L
369.871 307.573 L
369.871 333.179 L
370.634 333.179 L
370.634 312.508 L
371.397 312.508 L
371.397 404.244 L
372.16 404.244 L
372.16 258.89 L
372.923 258.89 L
372.923 299.98 L
373.686 299.98 L
373.686 234.093 L
374.449 234.093 L
374.449 308.173 L
375.212 308.173 L
375.212 437.465 L
375.975 437.465 L
375.975 253.243 L
376.738 253.243 L
376.738 303.814 L
377.501 303.814 L
377.501 226.263 L
378.264 226.263 L
378.264 279.755 L
379.027 279.755 L
379.027 365.256 L
379.79 365.256 L
379.79 358.584 L
380.553 358.584 L
380.553 279.782 L
381.316 279.782 L
381.316 254.924 L
382.079 254.924 L
382.079 308.969 L
382.842 308.969 L
382.842 309.617 L
383.605 309.617 L
383.605 312.807 L
384.368 312.807 L
384.368 348.735 L
385.131 348.735 L
385.131 243.385 L
385.894 243.385 L
385.894 329.495 L
386.657 329.495 L
386.657 347.375 L
387.42 347.375 L
387.42 365.006 L
388.183 365.006 L
388.183 245.494 L
388.946 245.494 L
388.946 331.073 L
389.709 331.073 L
389.709 341.807 L
390.472 341.807 L
390.472 325.51 L
391.235 325.51 L
391.235 349.406 L
391.998 349.406 L
391.998 320.597 L
392.761 320.597 L
392.761 330.85 L
393.524 330.85 L
393.524 337.008 L
394.287 337.008 L
394.287 317.716 L
395.05 317.716 L
395.05 258.874 L
395.813 258.874 L
395.813 403.738 L
396.576 403.738 L
396.576 299.604 L
397.339 299.604 L
397.339 376.819 L
398.102 376.819 L
398.102 497.57 L
398.865 497.57 L
398.865 316.861 L
399.628 316.861 L
399.628 263.33 L
400.391 263.33 L
400.391 252.259 L
401.154 252.259 L
401.154 257.834 L
401.917 257.834 L
401.917 285.321 L
402.68 285.321 L
402.68 372.309 L
403.443 372.309 L
403.443 247.058 L
404.206 247.058 L
404.206 364.691 L
404.969 364.691 L
404.969 319.114 L
405.732 319.114 L
405.732 304.175 L
406.495 304.175 L
406.495 362.029 L
407.258 362.029 L
407.258 328.126 L
408.021 328.126 L
408.021 365.087 L
408.784 365.087 L
408.784 189.369 L
409.547 189.369 L
409.547 360.547 L
410.31 360.547 L
410.31 310.969 L
411.073 310.969 L
411.073 331.652 L
411.836 331.652 L
411.836 326.895 L
412.599 326.895 L
412.599 322.564 L
413.362 322.564 L
413.362 293.553 L
414.125 293.553 L
414.125 257.084 L
414.888 257.084 L
414.888 415.038 L
415.651 415.038 L
415.651 294.522 L
416.414 294.522 L
416.414 291.047 L
417.177 291.047 L
417.177 338.647 L
417.94 338.647 L
417.94 418.598 L
418.703 418.598 L
418.703 197.988 L
419.466 197.988 L
419.466 336.889 L
420.229 336.889 L
420.229 261.121 L
420.992 261.121 L
420.992 310.717 L
421.755 310.717 L
421.755 262.15 L
422.518 262.15 L
422.518 322.782 L
423.281 322.782 L
423.281 309.952 L
424.044 309.952 L
424.044 286.249 L
424.807 286.249 L
424.807 283.245 L
425.57 283.245 L
425.57 268.587 L
426.333 268.587 L
426.333 346.555 L
427.096 346.555 L
427.096 275.353 L
427.859 275.353 L
427.859 317.595 L
428.622 317.595 L
428.622 394.886 L
429.385 394.886 L
429.385 307.611 L
430.148 307.611 L
430.148 256.609 L
430.911 256.609 L
430.911 267.939 L
431.674 267.939 L
431.674 280.869 L
432.437 280.869 L
432.437 273.9 L
433.2 273.9 L
433.2 296.996 L
433.963 296.996 L
433.963 234.573 L
434.726 234.573 L
434.726 232.373 L
435.489 232.373 L
435.489 334.432 L
436.252 334.432 L
436.252 342.228 L
437.015 342.228 L
437.015 327.979 L
437.778 327.979 L
437.778 328.119 L
438.541 328.119 L
438.541 382.882 L
439.304 382.882 L
439.304 312.805 L
440.067 312.805 L
440.067 287.614 L
440.83 287.614 L
440.83 296.001 L
441.593 296.001 L
441.593 217.975 L
442.356 217.975 L
442.356 301.594 L
443.119 301.594 L
443.119 301.65 L
443.882 301.65 L
443.882 289.158 L
444.645 289.158 L
444.645 344.339 L
445.408 344.339 L
445.408 273.913 L
446.171 273.913 L
446.171 225.353 L
446.934 225.353 L
446.934 251.615 L
447.697 251.615 L
447.697 233.148 L
448.46 233.148 L
448.46 301.164 L
449.223 301.164 L
449.223 370.265 L
449.986 370.265 L
449.986 401.024 L
450.749 401.024 L
450.749 278.814 L
451.512 278.814 L
451.512 270.035 L
452.275 270.035 L
452.275 327.166 L
453.038 327.166 L
453.038 293.253 L
453.801 293.253 L
453.801 357.393 L
454.564 357.393 L
454.564 333.459 L
455.327 333.459 L
455.327 231.087 L
456.09 231.087 L
456.09 262.885 L
456.853 262.885 L
456.853 358.606 L
457.616 358.606 L
457.616 289.165 L
458.379 289.165 L
458.379 420.053 L
459.142 420.053 L
459.142 287.129 L
459.905 287.129 L
459.905 281.41 L
460.668 281.41 L
460.668 359.537 L
461.431 359.537 L
461.431 394.496 L
462.194 394.496 L
462.194 241.246 L
462.957 241.246 L
462.957 221.323 L
463.72 221.323 L
463.72 311.149 L
464.483 311.149 L
464.483 332.789 L
465.246 332.789 L
465.246 374.221 L
466.009 374.221 L
466.009 277.137 L
466.772 277.137 L
466.772 323.003 L
467.535 323.003 L
467.535 380.023 L
468.298 380.023 L
468.298 328.2 L
469.061 328.2 L
469.061 265.516 L
469.824 265.516 L
469.824 316.94 L
470.587 316.94 L
470.587 291.249 L
471.35 291.249 L
471.35 348.132 L
472.113 348.132 L
472.113 327.453 L
472.876 327.453 L
472.876 254.889 L
473.639 254.889 L
473.639 308.304 L
474.402 308.304 L
474.402 268.99 L
475.165 268.99 L
475.165 266.86 L
475.928 266.86 L
475.928 298.974 L
476.691 298.974 L
476.691 258.005 L
477.454 258.005 L
477.454 280.344 L
478.217 280.344 L
478.217 356.803 L
478.98 356.803 L
478.98 243.248 L
479.743 243.248 L
479.743 335.866 L
480.506 335.866 L
480.506 411.189 L
481.269 411.189 L
481.269 267.113 L
482.032 267.113 L
482.032 344.521 L
482.795 344.521 L
482.795 218.606 L
483.558 218.606 L
483.558 381.973 L
484.321 381.973 L
484.321 407.777 L
485.084 407.777 L
485.084 344.973 L
485.847 344.973 L
485.847 338.519 L
486.61 338.519 L
486.61 301.481 L
487.373 301.481 L
487.373 259.086 L
488.136 259.086 L
488.136 252.498 L
488.899 252.498 L
488.899 353.974 L
489.662 353.974 L
489.662 312.403 L
490.425 312.403 L
490.425 343.811 L
491.188 343.811 L
491.188 251.768 L
491.951 251.768 L
491.951 240.189 L
492.714 240.189 L
492.714 278.012 L
493.477 278.012 L
493.477 386.361 L
494.24 386.361 L
494.24 314.118 L
495.003 314.118 L
495.003 251.726 L
495.766 251.726 L
495.766 298.254 L
496.529 298.254 L
496.529 307.683 L
497.292 307.683 L
497.292 296.409 L
498.055 296.409 L
498.055 233.784 L
498.818 233.784 L
498.818 290.433 L
499.581 290.433 L
499.581 382.929 L
500.344 382.929 L
500.344 399.69 L
501.107 399.69 L
501.107 317.471 L
501.87 317.471 L
501.87 250.333 L
502.633 250.333 L
502.633 275.429 L
503.396 275.429 L
503.396 299.297 L
504.159 299.297 L
504.159 355.532 L
504.922 355.532 L
504.922 269.882 L
505.685 269.882 L
505.685 336.674 L
506.448 336.674 L
506.448 355.056 L
507.211 355.056 L
507.211 308.178 L
507.974 308.178 L
507.974 340.222 L
508.737 340.222 L
508.737 317.956 L
509.5 317.956 L
509.5 235.581 L
510.263 235.581 L
510.263 348.176 L
511.026 348.176 L
511.026 383.058 L
511.789 383.058 L
511.789 345.704 L
512.552 345.704 L
512.552 296.055 L
513.315 296.055 L
513.315 198.925 L
514.078 198.925 L
514.078 266.887 L
514.841 266.887 L
514.841 306.228 L
515.604 306.228 L
515.604 277.845 L
516.367 277.845 L
516.367 259.073 L
517.13 259.073 L
517.13 277.493 L
517.893 277.493 L
517.893 351.174 L
518.656 351.174 L
518.656 211.686 L
519.419 211.686 L
519.419 364.267 L
520.182 364.267 L
520.182 308.069 L
520.945 308.069 L
520.945 378.68 L
521.708 378.68 L
521.708 284.329 L
522.471 284.329 L
522.471 314.262 L
523.234 314.262 L
523.234 318.433 L
523.997 318.433 L
523.997 245.968 L
524.76 245.968 L
524.76 356.084 L
525.523 356.084 L
525.523 202.745 L
526.286 202.745 L
526.286 253.746 L
527.049 253.746 L
527.049 297.086 L
527.812 297.086 L
527.812 337.303 L
528.575 337.303 L
528.575 255.583 L
529.338 255.583 L
529.338 285.868 L
530.101 285.868 L
530.101 313.815 L
530.864 313.815 L
530.864 223.535 L
531.627 223.535 L
531.627 246.295 L
532.39 246.295 L
532.39 328.967 L
533.153 328.967 L
533.153 229.571 L
533.916 229.571 L
533.916 324.852 L
534.679 324.852 L
534.679 393.886 L
535.442 393.886 L
535.442 325.07 L
536.205 325.07 L
536.205 285.018 L
536.968 285.018 L
536.968 306.054 L
537.731 306.054 L
537.731 347.703 L
538.494 347.703 L
538.494 391.268 L
539.257 391.268 L
539.257 273.881 L
540.02 273.881 L
540.02 318.801 L
540.783 318.801 L
540.783 318.718 L
541.546 318.718 L
541.546 389.368 L
542.309 389.368 L
542.309 247.714 L
543.072 247.714 L
543.072 314.301 L
543.835 314.301 L
543.835 232.291 L
544.598 232.291 L
544.598 354.214 L
545.361 354.214 L
545.361 253.419 L
546.124 253.419 L
546.124 350.134 L
546.887 350.134 L
546.887 408.722 L
547.65 408.722 L
547.65 315.083 L
548.413 315.083 L
548.413 314.888 L
549.176 314.888 L
549.176 275.926 L
549.939 275.926 L
549.939 292.969 L
550.702 292.969 L
550.702 239.561 L
551.465 239.561 L
551.465 298.481 L
552.228 298.481 L
552.228 309.752 L
552.991 309.752 L
552.991 402.633 L
553.754 402.633 L
553.754 335.196 L
554.517 335.196 L
554.517 302.018 L
555.28 302.018 L
555.28 290.495 L
556.043 290.495 L
556.043 386.689 L
556.806 386.689 L
556.806 246.09 L
557.569 246.09 L
557.569 257.806 L
558.332 257.806 L
558.332 365.391 L
559.095 365.391 L
559.095 410.823 L
559.858 410.823 L
559.858 281.151 L
560.621 281.151 L
560.621 306.495 L
561.384 306.495 L
561.384 308.503 L
562.147 308.503 L
562.147 378.451 L
562.91 378.451 L
562.91 186.987 L
563.673 186.987 L
563.673 344.856 L
564.436 344.856 L
564.436 299.528 L
565.199 299.528 L
565.199 352.462 L
565.962 352.462 L
565.962 429.469 L
566.725 429.469 L
566.725 339.854 L
567.488 339.854 L
567.488 280.245 L
568.251 280.245 L
568.251 352.641 L
569.014 352.641 L
569.014 336.465 L
569.777 336.465 L
569.777 319.157 L
570.54 319.157 L
570.54 257.472 L
571.303 257.472 L
571.303 287.001 L
572.066 287.001 L
572.066 266.674 L
572.829 266.674 L
572.829 268.824 L
573.592 268.824 L
573.592 334.145 L
574.355 334.145 L
574.355 221.114 L
575.118 221.114 L
575.118 267.023 L
575.881 267.023 L
575.881 391.43 L
576.644 391.43 L
576.644 258.624 L
577.407 258.624 L
577.407 372.745 L
578.17 372.745 L
578.17 242.57 L
578.933 242.57 L
578.933 293.942 L
579.696 293.942 L
579.696 291.929 L
580.459 291.929 L
580.459 272.459 L
581.222 272.459 L
581.222 247.475 L
581.985 247.475 L
581.985 325.057 L
582.748 325.057 L
582.748 347.428 L
583.511 347.428 L
583.511 230.559 L
584.274 230.559 L
584.274 263.972 L
585.037 263.972 L
585.037 402.903 L
585.8 402.903 L
585.8 302.854 L
586.563 302.854 L
586.563 310.873 L
587.326 310.873 L
587.326 355.419 L
588.089 355.419 L
588.089 337.193 L
588.852 337.193 L
588.852 265.132 L
589.615 265.132 L
589.615 186.663 L
590.378 186.663 L
590.378 245.164 L
591.141 245.164 L
591.141 336.033 L
591.904 336.033 L
591.904 315.967 L
592.667 315.967 L
592.667 320.805 L
593.43 320.805 L
593.43 301.71 L
594.193 301.71 L
594.193 312.652 L
594.956 312.652 L
594.956 337.665 L
595.719 337.665 L
595.719 316.212 L
596.482 316.212 L
596.482 335.146 L
597.245 335.146 L
597.245 233.829 L
598.008 233.829 L
598.008 269.998 L
598.771 269.998 L
598.771 260.913 L
599.534 260.913 L
599.534 310.452 L
600.297 310.452 L
600.297 319.088 L
601.06 319.088 L
601.06 265.361 L
601.823 265.361 L
601.823 377.081 L
602.586 377.081 L
602.586 205.849 L
603.349 205.849 L
603.349 233.107 L
604.112 233.107 L
604.112 205.963 L
604.875 205.963 L
604.875 295.597 L
605.638 295.597 L
605.638 261.257 L
606.401 261.257 L
606.401 386.09 L
607.164 386.09 L
607.164 367.47 L
607.927 367.47 L
607.927 308.651 L
608.69 308.651 L
608.69 362.515 L
609.453 362.515 L
609.453 333.458 L
610.216 333.458 L
610.216 292.672 L
610.979 292.672 L
610.979 301.914 L
611.742 301.914 L
611.742 323.681 L
612.505 323.681 L
612.505 409.498 L
613.268 409.498 L
613.268 333.766 L
614.031 333.766 L
614.031 369.382 L
614.794 369.382 L
614.794 301.743 L
615.557 301.743 L
615.557 346.961 L
616.32 346.961 L
616.32 249.514 L
617.083 249.514 L
617.083 310.084 L
617.846 310.084 L
617.846 271.957 L
618.609 271.957 L
618.609 297.269 L
619.372 297.269 L
619.372 276.894 L
620.135 276.894 L
620.135 379.786 L
620.898 379.786 L
620.898 272.41 L
621.661 272.41 L
621.661 324.554 L
622.424 324.554 L
622.424 374.264 L
623.187 374.264 L
623.187 290.532 L
623.95 290.532 L
623.95 373.243 L
624.713 373.243 L
624.713 239.938 L
625.476 239.938 L
625.476 366.868 L
626.239 366.868 L
626.239 267.873 L
627.002 267.873 L
627.002 234.824 L
627.765 234.824 L
627.765 274.916 L
628.528 274.916 L
628.528 404.064 L
629.291 404.064 L
629.291 348.893 L
630.054 348.893 L
630.054 236.926 L
630.817 236.926 L
630.817 273.988 L
631.58 273.988 L
631.58 226.813 L
632.343 226.813 L
632.343 269.735 L
633.106 269.735 L
633.106 249.928 L
633.869 249.928 L
633.869 269.386 L
634.632 269.386 L
634.632 323.875 L
635.395 323.875 L
635.395 275.637 L
636.158 275.637 L
636.158 288.234 L
636.921 288.234 L
636.921 216.568 L
637.684 216.568 L
637.684 256.854 L
638.447 256.854 L
638.447 360.943 L
639.21 360.943 L
639.21 235.826 L
639.973 235.826 L
639.973 294.243 L
640.736 294.243 L
640.736 284.459 L
641.499 284.459 L
641.499 295.796 L
642.262 295.796 L
642.262 258.984 L
643.025 258.984 L
643.025 272.757 L
643.788 272.757 L
643.788 345.955 L
644.551 345.955 L
644.551 366.657 L
645.314 366.657 L
645.314 306.101 L
646.077 306.101 L
646.077 240.602 L
646.84 240.602 L
646.84 228.035 L
647.603 228.035 L
647.603 312.361 L
648.366 312.361 L
648.366 290.697 L
649.129 290.697 L
649.129 248.74 L
649.892 248.74 L
649.892 313.649 L
650.655 313.649 L
650.655 310.238 L
651.418 310.238 L
651.418 296.678 L
652.181 296.678 L
652.181 306.766 L
652.944 306.766 L
652.944 300.084 L
653.707 300.084 L
653.707 261.556 L
654.47 261.556 L
654.47 301.583 L
655.233 301.583 L
655.233 277.534 L
655.996 277.534 L
655.996 264.802 L
656.759 264.802 L
656.759 426.573 L
657.522 426.573 L
657.522 298.018 L
658.285 298.018 L
658.285 283.823 L
659.048 283.823 L
659.048 190.384 L
659.811 190.384 L
659.811 269.525 L
660.574 269.525 L
660.574 331.541 L
661.337 331.541 L
661.337 363.379 L
662.1 363.379 L
662.1 221.641 L
662.863 221.641 L
662.863 309.126 L
663.626 309.126 L
663.626 421.378 L
664.389 421.378 L
664.389 275.592 L
665.152 275.592 L
665.152 328.204 L
665.915 328.204 L
665.915 219.934 L
666.678 219.934 L
666.678 298.456 L
667.441 298.456 L
667.441 333.925 L
668.204 333.925 L
668.204 400.656 L
668.967 400.656 L
668.967 317.164 L
669.73 317.164 L
669.73 382.588 L
670.493 382.588 L
670.493 387.066 L
671.256 387.066 L
671.256 222.701 L
672.019 222.701 L
672.019 303.426 L
672.782 303.426 L
672.782 349.162 L
673.545 349.162 L
673.545 284.296 L
674.308 284.296 L
674.308 312.396 L
675.071 312.396 L
675.071 246.35 L
675.834 246.35 L
675.834 412.439 L
676.597 412.439 L
676.597 260.718 L
677.36 260.718 L
677.36 259.058 L
678.123 259.058 L
678.123 294.494 L
678.886 294.494 L
678.886 311.708 L
679.649 311.708 L
679.649 339.406 L
680.412 339.406 L
680.412 320.889 L
681.175 320.889 L
681.175 272.094 L
681.938 272.094 L
681.938 313.937 L
682.701 313.937 L
682.701 354.582 L
683.464 354.582 L
683.464 326.849 L
684.227 326.849 L
684.227 273.261 L
684.99 273.261 L
684.99 269.055 L
685.753 269.055 L
685.753 375.302 L
686.516 375.302 L
686.516 318.314 L
687.279 318.314 L
687.279 290.43 L
688.042 290.43 L
688.042 284.538 L
688.805 284.538 L
688.805 323.234 L
689.568 323.234 L
689.568 222.725 L
690.331 222.725 L
690.331 332.524 L
691.094 332.524 L
691.094 318.835 L
691.857 318.835 L
691.857 292.448 L
692.62 292.448 L
692.62 268.572 L
693.383 268.572 L
693.383 328.721 L
694.146 328.721 L
694.146 289.172 L
694.909 289.172 L
694.909 352.011 L
695.672 352.011 L
695.672 298.862 L
696.435 298.862 L
696.435 244.644 L
697.198 244.644 L
697.198 262.968 L
697.961 262.968 L
697.961 297.534 L
698.724 297.534 L
698.724 178.138 L
699.487 178.138 L
699.487 320.073 L
700.25 320.073 L
700.25 344.083 L
701.013 344.083 L
701.013 292.878 L
701.776 292.878 L
701.776 331.86 L
702.539 331.86 L
702.539 319.52 L
703.302 319.52 L
703.302 257.045 L
704.065 257.045 L
704.065 406.101 L
704.828 406.101 L
704.828 245.843 L
705.591 245.843 L
705.591 469.756 L
706.354 469.756 L
706.354 337.894 L
707.117 337.894 L
707.117 209.188 L
707.88 209.188 L
707.88 307.445 L
708.643 307.445 L
708.643 346.313 L
709.406 346.313 L
709.406 256.286 L
710.169 256.286 L
710.169 284.684 L
710.932 284.684 L
710.932 294.354 L
711.695 294.354 L
711.695 289.277 L
712.458 289.277 L
712.458 283.618 L
713.221 283.618 L
713.221 229.887 L
713.984 229.887 L
713.984 278.625 L
714.747 278.625 L
714.747 100.848 L
715.51 100.848 L
715.51 261.996 L
716.273 261.996 L
716.273 226.01 L
717.036 226.01 L
717.036 362.437 L
717.799 362.437 L
717.799 291.942 L
718.562 291.942 L
718.562 321.573 L
719.325 321.573 L
719.325 297.317 L
720.088 297.317 L
720.088 332.862 L
720.851 332.862 L
720.851 347.315 L
721.614 347.315 L
721.614 229.087 L
722.377 229.087 L
722.377 234.305 L
723.14 234.305 L
723.14 296.368 L
723.903 296.368 L
723.903 290.799 L
724.666 290.799 L
724.666 255.917 L
725.429 255.917 L
725.429 267.175 L
726.192 267.175 L
726.192 329.1 L
726.955 329.1 L
726.955 431.129 L
727.718 431.129 L
727.718 315.349 L
728.481 315.349 L
728.481 373.264 L
729.244 373.264 L
729.244 334.135 L
730.007 334.135 L
730.007 90.15 L
730.77 90.15 L
730.77 354.266 L
731.533 354.266 L
731.533 377.193 L
732.296 377.193 L
732.296 300.884 L
733.059 300.884 L
733.059 403.787 L
733.822 403.787 L
733.822 352.636 L
734.585 352.636 L
734.585 279.004 L
735.348 279.004 L
735.348 284.007 L
736.111 284.007 L
736.111 254.665 L
736.874 254.665 L
736.874 399.727 L
737.637 399.727 L
737.637 221.538 L
738.4 221.538 L
738.4 267.252 L
739.163 267.252 L
739.163 186.668 L
739.926 186.668 L
739.926 343.253 L
740.689 343.253 L
740.689 337.569 L
741.452 337.569 L
741.452 372.768 L
742.215 372.768 L
742.215 298.717 L
742.978 298.717 L
742.978 417.48 L
743.741 417.48 L
743.741 272.157 L
744.504 272.157 L
744.504 322.802 L
745.267 322.802 L
745.267 316.002 L
746.03 316.002 L
746.03 300.216 L
746.793 300.216 L
746.793 264.349 L
747.556 264.349 L
747.556 394.69 L
748.319 394.69 L
748.319 286.035 L
749.082 286.035 L
749.082 291.947 L
749.845 291.947 L
749.845 336.708 L
750.608 336.708 L
750.608 318.163 L
751.371 318.163 L
751.371 372.47 L
752.134 372.47 L
752.134 292.585 L
752.897 292.585 L
752.897 357.345 L
753.66 357.345 L
753.66 311.28 L
754.423 311.28 L
754.423 364.488 L
755.186 364.488 L
755.186 306.372 L
755.949 306.372 L
755.949 383.813 L
756.712 383.813 L
756.712 322.271 L
757.475 322.271 L
757.475 240.153 L
758.238 240.153 L
758.238 274.661 L
759.001 274.661 L
759.001 280.157 L
759.764 280.157 L
759.764 319.192 L
760.527 319.192 L
760.527 237.681 L
761.29 237.681 L
761.29 249.137 L
762.053 249.137 L
762.053 237.883 L
762.816 237.883 L
762.816 311.05 L
763.579 311.05 L
763.579 259.664 L
764.342 259.664 L
764.342 226.563 L
765.105 226.563 L
765.105 315.331 L
765.868 315.331 L
765.868 341.738 L
766.631 341.738 L
766.631 242.936 L
767.394 242.936 L
767.394 275.07 L
768.157 275.07 L
768.157 289.093 L
768.92 289.093 L
768.92 366.554 L
769.683 366.554 L
769.683 318.684 L
770.446 318.684 L
770.446 248.949 L
771.209 248.949 L
771.209 325.725 L
771.972 325.725 L
771.972 286.092 L
772.735 286.092 L
772.735 296.415 L
773.498 296.415 L
773.498 258.151 L
774.261 258.151 L
774.261 368.193 L
775.024 368.193 L
775.024 247.618 L
775.787 247.618 L
775.787 281.951 L
776.55 281.951 L
776.55 298.159 L
777.313 298.159 L
777.313 292.92 L
778.076 292.92 L
778.076 356.338 L
778.839 356.338 L
778.839 308.289 L
779.602 308.289 L
779.602 334.332 L
780.365 334.332 L
780.365 276.488 L
781.128 276.488 L
781.128 327.147 L
781.891 327.147 L
781.891 232.627 L
782.654 232.627 L
782.654 288.061 L
783.417 288.061 L
783.417 295.612 L
784.18 295.612 L
784.18 346.49 L
784.943 346.49 L
784.943 231.617 L
785.706 231.617 L
785.706 239.923 L
786.469 239.923 L
786.469 304.656 L
787.232 304.656 L
787.232 282.337 L
787.995 282.337 L
787.995 181.914 L
788.758 181.914 L
788.758 307.144 L
789.521 307.144 L
789.521 326.964 L
790.284 326.964 L
790.284 323.948 L
791.047 323.948 L
791.047 210.93 L
791.81 210.93 L
791.81 291.625 L
792.573 291.625 L
792.573 288.355 L
793.336 288.355 L
793.336 279.441 L
794.099 279.441 L
794.099 280.986 L
794.862 280.986 L
794.862 404.912 L
795.625 404.912 L
795.625 383.577 L
796.388 383.577 L
796.388 319.158 L
797.151 319.158 L
797.151 285.373 L
797.914 285.373 L
797.914 322.078 L
798.677 322.078 L
798.677 345.833 L
799.44 345.833 L
799.44 389.299 L
800.203 389.299 L
800.203 290.284 L
800.966 290.284 L
800.966 170.286 L
801.729 170.286 L
801.729 299.704 L
802.492 299.704 L
802.492 376.173 L
803.255 376.173 L
803.255 308.201 L
804.018 308.201 L
804.018 312.419 L
804.781 312.419 L
804.781 284.047 L
805.544 284.047 L
805.544 235.842 L
806.307 235.842 L
806.307 294.91 L
807.07 294.91 L
807.07 276.409 L
807.833 276.409 L
807.833 312.751 L
808.596 312.751 L
808.596 329.987 L
809.359 329.987 L
809.359 345.422 L
810.122 345.422 L
810.122 223.024 L
810.885 223.024 L
810.885 251.704 L
811.648 251.704 L
811.648 341.74 L
812.411 341.74 L
812.411 370.094 L
813.174 370.094 L
813.174 211.78 L
813.937 211.78 L
813.937 375.881 L
814.7 375.881 L
814.7 317.873 L
815.463 317.873 L
815.463 320.83 L
816.226 320.83 L
816.226 267.717 L
816.989 267.717 L
816.989 254.7 L
817.752 254.7 L
817.752 270.802 L
818.515 270.802 L
818.515 357.97 L
819.278 357.97 L
819.278 264.348 L
820.041 264.348 L
820.041 349.261 L
820.804 349.261 L
820.804 309.302 L
821.567 309.302 L
821.567 225.698 L
822.33 225.698 L
822.33 272.29 L
823.093 272.29 L
823.093 362.14 L
823.856 362.14 L
823.856 275.777 L
824.619 275.777 L
824.619 268.373 L
825.382 268.373 L
825.382 354.214 L
826.145 354.214 L
826.145 311.359 L
826.908 311.359 L
826.908 255.294 L
827.671 255.294 L
827.671 241.316 L
828.434 241.316 L
828.434 318.693 L
829.197 318.693 L
829.197 255.897 L
829.96 255.897 L
829.96 223.856 L
830.723 223.856 L
830.723 437.785 L
831.486 437.785 L
831.486 356.479 L
832.249 356.479 L
832.249 314.411 L
833.012 314.411 L
833.012 373.439 L
833.775 373.439 L
833.775 373.128 L
834.538 373.128 L
834.538 361.406 L
835.301 361.406 L
835.301 296.755 L
836.064 296.755 L
836.064 339.195 L
836.827 339.195 L
836.827 337.636 L
837.59 337.636 L
837.59 306.865 L
838.353 306.865 L
838.353 171.811 L
839.116 171.811 L
839.116 234.799 L
839.879 234.799 L
839.879 314.025 L
840.642 314.025 L
840.642 262.186 L
841.405 262.186 L
841.405 242.725 L
842.168 242.725 L
842.168 285.134 L
842.931 285.134 L
842.931 365.57 L
843.694 365.57 L
843.694 173.39 L
844.457 173.39 L
844.457 331.037 L
845.22 331.037 L
845.22 288.588 L
845.983 288.588 L
845.983 279.533 L
846.746 279.533 L
846.746 278.243 L
847.509 278.243 L
847.509 348.864 L
848.272 348.864 L
848.272 288.926 L
849.035 288.926 L
849.035 279.012 L
849.798 279.012 L
849.798 349.807 L
850.561 349.807 L
850.561 305.12 L
851.324 305.12 L
851.324 280.153 L
852.087 280.153 L
852.087 331.971 L
852.85 331.971 L
852.85 352.93 L
853.613 352.93 L
853.613 320.305 L
854.376 320.305 L
854.376 282.647 L
855.139 282.647 L
855.139 371.798 L
855.902 371.798 L
855.902 355.3 L
856.665 355.3 L
856.665 363.032 L
857.428 363.032 L
857.428 237.026 L
858.191 237.026 L
858.191 282.666 L
858.954 282.666 L
858.954 260.16 L
859.717 260.16 L
859.717 236.732 L
860.48 236.732 L
860.48 369.227 L
861.243 369.227 L
861.243 328.111 L
862.006 328.111 L
862.006 253.765 L
862.769 253.765 L
862.769 324.619 L
863.532 324.619 L
863.532 175.203 L
864.295 175.203 L
864.295 342.172 L
865.058 342.172 L
865.058 441.778 L
865.821 441.778 L
865.821 333.967 L
866.584 333.967 L
866.584 158.843 L
867.347 158.843 L
867.347 222.588 L
868.11 222.588 L
868.11 332.992 L
868.873 332.992 L
868.873 179.903 L
869.636 179.903 L
869.636 275.004 L
870.399 275.004 L
870.399 270.574 L
871.162 270.574 L
871.162 293.325 L
871.925 293.325 L
871.925 232.919 L
872.688 232.919 L
872.688 317.121 L
873.451 317.121 L
873.451 350.021 L
874.214 350.021 L
874.214 311.072 L
874.977 311.072 L
874.977 347.896 L
875.74 347.896 L
875.74 294.68 L
876.503 294.68 L
876.503 265.7 L
877.266 265.7 L
877.266 337.441 L
878.029 337.441 L
878.029 413.935 L
878.792 413.935 L
878.792 128.43 L
879.555 128.43 L
879.555 340.908 L
880.318 340.908 L
880.318 343.182 L
881.081 343.182 L
881.081 395.574 L
881.844 395.574 L
881.844 223.167 L
882.607 223.167 L
882.607 433.618 L
883.37 433.618 L
883.37 251.718 L
884.133 251.718 L
884.133 283.732 L
884.896 283.732 L
884.896 229.54 L
885.659 229.54 L
885.659 313.202 L
886.422 313.202 L
886.422 260.225 L
887.185 260.225 L
887.185 286.547 L
887.948 286.547 L
887.948 289.978 L
888.711 289.978 L
888.711 325.474 L
889.474 325.474 L
889.474 305.944 L
890.237 305.944 L
890.237 383.659 L
891 383.659 L
891 272.207 L
891.091 272.207 L
S
GR
%%Trailer
%%Pages: 1
%%EOF
