%!PS-Adobe-3.0 EPSF-3.0
%%Creator: (MATLAB, The Mathworks, Inc. Version 9.1.0.441655 \(R2016b\). Operating System: Linux)
%%Title: /home/frdm/Documents/RLS/rls-2017/sp2/figures/f2.eps
%%CreationDate: 2017-11-14T01:54:41
%%Pages: (atend)
%%BoundingBox: 0 0 731 458
%%LanguageLevel: 3
%%EndComments
%%BeginProlog
%%BeginResource: procset (Apache XML Graphics Std ProcSet) 1.2 0
%%Version: 1.2 0
%%Copyright: (Copyright 2001-2003,2010 The Apache Software Foundation. License terms: http://www.apache.org/licenses/LICENSE-2.0)
/bd{bind def}bind def
/ld{load def}bd
/GR/grestore ld
/M/moveto ld
/LJ/setlinejoin ld
/C/curveto ld
/f/fill ld
/LW/setlinewidth ld
/GC/setgray ld
/t/show ld
/N/newpath ld
/CT/concat ld
/cp/closepath ld
/S/stroke ld
/L/lineto ld
/CC/setcmykcolor ld
/A/ashow ld
/GS/gsave ld
/RC/setrgbcolor ld
/RM/rmoveto ld
/ML/setmiterlimit ld
/re {4 2 roll M
1 index 0 rlineto
0 exch rlineto
neg 0 rlineto
cp } bd
/_ctm matrix def
/_tm matrix def
/BT { _ctm currentmatrix pop matrix _tm copy pop 0 0 moveto } bd
/ET { _ctm setmatrix } bd
/iTm { _ctm setmatrix _tm concat } bd
/Tm { _tm astore pop iTm 0 0 moveto } bd
/ux 0.0 def
/uy 0.0 def
/F {
  /Tp exch def
  /Tf exch def
  Tf findfont Tp scalefont setfont
  /cf Tf def  /cs Tp def
} bd
/ULS {currentpoint /uy exch def /ux exch def} bd
/ULE {
  /Tcx currentpoint pop def
  gsave
  newpath
  cf findfont cs scalefont dup
  /FontMatrix get 0 get /Ts exch def /FontInfo get dup
  /UnderlinePosition get Ts mul /To exch def
  /UnderlineThickness get Ts mul /Tt exch def
  ux uy To add moveto  Tcx uy To add lineto
  Tt setlinewidth stroke
  grestore
} bd
/OLE {
  /Tcx currentpoint pop def
  gsave
  newpath
  cf findfont cs scalefont dup
  /FontMatrix get 0 get /Ts exch def /FontInfo get dup
  /UnderlinePosition get Ts mul /To exch def
  /UnderlineThickness get Ts mul /Tt exch def
  ux uy To add cs add moveto Tcx uy To add cs add lineto
  Tt setlinewidth stroke
  grestore
} bd
/SOE {
  /Tcx currentpoint pop def
  gsave
  newpath
  cf findfont cs scalefont dup
  /FontMatrix get 0 get /Ts exch def /FontInfo get dup
  /UnderlinePosition get Ts mul /To exch def
  /UnderlineThickness get Ts mul /Tt exch def
  ux uy To add cs 10 mul 26 idiv add moveto Tcx uy To add cs 10 mul 26 idiv add lineto
  Tt setlinewidth stroke
  grestore
} bd
/QT {
/Y22 exch store
/X22 exch store
/Y21 exch store
/X21 exch store
currentpoint
/Y21 load 2 mul add 3 div exch
/X21 load 2 mul add 3 div exch
/X21 load 2 mul /X22 load add 3 div
/Y21 load 2 mul /Y22 load add 3 div
/X22 load /Y22 load curveto
} bd
/SSPD {
dup length /d exch dict def
{
/v exch def
/k exch def
currentpagedevice k known {
/cpdv currentpagedevice k get def
v cpdv ne {
/upd false def
/nullv v type /nulltype eq def
/nullcpdv cpdv type /nulltype eq def
nullv nullcpdv or
{
/upd true def
} {
/sametype v type cpdv type eq def
sametype {
v type /arraytype eq {
/vlen v length def
/cpdvlen cpdv length def
vlen cpdvlen eq {
0 1 vlen 1 sub {
/i exch def
/obj v i get def
/cpdobj cpdv i get def
obj cpdobj ne {
/upd true def
exit
} if
} for
} {
/upd true def
} ifelse
} {
v type /dicttype eq {
v {
/dv exch def
/dk exch def
/cpddv cpdv dk get def
dv cpddv ne {
/upd true def
exit
} if
} forall
} {
/upd true def
} ifelse
} ifelse
} if
} ifelse
upd true eq {
d k v put
} if
} if
} if
} forall
d length 0 gt {
d setpagedevice
} if
} bd
/RE { % /NewFontName [NewEncodingArray] /FontName RE -
  findfont dup length dict begin
  {
    1 index /FID ne
    {def} {pop pop} ifelse
  } forall
  /Encoding exch def
  /FontName 1 index def
  currentdict definefont pop
  end
} bind def
%%EndResource
%%BeginResource: procset (Apache XML Graphics EPS ProcSet) 1.0 0
%%Version: 1.0 0
%%Copyright: (Copyright 2002-2003 The Apache Software Foundation. License terms: http://www.apache.org/licenses/LICENSE-2.0)
/BeginEPSF { %def
/b4_Inc_state save def         % Save state for cleanup
/dict_count countdictstack def % Count objects on dict stack
/op_count count 1 sub def      % Count objects on operand stack
userdict begin                 % Push userdict on dict stack
/showpage { } def              % Redefine showpage, { } = null proc
0 setgray 0 setlinecap         % Prepare graphics state
1 setlinewidth 0 setlinejoin
10 setmiterlimit [ ] 0 setdash newpath
/languagelevel where           % If level not equal to 1 then
{pop languagelevel             % set strokeadjust and
1 ne                           % overprint to their defaults.
{false setstrokeadjust false setoverprint
} if
} if
} bd
/EndEPSF { %def
count op_count sub {pop} repeat            % Clean up stacks
countdictstack dict_count sub {end} repeat
b4_Inc_state restore
} bd
%%EndResource
%FOPBeginFontDict
%%IncludeResource: font Courier-Bold
%%IncludeResource: font Helvetica
%%IncludeResource: font Courier-BoldOblique
%%IncludeResource: font Courier-Oblique
%%IncludeResource: font Times-Roman
%%IncludeResource: font Helvetica-BoldOblique
%%IncludeResource: font Helvetica-Bold
%%IncludeResource: font Helvetica-Oblique
%%IncludeResource: font Times-BoldItalic
%%IncludeResource: font Courier
%%IncludeResource: font Times-Italic
%%IncludeResource: font Times-Bold
%%IncludeResource: font Symbol
%%IncludeResource: font ZapfDingbats
%FOPEndFontDict
%%BeginResource: encoding WinAnsiEncoding
/WinAnsiEncoding [
/.notdef /.notdef /.notdef /.notdef /.notdef
/.notdef /.notdef /.notdef /.notdef /.notdef
/.notdef /.notdef /.notdef /.notdef /.notdef
/.notdef /.notdef /.notdef /.notdef /.notdef
/.notdef /.notdef /.notdef /.notdef /.notdef
/.notdef /.notdef /.notdef /.notdef /.notdef
/.notdef /.notdef /space /exclam /quotedbl
/numbersign /dollar /percent /ampersand /quotesingle
/parenleft /parenright /asterisk /plus /comma
/hyphen /period /slash /zero /one
/two /three /four /five /six
/seven /eight /nine /colon /semicolon
/less /equal /greater /question /at
/A /B /C /D /E
/F /G /H /I /J
/K /L /M /N /O
/P /Q /R /S /T
/U /V /W /X /Y
/Z /bracketleft /backslash /bracketright /asciicircum
/underscore /quoteleft /a /b /c
/d /e /f /g /h
/i /j /k /l /m
/n /o /p /q /r
/s /t /u /v /w
/x /y /z /braceleft /bar
/braceright /asciitilde /bullet /Euro /bullet
/quotesinglbase /florin /quotedblbase /ellipsis /dagger
/daggerdbl /circumflex /perthousand /Scaron /guilsinglleft
/OE /bullet /Zcaron /bullet /bullet
/quoteleft /quoteright /quotedblleft /quotedblright /bullet
/endash /emdash /asciitilde /trademark /scaron
/guilsinglright /oe /bullet /zcaron /Ydieresis
/space /exclamdown /cent /sterling /currency
/yen /brokenbar /section /dieresis /copyright
/ordfeminine /guillemotleft /logicalnot /sfthyphen /registered
/macron /degree /plusminus /twosuperior /threesuperior
/acute /mu /paragraph /middot /cedilla
/onesuperior /ordmasculine /guillemotright /onequarter /onehalf
/threequarters /questiondown /Agrave /Aacute /Acircumflex
/Atilde /Adieresis /Aring /AE /Ccedilla
/Egrave /Eacute /Ecircumflex /Edieresis /Igrave
/Iacute /Icircumflex /Idieresis /Eth /Ntilde
/Ograve /Oacute /Ocircumflex /Otilde /Odieresis
/multiply /Oslash /Ugrave /Uacute /Ucircumflex
/Udieresis /Yacute /Thorn /germandbls /agrave
/aacute /acircumflex /atilde /adieresis /aring
/ae /ccedilla /egrave /eacute /ecircumflex
/edieresis /igrave /iacute /icircumflex /idieresis
/eth /ntilde /ograve /oacute /ocircumflex
/otilde /odieresis /divide /oslash /ugrave
/uacute /ucircumflex /udieresis /yacute /thorn
/ydieresis
] def
%%EndResource
%FOPBeginFontReencode
/Courier-Bold findfont
dup length dict begin
  {1 index /FID ne {def} {pop pop} ifelse} forall
  /Encoding WinAnsiEncoding def
  currentdict
end
/Courier-Bold exch definefont pop
/Helvetica findfont
dup length dict begin
  {1 index /FID ne {def} {pop pop} ifelse} forall
  /Encoding WinAnsiEncoding def
  currentdict
end
/Helvetica exch definefont pop
/Courier-BoldOblique findfont
dup length dict begin
  {1 index /FID ne {def} {pop pop} ifelse} forall
  /Encoding WinAnsiEncoding def
  currentdict
end
/Courier-BoldOblique exch definefont pop
/Courier-Oblique findfont
dup length dict begin
  {1 index /FID ne {def} {pop pop} ifelse} forall
  /Encoding WinAnsiEncoding def
  currentdict
end
/Courier-Oblique exch definefont pop
/Times-Roman findfont
dup length dict begin
  {1 index /FID ne {def} {pop pop} ifelse} forall
  /Encoding WinAnsiEncoding def
  currentdict
end
/Times-Roman exch definefont pop
/Helvetica-BoldOblique findfont
dup length dict begin
  {1 index /FID ne {def} {pop pop} ifelse} forall
  /Encoding WinAnsiEncoding def
  currentdict
end
/Helvetica-BoldOblique exch definefont pop
/Helvetica-Bold findfont
dup length dict begin
  {1 index /FID ne {def} {pop pop} ifelse} forall
  /Encoding WinAnsiEncoding def
  currentdict
end
/Helvetica-Bold exch definefont pop
/Helvetica-Oblique findfont
dup length dict begin
  {1 index /FID ne {def} {pop pop} ifelse} forall
  /Encoding WinAnsiEncoding def
  currentdict
end
/Helvetica-Oblique exch definefont pop
/Times-BoldItalic findfont
dup length dict begin
  {1 index /FID ne {def} {pop pop} ifelse} forall
  /Encoding WinAnsiEncoding def
  currentdict
end
/Times-BoldItalic exch definefont pop
/Courier findfont
dup length dict begin
  {1 index /FID ne {def} {pop pop} ifelse} forall
  /Encoding WinAnsiEncoding def
  currentdict
end
/Courier exch definefont pop
/Times-Italic findfont
dup length dict begin
  {1 index /FID ne {def} {pop pop} ifelse} forall
  /Encoding WinAnsiEncoding def
  currentdict
end
/Times-Italic exch definefont pop
/Times-Bold findfont
dup length dict begin
  {1 index /FID ne {def} {pop pop} ifelse} forall
  /Encoding WinAnsiEncoding def
  currentdict
end
/Times-Bold exch definefont pop
%FOPEndFontReencode
%%EndProlog
%%Page: 1 1
%%PageBoundingBox: 0 0 731 458
%%BeginPageSetup
[1 0 0 -1 0 458] CT
%%EndPageSetup
GS
[0.75 0 0 0.75 0 -0.25] CT
1 GC
N
0 0 975 611 re
f
GR
GS
[0.75 0 0 0.75 0 -0.25] CT
1 GC
N
0 0 975 611 re
f
GR
GS
[0.75 0 0 0.75 0 -0.25] CT
1 GC
N
127 544 M
882 544 L
882 46 L
127 46 L
cp
f
GR
GS
[0.75 0 0 0.75 0 -0.25] CT
0.149 GC
2 setlinecap
1 LJ
0.667 LW
N
127 544 M
882 544 L
S
GR
GS
[0.75 0 0 0.75 0 -0.25] CT
0.149 GC
2 setlinecap
1 LJ
0.667 LW
N
127 46 M
882 46 L
S
GR
GS
[0.75 0 0 0.75 0 -0.25] CT
0.149 GC
2 setlinecap
1 LJ
0.667 LW
N
127 544 M
127 536.45 L
S
GR
GS
[0.75 0 0 0.75 0 -0.25] CT
0.149 GC
2 setlinecap
1 LJ
0.667 LW
N
257.172 544 M
257.172 536.45 L
S
GR
GS
[0.75 0 0 0.75 0 -0.25] CT
0.149 GC
2 setlinecap
1 LJ
0.667 LW
N
387.345 544 M
387.345 536.45 L
S
GR
GS
[0.75 0 0 0.75 0 -0.25] CT
0.149 GC
2 setlinecap
1 LJ
0.667 LW
N
517.517 544 M
517.517 536.45 L
S
GR
GS
[0.75 0 0 0.75 0 -0.25] CT
0.149 GC
2 setlinecap
1 LJ
0.667 LW
N
647.69 544 M
647.69 536.45 L
S
GR
GS
[0.75 0 0 0.75 0 -0.25] CT
0.149 GC
2 setlinecap
1 LJ
0.667 LW
N
777.862 544 M
777.862 536.45 L
S
GR
GS
[0.75 0 0 0.75 0 -0.25] CT
0.149 GC
2 setlinecap
1 LJ
0.667 LW
N
127 46 M
127 53.55 L
S
GR
GS
[0.75 0 0 0.75 0 -0.25] CT
0.149 GC
2 setlinecap
1 LJ
0.667 LW
N
257.172 46 M
257.172 53.55 L
S
GR
GS
[0.75 0 0 0.75 0 -0.25] CT
0.149 GC
2 setlinecap
1 LJ
0.667 LW
N
387.345 46 M
387.345 53.55 L
S
GR
GS
[0.75 0 0 0.75 0 -0.25] CT
0.149 GC
2 setlinecap
1 LJ
0.667 LW
N
517.517 46 M
517.517 53.55 L
S
GR
GS
[0.75 0 0 0.75 0 -0.25] CT
0.149 GC
2 setlinecap
1 LJ
0.667 LW
N
647.69 46 M
647.69 53.55 L
S
GR
GS
[0.75 0 0 0.75 0 -0.25] CT
0.149 GC
2 setlinecap
1 LJ
0.667 LW
N
777.862 46 M
777.862 53.55 L
S
GR
GS
[0.75 0 0 0.75 95.25 411.74998] CT
0.149 GC
/Helvetica 13.333 F
GS
[1 0 0 1 0 0] CT
-4.5 13 moveto 
1 -1 scale
(0) t 
GR
GR
GS
[0.75 0 0 0.75 192.87932 411.74998] CT
0.149 GC
/Helvetica 13.333 F
GS
[1 0 0 1 0 0] CT
-12.5 13 moveto 
1 -1 scale
(100) t 
GR
GR
GS
[0.75 0 0 0.75 290.50861 411.74998] CT
0.149 GC
/Helvetica 13.333 F
GS
[1 0 0 1 0 0] CT
-12.5 13 moveto 
1 -1 scale
(200) t 
GR
GR
GS
[0.75 0 0 0.75 388.13791 411.74998] CT
0.149 GC
/Helvetica 13.333 F
GS
[1 0 0 1 0 0] CT
-12.5 13 moveto 
1 -1 scale
(300) t 
GR
GR
GS
[0.75 0 0 0.75 485.76723 411.74998] CT
0.149 GC
/Helvetica 13.333 F
GS
[1 0 0 1 0 0] CT
-12.5 13 moveto 
1 -1 scale
(400) t 
GR
GR
GS
[0.75 0 0 0.75 583.39655 411.74998] CT
0.149 GC
/Helvetica 13.333 F
GS
[1 0 0 1 0 0] CT
-12.5 13 moveto 
1 -1 scale
(500) t 
GR
GR
GS
[0.75 0 0 0.75 378.37527 425.50002] CT
0.149 GC
/Helvetica 14.667 F
GS
[1 0 0 1 0 0] CT
-57.5 14 moveto 
1 -1 scale
(Time \(seconds\)) t 
GR
GR
GS
[0.75 0 0 0.75 0 -0.25] CT
0.149 GC
2 setlinecap
1 LJ
0.667 LW
N
127 544 M
127 46 L
S
GR
GS
[0.75 0 0 0.75 0 -0.25] CT
0.149 GC
2 setlinecap
1 LJ
0.667 LW
N
882 544 M
882 46 L
S
GR
GS
[0.75 0 0 0.75 0 -0.25] CT
0.149 GC
2 setlinecap
1 LJ
0.667 LW
N
127 500.696 M
134.55 500.696 L
S
GR
GS
[0.75 0 0 0.75 0 -0.25] CT
0.149 GC
2 setlinecap
1 LJ
0.667 LW
N
127 392.435 M
134.55 392.435 L
S
GR
GS
[0.75 0 0 0.75 0 -0.25] CT
0.149 GC
2 setlinecap
1 LJ
0.667 LW
N
127 284.174 M
134.55 284.174 L
S
GR
GS
[0.75 0 0 0.75 0 -0.25] CT
0.149 GC
2 setlinecap
1 LJ
0.667 LW
N
127 175.913 M
134.55 175.913 L
S
GR
GS
[0.75 0 0 0.75 0 -0.25] CT
0.149 GC
2 setlinecap
1 LJ
0.667 LW
N
127 67.652 M
134.55 67.652 L
S
GR
GS
[0.75 0 0 0.75 0 -0.25] CT
0.149 GC
2 setlinecap
1 LJ
0.667 LW
N
882 500.696 M
874.45 500.696 L
S
GR
GS
[0.75 0 0 0.75 0 -0.25] CT
0.149 GC
2 setlinecap
1 LJ
0.667 LW
N
882 392.435 M
874.45 392.435 L
S
GR
GS
[0.75 0 0 0.75 0 -0.25] CT
0.149 GC
2 setlinecap
1 LJ
0.667 LW
N
882 284.174 M
874.45 284.174 L
S
GR
GS
[0.75 0 0 0.75 0 -0.25] CT
0.149 GC
2 setlinecap
1 LJ
0.667 LW
N
882 175.913 M
874.45 175.913 L
S
GR
GS
[0.75 0 0 0.75 0 -0.25] CT
0.149 GC
2 setlinecap
1 LJ
0.667 LW
N
882 67.652 M
874.45 67.652 L
S
GR
GS
[0.75 0 0 0.75 91.25 375.27174] CT
0.149 GC
/Helvetica 13.333 F
GS
[1 0 0 1 0 0] CT
-9 4.5 moveto 
1 -1 scale
(0) t 
GR
GR
GS
[0.75 0 0 0.75 91.25 294.07609] CT
0.149 GC
/Helvetica 13.333 F
GS
[1 0 0 1 0 0] CT
-21 4.5 moveto 
1 -1 scale
(0.5) t 
GR
GR
GS
[0.75 0 0 0.75 91.25 212.88044] CT
0.149 GC
/Helvetica 13.333 F
GS
[1 0 0 1 0 0] CT
-9 4.5 moveto 
1 -1 scale
(1) t 
GR
GR
GS
[0.75 0 0 0.75 91.25 131.68478] CT
0.149 GC
/Helvetica 13.333 F
GS
[1 0 0 1 0 0] CT
-21 4.5 moveto 
1 -1 scale
(1.5) t 
GR
GR
GS
[0.75 0 0 0.75 91.25 50.48913] CT
0.149 GC
/Helvetica 13.333 F
GS
[1 0 0 1 0 0] CT
-9 4.5 moveto 
1 -1 scale
(2) t 
GR
GR
GS
[0.75 0 0 0.75 378.37537 32.18752] CT
N
-161.016 -14.594 M
-161.016 -12.281 L
-161.906 -12.672 -162.766 -12.883 QT
-163.625 -13.094 -164.391 -13.094 QT
-165.406 -13.094 -165.883 -12.813 QT
-166.359 -12.531 -166.359 -11.953 QT
-166.359 -11.5 -166.039 -11.258 QT
-165.719 -11.016 -164.859 -10.844 QT
-163.656 -10.594 L
-161.828 -10.234 -161.063 -9.484 QT
-160.297 -8.734 -160.297 -7.359 QT
-160.297 -5.547 -161.367 -4.664 QT
-162.438 -3.781 -164.641 -3.781 QT
-165.688 -3.781 -166.734 -3.984 QT
-167.781 -4.188 -168.828 -4.578 QT
-168.828 -6.953 L
-167.781 -6.391 -166.805 -6.109 QT
-165.828 -5.828 -164.922 -5.828 QT
-164 -5.828 -163.508 -6.141 QT
-163.016 -6.453 -163.016 -7.016 QT
-163.016 -7.531 -163.344 -7.813 QT
-163.672 -8.094 -164.672 -8.313 QT
-165.766 -8.547 L
-167.406 -8.906 -168.164 -9.672 QT
-168.922 -10.438 -168.922 -11.734 QT
-168.922 -13.375 -167.867 -14.258 QT
-166.813 -15.141 -164.844 -15.141 QT
-163.938 -15.141 -162.984 -15 QT
-162.031 -14.859 -161.016 -14.594 QT
cp
-155.319 -14.531 M
-155.319 -12.203 L
-152.616 -12.203 L
-152.616 -10.328 L
-155.319 -10.328 L
-155.319 -6.844 L
-155.319 -6.281 -155.093 -6.078 QT
-154.866 -5.875 -154.194 -5.875 QT
-152.851 -5.875 L
-152.851 -4 L
-155.101 -4 L
-156.647 -4 -157.296 -4.648 QT
-157.944 -5.297 -157.944 -6.844 QT
-157.944 -10.328 L
-159.241 -10.328 L
-159.241 -12.203 L
-157.944 -12.203 L
-157.944 -14.531 L
-155.319 -14.531 L
cp
-147.501 -7.688 M
-148.329 -7.688 -148.743 -7.414 QT
-149.157 -7.141 -149.157 -6.594 QT
-149.157 -6.094 -148.821 -5.813 QT
-148.485 -5.531 -147.891 -5.531 QT
-147.157 -5.531 -146.649 -6.063 QT
-146.141 -6.594 -146.141 -7.391 QT
-146.141 -7.688 L
-147.501 -7.688 L
cp
-143.501 -8.688 M
-143.501 -4 L
-146.141 -4 L
-146.141 -5.219 L
-146.673 -4.469 -147.329 -4.125 QT
-147.985 -3.781 -148.923 -3.781 QT
-150.204 -3.781 -151.001 -4.531 QT
-151.798 -5.281 -151.798 -6.469 QT
-151.798 -7.906 -150.805 -8.578 QT
-149.813 -9.25 -147.688 -9.25 QT
-146.141 -9.25 L
-146.141 -9.453 L
-146.141 -10.078 -146.634 -10.367 QT
-147.126 -10.656 -148.157 -10.656 QT
-149.001 -10.656 -149.727 -10.492 QT
-150.454 -10.328 -151.079 -9.984 QT
-151.079 -11.984 L
-150.235 -12.188 -149.384 -12.297 QT
-148.532 -12.406 -147.688 -12.406 QT
-145.47 -12.406 -144.485 -11.531 QT
-143.501 -10.656 -143.501 -8.688 QT
cp
-142.314 -12.203 M
-139.704 -12.203 L
-137.658 -6.531 L
-135.626 -12.203 L
-132.986 -12.203 L
-136.22 -4 L
-139.095 -4 L
-142.314 -12.203 L
cp
-127.838 -10.531 M
-128.698 -10.531 -129.158 -9.906 QT
-129.619 -9.281 -129.619 -8.094 QT
-129.619 -6.922 -129.158 -6.289 QT
-128.698 -5.656 -127.838 -5.656 QT
-126.979 -5.656 -126.526 -6.289 QT
-126.073 -6.922 -126.073 -8.094 QT
-126.073 -9.281 -126.526 -9.906 QT
-126.979 -10.531 -127.838 -10.531 QT
cp
-127.838 -12.406 M
-125.713 -12.406 -124.526 -11.258 QT
-123.338 -10.109 -123.338 -8.094 QT
-123.338 -6.078 -124.526 -4.93 QT
-125.713 -3.781 -127.838 -3.781 QT
-129.948 -3.781 -131.151 -4.93 QT
-132.354 -6.078 -132.354 -8.094 QT
-132.354 -10.109 -131.151 -11.258 QT
-129.948 -12.406 -127.838 -12.406 QT
cp
-122.691 -12.203 M
-120.082 -12.203 L
-118.035 -6.531 L
-116.004 -12.203 L
-113.363 -12.203 L
-116.597 -4 L
-119.472 -4 L
-122.691 -12.203 L
cp
-113.184 -12.203 M
-110.559 -12.203 L
-108.356 -6.641 L
-106.481 -12.203 L
-103.872 -12.203 L
-107.309 -3.219 L
-107.84 -1.859 -108.528 -1.313 QT
-109.215 -0.766 -110.356 -0.766 QT
-111.872 -0.766 L
-111.872 -2.484 L
-111.044 -2.484 L
-110.387 -2.484 -110.083 -2.695 QT
-109.778 -2.906 -109.606 -3.453 QT
-109.528 -3.688 L
-113.184 -12.203 L
cp
-107.637 -16 M
-105.559 -16 L
-108.262 -13.25 L
-109.7 -13.25 L
-107.637 -16 L
cp
-91.356 -9.969 M
-91.7 -10.125 -92.044 -10.203 QT
-92.387 -10.281 -92.731 -10.281 QT
-93.747 -10.281 -94.294 -9.633 QT
-94.84 -8.984 -94.84 -7.781 QT
-94.84 -4 L
-97.45 -4 L
-97.45 -12.203 L
-94.84 -12.203 L
-94.84 -10.859 L
-94.325 -11.656 -93.669 -12.031 QT
-93.012 -12.406 -92.106 -12.406 QT
-91.965 -12.406 -91.817 -12.391 QT
-91.669 -12.375 -91.372 -12.344 QT
-91.356 -9.969 L
cp
-82.034 -8.125 M
-82.034 -7.375 L
-88.175 -7.375 L
-88.081 -6.453 -87.503 -5.992 QT
-86.925 -5.531 -85.909 -5.531 QT
-85.081 -5.531 -84.214 -5.773 QT
-83.347 -6.016 -82.425 -6.516 QT
-82.425 -4.5 L
-83.362 -4.141 -84.292 -3.961 QT
-85.222 -3.781 -86.144 -3.781 QT
-88.378 -3.781 -89.612 -4.914 QT
-90.847 -6.047 -90.847 -8.094 QT
-90.847 -10.094 -89.636 -11.25 QT
-88.425 -12.406 -86.3 -12.406 QT
-84.362 -12.406 -83.198 -11.242 QT
-82.034 -10.078 -82.034 -8.125 QT
cp
-84.737 -9 M
-84.737 -9.75 -85.175 -10.203 QT
-85.612 -10.656 -86.316 -10.656 QT
-87.066 -10.656 -87.542 -10.227 QT
-88.019 -9.797 -88.144 -9 QT
-84.737 -9 L
cp
-74.703 -5.391 M
-75.25 -4.672 -75.899 -4.336 QT
-76.547 -4 -77.407 -4 QT
-78.907 -4 -79.891 -5.18 QT
-80.875 -6.359 -80.875 -8.203 QT
-80.875 -10.031 -79.891 -11.211 QT
-78.907 -12.391 -77.407 -12.391 QT
-76.547 -12.391 -75.899 -12.055 QT
-75.25 -11.719 -74.703 -10.984 QT
-74.703 -12.203 L
-72.063 -12.203 L
-72.063 -4.828 L
-72.063 -2.844 -73.313 -1.805 QT
-74.563 -0.766 -76.938 -0.766 QT
-77.703 -0.766 -78.422 -0.883 QT
-79.141 -1 -79.875 -1.234 QT
-79.875 -3.281 L
-79.188 -2.891 -78.524 -2.695 QT
-77.86 -2.5 -77.203 -2.5 QT
-75.907 -2.5 -75.305 -3.063 QT
-74.703 -3.625 -74.703 -4.828 QT
-74.703 -5.391 L
cp
-76.438 -10.5 M
-77.25 -10.5 -77.703 -9.898 QT
-78.157 -9.297 -78.157 -8.203 QT
-78.157 -7.063 -77.719 -6.484 QT
-77.282 -5.906 -76.438 -5.906 QT
-75.61 -5.906 -75.157 -6.508 QT
-74.703 -7.109 -74.703 -8.203 QT
-74.703 -9.297 -75.157 -9.898 QT
-75.61 -10.5 -76.438 -10.5 QT
cp
-69.884 -7.188 M
-69.884 -12.203 L
-67.243 -12.203 L
-67.243 -11.391 L
-67.243 -10.719 -67.251 -9.711 QT
-67.259 -8.703 -67.259 -8.359 QT
-67.259 -7.375 -67.212 -6.938 QT
-67.165 -6.5 -67.04 -6.313 QT
-66.868 -6.047 -66.611 -5.906 QT
-66.353 -5.766 -66.009 -5.766 QT
-65.197 -5.766 -64.728 -6.398 QT
-64.259 -7.031 -64.259 -8.156 QT
-64.259 -12.203 L
-61.634 -12.203 L
-61.634 -4 L
-64.259 -4 L
-64.259 -5.188 L
-64.853 -4.469 -65.517 -4.125 QT
-66.181 -3.781 -66.978 -3.781 QT
-68.4 -3.781 -69.142 -4.656 QT
-69.884 -5.531 -69.884 -7.188 QT
cp
-59.356 -15.391 M
-56.747 -15.391 L
-56.747 -4 L
-59.356 -4 L
-59.356 -15.391 L
cp
-50.661 -7.688 M
-51.489 -7.688 -51.903 -7.414 QT
-52.317 -7.141 -52.317 -6.594 QT
-52.317 -6.094 -51.981 -5.813 QT
-51.645 -5.531 -51.051 -5.531 QT
-50.317 -5.531 -49.809 -6.063 QT
-49.301 -6.594 -49.301 -7.391 QT
-49.301 -7.688 L
-50.661 -7.688 L
cp
-46.661 -8.688 M
-46.661 -4 L
-49.301 -4 L
-49.301 -5.219 L
-49.833 -4.469 -50.489 -4.125 QT
-51.145 -3.781 -52.083 -3.781 QT
-53.364 -3.781 -54.161 -4.531 QT
-54.958 -5.281 -54.958 -6.469 QT
-54.958 -7.906 -53.965 -8.578 QT
-52.973 -9.25 -50.848 -9.25 QT
-49.301 -9.25 L
-49.301 -9.453 L
-49.301 -10.078 -49.794 -10.367 QT
-50.286 -10.656 -51.317 -10.656 QT
-52.161 -10.656 -52.887 -10.492 QT
-53.614 -10.328 -54.239 -9.984 QT
-54.239 -11.984 L
-53.395 -12.188 -52.544 -12.297 QT
-51.692 -12.406 -50.848 -12.406 QT
-48.629 -12.406 -47.645 -11.531 QT
-46.661 -10.656 -46.661 -8.688 QT
cp
-49.864 -16 M
-47.786 -16 L
-50.489 -13.25 L
-51.926 -13.25 L
-49.864 -16 L
cp
-41.583 -14.531 M
-41.583 -12.203 L
-38.88 -12.203 L
-38.88 -10.328 L
-41.583 -10.328 L
-41.583 -6.844 L
-41.583 -6.281 -41.357 -6.078 QT
-41.13 -5.875 -40.458 -5.875 QT
-39.114 -5.875 L
-39.114 -4 L
-41.364 -4 L
-42.911 -4 -43.56 -4.648 QT
-44.208 -5.297 -44.208 -6.844 QT
-44.208 -10.328 L
-45.505 -10.328 L
-45.505 -12.203 L
-44.208 -12.203 L
-44.208 -14.531 L
-41.583 -14.531 L
cp
-33.546 -10.531 M
-34.405 -10.531 -34.866 -9.906 QT
-35.327 -9.281 -35.327 -8.094 QT
-35.327 -6.922 -34.866 -6.289 QT
-34.405 -5.656 -33.546 -5.656 QT
-32.686 -5.656 -32.233 -6.289 QT
-31.78 -6.922 -31.78 -8.094 QT
-31.78 -9.281 -32.233 -9.906 QT
-32.686 -10.531 -33.546 -10.531 QT
cp
-33.546 -12.406 M
-31.421 -12.406 -30.233 -11.258 QT
-29.046 -10.109 -29.046 -8.094 QT
-29.046 -6.078 -30.233 -4.93 QT
-31.421 -3.781 -33.546 -3.781 QT
-35.655 -3.781 -36.858 -4.93 QT
-38.061 -6.078 -38.061 -8.094 QT
-38.061 -10.109 -36.858 -11.258 QT
-35.655 -12.406 -33.546 -12.406 QT
cp
-21.274 -9.969 M
-21.617 -10.125 -21.961 -10.203 QT
-22.305 -10.281 -22.649 -10.281 QT
-23.664 -10.281 -24.211 -9.633 QT
-24.758 -8.984 -24.758 -7.781 QT
-24.758 -4 L
-27.367 -4 L
-27.367 -12.203 L
-24.758 -12.203 L
-24.758 -10.859 L
-24.242 -11.656 -23.586 -12.031 QT
-22.93 -12.406 -22.024 -12.406 QT
-21.883 -12.406 -21.735 -12.391 QT
-21.586 -12.375 -21.289 -12.344 QT
-21.274 -9.969 L
cp
-8.631 -11.953 M
-8.631 -9.953 L
-9.474 -10.313 -10.256 -10.484 QT
-11.037 -10.656 -11.74 -10.656 QT
-12.49 -10.656 -12.849 -10.469 QT
-13.209 -10.281 -13.209 -9.891 QT
-13.209 -9.578 -12.935 -9.414 QT
-12.662 -9.25 -11.959 -9.156 QT
-11.49 -9.094 L
-9.474 -8.844 -8.779 -8.258 QT
-8.084 -7.672 -8.084 -6.422 QT
-8.084 -5.109 -9.053 -4.445 QT
-10.021 -3.781 -11.943 -3.781 QT
-12.756 -3.781 -13.623 -3.914 QT
-14.49 -4.047 -15.396 -4.297 QT
-15.396 -6.297 L
-14.615 -5.906 -13.795 -5.719 QT
-12.974 -5.531 -12.115 -5.531 QT
-11.349 -5.531 -10.959 -5.742 QT
-10.568 -5.953 -10.568 -6.375 QT
-10.568 -6.719 -10.842 -6.891 QT
-11.115 -7.063 -11.912 -7.172 QT
-12.365 -7.219 L
-14.115 -7.438 -14.818 -8.031 QT
-15.521 -8.625 -15.521 -9.844 QT
-15.521 -11.141 -14.631 -11.773 QT
-13.74 -12.406 -11.896 -12.406 QT
-11.162 -12.406 -10.365 -12.297 QT
-9.568 -12.188 -8.631 -11.953 QT
cp
-1.211 -15.391 M
1.399 -15.391 L
1.399 -9.188 L
4.43 -12.203 L
7.477 -12.203 L
3.461 -8.438 L
7.789 -4 L
4.602 -4 L
1.399 -7.422 L
1.399 -4 L
-1.211 -4 L
-1.211 -15.391 L
cp
12.427 -10.531 M
11.567 -10.531 11.106 -9.906 QT
10.645 -9.281 10.645 -8.094 QT
10.645 -6.922 11.106 -6.289 QT
11.567 -5.656 12.427 -5.656 QT
13.286 -5.656 13.739 -6.289 QT
14.192 -6.922 14.192 -8.094 QT
14.192 -9.281 13.739 -9.906 QT
13.286 -10.531 12.427 -10.531 QT
cp
12.427 -12.406 M
14.552 -12.406 15.739 -11.258 QT
16.927 -10.109 16.927 -8.094 QT
16.927 -6.078 15.739 -4.93 QT
14.552 -3.781 12.427 -3.781 QT
10.317 -3.781 9.114 -4.93 QT
7.911 -6.078 7.911 -8.094 QT
7.911 -10.109 9.114 -11.258 QT
10.317 -12.406 12.427 -12.406 QT
cp
26.199 -10.844 M
26.699 -11.609 27.386 -12.008 QT
28.074 -12.406 28.886 -12.406 QT
30.308 -12.406 31.043 -11.531 QT
31.777 -10.656 31.777 -9 QT
31.777 -4 L
29.152 -4 L
29.152 -8.281 L
29.152 -8.375 29.16 -8.477 QT
29.168 -8.578 29.168 -8.766 QT
29.168 -9.641 28.91 -10.031 QT
28.652 -10.422 28.074 -10.422 QT
27.324 -10.422 26.918 -9.805 QT
26.511 -9.188 26.496 -8.031 QT
26.496 -4 L
23.871 -4 L
23.871 -8.281 L
23.871 -9.641 23.636 -10.031 QT
23.402 -10.422 22.793 -10.422 QT
22.043 -10.422 21.629 -9.805 QT
21.215 -9.188 21.215 -8.031 QT
21.215 -4 L
18.59 -4 L
18.59 -12.203 L
21.215 -12.203 L
21.215 -11 L
21.699 -11.703 22.332 -12.055 QT
22.965 -12.406 23.715 -12.406 QT
24.558 -12.406 25.215 -11.992 QT
25.871 -11.578 26.199 -10.844 QT
cp
36.486 -5.188 M
36.486 -0.875 L
33.877 -0.875 L
33.877 -12.203 L
36.486 -12.203 L
36.486 -11 L
37.033 -11.719 37.697 -12.063 QT
38.361 -12.406 39.205 -12.406 QT
40.721 -12.406 41.697 -11.195 QT
42.674 -9.984 42.674 -8.094 QT
42.674 -6.203 41.697 -4.992 QT
40.721 -3.781 39.205 -3.781 QT
38.361 -3.781 37.697 -4.125 QT
37.033 -4.469 36.486 -5.188 QT
cp
38.236 -10.5 M
37.392 -10.5 36.939 -9.883 QT
36.486 -9.266 36.486 -8.094 QT
36.486 -6.938 36.939 -6.313 QT
37.392 -5.688 38.236 -5.688 QT
39.08 -5.688 39.525 -6.305 QT
39.971 -6.922 39.971 -8.094 QT
39.971 -9.266 39.525 -9.883 QT
39.08 -10.5 38.236 -10.5 QT
cp
52.556 -8.125 M
52.556 -7.375 L
46.415 -7.375 L
46.509 -6.453 47.087 -5.992 QT
47.665 -5.531 48.681 -5.531 QT
49.509 -5.531 50.376 -5.773 QT
51.243 -6.016 52.165 -6.516 QT
52.165 -4.5 L
51.227 -4.141 50.298 -3.961 QT
49.368 -3.781 48.446 -3.781 QT
46.212 -3.781 44.977 -4.914 QT
43.743 -6.047 43.743 -8.094 QT
43.743 -10.094 44.954 -11.25 QT
46.165 -12.406 48.29 -12.406 QT
50.227 -12.406 51.392 -11.242 QT
52.556 -10.078 52.556 -8.125 QT
cp
49.852 -9 M
49.852 -9.75 49.415 -10.203 QT
48.977 -10.656 48.274 -10.656 QT
47.524 -10.656 47.048 -10.227 QT
46.571 -9.797 46.446 -9 QT
49.852 -9 L
cp
62.543 -9 M
62.543 -4 L
59.918 -4 L
59.918 -4.813 L
59.918 -7.828 L
59.918 -8.891 59.871 -9.289 QT
59.824 -9.688 59.699 -9.875 QT
59.543 -10.141 59.285 -10.281 QT
59.027 -10.422 58.683 -10.422 QT
57.855 -10.422 57.386 -9.789 QT
56.918 -9.156 56.918 -8.031 QT
56.918 -4 L
54.308 -4 L
54.308 -12.203 L
56.918 -12.203 L
56.918 -11 L
57.511 -11.719 58.183 -12.063 QT
58.855 -12.406 59.652 -12.406 QT
61.074 -12.406 61.808 -11.531 QT
62.543 -10.656 62.543 -9 QT
cp
64.336 -12.203 M
71.492 -12.203 L
71.492 -10.375 L
67.164 -5.875 L
71.492 -5.875 L
71.492 -4 L
64.149 -4 L
64.149 -5.828 L
68.477 -10.328 L
64.336 -10.328 L
64.336 -12.203 L
cp
76.945 -7.688 M
76.116 -7.688 75.702 -7.414 QT
75.288 -7.141 75.288 -6.594 QT
75.288 -6.094 75.624 -5.813 QT
75.96 -5.531 76.554 -5.531 QT
77.288 -5.531 77.796 -6.063 QT
78.304 -6.594 78.304 -7.391 QT
78.304 -7.688 L
76.945 -7.688 L
cp
80.945 -8.688 M
80.945 -4 L
78.304 -4 L
78.304 -5.219 L
77.773 -4.469 77.116 -4.125 QT
76.46 -3.781 75.523 -3.781 QT
74.241 -3.781 73.445 -4.531 QT
72.648 -5.281 72.648 -6.469 QT
72.648 -7.906 73.64 -8.578 QT
74.632 -9.25 76.757 -9.25 QT
78.304 -9.25 L
78.304 -9.453 L
78.304 -10.078 77.812 -10.367 QT
77.32 -10.656 76.288 -10.656 QT
75.445 -10.656 74.718 -10.492 QT
73.991 -10.328 73.366 -9.984 QT
73.366 -11.984 L
74.21 -12.188 75.062 -12.297 QT
75.913 -12.406 76.757 -12.406 QT
78.976 -12.406 79.96 -11.531 QT
80.945 -10.656 80.945 -8.688 QT
cp
89.788 -11.953 M
89.788 -9.813 L
89.257 -10.172 88.717 -10.352 QT
88.178 -10.531 87.6 -10.531 QT
86.491 -10.531 85.882 -9.891 QT
85.272 -9.25 85.272 -8.094 QT
85.272 -6.938 85.882 -6.297 QT
86.491 -5.656 87.6 -5.656 QT
88.21 -5.656 88.764 -5.844 QT
89.319 -6.031 89.788 -6.391 QT
89.788 -4.234 L
89.163 -4.016 88.53 -3.898 QT
87.897 -3.781 87.272 -3.781 QT
85.053 -3.781 83.796 -4.922 QT
82.538 -6.063 82.538 -8.094 QT
82.538 -10.125 83.796 -11.266 QT
85.053 -12.406 87.272 -12.406 QT
87.913 -12.406 88.538 -12.289 QT
89.163 -12.172 89.788 -11.953 QT
cp
86.757 -13.25 M
84.882 -16 L
86.194 -16 L
87.647 -14.328 L
89.1 -16 L
90.413 -16 L
88.538 -13.25 L
86.757 -13.25 L
cp
100.085 -9 M
100.085 -4 L
97.46 -4 L
97.46 -4.813 L
97.46 -7.828 L
97.46 -8.891 97.413 -9.289 QT
97.366 -9.688 97.241 -9.875 QT
97.085 -10.141 96.827 -10.281 QT
96.569 -10.422 96.226 -10.422 QT
95.397 -10.422 94.929 -9.789 QT
94.46 -9.156 94.46 -8.031 QT
94.46 -4 L
91.851 -4 L
91.851 -12.203 L
94.46 -12.203 L
94.46 -11 L
95.054 -11.719 95.726 -12.063 QT
96.397 -12.406 97.194 -12.406 QT
98.616 -12.406 99.351 -11.531 QT
100.085 -10.656 100.085 -9 QT
cp
102.285 -12.203 M
104.894 -12.203 L
104.894 -4 L
102.285 -4 L
102.285 -12.203 L
cp
104.753 -16 M
106.831 -16 L
104.128 -13.25 L
102.691 -13.25 L
104.753 -16 L
cp
120.005 -10.844 M
120.505 -11.609 121.192 -12.008 QT
121.88 -12.406 122.692 -12.406 QT
124.114 -12.406 124.848 -11.531 QT
125.583 -10.656 125.583 -9 QT
125.583 -4 L
122.958 -4 L
122.958 -8.281 L
122.958 -8.375 122.966 -8.477 QT
122.973 -8.578 122.973 -8.766 QT
122.973 -9.641 122.716 -10.031 QT
122.458 -10.422 121.88 -10.422 QT
121.13 -10.422 120.723 -9.805 QT
120.317 -9.188 120.301 -8.031 QT
120.301 -4 L
117.676 -4 L
117.676 -8.281 L
117.676 -9.641 117.442 -10.031 QT
117.208 -10.422 116.598 -10.422 QT
115.848 -10.422 115.434 -9.805 QT
115.02 -9.188 115.02 -8.031 QT
115.02 -4 L
112.395 -4 L
112.395 -12.203 L
115.02 -12.203 L
115.02 -11 L
115.505 -11.703 116.137 -12.055 QT
116.77 -12.406 117.52 -12.406 QT
118.364 -12.406 119.02 -11.992 QT
119.676 -11.578 120.005 -10.844 QT
cp
131.354 -7.688 M
130.526 -7.688 130.112 -7.414 QT
129.698 -7.141 129.698 -6.594 QT
129.698 -6.094 130.034 -5.813 QT
130.37 -5.531 130.964 -5.531 QT
131.698 -5.531 132.206 -6.063 QT
132.714 -6.594 132.714 -7.391 QT
132.714 -7.688 L
131.354 -7.688 L
cp
135.354 -8.688 M
135.354 -4 L
132.714 -4 L
132.714 -5.219 L
132.183 -4.469 131.526 -4.125 QT
130.87 -3.781 129.933 -3.781 QT
128.651 -3.781 127.854 -4.531 QT
127.058 -5.281 127.058 -6.469 QT
127.058 -7.906 128.05 -8.578 QT
129.042 -9.25 131.167 -9.25 QT
132.714 -9.25 L
132.714 -9.453 L
132.714 -10.078 132.222 -10.367 QT
131.729 -10.656 130.698 -10.656 QT
129.854 -10.656 129.128 -10.492 QT
128.401 -10.328 127.776 -9.984 QT
127.776 -11.984 L
128.62 -12.188 129.472 -12.297 QT
130.323 -12.406 131.167 -12.406 QT
133.386 -12.406 134.37 -11.531 QT
135.354 -10.656 135.354 -8.688 QT
cp
140.432 -14.531 M
140.432 -12.203 L
143.135 -12.203 L
143.135 -10.328 L
140.432 -10.328 L
140.432 -6.844 L
140.432 -6.281 140.659 -6.078 QT
140.885 -5.875 141.557 -5.875 QT
142.901 -5.875 L
142.901 -4 L
140.651 -4 L
139.104 -4 138.455 -4.648 QT
137.807 -5.297 137.807 -6.844 QT
137.807 -10.328 L
136.51 -10.328 L
136.51 -12.203 L
137.807 -12.203 L
137.807 -14.531 L
140.432 -14.531 L
cp
144.579 -12.203 M
147.188 -12.203 L
147.188 -4 L
144.579 -4 L
144.579 -12.203 L
cp
144.579 -15.391 M
147.188 -15.391 L
147.188 -13.266 L
144.579 -13.266 L
144.579 -15.391 L
cp
156.228 -11.953 M
156.228 -9.813 L
155.696 -10.172 155.157 -10.352 QT
154.618 -10.531 154.04 -10.531 QT
152.931 -10.531 152.321 -9.891 QT
151.712 -9.25 151.712 -8.094 QT
151.712 -6.938 152.321 -6.297 QT
152.931 -5.656 154.04 -5.656 QT
154.649 -5.656 155.204 -5.844 QT
155.759 -6.031 156.228 -6.391 QT
156.228 -4.234 L
155.603 -4.016 154.97 -3.898 QT
154.337 -3.781 153.712 -3.781 QT
151.493 -3.781 150.235 -4.922 QT
148.978 -6.063 148.978 -8.094 QT
148.978 -10.125 150.235 -11.266 QT
151.493 -12.406 153.712 -12.406 QT
154.353 -12.406 154.978 -12.289 QT
155.603 -12.172 156.228 -11.953 QT
cp
158.29 -12.203 M
160.9 -12.203 L
160.9 -4 L
158.29 -4 L
158.29 -12.203 L
cp
160.759 -16 M
162.837 -16 L
160.134 -13.25 L
158.697 -13.25 L
160.759 -16 L
cp
f
GR
GS
[0.75 0 0 0.75 0 -0.25] CT
0 0.447 0.741 RC
1 LJ
0.667 LW
N
127 479.043 M
127.927 477.705 L
132.023 474.588 L
136.078 474.156 L
140.838 475.155 L
146.36 477.087 L
152.945 479.617 L
161.009 482.543 L
171.257 485.758 L
184.871 489.19 L
192.086 490.677 L
192.086 490.677 L
196.212 484.766 L
200.338 466.443 L
205.103 439.103 L
211.118 402.546 L
218.121 362.008 L
224.35 329.59 L
230.58 301.878 L
238.558 271.425 L
248.29 240.3 L
260.862 207.893 L
275.962 178.038 L
283.207 166.512 L
287.673 158.824 L
292.139 152.429 L
298.113 145.178 L
305.034 138.049 L
309.241 134.221 L
315.237 129.071 L
321.232 123.191 L
329.093 115.755 L
338.562 107.86 L
350.723 99.509 L
361.31 93.652 L
365.776 92.857 L
370.242 91.467 L
376.217 89.293 L
383.138 86.774 L
391.674 83.947 L
400.362 81.46 L
414.987 78.082 L
430.087 75.458 L
439.414 74.178 L
443.88 74.983 L
448.345 75.062 L
454.32 74.666 L
461.241 73.967 L
469.782 73.076 L
480.584 72.078 L
491.483 71.245 L
497.227 71.062 L
502.971 72.142 L
510.751 74.145 L
517.517 75.89 L
522.119 75.628 L
526.721 76.092 L
532.715 77.129 L
539.703 78.488 L
548.322 80.076 L
559.245 81.805 L
573.716 83.622 L
582.603 84.513 L
588.468 84.81 L
594.333 83.802 L
595.621 83.51 L
602.059 81.939 L
611.991 79.571 L
623.905 77.157 L
639.005 74.768 L
654.105 72.978 L
669.205 71.637 L
673.724 71.306 L
688.824 70.386 L
703.924 69.698 L
719.024 69.183 L
734.124 68.798 L
749.224 68.509 L
751.828 68.467 L
764.845 68.287 L
779.945 68.127 L
795.045 68.008 L
810.145 67.918 L
825.245 67.851 L
829.931 67.834 L
845.031 67.788 L
855.966 67.763 L
871.065 67.735 L
882 67.719 L
S
GR
GS
[0.75 0 0 0.75 0 -0.25] CT
0.851 0.325 0.098 RC
1 LJ
0.667 LW
N
127 479.043 M
127.927 477.893 L
132.023 475.514 L
136.078 475.571 L
140.838 476.861 L
146.36 478.878 L
152.945 481.331 L
161.009 484.07 L
171.257 487.032 L
184.871 490.175 L
192.086 491.536 L
192.086 491.536 L
196.212 481.78 L
200.338 472.845 L
205.103 463.548 L
211.118 453.178 L
218.121 442.683 L
224.35 435.1 L
230.58 428.023 L
238.558 419.957 L
248.29 411.591 L
260.862 402.84 L
275.962 394.771 L
283.207 391.655 L
287.673 389.642 L
292.139 386.958 L
298.113 383.186 L
305.034 379.063 L
309.241 376.766 L
315.237 373.217 L
321.232 370.404 L
329.093 367.346 L
338.562 364.296 L
350.723 361.132 L
361.31 358.923 L
365.776 358.416 L
370.242 358.787 L
376.217 359.758 L
383.138 361.014 L
391.674 362.456 L
400.362 363.728 L
414.987 365.454 L
430.087 366.795 L
439.414 367.449 L
443.88 368.02 L
448.345 369.382 L
454.32 371.552 L
461.241 374.035 L
469.782 376.783 L
480.584 379.708 L
491.483 382.11 L
497.227 383.734 L
502.971 384.845 L
510.751 385.984 L
517.517 386.792 L
522.119 386.951 L
526.721 386.227 L
532.715 384.862 L
539.703 383.205 L
548.322 381.343 L
559.245 379.352 L
573.716 377.274 L
582.603 376.256 L
588.468 375.121 L
594.333 374.459 L
595.621 374.345 L
602.059 373.869 L
611.991 373.31 L
623.905 372.788 L
639.005 372.283 L
654.105 371.905 L
669.205 371.622 L
673.724 371.553 L
688.824 371.359 L
703.924 371.214 L
719.024 371.105 L
734.124 371.024 L
749.224 370.963 L
751.828 370.954 L
764.845 370.916 L
779.945 370.883 L
795.045 370.858 L
810.145 370.839 L
825.245 370.825 L
829.931 370.821 L
845.031 370.811 L
855.966 370.806 L
871.065 370.8 L
882 370.797 L
S
GR
GS
[0.75 0 0 0.75 0 -0.25] CT
0.929 0.694 0.125 RC
1 LJ
0.667 LW
N
127 500.696 M
127.927 500.696 L
132.023 500.696 L
136.078 500.696 L
140.838 500.696 L
146.36 500.696 L
152.945 500.696 L
161.009 500.696 L
171.257 500.696 L
184.871 500.696 L
192.086 500.696 L
192.086 67.652 L
196.212 67.652 L
200.338 67.652 L
205.103 67.652 L
211.118 67.652 L
218.121 67.652 L
224.35 67.652 L
230.58 67.652 L
238.558 67.652 L
248.29 67.652 L
260.862 67.652 L
275.962 67.652 L
283.207 67.652 L
287.673 67.652 L
292.139 67.652 L
298.113 67.652 L
305.034 67.652 L
309.241 67.652 L
315.237 67.652 L
321.232 67.652 L
329.093 67.652 L
338.562 67.652 L
350.723 67.652 L
361.31 67.652 L
365.776 67.652 L
370.242 67.652 L
376.217 67.652 L
383.138 67.652 L
391.674 67.652 L
400.362 67.652 L
414.987 67.652 L
430.087 67.652 L
439.414 67.652 L
443.88 67.652 L
448.345 67.652 L
454.32 67.652 L
461.241 67.652 L
469.782 67.652 L
480.584 67.652 L
491.483 67.652 L
497.227 67.652 L
502.971 67.652 L
510.751 67.652 L
517.517 67.652 L
522.119 67.652 L
526.721 67.652 L
532.715 67.652 L
539.703 67.652 L
548.322 67.652 L
559.245 67.652 L
573.716 67.652 L
582.603 67.652 L
588.468 67.652 L
594.333 67.652 L
595.621 67.652 L
602.059 67.652 L
611.991 67.652 L
623.905 67.652 L
639.005 67.652 L
654.105 67.652 L
669.205 67.652 L
673.724 67.652 L
688.824 67.652 L
703.924 67.652 L
719.024 67.652 L
734.124 67.652 L
749.224 67.652 L
751.828 67.652 L
764.845 67.652 L
779.945 67.652 L
795.045 67.652 L
810.145 67.652 L
825.245 67.652 L
829.931 67.652 L
845.031 67.652 L
855.966 67.652 L
871.065 67.652 L
882 67.652 L
S
GR
GS
[0.75 0 0 0.75 0 -0.25] CT
0.494 0.184 0.557 RC
1 LJ
0.667 LW
N
127 500.696 M
127.927 500.696 L
132.023 500.696 L
136.078 500.696 L
140.838 500.696 L
146.36 500.696 L
152.945 500.696 L
161.009 500.696 L
171.257 500.696 L
184.871 500.696 L
192.086 500.696 L
192.086 370.783 L
196.212 370.783 L
200.338 370.783 L
205.103 370.783 L
211.118 370.783 L
218.121 370.783 L
224.35 370.783 L
230.58 370.783 L
238.558 370.783 L
248.29 370.783 L
260.862 370.783 L
275.962 370.783 L
283.207 370.783 L
287.673 370.783 L
292.139 370.783 L
298.113 370.783 L
305.034 370.783 L
309.241 370.783 L
315.237 370.783 L
321.232 370.783 L
329.093 370.783 L
338.562 370.783 L
350.723 370.783 L
361.31 370.783 L
365.776 370.783 L
370.242 370.783 L
376.217 370.783 L
383.138 370.783 L
391.674 370.783 L
400.362 370.783 L
414.987 370.783 L
430.087 370.783 L
439.414 370.783 L
443.88 370.783 L
448.345 370.783 L
454.32 370.783 L
461.241 370.783 L
469.782 370.783 L
480.584 370.783 L
491.483 370.783 L
497.227 370.783 L
502.971 370.783 L
510.751 370.783 L
517.517 370.783 L
522.119 370.783 L
526.721 370.783 L
532.715 370.783 L
539.703 370.783 L
548.322 370.783 L
559.245 370.783 L
573.716 370.783 L
582.603 370.783 L
588.468 370.783 L
594.333 370.783 L
595.621 370.783 L
602.059 370.783 L
611.991 370.783 L
623.905 370.783 L
639.005 370.783 L
654.105 370.783 L
669.205 370.783 L
673.724 370.783 L
688.824 370.783 L
703.924 370.783 L
719.024 370.783 L
734.124 370.783 L
749.224 370.783 L
751.828 370.783 L
764.845 370.783 L
779.945 370.783 L
795.045 370.783 L
810.145 370.783 L
825.245 370.783 L
829.931 370.783 L
845.031 370.783 L
855.966 370.783 L
871.065 370.783 L
882 370.783 L
S
GR
GS
[0.75 0 0 0.75 0 -0.25] CT
0.467 0.675 0.188 RC
1 LJ
0.667 LW
N
127 500.696 M
127.927 500.696 L
132.023 500.696 L
136.078 500.696 L
140.838 500.696 L
146.36 500.696 L
152.945 500.696 L
161.009 500.696 L
171.257 500.696 L
184.871 500.696 L
192.086 500.696 L
192.086 500.696 L
196.212 500.696 L
200.338 500.696 L
205.103 500.696 L
211.118 500.696 L
218.121 522.348 L
224.35 522.348 L
230.58 522.348 L
238.558 522.348 L
248.29 522.348 L
260.862 522.348 L
275.962 522.348 L
283.207 522.348 L
287.673 522.348 L
292.139 522.348 L
298.113 522.348 L
305.034 522.348 L
309.241 500.696 L
315.237 500.696 L
321.232 500.696 L
329.093 500.696 L
338.562 500.696 L
350.723 500.696 L
361.31 500.696 L
365.776 500.696 L
370.242 500.696 L
376.217 500.696 L
383.138 500.696 L
391.674 500.696 L
400.362 500.696 L
414.987 500.696 L
430.087 500.696 L
439.414 500.696 L
443.88 500.696 L
448.345 500.696 L
454.32 500.696 L
461.241 500.696 L
469.782 500.696 L
480.584 500.696 L
491.483 522.348 L
497.227 522.348 L
502.971 522.348 L
510.751 522.348 L
517.517 522.348 L
522.119 522.348 L
526.721 522.348 L
532.715 522.348 L
539.703 522.348 L
548.322 522.348 L
559.245 522.348 L
573.716 522.348 L
582.603 500.696 L
588.468 500.696 L
594.333 500.696 L
595.621 500.696 L
602.059 500.696 L
611.991 500.696 L
623.905 500.696 L
639.005 500.696 L
654.105 500.696 L
669.205 500.696 L
673.724 500.696 L
688.824 500.696 L
703.924 500.696 L
719.024 500.696 L
734.124 500.696 L
749.224 500.696 L
751.828 500.696 L
764.845 500.696 L
779.945 500.696 L
795.045 500.696 L
810.145 500.696 L
825.245 500.696 L
829.931 500.696 L
845.031 500.696 L
855.966 500.696 L
871.065 500.696 L
882 500.696 L
S
GR
GS
[0.75 0 0 0.75 0 -0.25] CT
0.302 0.745 0.933 RC
1 LJ
0.667 LW
N
127 500.696 M
127.927 500.696 L
132.023 500.696 L
136.078 500.696 L
140.838 500.696 L
146.36 500.696 L
152.945 500.696 L
161.009 500.696 L
171.257 500.696 L
184.871 500.696 L
192.086 500.696 L
192.086 500.696 L
196.212 500.696 L
200.338 500.696 L
205.103 500.696 L
211.118 500.696 L
218.121 500.696 L
224.35 500.696 L
230.58 500.696 L
238.558 500.696 L
248.29 500.696 L
260.862 500.696 L
275.962 500.696 L
283.207 479.043 L
287.673 479.043 L
292.139 479.043 L
298.113 479.043 L
305.034 479.043 L
309.241 479.043 L
315.237 479.043 L
321.232 479.043 L
329.093 479.043 L
338.562 479.043 L
350.723 479.043 L
361.31 500.696 L
365.776 500.696 L
370.242 500.696 L
376.217 500.696 L
383.138 500.696 L
391.674 500.696 L
400.362 500.696 L
414.987 500.696 L
430.087 500.696 L
439.414 522.348 L
443.88 522.348 L
448.345 522.348 L
454.32 522.348 L
461.241 522.348 L
469.782 522.348 L
480.584 522.348 L
491.483 522.348 L
497.227 522.348 L
502.971 522.348 L
510.751 522.348 L
517.517 500.696 L
522.119 500.696 L
526.721 500.696 L
532.715 500.696 L
539.703 500.696 L
548.322 500.696 L
559.245 500.696 L
573.716 500.696 L
582.603 500.696 L
588.468 500.696 L
594.333 500.696 L
595.621 500.696 L
602.059 500.696 L
611.991 500.696 L
623.905 500.696 L
639.005 500.696 L
654.105 500.696 L
669.205 500.696 L
673.724 500.696 L
688.824 500.696 L
703.924 500.696 L
719.024 500.696 L
734.124 500.696 L
749.224 500.696 L
751.828 500.696 L
764.845 500.696 L
779.945 500.696 L
795.045 500.696 L
810.145 500.696 L
825.245 500.696 L
829.931 500.696 L
845.031 500.696 L
855.966 500.696 L
871.065 500.696 L
882 500.696 L
S
GR
GS
[0.75 0 0 0.75 0 -0.25] CT
1 GC
N
686 233 M
686 100 L
837 100 L
837 233 L
cp
f
GR
GS
[0.75 0 0 0.75 542.25 86] CT
/Helvetica 12 F
GS
[1 0 0 1 0 0] CT
0 0 moveto 
1 -1 scale
(h) t 
GR
GR
GS
[0.75 0 0 0.75 548.25 90.5] CT
/Helvetica 9.6 F
GS
[1 0 0 1 0 0] CT
0 0 moveto 
1 -1 scale
(1) t 
GR
GR
GS
[0.75 0 0 0.75 0 -0.25] CT
0 0.447 0.741 RC
1 LJ
0.667 LW
N
690 112.547 M
720 112.547 L
S
GR
GS
[0.75 0 0 0.75 542.25 101.75] CT
/Helvetica 12 F
GS
[1 0 0 1 0 0] CT
0 0 moveto 
1 -1 scale
(h) t 
GR
GR
GS
[0.75 0 0 0.75 548.25 106.25] CT
/Helvetica 9.6 F
GS
[1 0 0 1 0 0] CT
0 0 moveto 
1 -1 scale
(2) t 
GR
GR
GS
[0.75 0 0 0.75 0 -0.25] CT
0.851 0.325 0.098 RC
1 LJ
0.667 LW
N
690 134.128 M
720 134.128 L
S
GR
GS
[0.75 0 0 0.75 542.25 118.25] CT
/Helvetica 12 F
GS
[1 0 0 1 0 0] CT
0 0 moveto 
1 -1 scale
(sp: u) t 
GR
GR
GS
[0.75 0 0 0.75 564.75 122.75] CT
/Helvetica 9.6 F
GS
[1 0 0 1 0 0] CT
0 0 moveto 
1 -1 scale
(1) t 
GR
GR
GS
[0.75 0 0 0.75 0 -0.25] CT
0.929 0.694 0.125 RC
1 LJ
0.667 LW
N
690 155.709 M
720 155.709 L
S
GR
GS
[0.75 0 0 0.75 542.25 134] CT
/Helvetica 12 F
GS
[1 0 0 1 0 0] CT
0 0 moveto 
1 -1 scale
(sp: u) t 
GR
GR
GS
[0.75 0 0 0.75 564.75 138.5] CT
/Helvetica 9.6 F
GS
[1 0 0 1 0 0] CT
0 0 moveto 
1 -1 scale
(2) t 
GR
GR
GS
[0.75 0 0 0.75 0 -0.25] CT
0.494 0.184 0.557 RC
1 LJ
0.667 LW
N
690 177.291 M
720 177.291 L
S
GR
GS
[0.75 0 0 0.75 542.25 150.5] CT
N
2.172 -0.984 M
2.172 2.5 L
1.094 2.5 L
1.094 -6.563 L
2.172 -6.563 L
2.172 -5.563 L
2.516 -6.156 3.031 -6.438 QT
3.547 -6.719 4.266 -6.719 QT
5.469 -6.719 6.219 -5.773 QT
6.969 -4.828 6.969 -3.281 QT
6.969 -1.734 6.219 -0.781 QT
5.469 0.172 4.266 0.172 QT
3.547 0.172 3.031 -0.117 QT
2.516 -0.406 2.172 -0.984 QT
cp
5.844 -3.281 M
5.844 -4.469 5.352 -5.141 QT
4.859 -5.813 4.016 -5.813 QT
3.156 -5.813 2.664 -5.141 QT
2.172 -4.469 2.172 -3.281 QT
2.172 -2.094 2.664 -1.414 QT
3.156 -0.734 4.016 -0.734 QT
4.859 -0.734 5.352 -1.414 QT
5.844 -2.094 5.844 -3.281 QT
cp
11.727 -3.297 M
10.43 -3.297 9.922 -3 QT
9.414 -2.703 9.414 -1.984 QT
9.414 -1.406 9.797 -1.07 QT
10.18 -0.734 10.82 -0.734 QT
11.727 -0.734 12.266 -1.367 QT
12.805 -2 12.805 -3.063 QT
12.805 -3.297 L
11.727 -3.297 L
cp
13.883 -3.75 M
13.883 0 L
12.805 0 L
12.805 -1 L
12.43 -0.406 11.883 -0.117 QT
11.336 0.172 10.539 0.172 QT
9.523 0.172 8.93 -0.398 QT
8.336 -0.969 8.336 -1.906 QT
8.336 -3.016 9.078 -3.578 QT
9.82 -4.141 11.289 -4.141 QT
12.805 -4.141 L
12.805 -4.25 L
12.805 -5 12.313 -5.406 QT
11.82 -5.813 10.945 -5.813 QT
10.383 -5.813 9.844 -5.672 QT
9.305 -5.531 8.82 -5.266 QT
8.82 -6.266 L
9.414 -6.5 9.969 -6.609 QT
10.523 -6.719 11.055 -6.719 QT
12.477 -6.719 13.18 -5.984 QT
13.883 -5.25 13.883 -3.75 QT
cp
19.908 -5.563 M
19.721 -5.656 19.51 -5.711 QT
19.299 -5.766 19.033 -5.766 QT
18.127 -5.766 17.635 -5.172 QT
17.143 -4.578 17.143 -3.453 QT
17.143 0 L
16.064 0 L
16.064 -6.563 L
17.143 -6.563 L
17.143 -5.547 L
17.486 -6.141 18.033 -6.43 QT
18.58 -6.719 19.361 -6.719 QT
19.471 -6.719 19.604 -6.703 QT
19.736 -6.688 19.893 -6.656 QT
19.908 -5.563 L
cp
24.014 -3.297 M
22.717 -3.297 22.209 -3 QT
21.701 -2.703 21.701 -1.984 QT
21.701 -1.406 22.084 -1.07 QT
22.467 -0.734 23.107 -0.734 QT
24.014 -0.734 24.553 -1.367 QT
25.092 -2 25.092 -3.063 QT
25.092 -3.297 L
24.014 -3.297 L
cp
26.17 -3.75 M
26.17 0 L
25.092 0 L
25.092 -1 L
24.717 -0.406 24.17 -0.117 QT
23.623 0.172 22.826 0.172 QT
21.811 0.172 21.217 -0.398 QT
20.623 -0.969 20.623 -1.906 QT
20.623 -3.016 21.365 -3.578 QT
22.107 -4.141 23.576 -4.141 QT
25.092 -4.141 L
25.092 -4.25 L
25.092 -5 24.6 -5.406 QT
24.107 -5.813 23.232 -5.813 QT
22.67 -5.813 22.131 -5.672 QT
21.592 -5.531 21.107 -5.266 QT
21.107 -6.266 L
21.701 -6.5 22.256 -6.609 QT
22.811 -6.719 23.342 -6.719 QT
24.764 -6.719 25.467 -5.984 QT
26.17 -5.25 26.17 -3.75 QT
cp
27.914 -6.563 M
33.039 -6.563 L
33.039 -5.578 L
28.992 -0.859 L
33.039 -0.859 L
33.039 0 L
27.773 0 L
27.773 -0.984 L
31.836 -5.703 L
27.914 -5.703 L
27.914 -6.563 L
cp
34.682 -6.563 M
35.76 -6.563 L
35.76 0 L
34.682 0 L
34.682 -6.563 L
cp
34.682 -9.125 M
35.76 -9.125 L
35.76 -7.75 L
34.682 -7.75 L
34.682 -9.125 L
cp
39.094 -8.422 M
39.094 -6.563 L
41.313 -6.563 L
41.313 -5.719 L
39.094 -5.719 L
39.094 -2.156 L
39.094 -1.359 39.313 -1.133 QT
39.531 -0.906 40.203 -0.906 QT
41.313 -0.906 L
41.313 0 L
40.203 0 L
38.953 0 38.477 -0.469 QT
38 -0.938 38 -2.156 QT
38 -5.719 L
37.219 -5.719 L
37.219 -6.563 L
38 -6.563 L
38 -8.422 L
39.094 -8.422 L
cp
48.189 -3.969 M
48.189 0 L
47.111 0 L
47.111 -3.922 L
47.111 -4.859 46.744 -5.32 QT
46.377 -5.781 45.658 -5.781 QT
44.783 -5.781 44.275 -5.227 QT
43.768 -4.672 43.768 -3.703 QT
43.768 0 L
42.689 0 L
42.689 -6.563 L
43.768 -6.563 L
43.768 -5.547 L
44.158 -6.141 44.682 -6.43 QT
45.205 -6.719 45.893 -6.719 QT
47.018 -6.719 47.604 -6.023 QT
48.189 -5.328 48.189 -3.969 QT
cp
52.014 -9.594 M
53.186 -9.594 L
51.279 -7.391 L
50.373 -7.391 L
52.014 -9.594 L
cp
50.326 -6.563 M
51.404 -6.563 L
51.404 0 L
50.326 0 L
50.326 -6.563 L
cp
58.521 -0.984 M
58.521 2.5 L
57.443 2.5 L
57.443 -6.563 L
58.521 -6.563 L
58.521 -5.563 L
58.865 -6.156 59.381 -6.438 QT
59.896 -6.719 60.615 -6.719 QT
61.818 -6.719 62.568 -5.773 QT
63.318 -4.828 63.318 -3.281 QT
63.318 -1.734 62.568 -0.781 QT
61.818 0.172 60.615 0.172 QT
59.896 0.172 59.381 -0.117 QT
58.865 -0.406 58.521 -0.984 QT
cp
62.193 -3.281 M
62.193 -4.469 61.701 -5.141 QT
61.209 -5.813 60.365 -5.813 QT
59.506 -5.813 59.014 -5.141 QT
58.521 -4.469 58.521 -3.281 QT
58.521 -2.094 59.014 -1.414 QT
59.506 -0.734 60.365 -0.734 QT
61.209 -0.734 61.701 -1.414 QT
62.193 -2.094 62.193 -3.281 QT
cp
68.904 -5.563 M
68.717 -5.656 68.506 -5.711 QT
68.295 -5.766 68.029 -5.766 QT
67.123 -5.766 66.631 -5.172 QT
66.139 -4.578 66.139 -3.453 QT
66.139 0 L
65.061 0 L
65.061 -6.563 L
66.139 -6.563 L
66.139 -5.547 L
66.482 -6.141 67.029 -6.43 QT
67.576 -6.719 68.357 -6.719 QT
68.467 -6.719 68.6 -6.703 QT
68.732 -6.688 68.889 -6.656 QT
68.904 -5.563 L
cp
66.529 -7.391 M
65.061 -9.594 L
65.889 -9.594 L
66.982 -8.156 L
68.061 -9.594 L
68.889 -9.594 L
67.42 -7.391 L
66.529 -7.391 L
cp
71.713 -9.594 M
72.885 -9.594 L
70.979 -7.391 L
70.072 -7.391 L
71.713 -9.594 L
cp
70.025 -6.563 M
71.104 -6.563 L
71.104 0 L
70.025 0 L
70.025 -6.563 L
cp
74.438 -8.422 M
74.438 -6.563 L
76.656 -6.563 L
76.656 -5.719 L
74.438 -5.719 L
74.438 -2.156 L
74.438 -1.359 74.656 -1.133 QT
74.875 -0.906 75.547 -0.906 QT
76.656 -0.906 L
76.656 0 L
75.547 0 L
74.297 0 73.82 -0.469 QT
73.344 -0.938 73.344 -2.156 QT
73.344 -5.719 L
72.563 -5.719 L
72.563 -6.563 L
73.344 -6.563 L
73.344 -8.422 L
74.438 -8.422 L
cp
80.611 -5.813 M
79.752 -5.813 79.244 -5.133 QT
78.736 -4.453 78.736 -3.281 QT
78.736 -2.094 79.236 -1.422 QT
79.736 -0.75 80.611 -0.75 QT
81.471 -0.75 81.979 -1.43 QT
82.486 -2.109 82.486 -3.281 QT
82.486 -4.438 81.979 -5.125 QT
81.471 -5.813 80.611 -5.813 QT
cp
80.611 -6.719 M
82.018 -6.719 82.822 -5.805 QT
83.627 -4.891 83.627 -3.281 QT
83.627 -1.672 82.822 -0.75 QT
82.018 0.172 80.611 0.172 QT
79.205 0.172 78.4 -0.75 QT
77.596 -1.672 77.596 -3.281 QT
77.596 -4.891 78.4 -5.805 QT
79.205 -6.719 80.611 -6.719 QT
cp
85.375 -9.125 M
86.453 -9.125 L
86.453 -3.734 L
89.672 -6.563 L
91.047 -6.563 L
87.563 -3.5 L
91.203 0 L
89.797 0 L
86.453 -3.203 L
86.453 0 L
85.375 0 L
85.375 -9.125 L
cp
96.061 -2.594 M
96.061 -6.563 L
97.139 -6.563 L
97.139 -2.625 L
97.139 -1.703 97.506 -1.234 QT
97.873 -0.766 98.592 -0.766 QT
99.467 -0.766 99.975 -1.32 QT
100.482 -1.875 100.482 -2.844 QT
100.482 -6.563 L
101.561 -6.563 L
101.561 0 L
100.482 0 L
100.482 -1.016 L
100.092 -0.406 99.576 -0.117 QT
99.061 0.172 98.373 0.172 QT
97.232 0.172 96.646 -0.531 QT
96.061 -1.234 96.061 -2.594 QT
cp
f
GR
GS
[0.75 0 0 0.75 619.5 155] CT
/Helvetica 9.6 F
GS
[1 0 0 1 0 0] CT
0 0 moveto 
1 -1 scale
(1) t 
GR
GR
GS
[0.75 0 0 0.75 0 -0.25] CT
0.467 0.675 0.188 RC
1 LJ
0.667 LW
N
690 198.872 M
720 198.872 L
S
GR
GS
[0.75 0 0 0.75 542.25 166.25] CT
N
/f708937870{2.172 -0.984 M
2.172 2.5 L
1.094 2.5 L
1.094 -6.563 L
2.172 -6.563 L
2.172 -5.563 L
2.516 -6.156 3.031 -6.438 QT
3.547 -6.719 4.266 -6.719 QT
5.469 -6.719 6.219 -5.773 QT
6.969 -4.828 6.969 -3.281 QT
6.969 -1.734 6.219 -0.781 QT
5.469 0.172 4.266 0.172 QT
3.547 0.172 3.031 -0.117 QT
2.516 -0.406 2.172 -0.984 QT
cp
5.844 -3.281 M
5.844 -4.469 5.352 -5.141 QT
4.859 -5.813 4.016 -5.813 QT
3.156 -5.813 2.664 -5.141 QT
2.172 -4.469 2.172 -3.281 QT
2.172 -2.094 2.664 -1.414 QT
3.156 -0.734 4.016 -0.734 QT
4.859 -0.734 5.352 -1.414 QT
5.844 -2.094 5.844 -3.281 QT
cp
11.727 -3.297 M
10.43 -3.297 9.922 -3 QT
9.414 -2.703 9.414 -1.984 QT
9.414 -1.406 9.797 -1.07 QT
10.18 -0.734 10.82 -0.734 QT
11.727 -0.734 12.266 -1.367 QT
12.805 -2 12.805 -3.063 QT
12.805 -3.297 L
11.727 -3.297 L
cp
13.883 -3.75 M
13.883 0 L
12.805 0 L
12.805 -1 L
12.43 -0.406 11.883 -0.117 QT
11.336 0.172 10.539 0.172 QT
9.523 0.172 8.93 -0.398 QT
8.336 -0.969 8.336 -1.906 QT
8.336 -3.016 9.078 -3.578 QT
9.82 -4.141 11.289 -4.141 QT
12.805 -4.141 L
12.805 -4.25 L
12.805 -5 12.313 -5.406 QT
11.82 -5.813 10.945 -5.813 QT
10.383 -5.813 9.844 -5.672 QT
9.305 -5.531 8.82 -5.266 QT
8.82 -6.266 L
9.414 -6.5 9.969 -6.609 QT
10.523 -6.719 11.055 -6.719 QT
12.477 -6.719 13.18 -5.984 QT
13.883 -5.25 13.883 -3.75 QT
cp
19.908 -5.563 M
19.721 -5.656 19.51 -5.711 QT
19.299 -5.766 19.033 -5.766 QT
18.127 -5.766 17.635 -5.172 QT
17.143 -4.578 17.143 -3.453 QT
17.143 0 L
16.064 0 L
16.064 -6.563 L
17.143 -6.563 L
17.143 -5.547 L
17.486 -6.141 18.033 -6.43 QT
18.58 -6.719 19.361 -6.719 QT
19.471 -6.719 19.604 -6.703 QT
19.736 -6.688 19.893 -6.656 QT
19.908 -5.563 L
cp
24.014 -3.297 M
22.717 -3.297 22.209 -3 QT
21.701 -2.703 21.701 -1.984 QT
21.701 -1.406 22.084 -1.07 QT
22.467 -0.734 23.107 -0.734 QT
24.014 -0.734 24.553 -1.367 QT
25.092 -2 25.092 -3.063 QT
25.092 -3.297 L
24.014 -3.297 L
cp
26.17 -3.75 M
26.17 0 L
25.092 0 L
25.092 -1 L
24.717 -0.406 24.17 -0.117 QT
23.623 0.172 22.826 0.172 QT
21.811 0.172 21.217 -0.398 QT
20.623 -0.969 20.623 -1.906 QT
20.623 -3.016 21.365 -3.578 QT
22.107 -4.141 23.576 -4.141 QT
25.092 -4.141 L
25.092 -4.25 L
25.092 -5 24.6 -5.406 QT
24.107 -5.813 23.232 -5.813 QT
22.67 -5.813 22.131 -5.672 QT
21.592 -5.531 21.107 -5.266 QT
21.107 -6.266 L
21.701 -6.5 22.256 -6.609 QT
22.811 -6.719 23.342 -6.719 QT
24.764 -6.719 25.467 -5.984 QT
26.17 -5.25 26.17 -3.75 QT
cp
27.914 -6.563 M
33.039 -6.563 L
33.039 -5.578 L
28.992 -0.859 L
33.039 -0.859 L
33.039 0 L
27.773 0 L
27.773 -0.984 L
31.836 -5.703 L
27.914 -5.703 L
27.914 -6.563 L
cp
34.682 -6.563 M
35.76 -6.563 L
35.76 0 L
34.682 0 L
34.682 -6.563 L
cp
34.682 -9.125 M
35.76 -9.125 L
35.76 -7.75 L
34.682 -7.75 L
34.682 -9.125 L
cp
39.094 -8.422 M
39.094 -6.563 L
41.313 -6.563 L
41.313 -5.719 L
39.094 -5.719 L
39.094 -2.156 L
39.094 -1.359 39.313 -1.133 QT
39.531 -0.906 40.203 -0.906 QT
41.313 -0.906 L
41.313 0 L
40.203 0 L
38.953 0 38.477 -0.469 QT
38 -0.938 38 -2.156 QT
38 -5.719 L
37.219 -5.719 L
37.219 -6.563 L
38 -6.563 L
38 -8.422 L
39.094 -8.422 L
cp
48.189 -3.969 M
48.189 0 L
47.111 0 L
47.111 -3.922 L
47.111 -4.859 46.744 -5.32 QT
46.377 -5.781 45.658 -5.781 QT
44.783 -5.781 44.275 -5.227 QT
43.768 -4.672 43.768 -3.703 QT
43.768 0 L
42.689 0 L
42.689 -6.563 L
43.768 -6.563 L
43.768 -5.547 L
44.158 -6.141 44.682 -6.43 QT
45.205 -6.719 45.893 -6.719 QT
47.018 -6.719 47.604 -6.023 QT
48.189 -5.328 48.189 -3.969 QT
cp
52.014 -9.594 M
53.186 -9.594 L
51.279 -7.391 L
50.373 -7.391 L
52.014 -9.594 L
cp
50.326 -6.563 M
51.404 -6.563 L
51.404 0 L
50.326 0 L
50.326 -6.563 L
cp
58.521 -0.984 M
58.521 2.5 L
57.443 2.5 L
57.443 -6.563 L
58.521 -6.563 L
58.521 -5.563 L
58.865 -6.156 59.381 -6.438 QT
59.896 -6.719 60.615 -6.719 QT
61.818 -6.719 62.568 -5.773 QT
63.318 -4.828 63.318 -3.281 QT
63.318 -1.734 62.568 -0.781 QT
61.818 0.172 60.615 0.172 QT
59.896 0.172 59.381 -0.117 QT
58.865 -0.406 58.521 -0.984 QT
cp
62.193 -3.281 M
62.193 -4.469 61.701 -5.141 QT
61.209 -5.813 60.365 -5.813 QT
59.506 -5.813 59.014 -5.141 QT
58.521 -4.469 58.521 -3.281 QT
58.521 -2.094 59.014 -1.414 QT
59.506 -0.734 60.365 -0.734 QT
61.209 -0.734 61.701 -1.414 QT
62.193 -2.094 62.193 -3.281 QT
cp
68.904 -5.563 M
68.717 -5.656 68.506 -5.711 QT
68.295 -5.766 68.029 -5.766 QT
67.123 -5.766 66.631 -5.172 QT
66.139 -4.578 66.139 -3.453 QT
66.139 0 L
65.061 0 L
65.061 -6.563 L
66.139 -6.563 L
66.139 -5.547 L
66.482 -6.141 67.029 -6.43 QT
67.576 -6.719 68.357 -6.719 QT
68.467 -6.719 68.6 -6.703 QT
68.732 -6.688 68.889 -6.656 QT
68.904 -5.563 L
cp
66.529 -7.391 M
65.061 -9.594 L
65.889 -9.594 L
66.982 -8.156 L
68.061 -9.594 L
68.889 -9.594 L
67.42 -7.391 L
66.529 -7.391 L
cp
71.713 -9.594 M
72.885 -9.594 L
70.979 -7.391 L
70.072 -7.391 L
71.713 -9.594 L
cp
70.025 -6.563 M
71.104 -6.563 L
71.104 0 L
70.025 0 L
70.025 -6.563 L
cp
74.438 -8.422 M
74.438 -6.563 L
76.656 -6.563 L
76.656 -5.719 L
74.438 -5.719 L
74.438 -2.156 L
74.438 -1.359 74.656 -1.133 QT
74.875 -0.906 75.547 -0.906 QT
76.656 -0.906 L
76.656 0 L
75.547 0 L
74.297 0 73.82 -0.469 QT
73.344 -0.938 73.344 -2.156 QT
73.344 -5.719 L
72.563 -5.719 L
72.563 -6.563 L
73.344 -6.563 L
73.344 -8.422 L
74.438 -8.422 L
cp
80.611 -5.813 M
79.752 -5.813 79.244 -5.133 QT
78.736 -4.453 78.736 -3.281 QT
78.736 -2.094 79.236 -1.422 QT
79.736 -0.75 80.611 -0.75 QT
81.471 -0.75 81.979 -1.43 QT
82.486 -2.109 82.486 -3.281 QT
82.486 -4.438 81.979 -5.125 QT
81.471 -5.813 80.611 -5.813 QT
cp
80.611 -6.719 M
82.018 -6.719 82.822 -5.805 QT
83.627 -4.891 83.627 -3.281 QT
83.627 -1.672 82.822 -0.75 QT
82.018 0.172 80.611 0.172 QT
79.205 0.172 78.4 -0.75 QT
77.596 -1.672 77.596 -3.281 QT
77.596 -4.891 78.4 -5.805 QT
79.205 -6.719 80.611 -6.719 QT
cp
85.375 -9.125 M
86.453 -9.125 L
86.453 -3.734 L
89.672 -6.563 L
91.047 -6.563 L
87.563 -3.5 L
91.203 0 L
89.797 0 L
86.453 -3.203 L
86.453 0 L
85.375 0 L
85.375 -9.125 L
cp
96.061 -2.594 M
96.061 -6.563 L
97.139 -6.563 L
97.139 -2.625 L
97.139 -1.703 97.506 -1.234 QT
97.873 -0.766 98.592 -0.766 QT
99.467 -0.766 99.975 -1.32 QT
100.482 -1.875 100.482 -2.844 QT
100.482 -6.563 L
101.561 -6.563 L
101.561 0 L
100.482 0 L
100.482 -1.016 L
100.092 -0.406 99.576 -0.117 QT
99.061 0.172 98.373 0.172 QT
97.232 0.172 96.646 -0.531 QT
96.061 -1.234 96.061 -2.594 QT
cp}def
f708937870
f
GR
GS
[0.75 0 0 0.75 619.5 170.75] CT
/Helvetica 9.6 F
GS
[1 0 0 1 0 0] CT
0 0 moveto 
1 -1 scale
(2) t 
GR
GR
GS
[0.75 0 0 0.75 0 -0.25] CT
0.302 0.745 0.933 RC
1 LJ
0.667 LW
N
690 220.453 M
720 220.453 L
S
GR
GS
[0.75 0 0 0.75 0 -0.25] CT
0.149 GC
10.0 ML
0.667 LW
N
686 233 M
686 100 L
837 100 L
837 233 L
cp
S
GR
%%Trailer
%%Pages: 1
%%EOF
