%!PS-Adobe-3.0 EPSF-3.0
%%Creator: (MATLAB, The Mathworks, Inc. Version 9.1.0.441655 \(R2016b\). Operating System: Windows 7)
%%Title: C:/Users/June/Documents/GitKraken/rls-2017/sp6/figures/rp.eps
%%CreationDate: 2018-03-04T21:05:44
%%Pages: (atend)
%%BoundingBox: 0 0 420 315
%%LanguageLevel: 3
%%EndComments
%%BeginProlog
%%BeginResource: procset (Apache XML Graphics Std ProcSet) 1.2 0
%%Version: 1.2 0
%%Copyright: (Copyright 2001-2003,2010 The Apache Software Foundation. License terms: http://www.apache.org/licenses/LICENSE-2.0)
/bd{bind def}bind def
/ld{load def}bd
/GR/grestore ld
/M/moveto ld
/LJ/setlinejoin ld
/C/curveto ld
/f/fill ld
/LW/setlinewidth ld
/GC/setgray ld
/t/show ld
/N/newpath ld
/CT/concat ld
/cp/closepath ld
/S/stroke ld
/L/lineto ld
/CC/setcmykcolor ld
/A/ashow ld
/GS/gsave ld
/RC/setrgbcolor ld
/RM/rmoveto ld
/ML/setmiterlimit ld
/re {4 2 roll M
1 index 0 rlineto
0 exch rlineto
neg 0 rlineto
cp } bd
/_ctm matrix def
/_tm matrix def
/BT { _ctm currentmatrix pop matrix _tm copy pop 0 0 moveto } bd
/ET { _ctm setmatrix } bd
/iTm { _ctm setmatrix _tm concat } bd
/Tm { _tm astore pop iTm 0 0 moveto } bd
/ux 0.0 def
/uy 0.0 def
/F {
  /Tp exch def
  /Tf exch def
  Tf findfont Tp scalefont setfont
  /cf Tf def  /cs Tp def
} bd
/ULS {currentpoint /uy exch def /ux exch def} bd
/ULE {
  /Tcx currentpoint pop def
  gsave
  newpath
  cf findfont cs scalefont dup
  /FontMatrix get 0 get /Ts exch def /FontInfo get dup
  /UnderlinePosition get Ts mul /To exch def
  /UnderlineThickness get Ts mul /Tt exch def
  ux uy To add moveto  Tcx uy To add lineto
  Tt setlinewidth stroke
  grestore
} bd
/OLE {
  /Tcx currentpoint pop def
  gsave
  newpath
  cf findfont cs scalefont dup
  /FontMatrix get 0 get /Ts exch def /FontInfo get dup
  /UnderlinePosition get Ts mul /To exch def
  /UnderlineThickness get Ts mul /Tt exch def
  ux uy To add cs add moveto Tcx uy To add cs add lineto
  Tt setlinewidth stroke
  grestore
} bd
/SOE {
  /Tcx currentpoint pop def
  gsave
  newpath
  cf findfont cs scalefont dup
  /FontMatrix get 0 get /Ts exch def /FontInfo get dup
  /UnderlinePosition get Ts mul /To exch def
  /UnderlineThickness get Ts mul /Tt exch def
  ux uy To add cs 10 mul 26 idiv add moveto Tcx uy To add cs 10 mul 26 idiv add lineto
  Tt setlinewidth stroke
  grestore
} bd
/QT {
/Y22 exch store
/X22 exch store
/Y21 exch store
/X21 exch store
currentpoint
/Y21 load 2 mul add 3 div exch
/X21 load 2 mul add 3 div exch
/X21 load 2 mul /X22 load add 3 div
/Y21 load 2 mul /Y22 load add 3 div
/X22 load /Y22 load curveto
} bd
/SSPD {
dup length /d exch dict def
{
/v exch def
/k exch def
currentpagedevice k known {
/cpdv currentpagedevice k get def
v cpdv ne {
/upd false def
/nullv v type /nulltype eq def
/nullcpdv cpdv type /nulltype eq def
nullv nullcpdv or
{
/upd true def
} {
/sametype v type cpdv type eq def
sametype {
v type /arraytype eq {
/vlen v length def
/cpdvlen cpdv length def
vlen cpdvlen eq {
0 1 vlen 1 sub {
/i exch def
/obj v i get def
/cpdobj cpdv i get def
obj cpdobj ne {
/upd true def
exit
} if
} for
} {
/upd true def
} ifelse
} {
v type /dicttype eq {
v {
/dv exch def
/dk exch def
/cpddv cpdv dk get def
dv cpddv ne {
/upd true def
exit
} if
} forall
} {
/upd true def
} ifelse
} ifelse
} if
} ifelse
upd true eq {
d k v put
} if
} if
} if
} forall
d length 0 gt {
d setpagedevice
} if
} bd
/RE { % /NewFontName [NewEncodingArray] /FontName RE -
  findfont dup length dict begin
  {
    1 index /FID ne
    {def} {pop pop} ifelse
  } forall
  /Encoding exch def
  /FontName 1 index def
  currentdict definefont pop
  end
} bind def
%%EndResource
%%BeginResource: procset (Apache XML Graphics EPS ProcSet) 1.0 0
%%Version: 1.0 0
%%Copyright: (Copyright 2002-2003 The Apache Software Foundation. License terms: http://www.apache.org/licenses/LICENSE-2.0)
/BeginEPSF { %def
/b4_Inc_state save def         % Save state for cleanup
/dict_count countdictstack def % Count objects on dict stack
/op_count count 1 sub def      % Count objects on operand stack
userdict begin                 % Push userdict on dict stack
/showpage { } def              % Redefine showpage, { } = null proc
0 setgray 0 setlinecap         % Prepare graphics state
1 setlinewidth 0 setlinejoin
10 setmiterlimit [ ] 0 setdash newpath
/languagelevel where           % If level not equal to 1 then
{pop languagelevel             % set strokeadjust and
1 ne                           % overprint to their defaults.
{false setstrokeadjust false setoverprint
} if
} if
} bd
/EndEPSF { %def
count op_count sub {pop} repeat            % Clean up stacks
countdictstack dict_count sub {end} repeat
b4_Inc_state restore
} bd
%%EndResource
%FOPBeginFontDict
%%IncludeResource: font Courier-Bold
%%IncludeResource: font Helvetica
%%IncludeResource: font Courier-BoldOblique
%%IncludeResource: font Courier-Oblique
%%IncludeResource: font Times-Roman
%%IncludeResource: font Helvetica-BoldOblique
%%IncludeResource: font Helvetica-Bold
%%IncludeResource: font Helvetica-Oblique
%%IncludeResource: font Times-BoldItalic
%%IncludeResource: font Courier
%%IncludeResource: font Times-Italic
%%IncludeResource: font Times-Bold
%%IncludeResource: font Symbol
%%IncludeResource: font ZapfDingbats
%FOPEndFontDict
%%BeginResource: encoding WinAnsiEncoding
/WinAnsiEncoding [
/.notdef /.notdef /.notdef /.notdef /.notdef
/.notdef /.notdef /.notdef /.notdef /.notdef
/.notdef /.notdef /.notdef /.notdef /.notdef
/.notdef /.notdef /.notdef /.notdef /.notdef
/.notdef /.notdef /.notdef /.notdef /.notdef
/.notdef /.notdef /.notdef /.notdef /.notdef
/.notdef /.notdef /space /exclam /quotedbl
/numbersign /dollar /percent /ampersand /quotesingle
/parenleft /parenright /asterisk /plus /comma
/hyphen /period /slash /zero /one
/two /three /four /five /six
/seven /eight /nine /colon /semicolon
/less /equal /greater /question /at
/A /B /C /D /E
/F /G /H /I /J
/K /L /M /N /O
/P /Q /R /S /T
/U /V /W /X /Y
/Z /bracketleft /backslash /bracketright /asciicircum
/underscore /quoteleft /a /b /c
/d /e /f /g /h
/i /j /k /l /m
/n /o /p /q /r
/s /t /u /v /w
/x /y /z /braceleft /bar
/braceright /asciitilde /bullet /Euro /bullet
/quotesinglbase /florin /quotedblbase /ellipsis /dagger
/daggerdbl /circumflex /perthousand /Scaron /guilsinglleft
/OE /bullet /Zcaron /bullet /bullet
/quoteleft /quoteright /quotedblleft /quotedblright /bullet
/endash /emdash /asciitilde /trademark /scaron
/guilsinglright /oe /bullet /zcaron /Ydieresis
/space /exclamdown /cent /sterling /currency
/yen /brokenbar /section /dieresis /copyright
/ordfeminine /guillemotleft /logicalnot /sfthyphen /registered
/macron /degree /plusminus /twosuperior /threesuperior
/acute /mu /paragraph /middot /cedilla
/onesuperior /ordmasculine /guillemotright /onequarter /onehalf
/threequarters /questiondown /Agrave /Aacute /Acircumflex
/Atilde /Adieresis /Aring /AE /Ccedilla
/Egrave /Eacute /Ecircumflex /Edieresis /Igrave
/Iacute /Icircumflex /Idieresis /Eth /Ntilde
/Ograve /Oacute /Ocircumflex /Otilde /Odieresis
/multiply /Oslash /Ugrave /Uacute /Ucircumflex
/Udieresis /Yacute /Thorn /germandbls /agrave
/aacute /acircumflex /atilde /adieresis /aring
/ae /ccedilla /egrave /eacute /ecircumflex
/edieresis /igrave /iacute /icircumflex /idieresis
/eth /ntilde /ograve /oacute /ocircumflex
/otilde /odieresis /divide /oslash /ugrave
/uacute /ucircumflex /udieresis /yacute /thorn
/ydieresis
] def
%%EndResource
%FOPBeginFontReencode
/Courier-Bold findfont
dup length dict begin
  {1 index /FID ne {def} {pop pop} ifelse} forall
  /Encoding WinAnsiEncoding def
  currentdict
end
/Courier-Bold exch definefont pop
/Helvetica findfont
dup length dict begin
  {1 index /FID ne {def} {pop pop} ifelse} forall
  /Encoding WinAnsiEncoding def
  currentdict
end
/Helvetica exch definefont pop
/Courier-BoldOblique findfont
dup length dict begin
  {1 index /FID ne {def} {pop pop} ifelse} forall
  /Encoding WinAnsiEncoding def
  currentdict
end
/Courier-BoldOblique exch definefont pop
/Courier-Oblique findfont
dup length dict begin
  {1 index /FID ne {def} {pop pop} ifelse} forall
  /Encoding WinAnsiEncoding def
  currentdict
end
/Courier-Oblique exch definefont pop
/Times-Roman findfont
dup length dict begin
  {1 index /FID ne {def} {pop pop} ifelse} forall
  /Encoding WinAnsiEncoding def
  currentdict
end
/Times-Roman exch definefont pop
/Helvetica-BoldOblique findfont
dup length dict begin
  {1 index /FID ne {def} {pop pop} ifelse} forall
  /Encoding WinAnsiEncoding def
  currentdict
end
/Helvetica-BoldOblique exch definefont pop
/Helvetica-Bold findfont
dup length dict begin
  {1 index /FID ne {def} {pop pop} ifelse} forall
  /Encoding WinAnsiEncoding def
  currentdict
end
/Helvetica-Bold exch definefont pop
/Helvetica-Oblique findfont
dup length dict begin
  {1 index /FID ne {def} {pop pop} ifelse} forall
  /Encoding WinAnsiEncoding def
  currentdict
end
/Helvetica-Oblique exch definefont pop
/Times-BoldItalic findfont
dup length dict begin
  {1 index /FID ne {def} {pop pop} ifelse} forall
  /Encoding WinAnsiEncoding def
  currentdict
end
/Times-BoldItalic exch definefont pop
/Courier findfont
dup length dict begin
  {1 index /FID ne {def} {pop pop} ifelse} forall
  /Encoding WinAnsiEncoding def
  currentdict
end
/Courier exch definefont pop
/Times-Italic findfont
dup length dict begin
  {1 index /FID ne {def} {pop pop} ifelse} forall
  /Encoding WinAnsiEncoding def
  currentdict
end
/Times-Italic exch definefont pop
/Times-Bold findfont
dup length dict begin
  {1 index /FID ne {def} {pop pop} ifelse} forall
  /Encoding WinAnsiEncoding def
  currentdict
end
/Times-Bold exch definefont pop
%FOPEndFontReencode
%%EndProlog
%%Page: 1 1
%%PageBoundingBox: 0 0 420 315
%%BeginPageSetup
[1 0 0 -1 0 315] CT
%%EndPageSetup
GS
[0.75 0 0 0.75 0 0] CT
1 GC
N
0 0 560 420 re
f
GR
GS
[0.75 0 0 0.75 0 0] CT
1 GC
N
0 0 560 420 re
f
GR
GS
[0.75 0 0 0.75 0 0] CT
1 GC
N
73 374 M
507 374 L
507 31 L
73 31 L
cp
f
GR
GS
[0.75 0 0 0.75 0 0] CT
0.873 GC
1 LJ
0.667 LW
N
73 374 M
73 31 L
S
GR
GS
[0.75 0 0 0.75 0 0] CT
0.873 GC
1 LJ
0.667 LW
N
116.4 374 M
116.4 31 L
S
GR
GS
[0.75 0 0 0.75 0 0] CT
0.873 GC
1 LJ
0.667 LW
N
159.8 374 M
159.8 31 L
S
GR
GS
[0.75 0 0 0.75 0 0] CT
0.873 GC
1 LJ
0.667 LW
N
203.2 374 M
203.2 31 L
S
GR
GS
[0.75 0 0 0.75 0 0] CT
0.873 GC
1 LJ
0.667 LW
N
246.6 374 M
246.6 31 L
S
GR
GS
[0.75 0 0 0.75 0 0] CT
0.873 GC
1 LJ
0.667 LW
N
290 374 M
290 31 L
S
GR
GS
[0.75 0 0 0.75 0 0] CT
0.873 GC
1 LJ
0.667 LW
N
333.4 374 M
333.4 31 L
S
GR
GS
[0.75 0 0 0.75 0 0] CT
0.873 GC
1 LJ
0.667 LW
N
376.8 374 M
376.8 31 L
S
GR
GS
[0.75 0 0 0.75 0 0] CT
0.873 GC
1 LJ
0.667 LW
N
420.2 374 M
420.2 31 L
S
GR
GS
[0.75 0 0 0.75 0 0] CT
0.873 GC
1 LJ
0.667 LW
N
463.6 374 M
463.6 31 L
S
GR
GS
[0.75 0 0 0.75 0 0] CT
0.873 GC
1 LJ
0.667 LW
N
507 374 M
507 31 L
S
GR
GS
[0.75 0 0 0.75 0 0] CT
0.873 GC
1 LJ
0.667 LW
N
507 374 M
73 374 L
S
GR
GS
[0.75 0 0 0.75 0 0] CT
0.873 GC
1 LJ
0.667 LW
N
507 335.889 M
73 335.889 L
S
GR
GS
[0.75 0 0 0.75 0 0] CT
0.873 GC
1 LJ
0.667 LW
N
507 297.778 M
73 297.778 L
S
GR
GS
[0.75 0 0 0.75 0 0] CT
0.873 GC
1 LJ
0.667 LW
N
507 259.667 M
73 259.667 L
S
GR
GS
[0.75 0 0 0.75 0 0] CT
0.873 GC
1 LJ
0.667 LW
N
507 221.556 M
73 221.556 L
S
GR
GS
[0.75 0 0 0.75 0 0] CT
0.873 GC
1 LJ
0.667 LW
N
507 183.444 M
73 183.444 L
S
GR
GS
[0.75 0 0 0.75 0 0] CT
0.873 GC
1 LJ
0.667 LW
N
507 145.333 M
73 145.333 L
S
GR
GS
[0.75 0 0 0.75 0 0] CT
0.873 GC
1 LJ
0.667 LW
N
507 107.222 M
73 107.222 L
S
GR
GS
[0.75 0 0 0.75 0 0] CT
0.873 GC
1 LJ
0.667 LW
N
507 69.111 M
73 69.111 L
S
GR
GS
[0.75 0 0 0.75 0 0] CT
0.873 GC
1 LJ
0.667 LW
N
507 31 M
73 31 L
S
GR
GS
[0.75 0 0 0.75 0 0] CT
0.149 GC
2 setlinecap
1 LJ
0.667 LW
N
73 374 M
507 374 L
S
GR
GS
[0.75 0 0 0.75 0 0] CT
0.149 GC
2 setlinecap
1 LJ
0.667 LW
N
73 31 M
507 31 L
S
GR
GS
[0.75 0 0 0.75 0 0] CT
0.149 GC
2 setlinecap
1 LJ
0.667 LW
N
73 374 M
73 369.66 L
S
GR
GS
[0.75 0 0 0.75 0 0] CT
0.149 GC
2 setlinecap
1 LJ
0.667 LW
N
116.4 374 M
116.4 369.66 L
S
GR
GS
[0.75 0 0 0.75 0 0] CT
0.149 GC
2 setlinecap
1 LJ
0.667 LW
N
159.8 374 M
159.8 369.66 L
S
GR
GS
[0.75 0 0 0.75 0 0] CT
0.149 GC
2 setlinecap
1 LJ
0.667 LW
N
203.2 374 M
203.2 369.66 L
S
GR
GS
[0.75 0 0 0.75 0 0] CT
0.149 GC
2 setlinecap
1 LJ
0.667 LW
N
246.6 374 M
246.6 369.66 L
S
GR
GS
[0.75 0 0 0.75 0 0] CT
0.149 GC
2 setlinecap
1 LJ
0.667 LW
N
290 374 M
290 369.66 L
S
GR
GS
[0.75 0 0 0.75 0 0] CT
0.149 GC
2 setlinecap
1 LJ
0.667 LW
N
333.4 374 M
333.4 369.66 L
S
GR
GS
[0.75 0 0 0.75 0 0] CT
0.149 GC
2 setlinecap
1 LJ
0.667 LW
N
376.8 374 M
376.8 369.66 L
S
GR
GS
[0.75 0 0 0.75 0 0] CT
0.149 GC
2 setlinecap
1 LJ
0.667 LW
N
420.2 374 M
420.2 369.66 L
S
GR
GS
[0.75 0 0 0.75 0 0] CT
0.149 GC
2 setlinecap
1 LJ
0.667 LW
N
463.6 374 M
463.6 369.66 L
S
GR
GS
[0.75 0 0 0.75 0 0] CT
0.149 GC
2 setlinecap
1 LJ
0.667 LW
N
507 374 M
507 369.66 L
S
GR
GS
[0.75 0 0 0.75 0 0] CT
0.149 GC
2 setlinecap
1 LJ
0.667 LW
N
73 31 M
73 35.34 L
S
GR
GS
[0.75 0 0 0.75 0 0] CT
0.149 GC
2 setlinecap
1 LJ
0.667 LW
N
116.4 31 M
116.4 35.34 L
S
GR
GS
[0.75 0 0 0.75 0 0] CT
0.149 GC
2 setlinecap
1 LJ
0.667 LW
N
159.8 31 M
159.8 35.34 L
S
GR
GS
[0.75 0 0 0.75 0 0] CT
0.149 GC
2 setlinecap
1 LJ
0.667 LW
N
203.2 31 M
203.2 35.34 L
S
GR
GS
[0.75 0 0 0.75 0 0] CT
0.149 GC
2 setlinecap
1 LJ
0.667 LW
N
246.6 31 M
246.6 35.34 L
S
GR
GS
[0.75 0 0 0.75 0 0] CT
0.149 GC
2 setlinecap
1 LJ
0.667 LW
N
290 31 M
290 35.34 L
S
GR
GS
[0.75 0 0 0.75 0 0] CT
0.149 GC
2 setlinecap
1 LJ
0.667 LW
N
333.4 31 M
333.4 35.34 L
S
GR
GS
[0.75 0 0 0.75 0 0] CT
0.149 GC
2 setlinecap
1 LJ
0.667 LW
N
376.8 31 M
376.8 35.34 L
S
GR
GS
[0.75 0 0 0.75 0 0] CT
0.149 GC
2 setlinecap
1 LJ
0.667 LW
N
420.2 31 M
420.2 35.34 L
S
GR
GS
[0.75 0 0 0.75 0 0] CT
0.149 GC
2 setlinecap
1 LJ
0.667 LW
N
463.6 31 M
463.6 35.34 L
S
GR
GS
[0.75 0 0 0.75 0 0] CT
0.149 GC
2 setlinecap
1 LJ
0.667 LW
N
507 31 M
507 35.34 L
S
GR
GS
[0.75 0 0 0.75 54.75 284.50001] CT
0.149 GC
/Helvetica 13.333 F
GS
[1 0 0 1 0 0] CT
-4 14 moveto 
1 -1 scale
(0) t 
GR
GR
GS
[0.75 0 0 0.75 87.3 284.50001] CT
0.149 GC
/Helvetica 13.333 F
GS
[1 0 0 1 0 0] CT
-11 14 moveto 
1 -1 scale
(200) t 
GR
GR
GS
[0.75 0 0 0.75 119.85 284.50001] CT
0.149 GC
/Helvetica 13.333 F
GS
[1 0 0 1 0 0] CT
-11 14 moveto 
1 -1 scale
(400) t 
GR
GR
GS
[0.75 0 0 0.75 152.4 284.50001] CT
0.149 GC
/Helvetica 13.333 F
GS
[1 0 0 1 0 0] CT
-11 14 moveto 
1 -1 scale
(600) t 
GR
GR
GS
[0.75 0 0 0.75 184.95 284.50001] CT
0.149 GC
/Helvetica 13.333 F
GS
[1 0 0 1 0 0] CT
-11 14 moveto 
1 -1 scale
(800) t 
GR
GR
GS
[0.75 0 0 0.75 217.5 284.50001] CT
0.149 GC
/Helvetica 13.333 F
GS
[1 0 0 1 0 0] CT
-14.5 14 moveto 
1 -1 scale
(1000) t 
GR
GR
GS
[0.75 0 0 0.75 250.05 284.50001] CT
0.149 GC
/Helvetica 13.333 F
GS
[1 0 0 1 0 0] CT
-14.5 14 moveto 
1 -1 scale
(1200) t 
GR
GR
GS
[0.75 0 0 0.75 282.59999 284.50001] CT
0.149 GC
/Helvetica 13.333 F
GS
[1 0 0 1 0 0] CT
-14.5 14 moveto 
1 -1 scale
(1400) t 
GR
GR
GS
[0.75 0 0 0.75 315.15001 284.50001] CT
0.149 GC
/Helvetica 13.333 F
GS
[1 0 0 1 0 0] CT
-14.5 14 moveto 
1 -1 scale
(1600) t 
GR
GR
GS
[0.75 0 0 0.75 347.7 284.50001] CT
0.149 GC
/Helvetica 13.333 F
GS
[1 0 0 1 0 0] CT
-14.5 14 moveto 
1 -1 scale
(1800) t 
GR
GR
GS
[0.75 0 0 0.75 380.25 284.50001] CT
0.149 GC
/Helvetica 13.333 F
GS
[1 0 0 1 0 0] CT
-14.5 14 moveto 
1 -1 scale
(2000) t 
GR
GR
GS
[0.75 0 0 0.75 0 0] CT
0.149 GC
2 setlinecap
1 LJ
0.667 LW
N
73 374 M
73 31 L
S
GR
GS
[0.75 0 0 0.75 0 0] CT
0.149 GC
2 setlinecap
1 LJ
0.667 LW
N
507 374 M
507 31 L
S
GR
GS
[0.75 0 0 0.75 0 0] CT
0.149 GC
2 setlinecap
1 LJ
0.667 LW
N
73 374 M
77.34 374 L
S
GR
GS
[0.75 0 0 0.75 0 0] CT
0.149 GC
2 setlinecap
1 LJ
0.667 LW
N
73 335.889 M
77.34 335.889 L
S
GR
GS
[0.75 0 0 0.75 0 0] CT
0.149 GC
2 setlinecap
1 LJ
0.667 LW
N
73 297.778 M
77.34 297.778 L
S
GR
GS
[0.75 0 0 0.75 0 0] CT
0.149 GC
2 setlinecap
1 LJ
0.667 LW
N
73 259.667 M
77.34 259.667 L
S
GR
GS
[0.75 0 0 0.75 0 0] CT
0.149 GC
2 setlinecap
1 LJ
0.667 LW
N
73 221.556 M
77.34 221.556 L
S
GR
GS
[0.75 0 0 0.75 0 0] CT
0.149 GC
2 setlinecap
1 LJ
0.667 LW
N
73 183.444 M
77.34 183.444 L
S
GR
GS
[0.75 0 0 0.75 0 0] CT
0.149 GC
2 setlinecap
1 LJ
0.667 LW
N
73 145.333 M
77.34 145.333 L
S
GR
GS
[0.75 0 0 0.75 0 0] CT
0.149 GC
2 setlinecap
1 LJ
0.667 LW
N
73 107.222 M
77.34 107.222 L
S
GR
GS
[0.75 0 0 0.75 0 0] CT
0.149 GC
2 setlinecap
1 LJ
0.667 LW
N
73 69.111 M
77.34 69.111 L
S
GR
GS
[0.75 0 0 0.75 0 0] CT
0.149 GC
2 setlinecap
1 LJ
0.667 LW
N
73 31 M
77.34 31 L
S
GR
GS
[0.75 0 0 0.75 0 0] CT
0.149 GC
2 setlinecap
1 LJ
0.667 LW
N
507 374 M
502.66 374 L
S
GR
GS
[0.75 0 0 0.75 0 0] CT
0.149 GC
2 setlinecap
1 LJ
0.667 LW
N
507 335.889 M
502.66 335.889 L
S
GR
GS
[0.75 0 0 0.75 0 0] CT
0.149 GC
2 setlinecap
1 LJ
0.667 LW
N
507 297.778 M
502.66 297.778 L
S
GR
GS
[0.75 0 0 0.75 0 0] CT
0.149 GC
2 setlinecap
1 LJ
0.667 LW
N
507 259.667 M
502.66 259.667 L
S
GR
GS
[0.75 0 0 0.75 0 0] CT
0.149 GC
2 setlinecap
1 LJ
0.667 LW
N
507 221.556 M
502.66 221.556 L
S
GR
GS
[0.75 0 0 0.75 0 0] CT
0.149 GC
2 setlinecap
1 LJ
0.667 LW
N
507 183.444 M
502.66 183.444 L
S
GR
GS
[0.75 0 0 0.75 0 0] CT
0.149 GC
2 setlinecap
1 LJ
0.667 LW
N
507 145.333 M
502.66 145.333 L
S
GR
GS
[0.75 0 0 0.75 0 0] CT
0.149 GC
2 setlinecap
1 LJ
0.667 LW
N
507 107.222 M
502.66 107.222 L
S
GR
GS
[0.75 0 0 0.75 0 0] CT
0.149 GC
2 setlinecap
1 LJ
0.667 LW
N
507 69.111 M
502.66 69.111 L
S
GR
GS
[0.75 0 0 0.75 0 0] CT
0.149 GC
2 setlinecap
1 LJ
0.667 LW
N
507 31 M
502.66 31 L
S
GR
GS
[0.75 0 0 0.75 50.75 280.5] CT
0.149 GC
/Helvetica 13.333 F
GS
[1 0 0 1 0 0] CT
-19 5.5 moveto 
1 -1 scale
(0.5) t 
GR
GR
GS
[0.75 0 0 0.75 50.75 251.91666] CT
0.149 GC
/Helvetica 13.333 F
GS
[1 0 0 1 0 0] CT
-19 5.5 moveto 
1 -1 scale
(0.6) t 
GR
GR
GS
[0.75 0 0 0.75 50.75 223.33333] CT
0.149 GC
/Helvetica 13.333 F
GS
[1 0 0 1 0 0] CT
-19 5.5 moveto 
1 -1 scale
(0.7) t 
GR
GR
GS
[0.75 0 0 0.75 50.75 194.74999] CT
0.149 GC
/Helvetica 13.333 F
GS
[1 0 0 1 0 0] CT
-19 5.5 moveto 
1 -1 scale
(0.8) t 
GR
GR
GS
[0.75 0 0 0.75 50.75 166.16667] CT
0.149 GC
/Helvetica 13.333 F
GS
[1 0 0 1 0 0] CT
-19 5.5 moveto 
1 -1 scale
(0.9) t 
GR
GR
GS
[0.75 0 0 0.75 50.75 137.58333] CT
0.149 GC
/Helvetica 13.333 F
GS
[1 0 0 1 0 0] CT
-8 5.5 moveto 
1 -1 scale
(1) t 
GR
GR
GS
[0.75 0 0 0.75 50.75 109] CT
0.149 GC
/Helvetica 13.333 F
GS
[1 0 0 1 0 0] CT
-19 5.5 moveto 
1 -1 scale
(1.1) t 
GR
GR
GS
[0.75 0 0 0.75 50.75 80.41665] CT
0.149 GC
/Helvetica 13.333 F
GS
[1 0 0 1 0 0] CT
-19 5.5 moveto 
1 -1 scale
(1.2) t 
GR
GR
GS
[0.75 0 0 0.75 50.75 51.83335] CT
0.149 GC
/Helvetica 13.333 F
GS
[1 0 0 1 0 0] CT
-19 5.5 moveto 
1 -1 scale
(1.3) t 
GR
GR
GS
[0.75 0 0 0.75 50.75 23.25001] CT
0.149 GC
/Helvetica 13.333 F
GS
[1 0 0 1 0 0] CT
-19 5.5 moveto 
1 -1 scale
(1.4) t 
GR
GR
GS
[0.75 0 0 0.75 217.50021 21.18751] CT
/Helvetica-Bold 14.667 F
GS
[1 0 0 1 0 0] CT
-115.5 -4 moveto 
1 -1 scale
(Podminka robustni kvality rizeni) t 
GR
GR
GS
[0.75 0 0 0.75 0 0] CT
0 0.447 0.741 RC
1 LJ
0.667 LW
N
73.217 69.976 M
73.434 69.975 L
73.651 69.975 L
73.868 69.975 L
74.085 69.975 L
74.302 69.974 L
74.519 69.974 L
74.736 69.974 L
74.953 69.973 L
75.17 69.973 L
75.387 69.973 L
75.604 69.972 L
75.821 69.972 L
76.038 69.972 L
76.255 69.971 L
76.472 69.971 L
76.689 69.971 L
76.906 69.97 L
77.123 69.97 L
77.34 69.97 L
77.557 69.969 L
77.774 69.969 L
77.991 69.969 L
78.208 69.968 L
78.425 69.968 L
78.642 69.968 L
78.859 69.967 L
79.076 69.967 L
79.293 69.966 L
79.51 69.966 L
79.727 69.966 L
79.944 69.965 L
80.161 69.965 L
80.378 69.964 L
80.595 69.964 L
80.812 69.964 L
81.029 69.963 L
81.246 69.963 L
81.463 69.962 L
81.68 69.962 L
81.897 69.961 L
82.114 69.961 L
82.331 69.96 L
82.548 69.96 L
82.765 69.959 L
82.982 69.959 L
83.199 69.958 L
83.416 69.958 L
83.633 69.958 L
83.85 69.957 L
84.067 69.956 L
84.284 69.956 L
84.501 69.955 L
84.718 69.955 L
84.935 69.954 L
85.152 69.954 L
85.369 69.953 L
85.586 69.953 L
85.803 69.952 L
86.02 69.952 L
86.237 69.951 L
86.454 69.95 L
86.671 69.95 L
86.888 69.949 L
87.105 69.949 L
87.322 69.948 L
87.539 69.947 L
87.756 69.947 L
87.973 69.946 L
88.19 69.945 L
88.407 69.945 L
88.624 69.944 L
88.841 69.943 L
89.058 69.943 L
89.275 69.942 L
89.492 69.941 L
89.709 69.941 L
89.926 69.94 L
90.143 69.939 L
90.36 69.938 L
90.577 69.938 L
90.794 69.937 L
91.011 69.936 L
91.228 69.935 L
91.445 69.935 L
91.662 69.934 L
91.879 69.933 L
92.096 69.932 L
92.313 69.931 L
92.53 69.931 L
92.747 69.93 L
92.964 69.929 L
93.181 69.928 L
93.398 69.927 L
93.615 69.926 L
93.832 69.925 L
94.049 69.924 L
94.266 69.923 L
94.483 69.922 L
94.7 69.921 L
94.917 69.92 L
95.134 69.92 L
95.351 69.919 L
95.568 69.917 L
95.785 69.916 L
96.002 69.915 L
96.219 69.914 L
96.436 69.913 L
96.653 69.912 L
96.87 69.911 L
97.087 69.91 L
97.304 69.909 L
97.521 69.908 L
97.738 69.907 L
97.955 69.905 L
98.172 69.904 L
98.389 69.903 L
98.606 69.902 L
98.823 69.9 L
99.04 69.899 L
99.257 69.898 L
99.474 69.897 L
99.691 69.895 L
99.908 69.894 L
100.125 69.893 L
100.342 69.891 L
100.559 69.89 L
100.776 69.888 L
100.993 69.887 L
101.21 69.886 L
101.427 69.884 L
101.644 69.883 L
101.861 69.881 L
102.078 69.88 L
102.295 69.878 L
102.512 69.877 L
102.729 69.875 L
102.946 69.873 L
103.163 69.872 L
103.38 69.87 L
103.597 69.868 L
103.814 69.867 L
104.031 69.865 L
104.248 69.863 L
104.465 69.861 L
104.682 69.86 L
104.899 69.858 L
105.116 69.856 L
105.333 69.854 L
105.55 69.852 L
105.767 69.85 L
105.984 69.848 L
106.201 69.847 L
106.418 69.845 L
106.635 69.843 L
106.852 69.84 L
107.069 69.838 L
107.286 69.836 L
107.503 69.834 L
107.72 69.832 L
107.937 69.83 L
108.154 69.828 L
108.371 69.826 L
108.588 69.823 L
108.805 69.821 L
109.022 69.819 L
109.239 69.816 L
109.456 69.814 L
109.673 69.812 L
109.89 69.809 L
110.107 69.807 L
110.324 69.804 L
110.541 69.802 L
110.758 69.799 L
110.975 69.796 L
111.192 69.794 L
111.409 69.791 L
111.626 69.788 L
111.843 69.786 L
112.06 69.783 L
112.277 69.78 L
112.494 69.777 L
112.711 69.775 L
112.928 69.772 L
113.145 69.769 L
113.362 69.766 L
113.579 69.763 L
113.796 69.76 L
114.013 69.757 L
114.23 69.754 L
114.447 69.75 L
114.664 69.747 L
114.881 69.744 L
115.098 69.741 L
115.315 69.738 L
115.532 69.734 L
115.749 69.731 L
115.966 69.727 L
116.183 69.724 L
116.4 69.721 L
116.617 69.717 L
116.834 69.713 L
117.051 69.71 L
117.268 69.706 L
117.485 69.703 L
117.702 69.699 L
117.919 69.695 L
118.136 69.691 L
118.353 69.688 L
118.57 69.684 L
118.787 69.68 L
119.004 69.676 L
119.221 69.672 L
119.438 69.668 L
119.655 69.664 L
119.872 69.66 L
120.089 69.656 L
120.306 69.651 L
120.523 69.647 L
120.74 69.643 L
120.957 69.639 L
121.174 69.634 L
121.391 69.63 L
121.608 69.626 L
121.825 69.621 L
122.042 69.617 L
122.259 69.612 L
122.476 69.608 L
122.693 69.603 L
122.91 69.599 L
123.127 69.594 L
123.344 69.59 L
123.561 69.585 L
123.778 69.58 L
123.995 69.575 L
124.212 69.571 L
124.429 69.566 L
124.646 69.561 L
124.863 69.556 L
125.08 69.551 L
125.297 69.547 L
125.514 69.542 L
125.731 69.537 L
125.948 69.532 L
126.165 69.527 L
126.382 69.522 L
126.599 69.517 L
126.816 69.512 L
127.033 69.507 L
127.25 69.502 L
127.467 69.497 L
127.684 69.492 L
127.901 69.487 L
128.118 69.482 L
128.335 69.477 L
128.552 69.472 L
128.769 69.467 L
128.986 69.462 L
129.203 69.457 L
129.42 69.452 L
129.637 69.447 L
129.854 69.442 L
130.071 69.437 L
130.288 69.432 L
130.505 69.427 L
130.722 69.422 L
130.939 69.418 L
131.156 69.413 L
131.373 69.408 L
131.59 69.404 L
131.807 69.399 L
132.024 69.395 L
132.241 69.39 L
132.458 69.386 L
132.675 69.381 L
132.892 69.377 L
133.109 69.373 L
133.326 69.369 L
133.543 69.365 L
133.76 69.361 L
133.977 69.358 L
134.194 69.354 L
134.411 69.351 L
134.628 69.347 L
134.845 69.344 L
135.062 69.341 L
135.279 69.338 L
135.496 69.335 L
135.713 69.333 L
135.93 69.33 L
136.147 69.328 L
136.364 69.326 L
136.581 69.324 L
136.798 69.323 L
137.015 69.321 L
137.232 69.32 L
137.449 69.319 L
137.666 69.319 L
137.883 69.318 L
138.1 69.318 L
138.317 69.318 L
138.534 69.319 L
138.751 69.32 L
138.968 69.321 L
139.185 69.322 L
139.402 69.324 L
139.619 69.327 L
139.836 69.329 L
140.053 69.332 L
140.27 69.336 L
140.487 69.339 L
140.704 69.344 L
140.921 69.348 L
141.138 69.354 L
141.355 69.359 L
141.572 69.366 L
141.789 69.372 L
142.006 69.38 L
142.223 69.388 L
142.44 69.396 L
142.657 69.405 L
142.874 69.415 L
143.091 69.425 L
143.308 69.437 L
143.525 69.448 L
143.742 69.461 L
143.959 69.474 L
144.176 69.488 L
144.393 69.503 L
144.61 69.519 L
144.827 69.536 L
145.044 69.553 L
145.261 69.571 L
145.478 69.591 L
145.695 69.611 L
145.912 69.632 L
146.129 69.655 L
146.346 69.678 L
146.563 69.703 L
146.78 69.728 L
146.997 69.755 L
147.214 69.783 L
147.431 69.812 L
147.648 69.843 L
147.865 69.875 L
148.082 69.908 L
148.299 69.943 L
148.516 69.979 L
148.733 70.017 L
148.95 70.056 L
149.167 70.096 L
149.384 70.139 L
149.601 70.183 L
149.818 70.228 L
150.035 70.276 L
150.252 70.325 L
150.469 70.376 L
150.686 70.429 L
150.903 70.484 L
151.12 70.542 L
151.337 70.601 L
151.554 70.662 L
151.771 70.725 L
151.988 70.791 L
152.205 70.859 L
152.422 70.93 L
152.639 71.003 L
152.856 71.078 L
153.073 71.156 L
153.29 71.236 L
153.507 71.32 L
153.724 71.406 L
153.941 71.495 L
154.158 71.587 L
154.375 71.681 L
154.592 71.779 L
154.809 71.88 L
155.026 71.985 L
155.243 72.092 L
155.46 72.203 L
155.677 72.318 L
155.894 72.436 L
156.111 72.557 L
156.328 72.683 L
156.545 72.812 L
156.762 72.945 L
156.979 73.082 L
157.196 73.224 L
157.413 73.369 L
157.63 73.519 L
157.847 73.673 L
158.064 73.832 L
158.281 73.995 L
158.498 74.163 L
158.715 74.336 L
158.932 74.514 L
159.149 74.696 L
159.366 74.884 L
159.583 75.078 L
159.8 75.276 L
160.017 75.48 L
160.234 75.69 L
160.451 75.905 L
160.668 76.126 L
160.885 76.354 L
161.102 76.587 L
161.319 76.827 L
161.536 77.073 L
161.753 77.325 L
161.97 77.584 L
162.187 77.85 L
162.404 78.122 L
162.621 78.402 L
162.838 78.689 L
163.055 78.983 L
163.272 79.285 L
163.489 79.594 L
163.706 79.911 L
163.923 80.236 L
164.14 80.569 L
164.357 80.91 L
164.574 81.259 L
164.791 81.617 L
165.008 81.983 L
165.225 82.358 L
165.442 82.742 L
165.659 83.136 L
165.876 83.538 L
166.093 83.95 L
166.31 84.371 L
166.527 84.802 L
166.744 85.243 L
166.961 85.694 L
167.178 86.155 L
167.395 86.626 L
167.612 87.108 L
167.829 87.601 L
168.046 88.104 L
168.263 88.619 L
168.48 89.144 L
168.697 89.681 L
168.914 90.229 L
169.131 90.789 L
169.348 91.361 L
169.565 91.944 L
169.782 92.54 L
169.999 93.147 L
170.216 93.767 L
170.433 94.4 L
170.65 95.045 L
170.867 95.703 L
171.084 96.374 L
171.301 97.059 L
171.518 97.756 L
171.735 98.467 L
171.952 99.191 L
172.169 99.929 L
172.386 100.681 L
172.603 101.446 L
172.82 102.226 L
173.037 103.02 L
173.254 103.828 L
173.471 104.65 L
173.688 105.487 L
173.905 106.338 L
174.122 107.204 L
174.339 108.085 L
174.556 108.981 L
174.773 109.892 L
174.99 110.817 L
175.207 111.758 L
175.424 112.714 L
175.641 113.685 L
175.858 114.672 L
176.075 115.674 L
176.292 116.691 L
176.509 117.723 L
176.726 118.771 L
176.943 119.834 L
177.16 120.913 L
177.377 122.008 L
177.594 123.117 L
177.811 124.243 L
178.028 125.383 L
178.245 126.539 L
178.462 127.711 L
178.679 128.898 L
178.896 130.1 L
179.113 131.317 L
179.33 132.55 L
179.547 133.797 L
179.764 135.06 L
179.981 136.337 L
180.198 137.629 L
180.415 138.936 L
180.632 140.258 L
180.849 141.593 L
181.066 142.943 L
181.283 144.308 L
181.5 145.686 L
181.717 147.078 L
181.934 148.483 L
182.151 149.902 L
182.368 151.334 L
182.585 152.779 L
182.802 154.237 L
183.019 155.708 L
183.236 157.19 L
183.453 158.685 L
183.67 160.192 L
183.887 161.71 L
184.104 163.239 L
184.321 164.779 L
184.538 166.33 L
184.755 167.891 L
184.972 169.462 L
185.189 171.043 L
185.406 172.633 L
185.623 174.232 L
185.84 175.84 L
186.057 177.456 L
186.274 179.079 L
186.491 180.711 L
186.708 182.35 L
186.925 183.995 L
187.142 185.647 L
187.359 187.304 L
187.576 188.967 L
187.793 190.636 L
188.01 192.309 L
188.227 193.986 L
188.444 195.667 L
188.661 197.351 L
188.878 199.038 L
189.095 200.728 L
189.312 202.419 L
189.529 204.112 L
189.746 205.806 L
189.963 207.501 L
190.18 209.195 L
190.397 210.889 L
190.614 212.581 L
190.831 214.272 L
191.048 215.961 L
191.265 217.648 L
191.482 219.331 L
191.699 221.01 L
191.916 222.686 L
192.133 224.356 L
192.35 226.021 L
192.567 227.68 L
192.784 229.333 L
193.001 230.978 L
193.218 232.616 L
193.435 234.246 L
193.652 235.868 L
193.869 237.48 L
194.086 239.083 L
194.303 240.676 L
194.52 242.259 L
194.737 243.831 L
194.954 245.392 L
195.171 246.942 L
195.388 248.481 L
195.605 250.008 L
195.822 251.523 L
196.039 253.026 L
196.256 254.517 L
196.473 255.996 L
196.69 257.463 L
196.907 258.918 L
197.124 260.361 L
197.341 261.792 L
197.558 263.211 L
197.775 264.619 L
197.992 266.014 L
198.209 267.398 L
198.426 268.77 L
198.643 270.13 L
198.86 271.478 L
199.077 272.815 L
199.294 274.14 L
199.511 275.453 L
199.728 276.755 L
199.945 278.045 L
200.162 279.323 L
200.379 280.589 L
200.596 281.844 L
200.813 283.086 L
201.03 284.317 L
201.247 285.536 L
201.464 286.742 L
201.681 287.937 L
201.898 289.119 L
202.115 290.289 L
202.332 291.447 L
202.549 292.592 L
202.766 293.725 L
202.983 294.846 L
203.2 295.954 L
203.417 297.049 L
203.634 298.116 L
203.851 299.13 L
204.068 300.132 L
204.285 301.121 L
204.502 302.098 L
204.719 303.063 L
204.936 304.015 L
205.153 304.955 L
205.37 305.882 L
205.587 306.797 L
205.804 307.699 L
206.021 308.588 L
206.238 309.463 L
206.455 310.326 L
206.672 311.176 L
206.889 312.011 L
207.106 312.834 L
207.323 313.642 L
207.54 314.437 L
207.757 315.218 L
207.974 315.984 L
208.191 316.736 L
208.408 317.473 L
208.625 318.196 L
208.842 318.904 L
209.059 319.597 L
209.276 320.274 L
209.493 320.937 L
209.71 321.584 L
209.927 322.217 L
210.144 322.834 L
210.361 323.437 L
210.578 324.025 L
210.795 324.599 L
211.012 325.159 L
211.229 325.706 L
211.446 326.239 L
211.663 326.76 L
211.88 327.27 L
212.097 327.768 L
212.314 328.255 L
212.531 328.731 L
212.748 329.198 L
212.965 329.656 L
213.182 330.105 L
213.399 330.546 L
213.616 330.979 L
213.833 331.404 L
214.05 331.822 L
214.267 332.234 L
214.484 332.639 L
214.701 333.039 L
214.918 333.432 L
215.135 333.82 L
215.352 334.203 L
215.569 334.58 L
215.786 334.953 L
216.003 335.321 L
216.22 335.684 L
216.437 336.043 L
216.654 336.398 L
216.871 336.749 L
217.088 337.096 L
217.305 337.435 L
217.522 337.756 L
217.739 338.074 L
217.956 338.39 L
218.173 338.702 L
218.39 339.012 L
218.607 339.319 L
218.824 339.623 L
219.041 339.924 L
219.258 340.223 L
219.475 340.52 L
219.692 340.813 L
219.909 341.104 L
220.126 341.393 L
220.343 341.68 L
220.56 341.964 L
220.777 342.245 L
220.994 342.525 L
221.211 342.802 L
221.428 343.077 L
221.645 343.349 L
221.862 343.619 L
222.079 343.888 L
222.296 344.154 L
222.513 344.417 L
222.73 344.679 L
222.947 344.939 L
223.164 345.196 L
223.381 345.452 L
223.598 345.705 L
223.815 345.957 L
224.032 346.206 L
224.249 346.454 L
224.466 346.7 L
224.683 346.943 L
224.9 347.185 L
225.117 347.425 L
225.334 347.663 L
225.551 347.899 L
225.768 348.133 L
225.985 348.365 L
226.202 348.596 L
226.419 348.824 L
226.636 349.051 L
226.853 349.276 L
227.07 349.5 L
227.287 349.721 L
227.504 349.941 L
227.721 350.159 L
227.938 350.375 L
228.155 350.59 L
228.372 350.803 L
228.589 351.014 L
228.806 351.224 L
229.023 351.432 L
229.24 351.638 L
229.457 351.843 L
229.674 352.046 L
229.891 352.248 L
230.108 352.448 L
230.325 352.646 L
230.542 352.843 L
230.759 353.038 L
230.976 353.232 L
231.193 353.424 L
231.41 353.615 L
231.627 353.804 L
231.844 353.992 L
232.061 354.178 L
232.278 354.363 L
232.495 354.546 L
232.712 354.728 L
232.929 354.908 L
233.146 355.087 L
233.363 355.265 L
233.58 355.441 L
233.797 355.615 L
234.014 355.789 L
234.231 355.961 L
234.448 356.131 L
234.665 356.301 L
234.882 356.469 L
235.099 356.635 L
235.316 356.8 L
235.533 356.964 L
235.75 357.127 L
235.967 357.288 L
236.184 357.448 L
236.401 357.607 L
236.618 357.765 L
236.835 357.921 L
237.052 358.076 L
237.269 358.23 L
237.486 358.382 L
237.703 358.534 L
237.92 358.684 L
238.137 358.833 L
238.354 358.98 L
238.571 359.127 L
238.788 359.272 L
239.005 359.417 L
239.222 359.56 L
239.439 359.701 L
239.656 359.842 L
239.873 359.982 L
240.09 360.12 L
240.307 360.258 L
240.524 360.394 L
240.741 360.529 L
240.958 360.663 L
241.175 360.796 L
241.392 360.928 L
241.609 361.059 L
241.826 361.188 L
242.043 361.317 L
242.26 361.444 L
242.477 361.571 L
242.694 361.697 L
242.911 361.821 L
243.128 361.944 L
243.345 362.067 L
243.562 362.188 L
243.779 362.309 L
243.996 362.428 L
244.213 362.547 L
244.43 362.664 L
244.647 362.78 L
244.864 362.896 L
245.081 363.01 L
245.298 363.124 L
245.515 363.237 L
245.732 363.348 L
245.949 363.459 L
246.166 363.569 L
246.383 363.678 L
246.6 363.786 L
246.817 363.893 L
247.034 363.999 L
247.251 364.104 L
247.468 364.208 L
247.685 364.312 L
247.902 364.414 L
248.119 364.516 L
248.336 364.616 L
248.553 364.716 L
248.77 364.815 L
248.987 364.914 L
249.204 365.011 L
249.421 365.107 L
249.638 365.203 L
249.855 365.298 L
250.072 365.392 L
250.289 365.485 L
250.506 365.577 L
250.723 365.668 L
250.94 365.759 L
251.157 365.849 L
251.374 365.938 L
251.591 366.026 L
251.808 366.114 L
252.025 366.201 L
252.242 366.286 L
252.459 366.371 L
252.676 366.456 L
252.893 366.539 L
253.11 366.622 L
253.327 366.704 L
253.544 366.786 L
253.761 366.866 L
253.978 366.946 L
254.195 367.025 L
254.412 367.103 L
254.629 367.181 L
254.846 367.258 L
255.063 367.334 L
255.28 367.409 L
255.497 367.484 L
255.714 367.558 L
255.931 367.631 L
256.148 367.703 L
256.365 367.775 L
256.582 367.846 L
256.799 367.916 L
257.016 367.986 L
257.233 368.055 L
257.45 368.124 L
257.667 368.191 L
257.884 368.259 L
258.101 368.325 L
258.318 368.391 L
258.535 368.456 L
258.752 368.52 L
258.969 368.584 L
259.186 368.648 L
259.403 368.71 L
259.62 368.772 L
259.837 368.834 L
260.054 368.895 L
260.271 368.955 L
260.488 369.014 L
260.705 369.073 L
260.922 369.132 L
261.139 369.19 L
261.356 369.247 L
261.573 369.304 L
261.79 369.36 L
262.007 369.415 L
262.224 369.47 L
262.441 369.525 L
262.658 369.579 L
262.875 369.632 L
263.092 369.685 L
263.309 369.737 L
263.526 369.788 L
263.743 369.84 L
263.96 369.89 L
264.177 369.94 L
264.394 369.99 L
264.611 370.039 L
264.828 370.087 L
265.045 370.135 L
265.262 370.183 L
265.479 370.23 L
265.696 370.276 L
265.913 370.322 L
266.13 370.368 L
266.347 370.413 L
266.564 370.458 L
266.781 370.502 L
266.998 370.545 L
267.215 370.588 L
267.432 370.631 L
267.649 370.673 L
267.866 370.715 L
268.083 370.756 L
268.3 370.797 L
268.517 370.838 L
268.734 370.878 L
268.951 370.917 L
269.168 370.956 L
269.385 370.995 L
269.602 371.033 L
269.819 371.071 L
270.036 371.108 L
270.253 371.145 L
270.47 371.182 L
270.687 371.218 L
270.904 371.254 L
271.121 371.289 L
271.338 371.324 L
271.555 371.359 L
271.772 371.393 L
271.989 371.427 L
272.206 371.46 L
272.423 371.493 L
272.64 371.526 L
272.857 371.558 L
273.074 371.59 L
273.291 371.622 L
273.508 371.653 L
273.725 371.684 L
273.942 371.714 L
274.159 371.744 L
274.376 371.774 L
274.593 371.803 L
274.81 371.833 L
275.027 371.861 L
275.244 371.89 L
275.461 371.918 L
275.678 371.946 L
275.895 371.973 L
276.112 372 L
276.329 372.027 L
276.546 372.054 L
276.763 372.08 L
276.98 372.106 L
277.197 372.131 L
277.414 372.156 L
277.631 372.181 L
277.848 372.206 L
278.065 372.231 L
278.282 372.255 L
278.499 372.278 L
278.716 372.302 L
278.933 372.325 L
279.15 372.348 L
279.367 372.371 L
279.584 372.393 L
279.801 372.416 L
280.018 372.437 L
280.235 372.459 L
280.452 372.48 L
280.669 372.502 L
280.886 372.522 L
281.103 372.543 L
281.32 372.563 L
281.537 372.583 L
281.754 372.603 L
281.971 372.623 L
282.188 372.642 L
282.405 372.661 L
282.622 372.68 L
282.839 372.699 L
283.056 372.717 L
283.273 372.736 L
283.49 372.754 L
283.707 372.771 L
283.924 372.789 L
284.141 372.806 L
284.358 372.823 L
284.575 372.84 L
284.792 372.857 L
285.009 372.874 L
285.226 372.89 L
285.443 372.906 L
285.66 372.922 L
285.877 372.937 L
286.094 372.953 L
286.311 372.968 L
286.528 372.983 L
286.745 372.998 L
286.962 373.013 L
287.179 373.027 L
287.396 373.042 L
287.613 373.056 L
287.83 373.07 L
288.047 373.084 L
288.264 373.097 L
288.481 373.111 L
288.698 373.124 L
288.915 373.137 L
289.132 373.15 L
289.349 373.163 L
289.566 373.175 L
289.783 373.188 L
290 373.2 L
290.217 373.212 L
290.434 373.224 L
290.651 373.236 L
290.868 373.248 L
291.085 373.259 L
291.302 373.27 L
291.519 373.282 L
291.736 373.293 L
291.953 373.304 L
292.17 373.314 L
292.387 373.325 L
292.604 373.335 L
292.821 373.346 L
293.038 373.356 L
293.255 373.366 L
293.472 373.376 L
293.689 373.386 L
293.906 373.395 L
294.123 373.405 L
294.34 373.414 L
294.557 373.423 L
294.774 373.433 L
294.991 373.442 L
295.208 373.451 L
295.425 373.459 L
295.642 373.468 L
295.859 373.476 L
296.076 373.485 L
296.293 373.493 L
296.51 373.501 L
296.727 373.509 L
296.944 373.517 L
297.161 373.525 L
297.378 373.533 L
297.595 373.54 L
297.812 373.548 L
298.029 373.555 L
298.246 373.563 L
298.463 373.57 L
298.68 373.577 L
298.897 373.584 L
299.114 373.591 L
299.331 373.598 L
299.548 373.604 L
299.765 373.611 L
299.982 373.617 L
300.199 373.624 L
300.416 373.63 L
300.633 373.636 L
300.85 373.642 L
301.067 373.648 L
301.284 373.654 L
301.501 373.66 L
301.718 373.666 L
301.935 373.672 L
302.152 373.677 L
302.369 373.683 L
302.586 373.688 L
302.803 373.694 L
303.02 373.699 L
303.237 373.704 L
303.454 373.709 L
303.671 373.714 L
303.888 373.719 L
304.105 373.724 L
304.322 373.729 L
304.539 373.733 L
304.756 373.738 L
304.973 373.743 L
305.19 373.747 L
305.407 373.752 L
305.624 373.756 L
305.841 373.76 L
306.058 373.765 L
306.275 373.769 L
306.492 373.773 L
306.709 373.777 L
306.926 373.781 L
307.143 373.785 L
307.36 373.789 L
307.577 373.792 L
307.794 373.796 L
308.011 373.8 L
308.228 373.803 L
308.445 373.807 L
308.662 373.81 L
308.879 373.814 L
309.096 373.817 L
309.313 373.821 L
309.53 373.824 L
309.747 373.827 L
309.964 373.83 L
310.181 373.833 L
310.398 373.836 L
310.615 373.839 L
310.832 373.842 L
311.049 373.845 L
311.266 373.848 L
311.483 373.851 L
311.7 373.854 L
311.917 373.856 L
312.134 373.859 L
312.351 373.862 L
312.568 373.864 L
312.785 373.867 L
313.002 373.869 L
313.219 373.872 L
313.436 373.874 L
313.653 373.876 L
313.87 373.879 L
314.087 373.881 L
314.304 373.883 L
314.521 373.885 L
314.738 373.888 L
314.955 373.89 L
315.172 373.892 L
315.389 373.894 L
315.606 373.896 L
315.823 373.898 L
316.04 373.9 L
316.257 373.902 L
316.474 373.904 L
316.691 373.905 L
316.908 373.907 L
317.125 373.909 L
317.342 373.911 L
317.559 373.913 L
317.776 373.914 L
317.993 373.916 L
318.21 373.918 L
318.427 373.919 L
318.644 373.921 L
318.861 373.922 L
319.078 373.924 L
319.295 373.925 L
319.512 373.927 L
319.729 373.928 L
319.946 373.93 L
320.163 373.931 L
320.38 373.932 L
320.597 373.934 L
320.814 373.935 L
321.031 373.936 L
321.248 373.937 L
321.465 373.939 L
321.682 373.94 L
321.899 373.941 L
322.116 373.942 L
322.333 373.943 L
322.55 373.944 L
322.767 373.945 L
322.984 373.947 L
323.201 373.948 L
323.418 373.949 L
323.635 373.95 L
323.852 373.951 L
324.069 373.952 L
324.286 373.953 L
324.503 373.954 L
324.72 373.954 L
324.937 373.955 L
325.154 373.956 L
325.371 373.957 L
325.588 373.958 L
325.805 373.959 L
326.022 373.96 L
326.239 373.96 L
326.456 373.961 L
326.673 373.962 L
326.89 373.963 L
327.107 373.964 L
327.324 373.964 L
327.541 373.965 L
327.758 373.966 L
327.975 373.966 L
328.192 373.967 L
328.409 373.968 L
328.626 373.968 L
328.843 373.969 L
329.06 373.97 L
329.277 373.97 L
329.494 373.971 L
329.711 373.971 L
329.928 373.972 L
330.145 373.973 L
330.362 373.973 L
330.579 373.974 L
330.796 373.974 L
331.013 373.975 L
331.23 373.975 L
331.447 373.976 L
331.664 373.976 L
331.881 373.977 L
332.098 373.977 L
332.315 373.978 L
332.532 373.978 L
332.749 373.979 L
332.966 373.979 L
333.183 373.979 L
333.4 373.98 L
333.617 373.98 L
333.834 373.981 L
334.051 373.981 L
334.268 373.981 L
334.485 373.982 L
334.702 373.982 L
334.919 373.983 L
335.136 373.983 L
335.353 373.983 L
335.57 373.984 L
335.787 373.984 L
336.004 373.984 L
336.221 373.985 L
336.438 373.985 L
336.655 373.985 L
336.872 373.985 L
337.089 373.986 L
337.306 373.986 L
337.523 373.986 L
337.74 373.987 L
337.957 373.987 L
338.174 373.987 L
338.391 373.987 L
338.608 373.988 L
338.825 373.988 L
339.042 373.988 L
339.259 373.988 L
339.476 373.989 L
339.693 373.989 L
339.91 373.989 L
340.127 373.989 L
340.344 373.99 L
340.561 373.99 L
340.778 373.99 L
340.995 373.99 L
341.212 373.99 L
341.429 373.991 L
341.646 373.991 L
341.863 373.991 L
342.08 373.991 L
342.297 373.991 L
342.514 373.991 L
342.731 373.992 L
342.948 373.992 L
343.165 373.992 L
343.382 373.992 L
343.599 373.992 L
343.816 373.992 L
344.033 373.993 L
344.25 373.993 L
344.467 373.993 L
344.684 373.993 L
344.901 373.993 L
345.118 373.993 L
345.335 373.993 L
345.552 373.994 L
345.769 373.994 L
345.986 373.994 L
346.203 373.994 L
346.42 373.994 L
346.637 373.994 L
346.854 373.994 L
347.071 373.994 L
347.288 373.995 L
347.505 373.995 L
347.722 373.995 L
347.939 373.995 L
348.156 373.995 L
348.373 373.995 L
348.59 373.995 L
348.807 373.995 L
349.024 373.995 L
349.241 373.996 L
349.458 373.996 L
349.675 373.996 L
349.892 373.996 L
350.109 373.996 L
350.326 373.996 L
350.543 373.996 L
350.76 373.996 L
350.977 373.996 L
351.194 373.996 L
351.411 373.996 L
351.628 373.996 L
351.845 373.996 L
352.062 373.997 L
352.279 373.997 L
352.496 373.997 L
352.713 373.997 L
352.93 373.997 L
353.147 373.997 L
353.364 373.997 L
353.581 373.997 L
353.798 373.997 L
354.015 373.997 L
354.232 373.997 L
354.449 373.997 L
354.666 373.997 L
354.883 373.997 L
355.1 373.997 L
355.317 373.997 L
355.534 373.998 L
355.751 373.998 L
355.968 373.998 L
356.185 373.998 L
356.402 373.998 L
356.619 373.998 L
356.836 373.998 L
357.053 373.998 L
357.27 373.998 L
357.487 373.998 L
357.704 373.998 L
357.921 373.998 L
358.138 373.998 L
358.355 373.998 L
358.572 373.998 L
358.789 373.998 L
359.006 373.998 L
359.223 373.998 L
359.44 373.998 L
359.657 373.998 L
359.874 373.998 L
360.091 373.998 L
360.308 373.998 L
360.525 373.998 L
360.742 373.998 L
360.959 373.999 L
361.176 373.999 L
361.393 373.999 L
361.61 373.999 L
361.827 373.999 L
362.044 373.999 L
362.261 373.999 L
362.478 373.999 L
362.695 373.999 L
362.912 373.999 L
363.129 373.999 L
363.346 373.999 L
363.563 373.999 L
363.78 373.999 L
363.997 373.999 L
364.214 373.999 L
364.431 373.999 L
364.648 373.999 L
364.865 373.999 L
365.082 373.999 L
365.299 373.999 L
365.516 373.999 L
365.733 373.999 L
365.95 373.999 L
366.167 373.999 L
366.384 373.999 L
366.601 373.999 L
366.818 373.999 L
367.035 373.999 L
367.252 373.999 L
367.469 373.999 L
367.686 373.999 L
367.903 373.999 L
368.12 373.999 L
368.337 373.999 L
368.554 373.999 L
368.771 373.999 L
368.988 373.999 L
369.205 373.999 L
369.422 373.999 L
369.639 373.999 L
369.856 373.999 L
370.073 373.999 L
370.29 373.999 L
370.507 373.999 L
370.724 373.999 L
370.941 373.999 L
371.158 373.999 L
371.375 373.999 L
371.592 373.999 L
371.809 373.999 L
372.026 373.999 L
372.243 373.999 L
372.46 373.999 L
372.677 374 L
372.894 374 L
373.111 374 L
373.328 374 L
373.545 374 L
373.762 374 L
373.979 374 L
374.196 374 L
374.413 374 L
374.63 374 L
374.847 374 L
375.064 374 L
375.281 374 L
375.498 374 L
375.715 374 L
375.932 374 L
376.149 374 L
376.366 374 L
376.583 374 L
376.8 374 L
377.017 374 L
377.234 374 L
377.451 374 L
377.668 374 L
377.885 374 L
378.102 374 L
378.319 374 L
378.536 374 L
378.753 374 L
378.97 374 L
379.187 374 L
379.404 374 L
379.621 374 L
379.838 374 L
380.055 374 L
380.272 374 L
380.489 374 L
380.706 374 L
380.923 374 L
381.14 374 L
381.357 374 L
381.574 374 L
381.791 374 L
382.008 374 L
382.225 374 L
382.442 374 L
382.659 374 L
382.876 374 L
383.093 374 L
383.31 374 L
383.527 374 L
383.744 374 L
383.961 374 L
384.178 374 L
384.395 374 L
384.612 374 L
384.829 374 L
385.046 374 L
385.263 374 L
385.48 374 L
385.697 374 L
385.914 374 L
386.131 374 L
386.348 374 L
386.565 374 L
386.782 374 L
386.999 374 L
387.216 374 L
387.433 374 L
387.65 374 L
387.867 374 L
388.084 374 L
388.301 374 L
388.518 374 L
388.735 374 L
388.952 374 L
389.169 374 L
389.386 374 L
389.603 374 L
389.82 374 L
390.037 374 L
390.254 374 L
390.471 374 L
390.688 374 L
390.905 374 L
391.122 374 L
391.339 374 L
391.556 374 L
391.773 374 L
391.99 374 L
392.207 374 L
392.424 374 L
392.641 374 L
392.858 374 L
393.075 374 L
393.292 374 L
393.509 374 L
393.726 374 L
393.943 374 L
394.16 374 L
394.377 374 L
394.594 374 L
394.811 374 L
395.028 374 L
395.245 374 L
395.462 374 L
395.679 374 L
395.896 374 L
396.113 374 L
396.33 374 L
396.547 374 L
396.764 374 L
396.981 374 L
397.198 374 L
397.415 374 L
397.632 374 L
397.849 374 L
398.066 374 L
398.283 374 L
398.5 374 L
398.717 374 L
398.934 374 L
399.151 374 L
399.368 374 L
399.585 374 L
399.802 374 L
400.019 374 L
400.236 374 L
400.453 374 L
400.67 374 L
400.887 374 L
401.104 374 L
401.321 374 L
401.538 374 L
401.755 374 L
401.972 374 L
402.189 374 L
402.406 374 L
402.623 374 L
402.84 374 L
403.057 374 L
403.274 374 L
403.491 374 L
403.708 374 L
403.925 374 L
404.142 374 L
404.359 374 L
404.576 374 L
404.793 374 L
405.01 374 L
405.227 374 L
405.444 374 L
405.661 374 L
405.878 374 L
406.095 374 L
406.312 374 L
406.529 374 L
406.746 374 L
406.963 374 L
407.18 374 L
407.397 374 L
407.614 374 L
407.831 374 L
408.048 374 L
408.265 374 L
408.482 374 L
408.699 374 L
408.916 374 L
409.133 374 L
409.35 374 L
409.567 374 L
409.784 374 L
410.001 374 L
410.218 374 L
410.435 374 L
410.652 374 L
410.869 374 L
411.086 374 L
411.303 374 L
411.52 374 L
411.737 374 L
411.954 374 L
412.171 374 L
412.388 374 L
412.605 374 L
412.822 374 L
413.039 374 L
413.256 374 L
413.473 374 L
413.69 374 L
413.907 374 L
414.124 374 L
414.341 374 L
414.558 374 L
414.775 374 L
414.992 374 L
415.209 374 L
415.426 374 L
415.643 374 L
415.86 374 L
416.077 374 L
416.294 374 L
416.511 374 L
416.728 374 L
416.945 374 L
417.162 374 L
417.379 374 L
417.596 374 L
417.813 374 L
418.03 374 L
418.247 374 L
418.464 374 L
418.681 374 L
418.898 374 L
419.115 374 L
419.332 374 L
419.549 374 L
419.766 374 L
419.983 374 L
420.2 374 L
420.417 374 L
420.634 374 L
420.851 374 L
421.068 374 L
421.285 374 L
421.502 374 L
421.719 374 L
421.936 374 L
422.153 374 L
422.37 374 L
422.587 374 L
422.804 374 L
423.021 374 L
423.238 374 L
423.455 374 L
423.672 374 L
423.889 374 L
424.106 374 L
424.323 374 L
424.54 374 L
424.757 374 L
424.974 374 L
425.191 374 L
425.408 374 L
425.625 374 L
425.842 374 L
426.059 374 L
426.276 374 L
426.493 374 L
426.71 374 L
426.927 374 L
427.144 374 L
427.361 374 L
427.578 374 L
427.795 374 L
428.012 374 L
428.229 374 L
428.446 374 L
428.663 374 L
428.88 374 L
429.097 374 L
429.314 374 L
429.531 374 L
429.748 374 L
429.965 374 L
430.182 374 L
430.399 374 L
430.616 374 L
430.833 374 L
431.05 374 L
431.267 374 L
431.484 374 L
431.701 374 L
431.918 374 L
432.135 374 L
432.352 374 L
432.569 374 L
432.786 374 L
433.003 374 L
433.22 374 L
433.437 374 L
433.654 374 L
433.871 374 L
434.088 374 L
434.305 374 L
434.522 374 L
434.739 374 L
434.956 374 L
435.173 374 L
435.39 374 L
435.607 374 L
435.824 374 L
436.041 374 L
436.258 374 L
436.475 374 L
436.692 374 L
436.909 374 L
437.126 374 L
437.343 374 L
437.56 374 L
437.777 374 L
437.994 374 L
438.211 374 L
438.428 374 L
438.645 374 L
438.862 374 L
439.079 374 L
439.296 374 L
439.513 374 L
439.73 374 L
439.947 374 L
440.164 374 L
440.381 374 L
440.598 374 L
440.815 374 L
441.032 374 L
441.249 374 L
441.466 374 L
441.683 374 L
441.9 374 L
442.117 374 L
442.334 374 L
442.551 374 L
442.768 374 L
442.985 374 L
443.202 374 L
443.419 374 L
443.636 374 L
443.853 374 L
444.07 374 L
444.287 374 L
444.504 374 L
444.721 374 L
444.938 374 L
445.155 374 L
445.372 374 L
445.589 374 L
445.806 374 L
446.023 374 L
446.24 374 L
446.457 374 L
446.674 374 L
446.891 374 L
447.108 374 L
447.325 374 L
447.542 374 L
447.759 374 L
447.976 374 L
448.193 374 L
448.41 374 L
448.627 374 L
448.844 374 L
449.061 374 L
449.278 374 L
449.495 374 L
449.712 374 L
449.929 374 L
450.146 374 L
450.363 374 L
450.58 374 L
450.797 374 L
451.014 374 L
451.231 374 L
451.448 374 L
451.665 374 L
451.882 374 L
452.099 374 L
452.316 374 L
452.533 374 L
452.75 374 L
452.967 374 L
453.184 374 L
453.401 374 L
453.618 374 L
453.835 374 L
454.052 374 L
454.269 374 L
454.486 374 L
454.703 374 L
454.92 374 L
455.137 374 L
455.354 374 L
455.571 374 L
455.788 374 L
456.005 374 L
456.222 374 L
456.439 374 L
456.656 374 L
456.873 374 L
457.09 374 L
457.307 374 L
457.524 374 L
457.741 374 L
457.958 374 L
458.175 374 L
458.392 374 L
458.609 374 L
458.826 374 L
459.043 374 L
459.26 374 L
459.477 374 L
459.694 374 L
459.911 374 L
460.128 374 L
460.345 374 L
460.562 374 L
460.779 374 L
460.996 374 L
461.213 374 L
461.43 374 L
461.647 374 L
461.864 374 L
462.081 374 L
462.298 374 L
462.515 374 L
462.732 374 L
462.949 374 L
463.166 374 L
463.383 374 L
463.6 374 L
463.817 374 L
464.034 374 L
464.251 374 L
464.468 374 L
464.685 374 L
464.902 374 L
465.119 374 L
465.336 374 L
465.553 374 L
465.77 374 L
465.987 374 L
466.204 374 L
466.421 374 L
466.638 374 L
466.855 374 L
467.072 374 L
467.289 374 L
467.506 374 L
467.723 374 L
467.94 374 L
468.157 374 L
468.374 374 L
468.591 374 L
468.808 374 L
469.025 374 L
469.242 374 L
469.459 374 L
469.676 374 L
469.893 374 L
470.11 374 L
470.327 374 L
470.544 374 L
470.761 374 L
470.978 374 L
471.195 374 L
471.412 374 L
471.629 374 L
471.846 374 L
472.063 374 L
472.28 374 L
472.497 374 L
472.714 374 L
472.931 374 L
473.148 374 L
473.365 374 L
473.582 374 L
473.799 374 L
474.016 374 L
474.233 374 L
474.45 374 L
474.667 374 L
474.884 374 L
475.101 374 L
475.318 374 L
475.535 374 L
475.752 374 L
475.969 374 L
476.186 374 L
476.403 374 L
476.62 374 L
476.837 374 L
477.054 374 L
477.271 374 L
477.488 374 L
477.705 374 L
477.922 374 L
478.139 374 L
478.356 374 L
478.573 374 L
478.79 374 L
479.007 374 L
479.224 374 L
479.441 374 L
479.658 374 L
479.875 374 L
480.092 374 L
480.309 374 L
480.526 374 L
480.743 374 L
480.96 374 L
481.177 374 L
481.394 374 L
481.611 374 L
481.828 374 L
482.045 374 L
482.262 374 L
482.479 374 L
482.696 374 L
482.913 374 L
483.13 374 L
483.347 374 L
483.564 374 L
483.781 374 L
483.998 374 L
484.215 374 L
484.432 374 L
484.649 374 L
484.866 374 L
485.083 374 L
485.3 374 L
485.517 374 L
485.734 374 L
485.951 374 L
486.168 374 L
486.385 374 L
486.602 374 L
486.819 374 L
487.036 374 L
487.253 374 L
487.47 374 L
487.687 374 L
487.904 374 L
488.121 374 L
488.338 374 L
488.555 374 L
488.772 374 L
488.989 374 L
489.206 374 L
489.423 374 L
489.64 374 L
489.857 374 L
490.074 374 L
490.291 374 L
490.508 374 L
490.725 374 L
490.942 374 L
491.159 374 L
491.376 374 L
491.593 374 L
491.81 374 L
492.027 374 L
492.244 374 L
492.461 374 L
492.678 374 L
492.895 374 L
493.112 374 L
493.329 374 L
493.546 374 L
493.763 374 L
493.98 374 L
494.197 374 L
494.414 374 L
494.631 374 L
494.848 374 L
495.065 374 L
495.282 374 L
495.499 374 L
495.716 374 L
495.933 374 L
496.15 374 L
496.367 374 L
496.584 374 L
496.801 374 L
497.018 374 L
497.235 374 L
497.452 374 L
497.669 374 L
497.886 374 L
498.103 374 L
498.32 374 L
498.537 374 L
498.754 374 L
498.971 374 L
499.188 374 L
499.405 374 L
499.622 374 L
499.839 374 L
500.056 374 L
500.273 374 L
500.49 374 L
500.707 374 L
500.924 374 L
501.141 374 L
501.358 374 L
501.575 374 L
501.792 374 L
502.009 374 L
502.226 374 L
502.443 374 L
502.66 374 L
502.877 374 L
503.094 374 L
503.311 374 L
503.528 374 L
503.745 374 L
503.962 374 L
504.179 374 L
504.396 374 L
504.613 374 L
504.83 374 L
505.047 374 L
505.264 374 L
505.481 374 L
505.698 374 L
505.915 374 L
506.132 374 L
506.349 374 L
506.566 374 L
506.783 374 L
507 374 L
S
GR
%%Trailer
%%Pages: 1
%%EOF
