%!PS-Adobe-3.0 EPSF-3.0
%%Creator: (MATLAB, The Mathworks, Inc. Version 9.1.0.441655 \(R2016b\). Operating System: Windows 7)
%%Title: C:/Users/June/Documents/GitKraken/rls-2017/sp6/figures/ukol7_porovnani.eps
%%CreationDate: 2018-03-04T23:20:24
%%Pages: (atend)
%%BoundingBox: 0 0 420 315
%%LanguageLevel: 3
%%EndComments
%%BeginProlog
%%BeginResource: procset (Apache XML Graphics Std ProcSet) 1.2 0
%%Version: 1.2 0
%%Copyright: (Copyright 2001-2003,2010 The Apache Software Foundation. License terms: http://www.apache.org/licenses/LICENSE-2.0)
/bd{bind def}bind def
/ld{load def}bd
/GR/grestore ld
/M/moveto ld
/LJ/setlinejoin ld
/C/curveto ld
/f/fill ld
/LW/setlinewidth ld
/GC/setgray ld
/t/show ld
/N/newpath ld
/CT/concat ld
/cp/closepath ld
/S/stroke ld
/L/lineto ld
/CC/setcmykcolor ld
/A/ashow ld
/GS/gsave ld
/RC/setrgbcolor ld
/RM/rmoveto ld
/ML/setmiterlimit ld
/re {4 2 roll M
1 index 0 rlineto
0 exch rlineto
neg 0 rlineto
cp } bd
/_ctm matrix def
/_tm matrix def
/BT { _ctm currentmatrix pop matrix _tm copy pop 0 0 moveto } bd
/ET { _ctm setmatrix } bd
/iTm { _ctm setmatrix _tm concat } bd
/Tm { _tm astore pop iTm 0 0 moveto } bd
/ux 0.0 def
/uy 0.0 def
/F {
  /Tp exch def
  /Tf exch def
  Tf findfont Tp scalefont setfont
  /cf Tf def  /cs Tp def
} bd
/ULS {currentpoint /uy exch def /ux exch def} bd
/ULE {
  /Tcx currentpoint pop def
  gsave
  newpath
  cf findfont cs scalefont dup
  /FontMatrix get 0 get /Ts exch def /FontInfo get dup
  /UnderlinePosition get Ts mul /To exch def
  /UnderlineThickness get Ts mul /Tt exch def
  ux uy To add moveto  Tcx uy To add lineto
  Tt setlinewidth stroke
  grestore
} bd
/OLE {
  /Tcx currentpoint pop def
  gsave
  newpath
  cf findfont cs scalefont dup
  /FontMatrix get 0 get /Ts exch def /FontInfo get dup
  /UnderlinePosition get Ts mul /To exch def
  /UnderlineThickness get Ts mul /Tt exch def
  ux uy To add cs add moveto Tcx uy To add cs add lineto
  Tt setlinewidth stroke
  grestore
} bd
/SOE {
  /Tcx currentpoint pop def
  gsave
  newpath
  cf findfont cs scalefont dup
  /FontMatrix get 0 get /Ts exch def /FontInfo get dup
  /UnderlinePosition get Ts mul /To exch def
  /UnderlineThickness get Ts mul /Tt exch def
  ux uy To add cs 10 mul 26 idiv add moveto Tcx uy To add cs 10 mul 26 idiv add lineto
  Tt setlinewidth stroke
  grestore
} bd
/QT {
/Y22 exch store
/X22 exch store
/Y21 exch store
/X21 exch store
currentpoint
/Y21 load 2 mul add 3 div exch
/X21 load 2 mul add 3 div exch
/X21 load 2 mul /X22 load add 3 div
/Y21 load 2 mul /Y22 load add 3 div
/X22 load /Y22 load curveto
} bd
/SSPD {
dup length /d exch dict def
{
/v exch def
/k exch def
currentpagedevice k known {
/cpdv currentpagedevice k get def
v cpdv ne {
/upd false def
/nullv v type /nulltype eq def
/nullcpdv cpdv type /nulltype eq def
nullv nullcpdv or
{
/upd true def
} {
/sametype v type cpdv type eq def
sametype {
v type /arraytype eq {
/vlen v length def
/cpdvlen cpdv length def
vlen cpdvlen eq {
0 1 vlen 1 sub {
/i exch def
/obj v i get def
/cpdobj cpdv i get def
obj cpdobj ne {
/upd true def
exit
} if
} for
} {
/upd true def
} ifelse
} {
v type /dicttype eq {
v {
/dv exch def
/dk exch def
/cpddv cpdv dk get def
dv cpddv ne {
/upd true def
exit
} if
} forall
} {
/upd true def
} ifelse
} ifelse
} if
} ifelse
upd true eq {
d k v put
} if
} if
} if
} forall
d length 0 gt {
d setpagedevice
} if
} bd
/RE { % /NewFontName [NewEncodingArray] /FontName RE -
  findfont dup length dict begin
  {
    1 index /FID ne
    {def} {pop pop} ifelse
  } forall
  /Encoding exch def
  /FontName 1 index def
  currentdict definefont pop
  end
} bind def
%%EndResource
%%BeginResource: procset (Apache XML Graphics EPS ProcSet) 1.0 0
%%Version: 1.0 0
%%Copyright: (Copyright 2002-2003 The Apache Software Foundation. License terms: http://www.apache.org/licenses/LICENSE-2.0)
/BeginEPSF { %def
/b4_Inc_state save def         % Save state for cleanup
/dict_count countdictstack def % Count objects on dict stack
/op_count count 1 sub def      % Count objects on operand stack
userdict begin                 % Push userdict on dict stack
/showpage { } def              % Redefine showpage, { } = null proc
0 setgray 0 setlinecap         % Prepare graphics state
1 setlinewidth 0 setlinejoin
10 setmiterlimit [ ] 0 setdash newpath
/languagelevel where           % If level not equal to 1 then
{pop languagelevel             % set strokeadjust and
1 ne                           % overprint to their defaults.
{false setstrokeadjust false setoverprint
} if
} if
} bd
/EndEPSF { %def
count op_count sub {pop} repeat            % Clean up stacks
countdictstack dict_count sub {end} repeat
b4_Inc_state restore
} bd
%%EndResource
%FOPBeginFontDict
%%IncludeResource: font Courier-Bold
%%IncludeResource: font Helvetica
%%IncludeResource: font Courier-BoldOblique
%%IncludeResource: font Courier-Oblique
%%IncludeResource: font Times-Roman
%%IncludeResource: font Helvetica-BoldOblique
%%IncludeResource: font Helvetica-Bold
%%IncludeResource: font Helvetica-Oblique
%%IncludeResource: font Times-BoldItalic
%%IncludeResource: font Courier
%%IncludeResource: font Times-Italic
%%IncludeResource: font Times-Bold
%%IncludeResource: font Symbol
%%IncludeResource: font ZapfDingbats
%FOPEndFontDict
%%BeginResource: encoding WinAnsiEncoding
/WinAnsiEncoding [
/.notdef /.notdef /.notdef /.notdef /.notdef
/.notdef /.notdef /.notdef /.notdef /.notdef
/.notdef /.notdef /.notdef /.notdef /.notdef
/.notdef /.notdef /.notdef /.notdef /.notdef
/.notdef /.notdef /.notdef /.notdef /.notdef
/.notdef /.notdef /.notdef /.notdef /.notdef
/.notdef /.notdef /space /exclam /quotedbl
/numbersign /dollar /percent /ampersand /quotesingle
/parenleft /parenright /asterisk /plus /comma
/hyphen /period /slash /zero /one
/two /three /four /five /six
/seven /eight /nine /colon /semicolon
/less /equal /greater /question /at
/A /B /C /D /E
/F /G /H /I /J
/K /L /M /N /O
/P /Q /R /S /T
/U /V /W /X /Y
/Z /bracketleft /backslash /bracketright /asciicircum
/underscore /quoteleft /a /b /c
/d /e /f /g /h
/i /j /k /l /m
/n /o /p /q /r
/s /t /u /v /w
/x /y /z /braceleft /bar
/braceright /asciitilde /bullet /Euro /bullet
/quotesinglbase /florin /quotedblbase /ellipsis /dagger
/daggerdbl /circumflex /perthousand /Scaron /guilsinglleft
/OE /bullet /Zcaron /bullet /bullet
/quoteleft /quoteright /quotedblleft /quotedblright /bullet
/endash /emdash /asciitilde /trademark /scaron
/guilsinglright /oe /bullet /zcaron /Ydieresis
/space /exclamdown /cent /sterling /currency
/yen /brokenbar /section /dieresis /copyright
/ordfeminine /guillemotleft /logicalnot /sfthyphen /registered
/macron /degree /plusminus /twosuperior /threesuperior
/acute /mu /paragraph /middot /cedilla
/onesuperior /ordmasculine /guillemotright /onequarter /onehalf
/threequarters /questiondown /Agrave /Aacute /Acircumflex
/Atilde /Adieresis /Aring /AE /Ccedilla
/Egrave /Eacute /Ecircumflex /Edieresis /Igrave
/Iacute /Icircumflex /Idieresis /Eth /Ntilde
/Ograve /Oacute /Ocircumflex /Otilde /Odieresis
/multiply /Oslash /Ugrave /Uacute /Ucircumflex
/Udieresis /Yacute /Thorn /germandbls /agrave
/aacute /acircumflex /atilde /adieresis /aring
/ae /ccedilla /egrave /eacute /ecircumflex
/edieresis /igrave /iacute /icircumflex /idieresis
/eth /ntilde /ograve /oacute /ocircumflex
/otilde /odieresis /divide /oslash /ugrave
/uacute /ucircumflex /udieresis /yacute /thorn
/ydieresis
] def
%%EndResource
%FOPBeginFontReencode
/Courier-Bold findfont
dup length dict begin
  {1 index /FID ne {def} {pop pop} ifelse} forall
  /Encoding WinAnsiEncoding def
  currentdict
end
/Courier-Bold exch definefont pop
/Helvetica findfont
dup length dict begin
  {1 index /FID ne {def} {pop pop} ifelse} forall
  /Encoding WinAnsiEncoding def
  currentdict
end
/Helvetica exch definefont pop
/Courier-BoldOblique findfont
dup length dict begin
  {1 index /FID ne {def} {pop pop} ifelse} forall
  /Encoding WinAnsiEncoding def
  currentdict
end
/Courier-BoldOblique exch definefont pop
/Courier-Oblique findfont
dup length dict begin
  {1 index /FID ne {def} {pop pop} ifelse} forall
  /Encoding WinAnsiEncoding def
  currentdict
end
/Courier-Oblique exch definefont pop
/Times-Roman findfont
dup length dict begin
  {1 index /FID ne {def} {pop pop} ifelse} forall
  /Encoding WinAnsiEncoding def
  currentdict
end
/Times-Roman exch definefont pop
/Helvetica-BoldOblique findfont
dup length dict begin
  {1 index /FID ne {def} {pop pop} ifelse} forall
  /Encoding WinAnsiEncoding def
  currentdict
end
/Helvetica-BoldOblique exch definefont pop
/Helvetica-Bold findfont
dup length dict begin
  {1 index /FID ne {def} {pop pop} ifelse} forall
  /Encoding WinAnsiEncoding def
  currentdict
end
/Helvetica-Bold exch definefont pop
/Helvetica-Oblique findfont
dup length dict begin
  {1 index /FID ne {def} {pop pop} ifelse} forall
  /Encoding WinAnsiEncoding def
  currentdict
end
/Helvetica-Oblique exch definefont pop
/Times-BoldItalic findfont
dup length dict begin
  {1 index /FID ne {def} {pop pop} ifelse} forall
  /Encoding WinAnsiEncoding def
  currentdict
end
/Times-BoldItalic exch definefont pop
/Courier findfont
dup length dict begin
  {1 index /FID ne {def} {pop pop} ifelse} forall
  /Encoding WinAnsiEncoding def
  currentdict
end
/Courier exch definefont pop
/Times-Italic findfont
dup length dict begin
  {1 index /FID ne {def} {pop pop} ifelse} forall
  /Encoding WinAnsiEncoding def
  currentdict
end
/Times-Italic exch definefont pop
/Times-Bold findfont
dup length dict begin
  {1 index /FID ne {def} {pop pop} ifelse} forall
  /Encoding WinAnsiEncoding def
  currentdict
end
/Times-Bold exch definefont pop
%FOPEndFontReencode
%%EndProlog
%%Page: 1 1
%%PageBoundingBox: 0 0 420 315
%%BeginPageSetup
[1 0 0 -1 0 315] CT
%%EndPageSetup
GS
[0.75 0 0 0.75 0 0] CT
1 GC
N
0 0 560 420 re
f
GR
GS
[0.75 0 0 0.75 0 0] CT
1 GC
N
0 0 560 420 re
f
GR
GS
[0.75 0 0 0.75 0 0] CT
1 GC
N
85 374 M
507 374 L
507 51 L
85 51 L
cp
f
GR
GS
[0.75 0 0 0.75 0 0] CT
0.849 GC
[1 3] 0 setdash
2 LJ
0.667 LW
N
96.549 374 M
96.549 51 L
S
GR
GS
[0.75 0 0 0.75 0 0] CT
0.849 GC
[1 3] 0 setdash
2 LJ
0.667 LW
N
103.304 374 M
103.304 51 L
S
GR
GS
[0.75 0 0 0.75 0 0] CT
0.849 GC
[1 3] 0 setdash
2 LJ
0.667 LW
N
108.097 374 M
108.097 51 L
S
GR
GS
[0.75 0 0 0.75 0 0] CT
0.849 GC
[1 3] 0 setdash
2 LJ
0.667 LW
N
111.815 374 M
111.815 51 L
S
GR
GS
[0.75 0 0 0.75 0 0] CT
0.849 GC
[1 3] 0 setdash
2 LJ
0.667 LW
N
114.853 374 M
114.853 51 L
S
GR
GS
[0.75 0 0 0.75 0 0] CT
0.849 GC
[1 3] 0 setdash
2 LJ
0.667 LW
N
117.421 374 M
117.421 51 L
S
GR
GS
[0.75 0 0 0.75 0 0] CT
0.849 GC
[1 3] 0 setdash
2 LJ
0.667 LW
N
119.646 374 M
119.646 51 L
S
GR
GS
[0.75 0 0 0.75 0 0] CT
0.849 GC
[1 3] 0 setdash
2 LJ
0.667 LW
N
121.608 374 M
121.608 51 L
S
GR
GS
[0.75 0 0 0.75 0 0] CT
0.849 GC
[1 3] 0 setdash
2 LJ
0.667 LW
N
123.364 374 M
123.364 51 L
S
GR
GS
[0.75 0 0 0.75 0 0] CT
0.849 GC
[1 3] 0 setdash
2 LJ
0.667 LW
N
134.912 374 M
134.912 51 L
S
GR
GS
[0.75 0 0 0.75 0 0] CT
0.849 GC
[1 3] 0 setdash
2 LJ
0.667 LW
N
141.668 374 M
141.668 51 L
S
GR
GS
[0.75 0 0 0.75 0 0] CT
0.849 GC
[1 3] 0 setdash
2 LJ
0.667 LW
N
146.461 374 M
146.461 51 L
S
GR
GS
[0.75 0 0 0.75 0 0] CT
0.849 GC
[1 3] 0 setdash
2 LJ
0.667 LW
N
150.179 374 M
150.179 51 L
S
GR
GS
[0.75 0 0 0.75 0 0] CT
0.849 GC
[1 3] 0 setdash
2 LJ
0.667 LW
N
153.216 374 M
153.216 51 L
S
GR
GS
[0.75 0 0 0.75 0 0] CT
0.849 GC
[1 3] 0 setdash
2 LJ
0.667 LW
N
155.785 374 M
155.785 51 L
S
GR
GS
[0.75 0 0 0.75 0 0] CT
0.849 GC
[1 3] 0 setdash
2 LJ
0.667 LW
N
158.009 374 M
158.009 51 L
S
GR
GS
[0.75 0 0 0.75 0 0] CT
0.849 GC
[1 3] 0 setdash
2 LJ
0.667 LW
N
159.972 374 M
159.972 51 L
S
GR
GS
[0.75 0 0 0.75 0 0] CT
0.849 GC
[1 3] 0 setdash
2 LJ
0.667 LW
N
173.276 374 M
173.276 51 L
S
GR
GS
[0.75 0 0 0.75 0 0] CT
0.849 GC
[1 3] 0 setdash
2 LJ
0.667 LW
N
180.031 374 M
180.031 51 L
S
GR
GS
[0.75 0 0 0.75 0 0] CT
0.849 GC
[1 3] 0 setdash
2 LJ
0.667 LW
N
184.824 374 M
184.824 51 L
S
GR
GS
[0.75 0 0 0.75 0 0] CT
0.849 GC
[1 3] 0 setdash
2 LJ
0.667 LW
N
188.542 374 M
188.542 51 L
S
GR
GS
[0.75 0 0 0.75 0 0] CT
0.849 GC
[1 3] 0 setdash
2 LJ
0.667 LW
N
191.58 374 M
191.58 51 L
S
GR
GS
[0.75 0 0 0.75 0 0] CT
0.849 GC
[1 3] 0 setdash
2 LJ
0.667 LW
N
194.148 374 M
194.148 51 L
S
GR
GS
[0.75 0 0 0.75 0 0] CT
0.849 GC
[1 3] 0 setdash
2 LJ
0.667 LW
N
196.373 374 M
196.373 51 L
S
GR
GS
[0.75 0 0 0.75 0 0] CT
0.849 GC
[1 3] 0 setdash
2 LJ
0.667 LW
N
198.335 374 M
198.335 51 L
S
GR
GS
[0.75 0 0 0.75 0 0] CT
0.849 GC
[1 3] 0 setdash
2 LJ
0.667 LW
N
200.091 374 M
200.091 51 L
S
GR
GS
[0.75 0 0 0.75 0 0] CT
0.849 GC
[1 3] 0 setdash
2 LJ
0.667 LW
N
211.64 374 M
211.64 51 L
S
GR
GS
[0.75 0 0 0.75 0 0] CT
0.849 GC
[1 3] 0 setdash
2 LJ
0.667 LW
N
218.395 374 M
218.395 51 L
S
GR
GS
[0.75 0 0 0.75 0 0] CT
0.849 GC
[1 3] 0 setdash
2 LJ
0.667 LW
N
223.188 374 M
223.188 51 L
S
GR
GS
[0.75 0 0 0.75 0 0] CT
0.849 GC
[1 3] 0 setdash
2 LJ
0.667 LW
N
226.906 374 M
226.906 51 L
S
GR
GS
[0.75 0 0 0.75 0 0] CT
0.849 GC
[1 3] 0 setdash
2 LJ
0.667 LW
N
229.944 374 M
229.944 51 L
S
GR
GS
[0.75 0 0 0.75 0 0] CT
0.849 GC
[1 3] 0 setdash
2 LJ
0.667 LW
N
232.512 374 M
232.512 51 L
S
GR
GS
[0.75 0 0 0.75 0 0] CT
0.849 GC
[1 3] 0 setdash
2 LJ
0.667 LW
N
234.737 374 M
234.737 51 L
S
GR
GS
[0.75 0 0 0.75 0 0] CT
0.849 GC
[1 3] 0 setdash
2 LJ
0.667 LW
N
236.699 374 M
236.699 51 L
S
GR
GS
[0.75 0 0 0.75 0 0] CT
0.849 GC
[1 3] 0 setdash
2 LJ
0.667 LW
N
238.455 374 M
238.455 51 L
S
GR
GS
[0.75 0 0 0.75 0 0] CT
0.849 GC
[1 3] 0 setdash
2 LJ
0.667 LW
N
250.003 374 M
250.003 51 L
S
GR
GS
[0.75 0 0 0.75 0 0] CT
0.849 GC
[1 3] 0 setdash
2 LJ
0.667 LW
N
256.759 374 M
256.759 51 L
S
GR
GS
[0.75 0 0 0.75 0 0] CT
0.849 GC
[1 3] 0 setdash
2 LJ
0.667 LW
N
261.552 374 M
261.552 51 L
S
GR
GS
[0.75 0 0 0.75 0 0] CT
0.849 GC
[1 3] 0 setdash
2 LJ
0.667 LW
N
265.27 374 M
265.27 51 L
S
GR
GS
[0.75 0 0 0.75 0 0] CT
0.849 GC
[1 3] 0 setdash
2 LJ
0.667 LW
N
268.307 374 M
268.307 51 L
S
GR
GS
[0.75 0 0 0.75 0 0] CT
0.849 GC
[1 3] 0 setdash
2 LJ
0.667 LW
N
270.876 374 M
270.876 51 L
S
GR
GS
[0.75 0 0 0.75 0 0] CT
0.849 GC
[1 3] 0 setdash
2 LJ
0.667 LW
N
273.1 374 M
273.1 51 L
S
GR
GS
[0.75 0 0 0.75 0 0] CT
0.849 GC
[1 3] 0 setdash
2 LJ
0.667 LW
N
275.063 374 M
275.063 51 L
S
GR
GS
[0.75 0 0 0.75 0 0] CT
0.849 GC
[1 3] 0 setdash
2 LJ
0.667 LW
N
276.818 374 M
276.818 51 L
S
GR
GS
[0.75 0 0 0.75 0 0] CT
0.849 GC
[1 3] 0 setdash
2 LJ
0.667 LW
N
288.367 374 M
288.367 51 L
S
GR
GS
[0.75 0 0 0.75 0 0] CT
0.849 GC
[1 3] 0 setdash
2 LJ
0.667 LW
N
295.122 374 M
295.122 51 L
S
GR
GS
[0.75 0 0 0.75 0 0] CT
0.849 GC
[1 3] 0 setdash
2 LJ
0.667 LW
N
299.915 374 M
299.915 51 L
S
GR
GS
[0.75 0 0 0.75 0 0] CT
0.849 GC
[1 3] 0 setdash
2 LJ
0.667 LW
N
303.633 374 M
303.633 51 L
S
GR
GS
[0.75 0 0 0.75 0 0] CT
0.849 GC
[1 3] 0 setdash
2 LJ
0.667 LW
N
306.671 374 M
306.671 51 L
S
GR
GS
[0.75 0 0 0.75 0 0] CT
0.849 GC
[1 3] 0 setdash
2 LJ
0.667 LW
N
309.239 374 M
309.239 51 L
S
GR
GS
[0.75 0 0 0.75 0 0] CT
0.849 GC
[1 3] 0 setdash
2 LJ
0.667 LW
N
311.464 374 M
311.464 51 L
S
GR
GS
[0.75 0 0 0.75 0 0] CT
0.849 GC
[1 3] 0 setdash
2 LJ
0.667 LW
N
313.426 374 M
313.426 51 L
S
GR
GS
[0.75 0 0 0.75 0 0] CT
0.849 GC
[1 3] 0 setdash
2 LJ
0.667 LW
N
326.73 374 M
326.73 51 L
S
GR
GS
[0.75 0 0 0.75 0 0] CT
0.849 GC
[1 3] 0 setdash
2 LJ
0.667 LW
N
333.486 374 M
333.486 51 L
S
GR
GS
[0.75 0 0 0.75 0 0] CT
0.849 GC
[1 3] 0 setdash
2 LJ
0.667 LW
N
338.279 374 M
338.279 51 L
S
GR
GS
[0.75 0 0 0.75 0 0] CT
0.849 GC
[1 3] 0 setdash
2 LJ
0.667 LW
N
341.997 374 M
341.997 51 L
S
GR
GS
[0.75 0 0 0.75 0 0] CT
0.849 GC
[1 3] 0 setdash
2 LJ
0.667 LW
N
345.035 374 M
345.035 51 L
S
GR
GS
[0.75 0 0 0.75 0 0] CT
0.849 GC
[1 3] 0 setdash
2 LJ
0.667 LW
N
347.603 374 M
347.603 51 L
S
GR
GS
[0.75 0 0 0.75 0 0] CT
0.849 GC
[1 3] 0 setdash
2 LJ
0.667 LW
N
349.828 374 M
349.828 51 L
S
GR
GS
[0.75 0 0 0.75 0 0] CT
0.849 GC
[1 3] 0 setdash
2 LJ
0.667 LW
N
351.79 374 M
351.79 51 L
S
GR
GS
[0.75 0 0 0.75 0 0] CT
0.849 GC
[1 3] 0 setdash
2 LJ
0.667 LW
N
353.545 374 M
353.545 51 L
S
GR
GS
[0.75 0 0 0.75 0 0] CT
0.849 GC
[1 3] 0 setdash
2 LJ
0.667 LW
N
365.094 374 M
365.094 51 L
S
GR
GS
[0.75 0 0 0.75 0 0] CT
0.849 GC
[1 3] 0 setdash
2 LJ
0.667 LW
N
371.85 374 M
371.85 51 L
S
GR
GS
[0.75 0 0 0.75 0 0] CT
0.849 GC
[1 3] 0 setdash
2 LJ
0.667 LW
N
376.643 374 M
376.643 51 L
S
GR
GS
[0.75 0 0 0.75 0 0] CT
0.849 GC
[1 3] 0 setdash
2 LJ
0.667 LW
N
380.36 374 M
380.36 51 L
S
GR
GS
[0.75 0 0 0.75 0 0] CT
0.849 GC
[1 3] 0 setdash
2 LJ
0.667 LW
N
383.398 374 M
383.398 51 L
S
GR
GS
[0.75 0 0 0.75 0 0] CT
0.849 GC
[1 3] 0 setdash
2 LJ
0.667 LW
N
385.966 374 M
385.966 51 L
S
GR
GS
[0.75 0 0 0.75 0 0] CT
0.849 GC
[1 3] 0 setdash
2 LJ
0.667 LW
N
388.191 374 M
388.191 51 L
S
GR
GS
[0.75 0 0 0.75 0 0] CT
0.849 GC
[1 3] 0 setdash
2 LJ
0.667 LW
N
390.154 374 M
390.154 51 L
S
GR
GS
[0.75 0 0 0.75 0 0] CT
0.849 GC
[1 3] 0 setdash
2 LJ
0.667 LW
N
403.458 374 M
403.458 51 L
S
GR
GS
[0.75 0 0 0.75 0 0] CT
0.849 GC
[1 3] 0 setdash
2 LJ
0.667 LW
N
410.213 374 M
410.213 51 L
S
GR
GS
[0.75 0 0 0.75 0 0] CT
0.849 GC
[1 3] 0 setdash
2 LJ
0.667 LW
N
415.006 374 M
415.006 51 L
S
GR
GS
[0.75 0 0 0.75 0 0] CT
0.849 GC
[1 3] 0 setdash
2 LJ
0.667 LW
N
418.724 374 M
418.724 51 L
S
GR
GS
[0.75 0 0 0.75 0 0] CT
0.849 GC
[1 3] 0 setdash
2 LJ
0.667 LW
N
421.762 374 M
421.762 51 L
S
GR
GS
[0.75 0 0 0.75 0 0] CT
0.849 GC
[1 3] 0 setdash
2 LJ
0.667 LW
N
424.33 374 M
424.33 51 L
S
GR
GS
[0.75 0 0 0.75 0 0] CT
0.849 GC
[1 3] 0 setdash
2 LJ
0.667 LW
N
426.555 374 M
426.555 51 L
S
GR
GS
[0.75 0 0 0.75 0 0] CT
0.849 GC
[1 3] 0 setdash
2 LJ
0.667 LW
N
428.517 374 M
428.517 51 L
S
GR
GS
[0.75 0 0 0.75 0 0] CT
0.849 GC
[1 3] 0 setdash
2 LJ
0.667 LW
N
430.273 374 M
430.273 51 L
S
GR
GS
[0.75 0 0 0.75 0 0] CT
0.849 GC
[1 3] 0 setdash
2 LJ
0.667 LW
N
441.821 374 M
441.821 51 L
S
GR
GS
[0.75 0 0 0.75 0 0] CT
0.849 GC
[1 3] 0 setdash
2 LJ
0.667 LW
N
448.577 374 M
448.577 51 L
S
GR
GS
[0.75 0 0 0.75 0 0] CT
0.849 GC
[1 3] 0 setdash
2 LJ
0.667 LW
N
453.37 374 M
453.37 51 L
S
GR
GS
[0.75 0 0 0.75 0 0] CT
0.849 GC
[1 3] 0 setdash
2 LJ
0.667 LW
N
457.088 374 M
457.088 51 L
S
GR
GS
[0.75 0 0 0.75 0 0] CT
0.849 GC
[1 3] 0 setdash
2 LJ
0.667 LW
N
460.125 374 M
460.125 51 L
S
GR
GS
[0.75 0 0 0.75 0 0] CT
0.849 GC
[1 3] 0 setdash
2 LJ
0.667 LW
N
462.694 374 M
462.694 51 L
S
GR
GS
[0.75 0 0 0.75 0 0] CT
0.849 GC
[1 3] 0 setdash
2 LJ
0.667 LW
N
464.919 374 M
464.919 51 L
S
GR
GS
[0.75 0 0 0.75 0 0] CT
0.849 GC
[1 3] 0 setdash
2 LJ
0.667 LW
N
466.881 374 M
466.881 51 L
S
GR
GS
[0.75 0 0 0.75 0 0] CT
0.849 GC
[1 3] 0 setdash
2 LJ
0.667 LW
N
480.185 374 M
480.185 51 L
S
GR
GS
[0.75 0 0 0.75 0 0] CT
0.849 GC
[1 3] 0 setdash
2 LJ
0.667 LW
N
486.94 374 M
486.94 51 L
S
GR
GS
[0.75 0 0 0.75 0 0] CT
0.849 GC
[1 3] 0 setdash
2 LJ
0.667 LW
N
491.734 374 M
491.734 51 L
S
GR
GS
[0.75 0 0 0.75 0 0] CT
0.849 GC
[1 3] 0 setdash
2 LJ
0.667 LW
N
495.451 374 M
495.451 51 L
S
GR
GS
[0.75 0 0 0.75 0 0] CT
0.849 GC
[1 3] 0 setdash
2 LJ
0.667 LW
N
498.489 374 M
498.489 51 L
S
GR
GS
[0.75 0 0 0.75 0 0] CT
0.849 GC
[1 3] 0 setdash
2 LJ
0.667 LW
N
501.057 374 M
501.057 51 L
S
GR
GS
[0.75 0 0 0.75 0 0] CT
0.849 GC
[1 3] 0 setdash
2 LJ
0.667 LW
N
503.282 374 M
503.282 51 L
S
GR
GS
[0.75 0 0 0.75 0 0] CT
0.849 GC
[1 3] 0 setdash
2 LJ
0.667 LW
N
505.245 374 M
505.245 51 L
S
GR
GS
[0.75 0 0 0.75 0 0] CT
0.849 GC
[1 3] 0 setdash
2 LJ
0.667 LW
N
507 374 M
507 51 L
S
GR
GS
[0.75 0 0 0.75 0 0] CT
0.873 GC
1 LJ
0.667 LW
N
85 374 M
85 51 L
S
GR
GS
[0.75 0 0 0.75 0 0] CT
0.873 GC
1 LJ
0.667 LW
N
161.727 374 M
161.727 51 L
S
GR
GS
[0.75 0 0 0.75 0 0] CT
0.873 GC
1 LJ
0.667 LW
N
238.455 374 M
238.455 51 L
S
GR
GS
[0.75 0 0 0.75 0 0] CT
0.873 GC
1 LJ
0.667 LW
N
315.182 374 M
315.182 51 L
S
GR
GS
[0.75 0 0 0.75 0 0] CT
0.873 GC
1 LJ
0.667 LW
N
391.909 374 M
391.909 51 L
S
GR
GS
[0.75 0 0 0.75 0 0] CT
0.873 GC
1 LJ
0.667 LW
N
468.636 374 M
468.636 51 L
S
GR
GS
[0.75 0 0 0.75 0 0] CT
0.873 GC
1 LJ
0.667 LW
N
507 374 M
85 374 L
S
GR
GS
[0.75 0 0 0.75 0 0] CT
0.873 GC
1 LJ
0.667 LW
N
507 341.7 M
85 341.7 L
S
GR
GS
[0.75 0 0 0.75 0 0] CT
0.873 GC
1 LJ
0.667 LW
N
507 309.4 M
85 309.4 L
S
GR
GS
[0.75 0 0 0.75 0 0] CT
0.873 GC
1 LJ
0.667 LW
N
507 277.1 M
85 277.1 L
S
GR
GS
[0.75 0 0 0.75 0 0] CT
0.873 GC
1 LJ
0.667 LW
N
507 244.8 M
85 244.8 L
S
GR
GS
[0.75 0 0 0.75 0 0] CT
0.873 GC
1 LJ
0.667 LW
N
507 212.5 M
85 212.5 L
S
GR
GS
[0.75 0 0 0.75 0 0] CT
0.873 GC
1 LJ
0.667 LW
N
507 180.2 M
85 180.2 L
S
GR
GS
[0.75 0 0 0.75 0 0] CT
0.873 GC
1 LJ
0.667 LW
N
507 147.9 M
85 147.9 L
S
GR
GS
[0.75 0 0 0.75 0 0] CT
0.873 GC
1 LJ
0.667 LW
N
507 115.6 M
85 115.6 L
S
GR
GS
[0.75 0 0 0.75 0 0] CT
0.873 GC
1 LJ
0.667 LW
N
507 83.3 M
85 83.3 L
S
GR
GS
[0.75 0 0 0.75 0 0] CT
0.873 GC
1 LJ
0.667 LW
N
507 51 M
85 51 L
S
GR
GS
[0.75 0 0 0.75 0 0] CT
0.4 GC
2 setlinecap
1 LJ
0.667 LW
N
85 374 M
507 374 L
S
GR
GS
[0.75 0 0 0.75 0 0] CT
0.4 GC
2 setlinecap
1 LJ
0.667 LW
N
85 51 M
507 51 L
S
GR
GS
[0.75 0 0 0.75 0 0] CT
0.4 GC
2 setlinecap
1 LJ
0.667 LW
N
85 374 M
85 369.78 L
S
GR
GS
[0.75 0 0 0.75 0 0] CT
0.4 GC
2 setlinecap
1 LJ
0.667 LW
N
161.727 374 M
161.727 369.78 L
S
GR
GS
[0.75 0 0 0.75 0 0] CT
0.4 GC
2 setlinecap
1 LJ
0.667 LW
N
238.455 374 M
238.455 369.78 L
S
GR
GS
[0.75 0 0 0.75 0 0] CT
0.4 GC
2 setlinecap
1 LJ
0.667 LW
N
315.182 374 M
315.182 369.78 L
S
GR
GS
[0.75 0 0 0.75 0 0] CT
0.4 GC
2 setlinecap
1 LJ
0.667 LW
N
391.909 374 M
391.909 369.78 L
S
GR
GS
[0.75 0 0 0.75 0 0] CT
0.4 GC
2 setlinecap
1 LJ
0.667 LW
N
468.636 374 M
468.636 369.78 L
S
GR
GS
[0.75 0 0 0.75 0 0] CT
0.4 GC
2 setlinecap
1 LJ
0.667 LW
N
85 51 M
85 55.22 L
S
GR
GS
[0.75 0 0 0.75 0 0] CT
0.4 GC
2 setlinecap
1 LJ
0.667 LW
N
161.727 51 M
161.727 55.22 L
S
GR
GS
[0.75 0 0 0.75 0 0] CT
0.4 GC
2 setlinecap
1 LJ
0.667 LW
N
238.455 51 M
238.455 55.22 L
S
GR
GS
[0.75 0 0 0.75 0 0] CT
0.4 GC
2 setlinecap
1 LJ
0.667 LW
N
315.182 51 M
315.182 55.22 L
S
GR
GS
[0.75 0 0 0.75 0 0] CT
0.4 GC
2 setlinecap
1 LJ
0.667 LW
N
391.909 51 M
391.909 55.22 L
S
GR
GS
[0.75 0 0 0.75 0 0] CT
0.4 GC
2 setlinecap
1 LJ
0.667 LW
N
468.636 51 M
468.636 55.22 L
S
GR
GS
[0.75 0 0 0.75 0 0] CT
0.4 GC
2 setlinecap
1 LJ
0.667 LW
N
85 374 M
85 371.89 L
S
GR
GS
[0.75 0 0 0.75 0 0] CT
0.4 GC
2 setlinecap
1 LJ
0.667 LW
N
96.549 374 M
96.549 371.89 L
S
GR
GS
[0.75 0 0 0.75 0 0] CT
0.4 GC
2 setlinecap
1 LJ
0.667 LW
N
103.304 374 M
103.304 371.89 L
S
GR
GS
[0.75 0 0 0.75 0 0] CT
0.4 GC
2 setlinecap
1 LJ
0.667 LW
N
108.097 374 M
108.097 371.89 L
S
GR
GS
[0.75 0 0 0.75 0 0] CT
0.4 GC
2 setlinecap
1 LJ
0.667 LW
N
111.815 374 M
111.815 371.89 L
S
GR
GS
[0.75 0 0 0.75 0 0] CT
0.4 GC
2 setlinecap
1 LJ
0.667 LW
N
114.853 374 M
114.853 371.89 L
S
GR
GS
[0.75 0 0 0.75 0 0] CT
0.4 GC
2 setlinecap
1 LJ
0.667 LW
N
117.421 374 M
117.421 371.89 L
S
GR
GS
[0.75 0 0 0.75 0 0] CT
0.4 GC
2 setlinecap
1 LJ
0.667 LW
N
119.646 374 M
119.646 371.89 L
S
GR
GS
[0.75 0 0 0.75 0 0] CT
0.4 GC
2 setlinecap
1 LJ
0.667 LW
N
121.608 374 M
121.608 371.89 L
S
GR
GS
[0.75 0 0 0.75 0 0] CT
0.4 GC
2 setlinecap
1 LJ
0.667 LW
N
123.364 374 M
123.364 371.89 L
S
GR
GS
[0.75 0 0 0.75 0 0] CT
0.4 GC
2 setlinecap
1 LJ
0.667 LW
N
134.912 374 M
134.912 371.89 L
S
GR
GS
[0.75 0 0 0.75 0 0] CT
0.4 GC
2 setlinecap
1 LJ
0.667 LW
N
141.668 374 M
141.668 371.89 L
S
GR
GS
[0.75 0 0 0.75 0 0] CT
0.4 GC
2 setlinecap
1 LJ
0.667 LW
N
146.461 374 M
146.461 371.89 L
S
GR
GS
[0.75 0 0 0.75 0 0] CT
0.4 GC
2 setlinecap
1 LJ
0.667 LW
N
150.179 374 M
150.179 371.89 L
S
GR
GS
[0.75 0 0 0.75 0 0] CT
0.4 GC
2 setlinecap
1 LJ
0.667 LW
N
153.216 374 M
153.216 371.89 L
S
GR
GS
[0.75 0 0 0.75 0 0] CT
0.4 GC
2 setlinecap
1 LJ
0.667 LW
N
155.785 374 M
155.785 371.89 L
S
GR
GS
[0.75 0 0 0.75 0 0] CT
0.4 GC
2 setlinecap
1 LJ
0.667 LW
N
158.009 374 M
158.009 371.89 L
S
GR
GS
[0.75 0 0 0.75 0 0] CT
0.4 GC
2 setlinecap
1 LJ
0.667 LW
N
159.972 374 M
159.972 371.89 L
S
GR
GS
[0.75 0 0 0.75 0 0] CT
0.4 GC
2 setlinecap
1 LJ
0.667 LW
N
161.727 374 M
161.727 371.89 L
S
GR
GS
[0.75 0 0 0.75 0 0] CT
0.4 GC
2 setlinecap
1 LJ
0.667 LW
N
173.276 374 M
173.276 371.89 L
S
GR
GS
[0.75 0 0 0.75 0 0] CT
0.4 GC
2 setlinecap
1 LJ
0.667 LW
N
180.031 374 M
180.031 371.89 L
S
GR
GS
[0.75 0 0 0.75 0 0] CT
0.4 GC
2 setlinecap
1 LJ
0.667 LW
N
184.824 374 M
184.824 371.89 L
S
GR
GS
[0.75 0 0 0.75 0 0] CT
0.4 GC
2 setlinecap
1 LJ
0.667 LW
N
188.542 374 M
188.542 371.89 L
S
GR
GS
[0.75 0 0 0.75 0 0] CT
0.4 GC
2 setlinecap
1 LJ
0.667 LW
N
191.58 374 M
191.58 371.89 L
S
GR
GS
[0.75 0 0 0.75 0 0] CT
0.4 GC
2 setlinecap
1 LJ
0.667 LW
N
194.148 374 M
194.148 371.89 L
S
GR
GS
[0.75 0 0 0.75 0 0] CT
0.4 GC
2 setlinecap
1 LJ
0.667 LW
N
196.373 374 M
196.373 371.89 L
S
GR
GS
[0.75 0 0 0.75 0 0] CT
0.4 GC
2 setlinecap
1 LJ
0.667 LW
N
198.335 374 M
198.335 371.89 L
S
GR
GS
[0.75 0 0 0.75 0 0] CT
0.4 GC
2 setlinecap
1 LJ
0.667 LW
N
200.091 374 M
200.091 371.89 L
S
GR
GS
[0.75 0 0 0.75 0 0] CT
0.4 GC
2 setlinecap
1 LJ
0.667 LW
N
211.64 374 M
211.64 371.89 L
S
GR
GS
[0.75 0 0 0.75 0 0] CT
0.4 GC
2 setlinecap
1 LJ
0.667 LW
N
218.395 374 M
218.395 371.89 L
S
GR
GS
[0.75 0 0 0.75 0 0] CT
0.4 GC
2 setlinecap
1 LJ
0.667 LW
N
223.188 374 M
223.188 371.89 L
S
GR
GS
[0.75 0 0 0.75 0 0] CT
0.4 GC
2 setlinecap
1 LJ
0.667 LW
N
226.906 374 M
226.906 371.89 L
S
GR
GS
[0.75 0 0 0.75 0 0] CT
0.4 GC
2 setlinecap
1 LJ
0.667 LW
N
229.944 374 M
229.944 371.89 L
S
GR
GS
[0.75 0 0 0.75 0 0] CT
0.4 GC
2 setlinecap
1 LJ
0.667 LW
N
232.512 374 M
232.512 371.89 L
S
GR
GS
[0.75 0 0 0.75 0 0] CT
0.4 GC
2 setlinecap
1 LJ
0.667 LW
N
234.737 374 M
234.737 371.89 L
S
GR
GS
[0.75 0 0 0.75 0 0] CT
0.4 GC
2 setlinecap
1 LJ
0.667 LW
N
236.699 374 M
236.699 371.89 L
S
GR
GS
[0.75 0 0 0.75 0 0] CT
0.4 GC
2 setlinecap
1 LJ
0.667 LW
N
238.455 374 M
238.455 371.89 L
S
GR
GS
[0.75 0 0 0.75 0 0] CT
0.4 GC
2 setlinecap
1 LJ
0.667 LW
N
238.455 374 M
238.455 371.89 L
S
GR
GS
[0.75 0 0 0.75 0 0] CT
0.4 GC
2 setlinecap
1 LJ
0.667 LW
N
250.003 374 M
250.003 371.89 L
S
GR
GS
[0.75 0 0 0.75 0 0] CT
0.4 GC
2 setlinecap
1 LJ
0.667 LW
N
256.759 374 M
256.759 371.89 L
S
GR
GS
[0.75 0 0 0.75 0 0] CT
0.4 GC
2 setlinecap
1 LJ
0.667 LW
N
261.552 374 M
261.552 371.89 L
S
GR
GS
[0.75 0 0 0.75 0 0] CT
0.4 GC
2 setlinecap
1 LJ
0.667 LW
N
265.27 374 M
265.27 371.89 L
S
GR
GS
[0.75 0 0 0.75 0 0] CT
0.4 GC
2 setlinecap
1 LJ
0.667 LW
N
268.307 374 M
268.307 371.89 L
S
GR
GS
[0.75 0 0 0.75 0 0] CT
0.4 GC
2 setlinecap
1 LJ
0.667 LW
N
270.876 374 M
270.876 371.89 L
S
GR
GS
[0.75 0 0 0.75 0 0] CT
0.4 GC
2 setlinecap
1 LJ
0.667 LW
N
273.1 374 M
273.1 371.89 L
S
GR
GS
[0.75 0 0 0.75 0 0] CT
0.4 GC
2 setlinecap
1 LJ
0.667 LW
N
275.063 374 M
275.063 371.89 L
S
GR
GS
[0.75 0 0 0.75 0 0] CT
0.4 GC
2 setlinecap
1 LJ
0.667 LW
N
276.818 374 M
276.818 371.89 L
S
GR
GS
[0.75 0 0 0.75 0 0] CT
0.4 GC
2 setlinecap
1 LJ
0.667 LW
N
288.367 374 M
288.367 371.89 L
S
GR
GS
[0.75 0 0 0.75 0 0] CT
0.4 GC
2 setlinecap
1 LJ
0.667 LW
N
295.122 374 M
295.122 371.89 L
S
GR
GS
[0.75 0 0 0.75 0 0] CT
0.4 GC
2 setlinecap
1 LJ
0.667 LW
N
299.915 374 M
299.915 371.89 L
S
GR
GS
[0.75 0 0 0.75 0 0] CT
0.4 GC
2 setlinecap
1 LJ
0.667 LW
N
303.633 374 M
303.633 371.89 L
S
GR
GS
[0.75 0 0 0.75 0 0] CT
0.4 GC
2 setlinecap
1 LJ
0.667 LW
N
306.671 374 M
306.671 371.89 L
S
GR
GS
[0.75 0 0 0.75 0 0] CT
0.4 GC
2 setlinecap
1 LJ
0.667 LW
N
309.239 374 M
309.239 371.89 L
S
GR
GS
[0.75 0 0 0.75 0 0] CT
0.4 GC
2 setlinecap
1 LJ
0.667 LW
N
311.464 374 M
311.464 371.89 L
S
GR
GS
[0.75 0 0 0.75 0 0] CT
0.4 GC
2 setlinecap
1 LJ
0.667 LW
N
313.426 374 M
313.426 371.89 L
S
GR
GS
[0.75 0 0 0.75 0 0] CT
0.4 GC
2 setlinecap
1 LJ
0.667 LW
N
315.182 374 M
315.182 371.89 L
S
GR
GS
[0.75 0 0 0.75 0 0] CT
0.4 GC
2 setlinecap
1 LJ
0.667 LW
N
326.73 374 M
326.73 371.89 L
S
GR
GS
[0.75 0 0 0.75 0 0] CT
0.4 GC
2 setlinecap
1 LJ
0.667 LW
N
333.486 374 M
333.486 371.89 L
S
GR
GS
[0.75 0 0 0.75 0 0] CT
0.4 GC
2 setlinecap
1 LJ
0.667 LW
N
338.279 374 M
338.279 371.89 L
S
GR
GS
[0.75 0 0 0.75 0 0] CT
0.4 GC
2 setlinecap
1 LJ
0.667 LW
N
341.997 374 M
341.997 371.89 L
S
GR
GS
[0.75 0 0 0.75 0 0] CT
0.4 GC
2 setlinecap
1 LJ
0.667 LW
N
345.035 374 M
345.035 371.89 L
S
GR
GS
[0.75 0 0 0.75 0 0] CT
0.4 GC
2 setlinecap
1 LJ
0.667 LW
N
347.603 374 M
347.603 371.89 L
S
GR
GS
[0.75 0 0 0.75 0 0] CT
0.4 GC
2 setlinecap
1 LJ
0.667 LW
N
349.828 374 M
349.828 371.89 L
S
GR
GS
[0.75 0 0 0.75 0 0] CT
0.4 GC
2 setlinecap
1 LJ
0.667 LW
N
351.79 374 M
351.79 371.89 L
S
GR
GS
[0.75 0 0 0.75 0 0] CT
0.4 GC
2 setlinecap
1 LJ
0.667 LW
N
353.545 374 M
353.545 371.89 L
S
GR
GS
[0.75 0 0 0.75 0 0] CT
0.4 GC
2 setlinecap
1 LJ
0.667 LW
N
365.094 374 M
365.094 371.89 L
S
GR
GS
[0.75 0 0 0.75 0 0] CT
0.4 GC
2 setlinecap
1 LJ
0.667 LW
N
371.85 374 M
371.85 371.89 L
S
GR
GS
[0.75 0 0 0.75 0 0] CT
0.4 GC
2 setlinecap
1 LJ
0.667 LW
N
376.643 374 M
376.643 371.89 L
S
GR
GS
[0.75 0 0 0.75 0 0] CT
0.4 GC
2 setlinecap
1 LJ
0.667 LW
N
380.36 374 M
380.36 371.89 L
S
GR
GS
[0.75 0 0 0.75 0 0] CT
0.4 GC
2 setlinecap
1 LJ
0.667 LW
N
383.398 374 M
383.398 371.89 L
S
GR
GS
[0.75 0 0 0.75 0 0] CT
0.4 GC
2 setlinecap
1 LJ
0.667 LW
N
385.966 374 M
385.966 371.89 L
S
GR
GS
[0.75 0 0 0.75 0 0] CT
0.4 GC
2 setlinecap
1 LJ
0.667 LW
N
388.191 374 M
388.191 371.89 L
S
GR
GS
[0.75 0 0 0.75 0 0] CT
0.4 GC
2 setlinecap
1 LJ
0.667 LW
N
390.154 374 M
390.154 371.89 L
S
GR
GS
[0.75 0 0 0.75 0 0] CT
0.4 GC
2 setlinecap
1 LJ
0.667 LW
N
391.909 374 M
391.909 371.89 L
S
GR
GS
[0.75 0 0 0.75 0 0] CT
0.4 GC
2 setlinecap
1 LJ
0.667 LW
N
403.458 374 M
403.458 371.89 L
S
GR
GS
[0.75 0 0 0.75 0 0] CT
0.4 GC
2 setlinecap
1 LJ
0.667 LW
N
410.213 374 M
410.213 371.89 L
S
GR
GS
[0.75 0 0 0.75 0 0] CT
0.4 GC
2 setlinecap
1 LJ
0.667 LW
N
415.006 374 M
415.006 371.89 L
S
GR
GS
[0.75 0 0 0.75 0 0] CT
0.4 GC
2 setlinecap
1 LJ
0.667 LW
N
418.724 374 M
418.724 371.89 L
S
GR
GS
[0.75 0 0 0.75 0 0] CT
0.4 GC
2 setlinecap
1 LJ
0.667 LW
N
421.762 374 M
421.762 371.89 L
S
GR
GS
[0.75 0 0 0.75 0 0] CT
0.4 GC
2 setlinecap
1 LJ
0.667 LW
N
424.33 374 M
424.33 371.89 L
S
GR
GS
[0.75 0 0 0.75 0 0] CT
0.4 GC
2 setlinecap
1 LJ
0.667 LW
N
426.555 374 M
426.555 371.89 L
S
GR
GS
[0.75 0 0 0.75 0 0] CT
0.4 GC
2 setlinecap
1 LJ
0.667 LW
N
428.517 374 M
428.517 371.89 L
S
GR
GS
[0.75 0 0 0.75 0 0] CT
0.4 GC
2 setlinecap
1 LJ
0.667 LW
N
430.273 374 M
430.273 371.89 L
S
GR
GS
[0.75 0 0 0.75 0 0] CT
0.4 GC
2 setlinecap
1 LJ
0.667 LW
N
441.821 374 M
441.821 371.89 L
S
GR
GS
[0.75 0 0 0.75 0 0] CT
0.4 GC
2 setlinecap
1 LJ
0.667 LW
N
448.577 374 M
448.577 371.89 L
S
GR
GS
[0.75 0 0 0.75 0 0] CT
0.4 GC
2 setlinecap
1 LJ
0.667 LW
N
453.37 374 M
453.37 371.89 L
S
GR
GS
[0.75 0 0 0.75 0 0] CT
0.4 GC
2 setlinecap
1 LJ
0.667 LW
N
457.088 374 M
457.088 371.89 L
S
GR
GS
[0.75 0 0 0.75 0 0] CT
0.4 GC
2 setlinecap
1 LJ
0.667 LW
N
460.125 374 M
460.125 371.89 L
S
GR
GS
[0.75 0 0 0.75 0 0] CT
0.4 GC
2 setlinecap
1 LJ
0.667 LW
N
462.694 374 M
462.694 371.89 L
S
GR
GS
[0.75 0 0 0.75 0 0] CT
0.4 GC
2 setlinecap
1 LJ
0.667 LW
N
464.919 374 M
464.919 371.89 L
S
GR
GS
[0.75 0 0 0.75 0 0] CT
0.4 GC
2 setlinecap
1 LJ
0.667 LW
N
466.881 374 M
466.881 371.89 L
S
GR
GS
[0.75 0 0 0.75 0 0] CT
0.4 GC
2 setlinecap
1 LJ
0.667 LW
N
468.636 374 M
468.636 371.89 L
S
GR
GS
[0.75 0 0 0.75 0 0] CT
0.4 GC
2 setlinecap
1 LJ
0.667 LW
N
480.185 374 M
480.185 371.89 L
S
GR
GS
[0.75 0 0 0.75 0 0] CT
0.4 GC
2 setlinecap
1 LJ
0.667 LW
N
486.94 374 M
486.94 371.89 L
S
GR
GS
[0.75 0 0 0.75 0 0] CT
0.4 GC
2 setlinecap
1 LJ
0.667 LW
N
491.734 374 M
491.734 371.89 L
S
GR
GS
[0.75 0 0 0.75 0 0] CT
0.4 GC
2 setlinecap
1 LJ
0.667 LW
N
495.451 374 M
495.451 371.89 L
S
GR
GS
[0.75 0 0 0.75 0 0] CT
0.4 GC
2 setlinecap
1 LJ
0.667 LW
N
498.489 374 M
498.489 371.89 L
S
GR
GS
[0.75 0 0 0.75 0 0] CT
0.4 GC
2 setlinecap
1 LJ
0.667 LW
N
501.057 374 M
501.057 371.89 L
S
GR
GS
[0.75 0 0 0.75 0 0] CT
0.4 GC
2 setlinecap
1 LJ
0.667 LW
N
503.282 374 M
503.282 371.89 L
S
GR
GS
[0.75 0 0 0.75 0 0] CT
0.4 GC
2 setlinecap
1 LJ
0.667 LW
N
505.245 374 M
505.245 371.89 L
S
GR
GS
[0.75 0 0 0.75 0 0] CT
0.4 GC
2 setlinecap
1 LJ
0.667 LW
N
507 374 M
507 371.89 L
S
GR
GS
[0.75 0 0 0.75 0 0] CT
0.4 GC
2 setlinecap
1 LJ
0.667 LW
N
85 51 M
85 53.11 L
S
GR
GS
[0.75 0 0 0.75 0 0] CT
0.4 GC
2 setlinecap
1 LJ
0.667 LW
N
96.549 51 M
96.549 53.11 L
S
GR
GS
[0.75 0 0 0.75 0 0] CT
0.4 GC
2 setlinecap
1 LJ
0.667 LW
N
103.304 51 M
103.304 53.11 L
S
GR
GS
[0.75 0 0 0.75 0 0] CT
0.4 GC
2 setlinecap
1 LJ
0.667 LW
N
108.097 51 M
108.097 53.11 L
S
GR
GS
[0.75 0 0 0.75 0 0] CT
0.4 GC
2 setlinecap
1 LJ
0.667 LW
N
111.815 51 M
111.815 53.11 L
S
GR
GS
[0.75 0 0 0.75 0 0] CT
0.4 GC
2 setlinecap
1 LJ
0.667 LW
N
114.853 51 M
114.853 53.11 L
S
GR
GS
[0.75 0 0 0.75 0 0] CT
0.4 GC
2 setlinecap
1 LJ
0.667 LW
N
117.421 51 M
117.421 53.11 L
S
GR
GS
[0.75 0 0 0.75 0 0] CT
0.4 GC
2 setlinecap
1 LJ
0.667 LW
N
119.646 51 M
119.646 53.11 L
S
GR
GS
[0.75 0 0 0.75 0 0] CT
0.4 GC
2 setlinecap
1 LJ
0.667 LW
N
121.608 51 M
121.608 53.11 L
S
GR
GS
[0.75 0 0 0.75 0 0] CT
0.4 GC
2 setlinecap
1 LJ
0.667 LW
N
123.364 51 M
123.364 53.11 L
S
GR
GS
[0.75 0 0 0.75 0 0] CT
0.4 GC
2 setlinecap
1 LJ
0.667 LW
N
134.912 51 M
134.912 53.11 L
S
GR
GS
[0.75 0 0 0.75 0 0] CT
0.4 GC
2 setlinecap
1 LJ
0.667 LW
N
141.668 51 M
141.668 53.11 L
S
GR
GS
[0.75 0 0 0.75 0 0] CT
0.4 GC
2 setlinecap
1 LJ
0.667 LW
N
146.461 51 M
146.461 53.11 L
S
GR
GS
[0.75 0 0 0.75 0 0] CT
0.4 GC
2 setlinecap
1 LJ
0.667 LW
N
150.179 51 M
150.179 53.11 L
S
GR
GS
[0.75 0 0 0.75 0 0] CT
0.4 GC
2 setlinecap
1 LJ
0.667 LW
N
153.216 51 M
153.216 53.11 L
S
GR
GS
[0.75 0 0 0.75 0 0] CT
0.4 GC
2 setlinecap
1 LJ
0.667 LW
N
155.785 51 M
155.785 53.11 L
S
GR
GS
[0.75 0 0 0.75 0 0] CT
0.4 GC
2 setlinecap
1 LJ
0.667 LW
N
158.009 51 M
158.009 53.11 L
S
GR
GS
[0.75 0 0 0.75 0 0] CT
0.4 GC
2 setlinecap
1 LJ
0.667 LW
N
159.972 51 M
159.972 53.11 L
S
GR
GS
[0.75 0 0 0.75 0 0] CT
0.4 GC
2 setlinecap
1 LJ
0.667 LW
N
161.727 51 M
161.727 53.11 L
S
GR
GS
[0.75 0 0 0.75 0 0] CT
0.4 GC
2 setlinecap
1 LJ
0.667 LW
N
173.276 51 M
173.276 53.11 L
S
GR
GS
[0.75 0 0 0.75 0 0] CT
0.4 GC
2 setlinecap
1 LJ
0.667 LW
N
180.031 51 M
180.031 53.11 L
S
GR
GS
[0.75 0 0 0.75 0 0] CT
0.4 GC
2 setlinecap
1 LJ
0.667 LW
N
184.824 51 M
184.824 53.11 L
S
GR
GS
[0.75 0 0 0.75 0 0] CT
0.4 GC
2 setlinecap
1 LJ
0.667 LW
N
188.542 51 M
188.542 53.11 L
S
GR
GS
[0.75 0 0 0.75 0 0] CT
0.4 GC
2 setlinecap
1 LJ
0.667 LW
N
191.58 51 M
191.58 53.11 L
S
GR
GS
[0.75 0 0 0.75 0 0] CT
0.4 GC
2 setlinecap
1 LJ
0.667 LW
N
194.148 51 M
194.148 53.11 L
S
GR
GS
[0.75 0 0 0.75 0 0] CT
0.4 GC
2 setlinecap
1 LJ
0.667 LW
N
196.373 51 M
196.373 53.11 L
S
GR
GS
[0.75 0 0 0.75 0 0] CT
0.4 GC
2 setlinecap
1 LJ
0.667 LW
N
198.335 51 M
198.335 53.11 L
S
GR
GS
[0.75 0 0 0.75 0 0] CT
0.4 GC
2 setlinecap
1 LJ
0.667 LW
N
200.091 51 M
200.091 53.11 L
S
GR
GS
[0.75 0 0 0.75 0 0] CT
0.4 GC
2 setlinecap
1 LJ
0.667 LW
N
211.64 51 M
211.64 53.11 L
S
GR
GS
[0.75 0 0 0.75 0 0] CT
0.4 GC
2 setlinecap
1 LJ
0.667 LW
N
218.395 51 M
218.395 53.11 L
S
GR
GS
[0.75 0 0 0.75 0 0] CT
0.4 GC
2 setlinecap
1 LJ
0.667 LW
N
223.188 51 M
223.188 53.11 L
S
GR
GS
[0.75 0 0 0.75 0 0] CT
0.4 GC
2 setlinecap
1 LJ
0.667 LW
N
226.906 51 M
226.906 53.11 L
S
GR
GS
[0.75 0 0 0.75 0 0] CT
0.4 GC
2 setlinecap
1 LJ
0.667 LW
N
229.944 51 M
229.944 53.11 L
S
GR
GS
[0.75 0 0 0.75 0 0] CT
0.4 GC
2 setlinecap
1 LJ
0.667 LW
N
232.512 51 M
232.512 53.11 L
S
GR
GS
[0.75 0 0 0.75 0 0] CT
0.4 GC
2 setlinecap
1 LJ
0.667 LW
N
234.737 51 M
234.737 53.11 L
S
GR
GS
[0.75 0 0 0.75 0 0] CT
0.4 GC
2 setlinecap
1 LJ
0.667 LW
N
236.699 51 M
236.699 53.11 L
S
GR
GS
[0.75 0 0 0.75 0 0] CT
0.4 GC
2 setlinecap
1 LJ
0.667 LW
N
238.455 51 M
238.455 53.11 L
S
GR
GS
[0.75 0 0 0.75 0 0] CT
0.4 GC
2 setlinecap
1 LJ
0.667 LW
N
238.455 51 M
238.455 53.11 L
S
GR
GS
[0.75 0 0 0.75 0 0] CT
0.4 GC
2 setlinecap
1 LJ
0.667 LW
N
250.003 51 M
250.003 53.11 L
S
GR
GS
[0.75 0 0 0.75 0 0] CT
0.4 GC
2 setlinecap
1 LJ
0.667 LW
N
256.759 51 M
256.759 53.11 L
S
GR
GS
[0.75 0 0 0.75 0 0] CT
0.4 GC
2 setlinecap
1 LJ
0.667 LW
N
261.552 51 M
261.552 53.11 L
S
GR
GS
[0.75 0 0 0.75 0 0] CT
0.4 GC
2 setlinecap
1 LJ
0.667 LW
N
265.27 51 M
265.27 53.11 L
S
GR
GS
[0.75 0 0 0.75 0 0] CT
0.4 GC
2 setlinecap
1 LJ
0.667 LW
N
268.307 51 M
268.307 53.11 L
S
GR
GS
[0.75 0 0 0.75 0 0] CT
0.4 GC
2 setlinecap
1 LJ
0.667 LW
N
270.876 51 M
270.876 53.11 L
S
GR
GS
[0.75 0 0 0.75 0 0] CT
0.4 GC
2 setlinecap
1 LJ
0.667 LW
N
273.1 51 M
273.1 53.11 L
S
GR
GS
[0.75 0 0 0.75 0 0] CT
0.4 GC
2 setlinecap
1 LJ
0.667 LW
N
275.063 51 M
275.063 53.11 L
S
GR
GS
[0.75 0 0 0.75 0 0] CT
0.4 GC
2 setlinecap
1 LJ
0.667 LW
N
276.818 51 M
276.818 53.11 L
S
GR
GS
[0.75 0 0 0.75 0 0] CT
0.4 GC
2 setlinecap
1 LJ
0.667 LW
N
288.367 51 M
288.367 53.11 L
S
GR
GS
[0.75 0 0 0.75 0 0] CT
0.4 GC
2 setlinecap
1 LJ
0.667 LW
N
295.122 51 M
295.122 53.11 L
S
GR
GS
[0.75 0 0 0.75 0 0] CT
0.4 GC
2 setlinecap
1 LJ
0.667 LW
N
299.915 51 M
299.915 53.11 L
S
GR
GS
[0.75 0 0 0.75 0 0] CT
0.4 GC
2 setlinecap
1 LJ
0.667 LW
N
303.633 51 M
303.633 53.11 L
S
GR
GS
[0.75 0 0 0.75 0 0] CT
0.4 GC
2 setlinecap
1 LJ
0.667 LW
N
306.671 51 M
306.671 53.11 L
S
GR
GS
[0.75 0 0 0.75 0 0] CT
0.4 GC
2 setlinecap
1 LJ
0.667 LW
N
309.239 51 M
309.239 53.11 L
S
GR
GS
[0.75 0 0 0.75 0 0] CT
0.4 GC
2 setlinecap
1 LJ
0.667 LW
N
311.464 51 M
311.464 53.11 L
S
GR
GS
[0.75 0 0 0.75 0 0] CT
0.4 GC
2 setlinecap
1 LJ
0.667 LW
N
313.426 51 M
313.426 53.11 L
S
GR
GS
[0.75 0 0 0.75 0 0] CT
0.4 GC
2 setlinecap
1 LJ
0.667 LW
N
315.182 51 M
315.182 53.11 L
S
GR
GS
[0.75 0 0 0.75 0 0] CT
0.4 GC
2 setlinecap
1 LJ
0.667 LW
N
326.73 51 M
326.73 53.11 L
S
GR
GS
[0.75 0 0 0.75 0 0] CT
0.4 GC
2 setlinecap
1 LJ
0.667 LW
N
333.486 51 M
333.486 53.11 L
S
GR
GS
[0.75 0 0 0.75 0 0] CT
0.4 GC
2 setlinecap
1 LJ
0.667 LW
N
338.279 51 M
338.279 53.11 L
S
GR
GS
[0.75 0 0 0.75 0 0] CT
0.4 GC
2 setlinecap
1 LJ
0.667 LW
N
341.997 51 M
341.997 53.11 L
S
GR
GS
[0.75 0 0 0.75 0 0] CT
0.4 GC
2 setlinecap
1 LJ
0.667 LW
N
345.035 51 M
345.035 53.11 L
S
GR
GS
[0.75 0 0 0.75 0 0] CT
0.4 GC
2 setlinecap
1 LJ
0.667 LW
N
347.603 51 M
347.603 53.11 L
S
GR
GS
[0.75 0 0 0.75 0 0] CT
0.4 GC
2 setlinecap
1 LJ
0.667 LW
N
349.828 51 M
349.828 53.11 L
S
GR
GS
[0.75 0 0 0.75 0 0] CT
0.4 GC
2 setlinecap
1 LJ
0.667 LW
N
351.79 51 M
351.79 53.11 L
S
GR
GS
[0.75 0 0 0.75 0 0] CT
0.4 GC
2 setlinecap
1 LJ
0.667 LW
N
353.545 51 M
353.545 53.11 L
S
GR
GS
[0.75 0 0 0.75 0 0] CT
0.4 GC
2 setlinecap
1 LJ
0.667 LW
N
365.094 51 M
365.094 53.11 L
S
GR
GS
[0.75 0 0 0.75 0 0] CT
0.4 GC
2 setlinecap
1 LJ
0.667 LW
N
371.85 51 M
371.85 53.11 L
S
GR
GS
[0.75 0 0 0.75 0 0] CT
0.4 GC
2 setlinecap
1 LJ
0.667 LW
N
376.643 51 M
376.643 53.11 L
S
GR
GS
[0.75 0 0 0.75 0 0] CT
0.4 GC
2 setlinecap
1 LJ
0.667 LW
N
380.36 51 M
380.36 53.11 L
S
GR
GS
[0.75 0 0 0.75 0 0] CT
0.4 GC
2 setlinecap
1 LJ
0.667 LW
N
383.398 51 M
383.398 53.11 L
S
GR
GS
[0.75 0 0 0.75 0 0] CT
0.4 GC
2 setlinecap
1 LJ
0.667 LW
N
385.966 51 M
385.966 53.11 L
S
GR
GS
[0.75 0 0 0.75 0 0] CT
0.4 GC
2 setlinecap
1 LJ
0.667 LW
N
388.191 51 M
388.191 53.11 L
S
GR
GS
[0.75 0 0 0.75 0 0] CT
0.4 GC
2 setlinecap
1 LJ
0.667 LW
N
390.154 51 M
390.154 53.11 L
S
GR
GS
[0.75 0 0 0.75 0 0] CT
0.4 GC
2 setlinecap
1 LJ
0.667 LW
N
391.909 51 M
391.909 53.11 L
S
GR
GS
[0.75 0 0 0.75 0 0] CT
0.4 GC
2 setlinecap
1 LJ
0.667 LW
N
403.458 51 M
403.458 53.11 L
S
GR
GS
[0.75 0 0 0.75 0 0] CT
0.4 GC
2 setlinecap
1 LJ
0.667 LW
N
410.213 51 M
410.213 53.11 L
S
GR
GS
[0.75 0 0 0.75 0 0] CT
0.4 GC
2 setlinecap
1 LJ
0.667 LW
N
415.006 51 M
415.006 53.11 L
S
GR
GS
[0.75 0 0 0.75 0 0] CT
0.4 GC
2 setlinecap
1 LJ
0.667 LW
N
418.724 51 M
418.724 53.11 L
S
GR
GS
[0.75 0 0 0.75 0 0] CT
0.4 GC
2 setlinecap
1 LJ
0.667 LW
N
421.762 51 M
421.762 53.11 L
S
GR
GS
[0.75 0 0 0.75 0 0] CT
0.4 GC
2 setlinecap
1 LJ
0.667 LW
N
424.33 51 M
424.33 53.11 L
S
GR
GS
[0.75 0 0 0.75 0 0] CT
0.4 GC
2 setlinecap
1 LJ
0.667 LW
N
426.555 51 M
426.555 53.11 L
S
GR
GS
[0.75 0 0 0.75 0 0] CT
0.4 GC
2 setlinecap
1 LJ
0.667 LW
N
428.517 51 M
428.517 53.11 L
S
GR
GS
[0.75 0 0 0.75 0 0] CT
0.4 GC
2 setlinecap
1 LJ
0.667 LW
N
430.273 51 M
430.273 53.11 L
S
GR
GS
[0.75 0 0 0.75 0 0] CT
0.4 GC
2 setlinecap
1 LJ
0.667 LW
N
441.821 51 M
441.821 53.11 L
S
GR
GS
[0.75 0 0 0.75 0 0] CT
0.4 GC
2 setlinecap
1 LJ
0.667 LW
N
448.577 51 M
448.577 53.11 L
S
GR
GS
[0.75 0 0 0.75 0 0] CT
0.4 GC
2 setlinecap
1 LJ
0.667 LW
N
453.37 51 M
453.37 53.11 L
S
GR
GS
[0.75 0 0 0.75 0 0] CT
0.4 GC
2 setlinecap
1 LJ
0.667 LW
N
457.088 51 M
457.088 53.11 L
S
GR
GS
[0.75 0 0 0.75 0 0] CT
0.4 GC
2 setlinecap
1 LJ
0.667 LW
N
460.125 51 M
460.125 53.11 L
S
GR
GS
[0.75 0 0 0.75 0 0] CT
0.4 GC
2 setlinecap
1 LJ
0.667 LW
N
462.694 51 M
462.694 53.11 L
S
GR
GS
[0.75 0 0 0.75 0 0] CT
0.4 GC
2 setlinecap
1 LJ
0.667 LW
N
464.919 51 M
464.919 53.11 L
S
GR
GS
[0.75 0 0 0.75 0 0] CT
0.4 GC
2 setlinecap
1 LJ
0.667 LW
N
466.881 51 M
466.881 53.11 L
S
GR
GS
[0.75 0 0 0.75 0 0] CT
0.4 GC
2 setlinecap
1 LJ
0.667 LW
N
468.636 51 M
468.636 53.11 L
S
GR
GS
[0.75 0 0 0.75 0 0] CT
0.4 GC
2 setlinecap
1 LJ
0.667 LW
N
480.185 51 M
480.185 53.11 L
S
GR
GS
[0.75 0 0 0.75 0 0] CT
0.4 GC
2 setlinecap
1 LJ
0.667 LW
N
486.94 51 M
486.94 53.11 L
S
GR
GS
[0.75 0 0 0.75 0 0] CT
0.4 GC
2 setlinecap
1 LJ
0.667 LW
N
491.734 51 M
491.734 53.11 L
S
GR
GS
[0.75 0 0 0.75 0 0] CT
0.4 GC
2 setlinecap
1 LJ
0.667 LW
N
495.451 51 M
495.451 53.11 L
S
GR
GS
[0.75 0 0 0.75 0 0] CT
0.4 GC
2 setlinecap
1 LJ
0.667 LW
N
498.489 51 M
498.489 53.11 L
S
GR
GS
[0.75 0 0 0.75 0 0] CT
0.4 GC
2 setlinecap
1 LJ
0.667 LW
N
501.057 51 M
501.057 53.11 L
S
GR
GS
[0.75 0 0 0.75 0 0] CT
0.4 GC
2 setlinecap
1 LJ
0.667 LW
N
503.282 51 M
503.282 53.11 L
S
GR
GS
[0.75 0 0 0.75 0 0] CT
0.4 GC
2 setlinecap
1 LJ
0.667 LW
N
505.245 51 M
505.245 53.11 L
S
GR
GS
[0.75 0 0 0.75 0 0] CT
0.4 GC
2 setlinecap
1 LJ
0.667 LW
N
507 51 M
507 53.11 L
S
GR
GS
[0.75 0 0 0.75 54 297.75] CT
0.4 GC
/Helvetica 13.333 F
GS
[1 0 0 1 0 0] CT
0 0 moveto 
1 -1 scale
(10) t 
GR
GR
GS
[0.75 0 0 0.75 65.25 293.25] CT
0.4 GC
/Helvetica 10.667 F
GS
[1 0 0 1 0 0] CT
0 0 moveto 
1 -1 scale
(-8) t 
GR
GR
GS
[0.75 0 0 0.75 111.75 297.75] CT
0.4 GC
/Helvetica 13.333 F
GS
[1 0 0 1 0 0] CT
0 0 moveto 
1 -1 scale
(10) t 
GR
GR
GS
[0.75 0 0 0.75 123 293.25] CT
0.4 GC
/Helvetica 10.667 F
GS
[1 0 0 1 0 0] CT
0 0 moveto 
1 -1 scale
(-6) t 
GR
GR
GS
[0.75 0 0 0.75 168.75 297.75] CT
0.4 GC
/Helvetica 13.333 F
GS
[1 0 0 1 0 0] CT
0 0 moveto 
1 -1 scale
(10) t 
GR
GR
GS
[0.75 0 0 0.75 180 293.25] CT
0.4 GC
/Helvetica 10.667 F
GS
[1 0 0 1 0 0] CT
0 0 moveto 
1 -1 scale
(-4) t 
GR
GR
GS
[0.75 0 0 0.75 226.5 297.75] CT
0.4 GC
/Helvetica 13.333 F
GS
[1 0 0 1 0 0] CT
0 0 moveto 
1 -1 scale
(10) t 
GR
GR
GS
[0.75 0 0 0.75 237.75 293.25] CT
0.4 GC
/Helvetica 10.667 F
GS
[1 0 0 1 0 0] CT
0 0 moveto 
1 -1 scale
(-2) t 
GR
GR
GS
[0.75 0 0 0.75 285.75 297.75] CT
0.4 GC
/Helvetica 13.333 F
GS
[1 0 0 1 0 0] CT
0 0 moveto 
1 -1 scale
(10) t 
GR
GR
GS
[0.75 0 0 0.75 297 293.25] CT
0.4 GC
/Helvetica 10.667 F
GS
[1 0 0 1 0 0] CT
0 0 moveto 
1 -1 scale
(0) t 
GR
GR
GS
[0.75 0 0 0.75 343.5 297.75] CT
0.4 GC
/Helvetica 13.333 F
GS
[1 0 0 1 0 0] CT
0 0 moveto 
1 -1 scale
(10) t 
GR
GR
GS
[0.75 0 0 0.75 354.75 293.25] CT
0.4 GC
/Helvetica 10.667 F
GS
[1 0 0 1 0 0] CT
0 0 moveto 
1 -1 scale
(2) t 
GR
GR
GS
[0.75 0 0 0.75 0 0] CT
0.4 GC
2 setlinecap
1 LJ
0.667 LW
N
85 374 M
85 51 L
S
GR
GS
[0.75 0 0 0.75 0 0] CT
0.4 GC
2 setlinecap
1 LJ
0.667 LW
N
507 374 M
507 51 L
S
GR
GS
[0.75 0 0 0.75 0 0] CT
0.4 GC
2 setlinecap
1 LJ
0.667 LW
N
85 374 M
89.22 374 L
S
GR
GS
[0.75 0 0 0.75 0 0] CT
0.4 GC
2 setlinecap
1 LJ
0.667 LW
N
85 341.7 M
89.22 341.7 L
S
GR
GS
[0.75 0 0 0.75 0 0] CT
0.4 GC
2 setlinecap
1 LJ
0.667 LW
N
85 309.4 M
89.22 309.4 L
S
GR
GS
[0.75 0 0 0.75 0 0] CT
0.4 GC
2 setlinecap
1 LJ
0.667 LW
N
85 277.1 M
89.22 277.1 L
S
GR
GS
[0.75 0 0 0.75 0 0] CT
0.4 GC
2 setlinecap
1 LJ
0.667 LW
N
85 244.8 M
89.22 244.8 L
S
GR
GS
[0.75 0 0 0.75 0 0] CT
0.4 GC
2 setlinecap
1 LJ
0.667 LW
N
85 212.5 M
89.22 212.5 L
S
GR
GS
[0.75 0 0 0.75 0 0] CT
0.4 GC
2 setlinecap
1 LJ
0.667 LW
N
85 180.2 M
89.22 180.2 L
S
GR
GS
[0.75 0 0 0.75 0 0] CT
0.4 GC
2 setlinecap
1 LJ
0.667 LW
N
85 147.9 M
89.22 147.9 L
S
GR
GS
[0.75 0 0 0.75 0 0] CT
0.4 GC
2 setlinecap
1 LJ
0.667 LW
N
85 115.6 M
89.22 115.6 L
S
GR
GS
[0.75 0 0 0.75 0 0] CT
0.4 GC
2 setlinecap
1 LJ
0.667 LW
N
85 83.3 M
89.22 83.3 L
S
GR
GS
[0.75 0 0 0.75 0 0] CT
0.4 GC
2 setlinecap
1 LJ
0.667 LW
N
85 51 M
89.22 51 L
S
GR
GS
[0.75 0 0 0.75 0 0] CT
0.4 GC
2 setlinecap
1 LJ
0.667 LW
N
507 374 M
502.78 374 L
S
GR
GS
[0.75 0 0 0.75 0 0] CT
0.4 GC
2 setlinecap
1 LJ
0.667 LW
N
507 341.7 M
502.78 341.7 L
S
GR
GS
[0.75 0 0 0.75 0 0] CT
0.4 GC
2 setlinecap
1 LJ
0.667 LW
N
507 309.4 M
502.78 309.4 L
S
GR
GS
[0.75 0 0 0.75 0 0] CT
0.4 GC
2 setlinecap
1 LJ
0.667 LW
N
507 277.1 M
502.78 277.1 L
S
GR
GS
[0.75 0 0 0.75 0 0] CT
0.4 GC
2 setlinecap
1 LJ
0.667 LW
N
507 244.8 M
502.78 244.8 L
S
GR
GS
[0.75 0 0 0.75 0 0] CT
0.4 GC
2 setlinecap
1 LJ
0.667 LW
N
507 212.5 M
502.78 212.5 L
S
GR
GS
[0.75 0 0 0.75 0 0] CT
0.4 GC
2 setlinecap
1 LJ
0.667 LW
N
507 180.2 M
502.78 180.2 L
S
GR
GS
[0.75 0 0 0.75 0 0] CT
0.4 GC
2 setlinecap
1 LJ
0.667 LW
N
507 147.9 M
502.78 147.9 L
S
GR
GS
[0.75 0 0 0.75 0 0] CT
0.4 GC
2 setlinecap
1 LJ
0.667 LW
N
507 115.6 M
502.78 115.6 L
S
GR
GS
[0.75 0 0 0.75 0 0] CT
0.4 GC
2 setlinecap
1 LJ
0.667 LW
N
507 83.3 M
502.78 83.3 L
S
GR
GS
[0.75 0 0 0.75 0 0] CT
0.4 GC
2 setlinecap
1 LJ
0.667 LW
N
507 51 M
502.78 51 L
S
GR
GS
[0.75 0 0 0.75 59.75 280.5] CT
0.4 GC
/Helvetica 13.333 F
GS
[1 0 0 1 0 0] CT
-19 5.5 moveto 
1 -1 scale
(-40) t 
GR
GR
GS
[0.75 0 0 0.75 59.75 256.27501] CT
0.4 GC
/Helvetica 13.333 F
GS
[1 0 0 1 0 0] CT
-19 5.5 moveto 
1 -1 scale
(-20) t 
GR
GR
GS
[0.75 0 0 0.75 59.75 232.05] CT
0.4 GC
/Helvetica 13.333 F
GS
[1 0 0 1 0 0] CT
-8 5.5 moveto 
1 -1 scale
(0) t 
GR
GR
GS
[0.75 0 0 0.75 59.75 207.825] CT
0.4 GC
/Helvetica 13.333 F
GS
[1 0 0 1 0 0] CT
-15 5.5 moveto 
1 -1 scale
(20) t 
GR
GR
GS
[0.75 0 0 0.75 59.75 183.6] CT
0.4 GC
/Helvetica 13.333 F
GS
[1 0 0 1 0 0] CT
-15 5.5 moveto 
1 -1 scale
(40) t 
GR
GR
GS
[0.75 0 0 0.75 59.75 159.375] CT
0.4 GC
/Helvetica 13.333 F
GS
[1 0 0 1 0 0] CT
-15 5.5 moveto 
1 -1 scale
(60) t 
GR
GR
GS
[0.75 0 0 0.75 59.75 135.15] CT
0.4 GC
/Helvetica 13.333 F
GS
[1 0 0 1 0 0] CT
-15 5.5 moveto 
1 -1 scale
(80) t 
GR
GR
GS
[0.75 0 0 0.75 59.75 110.92501] CT
0.4 GC
/Helvetica 13.333 F
GS
[1 0 0 1 0 0] CT
-22 5.5 moveto 
1 -1 scale
(100) t 
GR
GR
GS
[0.75 0 0 0.75 59.75 86.7] CT
0.4 GC
/Helvetica 13.333 F
GS
[1 0 0 1 0 0] CT
-22 5.5 moveto 
1 -1 scale
(120) t 
GR
GR
GS
[0.75 0 0 0.75 59.75 62.47501] CT
0.4 GC
/Helvetica 13.333 F
GS
[1 0 0 1 0 0] CT
-22 5.5 moveto 
1 -1 scale
(140) t 
GR
GR
GS
[0.75 0 0 0.75 59.75 38.25] CT
0.4 GC
/Helvetica 13.333 F
GS
[1 0 0 1 0 0] CT
-22 5.5 moveto 
1 -1 scale
(160) t 
GR
GR
GS
[0.75 0 0 0.75 0 0] CT
0 0.447 0.741 RC
1 LJ
0.667 LW
N
84.95 92.96 M
85.787 92.96 L
88.348 92.958 L
90.909 92.956 L
93.469 92.954 L
96.03 92.952 L
98.591 92.95 L
101.152 92.949 L
103.713 92.948 L
106.273 92.949 L
108.834 92.951 L
111.395 92.954 L
113.956 92.959 L
116.517 92.966 L
119.077 92.977 L
121.638 92.991 L
124.199 93.011 L
126.76 93.038 L
129.321 93.075 L
131.882 93.126 L
134.442 93.193 L
137.003 93.285 L
139.564 93.407 L
142.125 93.57 L
144.686 93.786 L
147.246 94.069 L
149.807 94.437 L
152.368 94.908 L
154.929 95.501 L
157.49 96.235 L
160.05 97.124 L
162.611 98.177 L
165.172 99.394 L
167.733 100.77 L
170.294 102.291 L
172.855 103.94 L
175.415 105.699 L
177.976 107.548 L
180.537 109.47 L
183.098 111.45 L
185.659 113.473 L
188.219 115.531 L
190.78 117.616 L
193.341 119.721 L
195.902 121.841 L
198.463 123.974 L
201.023 126.117 L
203.584 128.27 L
206.145 130.432 L
208.706 132.603 L
211.267 134.786 L
213.828 136.981 L
216.388 139.194 L
218.949 141.427 L
221.51 143.689 L
224.071 145.988 L
226.632 148.333 L
229.192 150.737 L
231.753 153.216 L
234.314 155.785 L
236.875 158.461 L
239.436 161.258 L
241.996 164.186 L
244.557 167.247 L
247.118 170.435 L
249.679 173.733 L
252.24 177.116 L
254.801 180.55 L
257.361 183.995 L
259.922 187.411 L
262.483 190.759 L
265.044 194.004 L
267.605 197.116 L
270.165 200.08 L
272.726 202.888 L
275.287 205.546 L
277.848 208.068 L
280.409 210.475 L
282.969 212.788 L
285.53 215.03 L
288.091 217.219 L
290.652 219.367 L
293.213 221.485 L
295.773 223.575 L
298.334 225.637 L
300.895 227.666 L
303.456 229.656 L
306.017 231.596 L
308.578 233.472 L
311.138 235.27 L
313.699 236.97 L
316.26 238.555 L
318.821 240.007 L
321.382 241.313 L
323.942 242.464 L
326.503 243.459 L
329.064 244.308 L
331.625 245.025 L
334.186 245.632 L
336.746 246.154 L
339.307 246.62 L
341.868 247.058 L
344.429 247.495 L
346.99 247.961 L
349.551 248.48 L
352.111 249.077 L
354.672 249.772 L
357.233 250.581 L
359.794 251.514 L
362.355 252.569 L
364.915 253.723 L
367.476 254.911 L
370.037 256.096 L
372.598 257.424 L
375.159 259.057 L
377.719 261.027 L
380.28 263.275 L
382.841 265.696 L
385.402 268.191 L
387.963 270.692 L
390.523 273.159 L
393.084 275.576 L
395.645 277.943 L
398.206 280.264 L
400.767 282.547 L
403.328 284.798 L
405.888 287.026 L
408.449 289.235 L
411.01 291.43 L
413.571 293.615 L
416.132 295.792 L
418.692 297.964 L
421.253 300.131 L
423.814 302.296 L
426.375 304.458 L
428.936 306.619 L
431.496 308.778 L
434.057 310.936 L
436.618 313.094 L
439.179 315.252 L
441.74 317.409 L
444.301 319.565 L
446.861 321.722 L
449.422 323.878 L
451.983 326.035 L
454.544 328.191 L
457.105 330.347 L
459.665 332.503 L
462.226 334.66 L
464.787 336.816 L
503.151 369.116 L
507.05 372.399 L
S
GR
GS
[0.75 0 0 0.75 0 0] CT
0 0.447 0.741 RC
1 LJ
0.667 LW
N
84.95 123.761 M
85.787 123.761 L
88.348 123.761 L
90.909 123.762 L
93.469 123.762 L
96.03 123.763 L
98.591 123.764 L
101.152 123.765 L
103.713 123.767 L
106.273 123.769 L
108.834 123.772 L
111.395 123.777 L
113.956 123.783 L
116.517 123.791 L
119.077 123.802 L
121.638 123.817 L
124.199 123.837 L
126.76 123.865 L
129.321 123.902 L
131.882 123.952 L
134.442 124.02 L
137.003 124.112 L
139.564 124.234 L
142.125 124.397 L
144.686 124.613 L
147.246 124.896 L
149.807 125.264 L
152.368 125.734 L
154.929 126.328 L
157.49 127.062 L
160.05 127.951 L
162.611 129.004 L
165.172 130.221 L
167.733 131.596 L
170.294 133.117 L
172.855 134.766 L
175.415 136.524 L
177.976 138.373 L
180.537 140.294 L
183.098 142.272 L
185.659 144.294 L
188.219 146.35 L
190.78 148.432 L
193.341 150.532 L
195.902 152.647 L
198.463 154.773 L
201.023 156.907 L
203.584 159.046 L
206.145 161.189 L
208.706 163.336 L
211.267 165.484 L
213.828 167.635 L
216.388 169.785 L
218.949 171.937 L
221.51 174.088 L
224.071 176.239 L
226.632 178.389 L
229.192 180.537 L
231.753 182.683 L
234.314 184.825 L
236.875 186.963 L
239.436 189.095 L
241.996 191.219 L
244.557 193.332 L
247.118 195.43 L
249.679 197.51 L
252.24 199.565 L
254.801 201.59 L
257.361 203.577 L
259.922 205.52 L
262.483 207.412 L
265.044 209.25 L
267.605 211.035 L
270.165 212.772 L
272.726 214.472 L
275.287 216.152 L
277.848 217.831 L
280.409 219.526 L
282.969 221.253 L
285.53 223.022 L
288.091 224.836 L
290.652 226.693 L
293.213 228.587 L
295.773 230.505 L
298.334 232.437 L
300.895 234.368 L
303.456 236.285 L
306.017 238.172 L
308.578 240.014 L
311.138 241.794 L
313.699 243.495 L
316.26 245.096 L
318.821 246.579 L
321.382 247.926 L
323.942 249.124 L
326.503 250.166 L
329.064 251.05 L
331.625 251.786 L
334.186 252.385 L
336.746 252.865 L
339.307 253.244 L
341.868 253.544 L
344.429 253.781 L
346.99 253.973 L
349.551 254.134 L
352.111 254.281 L
354.672 254.428 L
357.233 254.597 L
359.794 254.814 L
362.355 255.127 L
364.915 255.618 L
367.476 256.433 L
370.037 257.701 L
372.598 259.362 L
375.159 261.296 L
377.719 263.43 L
380.28 265.709 L
382.841 268.085 L
385.402 270.513 L
387.963 272.957 L
390.523 275.389 L
393.084 277.79 L
395.645 280.152 L
398.206 282.476 L
400.767 284.764 L
403.328 287.022 L
405.888 289.254 L
408.449 291.468 L
411.01 293.666 L
413.571 295.854 L
416.132 298.033 L
418.692 300.206 L
421.253 302.374 L
423.814 304.539 L
426.375 306.702 L
428.936 308.863 L
431.496 311.023 L
434.057 313.181 L
436.618 315.34 L
439.179 317.497 L
441.74 319.654 L
444.301 321.811 L
446.861 323.968 L
449.422 326.124 L
451.983 328.28 L
454.544 330.437 L
457.105 332.593 L
459.665 334.749 L
462.226 336.905 L
464.787 339.061 L
503.151 371.362 L
506.33 374.039 L
S
GR
GS
[0.75 0 0 0.75 0 0] CT
0.851 0.325 0.098 RC
1 LJ
0.667 LW
N
84.95 78.41 M
86.969 78.412 L
89.534 78.414 L
92.099 78.418 L
94.664 78.422 L
97.229 78.429 L
99.794 78.437 L
102.359 78.449 L
104.924 78.465 L
107.489 78.487 L
110.053 78.517 L
112.618 78.557 L
115.183 78.611 L
117.748 78.683 L
120.313 78.781 L
122.878 78.912 L
125.443 79.087 L
128.008 79.317 L
130.573 79.619 L
133.138 80.01 L
135.703 80.51 L
138.267 81.137 L
140.832 81.909 L
143.397 82.839 L
145.962 83.935 L
148.527 85.195 L
151.092 86.611 L
153.657 88.17 L
156.222 89.853 L
158.787 91.642 L
161.352 93.516 L
163.916 95.459 L
166.481 97.456 L
169.046 99.494 L
171.611 101.563 L
174.176 103.656 L
176.741 105.766 L
179.306 107.89 L
181.871 110.024 L
184.436 112.165 L
187.001 114.312 L
189.565 116.463 L
192.13 118.618 L
194.695 120.776 L
197.26 122.937 L
199.825 125.102 L
202.39 127.271 L
204.955 129.444 L
207.52 131.623 L
210.085 133.81 L
212.65 136.007 L
215.215 138.218 L
217.779 140.447 L
220.344 142.7 L
222.909 144.985 L
225.474 147.311 L
228.039 149.69 L
230.604 152.136 L
233.169 154.665 L
235.734 157.293 L
238.299 160.036 L
240.864 162.905 L
243.428 165.909 L
245.993 169.043 L
248.558 172.297 L
251.123 175.649 L
253.688 179.067 L
256.253 182.515 L
258.818 185.952 L
261.383 189.338 L
263.948 192.634 L
266.513 195.81 L
269.077 198.843 L
271.642 201.721 L
274.207 204.445 L
276.772 207.025 L
279.337 209.481 L
281.902 211.834 L
284.467 214.106 L
287.032 216.318 L
289.597 218.485 L
292.162 220.619 L
294.727 222.724 L
297.291 224.803 L
299.856 226.852 L
302.421 228.866 L
304.986 230.834 L
307.551 232.743 L
310.116 234.579 L
312.681 236.323 L
315.246 237.956 L
317.811 239.46 L
320.376 240.819 L
322.94 242.022 L
325.505 243.068 L
328.07 243.962 L
330.635 244.717 L
333.2 245.353 L
335.765 245.896 L
338.33 246.373 L
340.895 246.813 L
343.46 247.245 L
346.025 247.699 L
348.59 248.204 L
351.154 248.788 L
353.719 249.476 L
356.284 250.291 L
358.59 251.144 L
360.953 252.139 L
363.073 253.127 L
364.974 254.064 L
366.679 254.898 L
368.208 255.573 L
369.579 256.096 L
370.81 256.54 L
372.04 257.018 L
373.411 257.654 L
374.941 258.562 L
376.646 259.858 L
378.546 261.59 L
380.666 263.671 L
383.029 265.951 L
384.498 267.308 L
387.063 269.586 L
389.628 271.791 L
392.193 273.956 L
394.758 276.093 L
397.323 278.206 L
399.888 280.295 L
402.452 282.356 L
405.017 284.382 L
407.582 286.367 L
410.147 288.301 L
412.712 290.173 L
415.277 291.967 L
417.842 293.67 L
420.407 295.263 L
422.972 296.73 L
425.537 298.056 L
428.101 299.229 L
430.666 300.244 L
433.231 301.102 L
435.796 301.81 L
438.361 302.384 L
440.926 302.839 L
443.491 303.194 L
446.056 303.468 L
448.621 303.677 L
451.186 303.835 L
453.751 303.953 L
456.315 304.041 L
458.88 304.107 L
461.445 304.155 L
464.01 304.191 L
466.575 304.218 L
469.14 304.238 L
471.705 304.252 L
474.27 304.263 L
476.835 304.271 L
479.4 304.276 L
481.964 304.281 L
484.529 304.284 L
487.094 304.286 L
489.659 304.288 L
492.224 304.289 L
494.789 304.29 L
497.354 304.29 L
499.919 304.291 L
502.484 304.291 L
505.049 304.292 L
507.05 304.292 L
S
GR
GS
[0.75 0 0 0.75 0 0] CT
0.851 0.325 0.098 RC
1 LJ
0.667 LW
N
84.95 124.395 M
86.969 124.395 L
89.534 124.395 L
92.099 124.396 L
94.664 124.396 L
97.229 124.397 L
99.794 124.398 L
102.359 124.399 L
104.924 124.401 L
107.489 124.404 L
110.053 124.407 L
112.618 124.412 L
115.183 124.418 L
117.748 124.427 L
120.313 124.438 L
122.878 124.454 L
125.443 124.476 L
128.008 124.505 L
130.573 124.545 L
133.138 124.598 L
135.703 124.67 L
138.267 124.767 L
140.832 124.897 L
143.397 125.07 L
145.962 125.299 L
148.527 125.598 L
151.092 125.986 L
153.657 126.482 L
156.222 127.104 L
158.787 127.872 L
161.352 128.796 L
163.916 129.886 L
166.481 131.14 L
169.046 132.55 L
171.611 134.103 L
174.176 135.781 L
176.741 137.564 L
179.306 139.433 L
181.871 141.372 L
184.436 143.364 L
187.001 145.398 L
189.565 147.464 L
192.13 149.553 L
194.695 151.661 L
197.26 153.782 L
199.825 155.913 L
202.39 158.052 L
204.955 160.196 L
207.52 162.343 L
210.085 164.494 L
212.65 166.646 L
215.215 168.8 L
217.779 170.954 L
220.344 173.109 L
222.909 175.263 L
225.474 177.417 L
228.039 179.569 L
230.604 181.719 L
233.169 183.867 L
235.734 186.011 L
238.299 188.149 L
240.864 190.28 L
243.428 192.401 L
245.993 194.51 L
248.558 196.602 L
251.123 198.672 L
253.688 200.714 L
256.253 202.721 L
258.818 204.687 L
261.383 206.605 L
263.948 208.47 L
266.513 210.28 L
269.077 212.039 L
271.642 213.756 L
274.207 215.444 L
276.772 217.123 L
279.337 218.81 L
281.902 220.524 L
284.467 222.276 L
287.032 224.075 L
289.597 225.92 L
292.162 227.808 L
294.727 229.727 L
297.291 231.668 L
299.856 233.616 L
302.421 235.557 L
304.986 237.474 L
307.551 239.349 L
310.116 241.164 L
312.681 242.898 L
315.246 244.53 L
317.811 246.039 L
320.376 247.408 L
322.94 248.623 L
325.505 249.678 L
328.07 250.575 L
330.635 251.321 L
333.2 251.932 L
335.765 252.426 L
338.33 252.825 L
340.895 253.151 L
343.46 253.422 L
346.025 253.658 L
348.59 253.878 L
351.154 254.096 L
353.719 254.328 L
356.284 254.59 L
358.59 254.861 L
360.953 255.187 L
363.073 255.534 L
364.974 255.917 L
366.679 256.369 L
368.208 256.935 L
369.579 257.609 L
370.81 258.326 L
372.04 259.118 L
373.411 260.064 L
374.941 261.18 L
376.646 262.487 L
378.546 264.014 L
380.666 265.792 L
383.029 267.834 L
384.498 269.113 L
387.063 271.327 L
389.628 273.508 L
392.193 275.665 L
394.758 277.811 L
397.323 279.955 L
399.888 282.103 L
402.452 284.254 L
405.017 286.408 L
407.582 288.563 L
410.147 290.713 L
412.712 292.854 L
415.277 294.978 L
417.842 297.073 L
420.407 299.128 L
422.972 301.129 L
425.537 303.057 L
428.101 304.894 L
430.666 306.62 L
433.231 308.216 L
435.796 309.662 L
438.361 310.946 L
440.926 312.061 L
443.491 313.006 L
446.056 313.789 L
448.621 314.424 L
451.186 314.93 L
453.751 315.326 L
456.315 315.632 L
458.88 315.865 L
461.445 316.041 L
464.01 316.174 L
466.575 316.273 L
469.14 316.346 L
471.705 316.401 L
474.27 316.441 L
476.835 316.471 L
479.4 316.493 L
481.964 316.509 L
484.529 316.521 L
487.094 316.53 L
489.659 316.537 L
492.224 316.541 L
494.789 316.545 L
497.354 316.547 L
499.919 316.549 L
502.484 316.551 L
505.049 316.552 L
507.05 316.552 L
S
GR
GS
[0.75 0 0 0.75 0 0] CT
1 GC
N
375 101 M
375 64 L
494 64 L
494 101 L
cp
f
GR
GS
[0.75 0 0 0.75 309 55.60274] CT
/Helvetica 12 F
GS
[1 0 0 1 0 0] CT
0 5 moveto 
1 -1 scale
(K) t 
GR
GR
GS
[0.75 0 0 0.75 0 0] CT
0 0.447 0.741 RC
1 LJ
0.667 LW
N
379 74.137 M
409 74.137 L
S
GR
GS
[0.75 0 0 0.75 309 72] CT
/Helvetica 12 F
GS
[1 0 0 1 0 0] CT
0 0 moveto 
1 -1 scale
(K_) t 
GR
GR
GS
[0.75 0 0 0.75 320.25 72] CT
/Helvetica 12 F
GS
[1 0 0 1 0 0] CT
0 0 moveto 
1 -1 scale
(redukovany) t 
GR
GR
GS
[0.75 0 0 0.75 0 0] CT
0.851 0.325 0.098 RC
1 LJ
0.667 LW
N
379 90.863 M
409 90.863 L
S
GR
GS
[0.75 0 0 0.75 0 0] CT
0.149 GC
10.0 ML
0.667 LW
N
375 101 M
375 64 L
494 64 L
494 101 L
cp
S
GR
GS
[0.75 0 0 0.75 221.25 33.52501] CT
/Helvetica-Bold 14.667 F
GS
[1 0 0 1 0 0] CT
-56.5 -4 moveto 
1 -1 scale
(Singular Values) t 
GR
GR
GS
[0.75 0 0 0.75 221.25 299.74999] CT
/Helvetica 14.667 F
GS
[1 0 0 1 0 0] CT
-59.5 16 moveto 
1 -1 scale
(Frequency \(rad/s\)) t 
GR
GR
GS
[0 -0.75 0.75 0 40.25 160.3875] CT
/Helvetica 14.667 F
GS
[1 0 0 1 0 0] CT
-69 -4 moveto 
1 -1 scale
(Singular Values \(dB\)) t 
GR
GR
%%Trailer
%%Pages: 1
%%EOF
