%!PS-Adobe-3.0 EPSF-3.0
%%Creator: (MATLAB, The Mathworks, Inc. Version 9.1.0.441655 \(R2016b\). Operating System: Linux)
%%Title: /home/frdm/Documents/RLS/rls-2017/sp5/figures/reg1_boosted_ur.eps
%%CreationDate: 2018-02-09T20:58:25
%%Pages: (atend)
%%BoundingBox: 0 0 737 470
%%LanguageLevel: 3
%%EndComments
%%BeginProlog
%%BeginResource: procset (Apache XML Graphics Std ProcSet) 1.2 0
%%Version: 1.2 0
%%Copyright: (Copyright 2001-2003,2010 The Apache Software Foundation. License terms: http://www.apache.org/licenses/LICENSE-2.0)
/bd{bind def}bind def
/ld{load def}bd
/GR/grestore ld
/M/moveto ld
/LJ/setlinejoin ld
/C/curveto ld
/f/fill ld
/LW/setlinewidth ld
/GC/setgray ld
/t/show ld
/N/newpath ld
/CT/concat ld
/cp/closepath ld
/S/stroke ld
/L/lineto ld
/CC/setcmykcolor ld
/A/ashow ld
/GS/gsave ld
/RC/setrgbcolor ld
/RM/rmoveto ld
/ML/setmiterlimit ld
/re {4 2 roll M
1 index 0 rlineto
0 exch rlineto
neg 0 rlineto
cp } bd
/_ctm matrix def
/_tm matrix def
/BT { _ctm currentmatrix pop matrix _tm copy pop 0 0 moveto } bd
/ET { _ctm setmatrix } bd
/iTm { _ctm setmatrix _tm concat } bd
/Tm { _tm astore pop iTm 0 0 moveto } bd
/ux 0.0 def
/uy 0.0 def
/F {
  /Tp exch def
  /Tf exch def
  Tf findfont Tp scalefont setfont
  /cf Tf def  /cs Tp def
} bd
/ULS {currentpoint /uy exch def /ux exch def} bd
/ULE {
  /Tcx currentpoint pop def
  gsave
  newpath
  cf findfont cs scalefont dup
  /FontMatrix get 0 get /Ts exch def /FontInfo get dup
  /UnderlinePosition get Ts mul /To exch def
  /UnderlineThickness get Ts mul /Tt exch def
  ux uy To add moveto  Tcx uy To add lineto
  Tt setlinewidth stroke
  grestore
} bd
/OLE {
  /Tcx currentpoint pop def
  gsave
  newpath
  cf findfont cs scalefont dup
  /FontMatrix get 0 get /Ts exch def /FontInfo get dup
  /UnderlinePosition get Ts mul /To exch def
  /UnderlineThickness get Ts mul /Tt exch def
  ux uy To add cs add moveto Tcx uy To add cs add lineto
  Tt setlinewidth stroke
  grestore
} bd
/SOE {
  /Tcx currentpoint pop def
  gsave
  newpath
  cf findfont cs scalefont dup
  /FontMatrix get 0 get /Ts exch def /FontInfo get dup
  /UnderlinePosition get Ts mul /To exch def
  /UnderlineThickness get Ts mul /Tt exch def
  ux uy To add cs 10 mul 26 idiv add moveto Tcx uy To add cs 10 mul 26 idiv add lineto
  Tt setlinewidth stroke
  grestore
} bd
/QT {
/Y22 exch store
/X22 exch store
/Y21 exch store
/X21 exch store
currentpoint
/Y21 load 2 mul add 3 div exch
/X21 load 2 mul add 3 div exch
/X21 load 2 mul /X22 load add 3 div
/Y21 load 2 mul /Y22 load add 3 div
/X22 load /Y22 load curveto
} bd
/SSPD {
dup length /d exch dict def
{
/v exch def
/k exch def
currentpagedevice k known {
/cpdv currentpagedevice k get def
v cpdv ne {
/upd false def
/nullv v type /nulltype eq def
/nullcpdv cpdv type /nulltype eq def
nullv nullcpdv or
{
/upd true def
} {
/sametype v type cpdv type eq def
sametype {
v type /arraytype eq {
/vlen v length def
/cpdvlen cpdv length def
vlen cpdvlen eq {
0 1 vlen 1 sub {
/i exch def
/obj v i get def
/cpdobj cpdv i get def
obj cpdobj ne {
/upd true def
exit
} if
} for
} {
/upd true def
} ifelse
} {
v type /dicttype eq {
v {
/dv exch def
/dk exch def
/cpddv cpdv dk get def
dv cpddv ne {
/upd true def
exit
} if
} forall
} {
/upd true def
} ifelse
} ifelse
} if
} ifelse
upd true eq {
d k v put
} if
} if
} if
} forall
d length 0 gt {
d setpagedevice
} if
} bd
/RE { % /NewFontName [NewEncodingArray] /FontName RE -
  findfont dup length dict begin
  {
    1 index /FID ne
    {def} {pop pop} ifelse
  } forall
  /Encoding exch def
  /FontName 1 index def
  currentdict definefont pop
  end
} bind def
%%EndResource
%%BeginResource: procset (Apache XML Graphics EPS ProcSet) 1.0 0
%%Version: 1.0 0
%%Copyright: (Copyright 2002-2003 The Apache Software Foundation. License terms: http://www.apache.org/licenses/LICENSE-2.0)
/BeginEPSF { %def
/b4_Inc_state save def         % Save state for cleanup
/dict_count countdictstack def % Count objects on dict stack
/op_count count 1 sub def      % Count objects on operand stack
userdict begin                 % Push userdict on dict stack
/showpage { } def              % Redefine showpage, { } = null proc
0 setgray 0 setlinecap         % Prepare graphics state
1 setlinewidth 0 setlinejoin
10 setmiterlimit [ ] 0 setdash newpath
/languagelevel where           % If level not equal to 1 then
{pop languagelevel             % set strokeadjust and
1 ne                           % overprint to their defaults.
{false setstrokeadjust false setoverprint
} if
} if
} bd
/EndEPSF { %def
count op_count sub {pop} repeat            % Clean up stacks
countdictstack dict_count sub {end} repeat
b4_Inc_state restore
} bd
%%EndResource
%FOPBeginFontDict
%%IncludeResource: font Courier-Bold
%%IncludeResource: font Helvetica
%%IncludeResource: font Courier-BoldOblique
%%IncludeResource: font Courier-Oblique
%%IncludeResource: font Times-Roman
%%IncludeResource: font Helvetica-BoldOblique
%%IncludeResource: font Helvetica-Bold
%%IncludeResource: font Helvetica-Oblique
%%IncludeResource: font Times-BoldItalic
%%IncludeResource: font Courier
%%IncludeResource: font Times-Italic
%%IncludeResource: font Times-Bold
%%IncludeResource: font Symbol
%%IncludeResource: font ZapfDingbats
%FOPEndFontDict
%%BeginResource: encoding WinAnsiEncoding
/WinAnsiEncoding [
/.notdef /.notdef /.notdef /.notdef /.notdef
/.notdef /.notdef /.notdef /.notdef /.notdef
/.notdef /.notdef /.notdef /.notdef /.notdef
/.notdef /.notdef /.notdef /.notdef /.notdef
/.notdef /.notdef /.notdef /.notdef /.notdef
/.notdef /.notdef /.notdef /.notdef /.notdef
/.notdef /.notdef /space /exclam /quotedbl
/numbersign /dollar /percent /ampersand /quotesingle
/parenleft /parenright /asterisk /plus /comma
/hyphen /period /slash /zero /one
/two /three /four /five /six
/seven /eight /nine /colon /semicolon
/less /equal /greater /question /at
/A /B /C /D /E
/F /G /H /I /J
/K /L /M /N /O
/P /Q /R /S /T
/U /V /W /X /Y
/Z /bracketleft /backslash /bracketright /asciicircum
/underscore /quoteleft /a /b /c
/d /e /f /g /h
/i /j /k /l /m
/n /o /p /q /r
/s /t /u /v /w
/x /y /z /braceleft /bar
/braceright /asciitilde /bullet /Euro /bullet
/quotesinglbase /florin /quotedblbase /ellipsis /dagger
/daggerdbl /circumflex /perthousand /Scaron /guilsinglleft
/OE /bullet /Zcaron /bullet /bullet
/quoteleft /quoteright /quotedblleft /quotedblright /bullet
/endash /emdash /asciitilde /trademark /scaron
/guilsinglright /oe /bullet /zcaron /Ydieresis
/space /exclamdown /cent /sterling /currency
/yen /brokenbar /section /dieresis /copyright
/ordfeminine /guillemotleft /logicalnot /sfthyphen /registered
/macron /degree /plusminus /twosuperior /threesuperior
/acute /mu /paragraph /middot /cedilla
/onesuperior /ordmasculine /guillemotright /onequarter /onehalf
/threequarters /questiondown /Agrave /Aacute /Acircumflex
/Atilde /Adieresis /Aring /AE /Ccedilla
/Egrave /Eacute /Ecircumflex /Edieresis /Igrave
/Iacute /Icircumflex /Idieresis /Eth /Ntilde
/Ograve /Oacute /Ocircumflex /Otilde /Odieresis
/multiply /Oslash /Ugrave /Uacute /Ucircumflex
/Udieresis /Yacute /Thorn /germandbls /agrave
/aacute /acircumflex /atilde /adieresis /aring
/ae /ccedilla /egrave /eacute /ecircumflex
/edieresis /igrave /iacute /icircumflex /idieresis
/eth /ntilde /ograve /oacute /ocircumflex
/otilde /odieresis /divide /oslash /ugrave
/uacute /ucircumflex /udieresis /yacute /thorn
/ydieresis
] def
%%EndResource
%FOPBeginFontReencode
/Courier-Bold findfont
dup length dict begin
  {1 index /FID ne {def} {pop pop} ifelse} forall
  /Encoding WinAnsiEncoding def
  currentdict
end
/Courier-Bold exch definefont pop
/Helvetica findfont
dup length dict begin
  {1 index /FID ne {def} {pop pop} ifelse} forall
  /Encoding WinAnsiEncoding def
  currentdict
end
/Helvetica exch definefont pop
/Courier-BoldOblique findfont
dup length dict begin
  {1 index /FID ne {def} {pop pop} ifelse} forall
  /Encoding WinAnsiEncoding def
  currentdict
end
/Courier-BoldOblique exch definefont pop
/Courier-Oblique findfont
dup length dict begin
  {1 index /FID ne {def} {pop pop} ifelse} forall
  /Encoding WinAnsiEncoding def
  currentdict
end
/Courier-Oblique exch definefont pop
/Times-Roman findfont
dup length dict begin
  {1 index /FID ne {def} {pop pop} ifelse} forall
  /Encoding WinAnsiEncoding def
  currentdict
end
/Times-Roman exch definefont pop
/Helvetica-BoldOblique findfont
dup length dict begin
  {1 index /FID ne {def} {pop pop} ifelse} forall
  /Encoding WinAnsiEncoding def
  currentdict
end
/Helvetica-BoldOblique exch definefont pop
/Helvetica-Bold findfont
dup length dict begin
  {1 index /FID ne {def} {pop pop} ifelse} forall
  /Encoding WinAnsiEncoding def
  currentdict
end
/Helvetica-Bold exch definefont pop
/Helvetica-Oblique findfont
dup length dict begin
  {1 index /FID ne {def} {pop pop} ifelse} forall
  /Encoding WinAnsiEncoding def
  currentdict
end
/Helvetica-Oblique exch definefont pop
/Times-BoldItalic findfont
dup length dict begin
  {1 index /FID ne {def} {pop pop} ifelse} forall
  /Encoding WinAnsiEncoding def
  currentdict
end
/Times-BoldItalic exch definefont pop
/Courier findfont
dup length dict begin
  {1 index /FID ne {def} {pop pop} ifelse} forall
  /Encoding WinAnsiEncoding def
  currentdict
end
/Courier exch definefont pop
/Times-Italic findfont
dup length dict begin
  {1 index /FID ne {def} {pop pop} ifelse} forall
  /Encoding WinAnsiEncoding def
  currentdict
end
/Times-Italic exch definefont pop
/Times-Bold findfont
dup length dict begin
  {1 index /FID ne {def} {pop pop} ifelse} forall
  /Encoding WinAnsiEncoding def
  currentdict
end
/Times-Bold exch definefont pop
%FOPEndFontReencode
%%EndProlog
%%Page: 1 1
%%PageBoundingBox: 0 0 737 470
%%BeginPageSetup
[1 0 0 -1 0 470] CT
%%EndPageSetup
GS
[0.75 0 0 0.75 0 -0.25] CT
1 GC
N
0 0 983 627 re
f
GR
GS
[0.75 0 0 0.75 0 -0.25] CT
1 GC
N
0 0 983 627 re
f
GR
GS
[0.75 0 0 0.75 0 -0.25] CT
1 GC
N
128 558 M
890 558 L
890 47 L
128 47 L
cp
f
GR
GS
[0.75 0 0 0.75 0 -0.25] CT
0.149 GC
2 setlinecap
1 LJ
0.667 LW
N
128 558 M
890 558 L
S
GR
GS
[0.75 0 0 0.75 0 -0.25] CT
0.149 GC
2 setlinecap
1 LJ
0.667 LW
N
128 558 M
128 550.38 L
S
GR
GS
[0.75 0 0 0.75 0 -0.25] CT
0.149 GC
2 setlinecap
1 LJ
0.667 LW
N
204.2 558 M
204.2 550.38 L
S
GR
GS
[0.75 0 0 0.75 0 -0.25] CT
0.149 GC
2 setlinecap
1 LJ
0.667 LW
N
280.4 558 M
280.4 550.38 L
S
GR
GS
[0.75 0 0 0.75 0 -0.25] CT
0.149 GC
2 setlinecap
1 LJ
0.667 LW
N
356.6 558 M
356.6 550.38 L
S
GR
GS
[0.75 0 0 0.75 0 -0.25] CT
0.149 GC
2 setlinecap
1 LJ
0.667 LW
N
432.8 558 M
432.8 550.38 L
S
GR
GS
[0.75 0 0 0.75 0 -0.25] CT
0.149 GC
2 setlinecap
1 LJ
0.667 LW
N
509 558 M
509 550.38 L
S
GR
GS
[0.75 0 0 0.75 0 -0.25] CT
0.149 GC
2 setlinecap
1 LJ
0.667 LW
N
585.2 558 M
585.2 550.38 L
S
GR
GS
[0.75 0 0 0.75 0 -0.25] CT
0.149 GC
2 setlinecap
1 LJ
0.667 LW
N
661.4 558 M
661.4 550.38 L
S
GR
GS
[0.75 0 0 0.75 0 -0.25] CT
0.149 GC
2 setlinecap
1 LJ
0.667 LW
N
737.6 558 M
737.6 550.38 L
S
GR
GS
[0.75 0 0 0.75 0 -0.25] CT
0.149 GC
2 setlinecap
1 LJ
0.667 LW
N
813.8 558 M
813.8 550.38 L
S
GR
GS
[0.75 0 0 0.75 0 -0.25] CT
0.149 GC
2 setlinecap
1 LJ
0.667 LW
N
890 558 M
890 550.38 L
S
GR
GS
[0.75 0 0 0.75 96 422.24998] CT
0.149 GC
/Helvetica 13.333 F
GS
[1 0 0 1 0 0] CT
-4.5 13 moveto 
1 -1 scale
(0) t 
GR
GR
GS
[0.75 0 0 0.75 153.15 422.24998] CT
0.149 GC
/Helvetica 13.333 F
GS
[1 0 0 1 0 0] CT
-8.5 13 moveto 
1 -1 scale
(50) t 
GR
GR
GS
[0.75 0 0 0.75 210.3 422.24998] CT
0.149 GC
/Helvetica 13.333 F
GS
[1 0 0 1 0 0] CT
-12.5 13 moveto 
1 -1 scale
(100) t 
GR
GR
GS
[0.75 0 0 0.75 267.45 422.24998] CT
0.149 GC
/Helvetica 13.333 F
GS
[1 0 0 1 0 0] CT
-12.5 13 moveto 
1 -1 scale
(150) t 
GR
GR
GS
[0.75 0 0 0.75 324.59999 422.24998] CT
0.149 GC
/Helvetica 13.333 F
GS
[1 0 0 1 0 0] CT
-12.5 13 moveto 
1 -1 scale
(200) t 
GR
GR
GS
[0.75 0 0 0.75 381.75 422.24998] CT
0.149 GC
/Helvetica 13.333 F
GS
[1 0 0 1 0 0] CT
-12.5 13 moveto 
1 -1 scale
(250) t 
GR
GR
GS
[0.75 0 0 0.75 438.90001 422.24998] CT
0.149 GC
/Helvetica 13.333 F
GS
[1 0 0 1 0 0] CT
-12.5 13 moveto 
1 -1 scale
(300) t 
GR
GR
GS
[0.75 0 0 0.75 496.05002 422.24998] CT
0.149 GC
/Helvetica 13.333 F
GS
[1 0 0 1 0 0] CT
-12.5 13 moveto 
1 -1 scale
(350) t 
GR
GR
GS
[0.75 0 0 0.75 553.19998 422.24998] CT
0.149 GC
/Helvetica 13.333 F
GS
[1 0 0 1 0 0] CT
-12.5 13 moveto 
1 -1 scale
(400) t 
GR
GR
GS
[0.75 0 0 0.75 610.34999 422.24998] CT
0.149 GC
/Helvetica 13.333 F
GS
[1 0 0 1 0 0] CT
-12.5 13 moveto 
1 -1 scale
(450) t 
GR
GR
GS
[0.75 0 0 0.75 667.5 422.24998] CT
0.149 GC
/Helvetica 13.333 F
GS
[1 0 0 1 0 0] CT
-12.5 13 moveto 
1 -1 scale
(500) t 
GR
GR
GS
[0.75 0 0 0.75 381.75027 436.00002] CT
0.149 GC
/Helvetica 14.667 F
GS
[1 0 0 1 0 0] CT
-57.5 14 moveto 
1 -1 scale
(Time \(seconds\)) t 
GR
GR
GS
[0.75 0 0 0.75 0 -0.25] CT
0.149 GC
2 setlinecap
1 LJ
0.667 LW
N
128 558 M
128 47 L
S
GR
GS
[0.75 0 0 0.75 0 -0.25] CT
0.149 GC
2 setlinecap
1 LJ
0.667 LW
N
128 558 M
135.62 558 L
S
GR
GS
[0.75 0 0 0.75 0 -0.25] CT
0.149 GC
2 setlinecap
1 LJ
0.667 LW
N
128 485 M
135.62 485 L
S
GR
GS
[0.75 0 0 0.75 0 -0.25] CT
0.149 GC
2 setlinecap
1 LJ
0.667 LW
N
128 412 M
135.62 412 L
S
GR
GS
[0.75 0 0 0.75 0 -0.25] CT
0.149 GC
2 setlinecap
1 LJ
0.667 LW
N
128 339 M
135.62 339 L
S
GR
GS
[0.75 0 0 0.75 0 -0.25] CT
0.149 GC
2 setlinecap
1 LJ
0.667 LW
N
128 266 M
135.62 266 L
S
GR
GS
[0.75 0 0 0.75 0 -0.25] CT
0.149 GC
2 setlinecap
1 LJ
0.667 LW
N
128 193 M
135.62 193 L
S
GR
GS
[0.75 0 0 0.75 0 -0.25] CT
0.149 GC
2 setlinecap
1 LJ
0.667 LW
N
128 120 M
135.62 120 L
S
GR
GS
[0.75 0 0 0.75 0 -0.25] CT
0.149 GC
2 setlinecap
1 LJ
0.667 LW
N
128 47 M
135.62 47 L
S
GR
GS
[0.75 0 0 0.75 92 418.25] CT
0.149 GC
/Helvetica 13.333 F
GS
[1 0 0 1 0 0] CT
-13 4.5 moveto 
1 -1 scale
(-1) t 
GR
GR
GS
[0.75 0 0 0.75 92 363.5] CT
0.149 GC
/Helvetica 13.333 F
GS
[1 0 0 1 0 0] CT
-9 4.5 moveto 
1 -1 scale
(0) t 
GR
GR
GS
[0.75 0 0 0.75 92 308.75] CT
0.149 GC
/Helvetica 13.333 F
GS
[1 0 0 1 0 0] CT
-9 4.5 moveto 
1 -1 scale
(1) t 
GR
GR
GS
[0.75 0 0 0.75 92 254] CT
0.149 GC
/Helvetica 13.333 F
GS
[1 0 0 1 0 0] CT
-9 4.5 moveto 
1 -1 scale
(2) t 
GR
GR
GS
[0.75 0 0 0.75 92 199.25] CT
0.149 GC
/Helvetica 13.333 F
GS
[1 0 0 1 0 0] CT
-9 4.5 moveto 
1 -1 scale
(3) t 
GR
GR
GS
[0.75 0 0 0.75 92 144.5] CT
0.149 GC
/Helvetica 13.333 F
GS
[1 0 0 1 0 0] CT
-9 4.5 moveto 
1 -1 scale
(4) t 
GR
GR
GS
[0.75 0 0 0.75 92 89.75] CT
0.149 GC
/Helvetica 13.333 F
GS
[1 0 0 1 0 0] CT
-9 4.5 moveto 
1 -1 scale
(5) t 
GR
GR
GS
[0.75 0 0 0.75 92 35] CT
0.149 GC
/Helvetica 13.333 F
GS
[1 0 0 1 0 0] CT
-9 4.5 moveto 
1 -1 scale
(6) t 
GR
GR
GS
[0 -0.75 0.75 0 79.25 226.62482] CT
0.149 GC
/Helvetica 14.667 F
GS
[1 0 0 1 0 0] CT
-17 -4 moveto 
1 -1 scale
(data) t 
GR
GR
GS
[0.75 0 0 0.75 381.75037 32.93751] CT
N
-149.984 -6 M
-154.391 -6 L
-155.094 -4 L
-157.922 -4 L
-153.875 -14.938 L
-150.516 -14.938 L
-146.469 -4 L
-149.297 -4 L
-149.984 -6 L
cp
-153.688 -8.016 M
-150.703 -8.016 L
-152.188 -12.375 L
-153.688 -8.016 L
cp
-145.392 -15.391 M
-142.782 -15.391 L
-142.782 -9.188 L
-139.751 -12.203 L
-136.704 -12.203 L
-140.72 -8.438 L
-136.392 -4 L
-139.579 -4 L
-142.782 -7.422 L
-142.782 -4 L
-145.392 -4 L
-145.392 -15.391 L
cp
-129.02 -11.953 M
-129.02 -9.813 L
-129.551 -10.172 -130.09 -10.352 QT
-130.629 -10.531 -131.207 -10.531 QT
-132.316 -10.531 -132.926 -9.891 QT
-133.535 -9.25 -133.535 -8.094 QT
-133.535 -6.938 -132.926 -6.297 QT
-132.316 -5.656 -131.207 -5.656 QT
-130.598 -5.656 -130.043 -5.844 QT
-129.488 -6.031 -129.02 -6.391 QT
-129.02 -4.234 L
-129.645 -4.016 -130.277 -3.898 QT
-130.91 -3.781 -131.535 -3.781 QT
-133.754 -3.781 -135.012 -4.922 QT
-136.27 -6.063 -136.27 -8.094 QT
-136.27 -10.125 -135.012 -11.266 QT
-133.754 -12.406 -131.535 -12.406 QT
-130.895 -12.406 -130.27 -12.289 QT
-129.645 -12.172 -129.02 -11.953 QT
cp
-132.051 -13.25 M
-133.926 -16 L
-132.613 -16 L
-131.16 -14.328 L
-129.707 -16 L
-128.395 -16 L
-130.27 -13.25 L
-132.051 -13.25 L
cp
-118.722 -9 M
-118.722 -4 L
-121.347 -4 L
-121.347 -4.813 L
-121.347 -7.828 L
-121.347 -8.891 -121.394 -9.289 QT
-121.441 -9.688 -121.566 -9.875 QT
-121.722 -10.141 -121.98 -10.281 QT
-122.238 -10.422 -122.582 -10.422 QT
-123.41 -10.422 -123.879 -9.789 QT
-124.347 -9.156 -124.347 -8.031 QT
-124.347 -4 L
-126.957 -4 L
-126.957 -12.203 L
-124.347 -12.203 L
-124.347 -11 L
-123.754 -11.719 -123.082 -12.063 QT
-122.41 -12.406 -121.613 -12.406 QT
-120.191 -12.406 -119.457 -11.531 QT
-118.722 -10.656 -118.722 -9 QT
cp
-116.523 -12.203 M
-113.913 -12.203 L
-113.913 -4 L
-116.523 -4 L
-116.523 -12.203 L
cp
-114.054 -16 M
-111.976 -16 L
-114.679 -13.25 L
-116.116 -13.25 L
-114.054 -16 L
cp
-106.803 -12.203 M
-99.646 -12.203 L
-99.646 -10.375 L
-103.975 -5.875 L
-99.646 -5.875 L
-99.646 -4 L
-106.99 -4 L
-106.99 -5.828 L
-102.662 -10.328 L
-106.803 -10.328 L
-106.803 -12.203 L
cp
-94.194 -7.688 M
-95.022 -7.688 -95.436 -7.414 QT
-95.85 -7.141 -95.85 -6.594 QT
-95.85 -6.094 -95.514 -5.813 QT
-95.179 -5.531 -94.585 -5.531 QT
-93.85 -5.531 -93.343 -6.063 QT
-92.835 -6.594 -92.835 -7.391 QT
-92.835 -7.688 L
-94.194 -7.688 L
cp
-90.194 -8.688 M
-90.194 -4 L
-92.835 -4 L
-92.835 -5.219 L
-93.366 -4.469 -94.022 -4.125 QT
-94.679 -3.781 -95.616 -3.781 QT
-96.897 -3.781 -97.694 -4.531 QT
-98.491 -5.281 -98.491 -6.469 QT
-98.491 -7.906 -97.499 -8.578 QT
-96.507 -9.25 -94.382 -9.25 QT
-92.835 -9.25 L
-92.835 -9.453 L
-92.835 -10.078 -93.327 -10.367 QT
-93.819 -10.656 -94.85 -10.656 QT
-95.694 -10.656 -96.421 -10.492 QT
-97.147 -10.328 -97.772 -9.984 QT
-97.772 -11.984 L
-96.929 -12.188 -96.077 -12.297 QT
-95.225 -12.406 -94.382 -12.406 QT
-92.163 -12.406 -91.179 -11.531 QT
-90.194 -10.656 -90.194 -8.688 QT
cp
-93.397 -16 M
-91.319 -16 L
-94.022 -13.25 L
-95.46 -13.25 L
-93.397 -16 L
cp
-81.57 -11.953 M
-81.57 -9.953 L
-82.413 -10.313 -83.195 -10.484 QT
-83.976 -10.656 -84.679 -10.656 QT
-85.429 -10.656 -85.788 -10.469 QT
-86.148 -10.281 -86.148 -9.891 QT
-86.148 -9.578 -85.874 -9.414 QT
-85.601 -9.25 -84.898 -9.156 QT
-84.429 -9.094 L
-82.413 -8.844 -81.718 -8.258 QT
-81.023 -7.672 -81.023 -6.422 QT
-81.023 -5.109 -81.992 -4.445 QT
-82.96 -3.781 -84.882 -3.781 QT
-85.695 -3.781 -86.562 -3.914 QT
-87.429 -4.047 -88.335 -4.297 QT
-88.335 -6.297 L
-87.554 -5.906 -86.734 -5.719 QT
-85.913 -5.531 -85.054 -5.531 QT
-84.288 -5.531 -83.898 -5.742 QT
-83.507 -5.953 -83.507 -6.375 QT
-83.507 -6.719 -83.781 -6.891 QT
-84.054 -7.063 -84.851 -7.172 QT
-85.304 -7.219 L
-87.054 -7.438 -87.757 -8.031 QT
-88.46 -8.625 -88.46 -9.844 QT
-88.46 -11.141 -87.57 -11.773 QT
-86.679 -12.406 -84.835 -12.406 QT
-84.101 -12.406 -83.304 -12.297 QT
-82.507 -12.188 -81.57 -11.953 QT
cp
-75.58 -7.688 M
-76.409 -7.688 -76.823 -7.414 QT
-77.237 -7.141 -77.237 -6.594 QT
-77.237 -6.094 -76.901 -5.813 QT
-76.565 -5.531 -75.971 -5.531 QT
-75.237 -5.531 -74.729 -6.063 QT
-74.221 -6.594 -74.221 -7.391 QT
-74.221 -7.688 L
-75.58 -7.688 L
cp
-71.58 -8.688 M
-71.58 -4 L
-74.221 -4 L
-74.221 -5.219 L
-74.752 -4.469 -75.409 -4.125 QT
-76.065 -3.781 -77.002 -3.781 QT
-78.284 -3.781 -79.08 -4.531 QT
-79.877 -5.281 -79.877 -6.469 QT
-79.877 -7.906 -78.885 -8.578 QT
-77.893 -9.25 -75.768 -9.25 QT
-74.221 -9.25 L
-74.221 -9.453 L
-74.221 -10.078 -74.713 -10.367 QT
-75.205 -10.656 -76.237 -10.656 QT
-77.08 -10.656 -77.807 -10.492 QT
-78.534 -10.328 -79.159 -9.984 QT
-79.159 -11.984 L
-78.315 -12.188 -77.463 -12.297 QT
-76.612 -12.406 -75.768 -12.406 QT
-73.549 -12.406 -72.565 -11.531 QT
-71.58 -10.656 -71.58 -8.688 QT
cp
-61.128 -9 M
-61.128 -4 L
-63.753 -4 L
-63.753 -4.813 L
-63.753 -7.813 L
-63.753 -8.891 -63.8 -9.289 QT
-63.847 -9.688 -63.972 -9.875 QT
-64.128 -10.141 -64.386 -10.281 QT
-64.643 -10.422 -64.987 -10.422 QT
-65.815 -10.422 -66.284 -9.789 QT
-66.753 -9.156 -66.753 -8.031 QT
-66.753 -4 L
-69.362 -4 L
-69.362 -15.391 L
-66.753 -15.391 L
-66.753 -11 L
-66.159 -11.719 -65.487 -12.063 QT
-64.815 -12.406 -64.018 -12.406 QT
-62.597 -12.406 -61.862 -11.531 QT
-61.128 -10.656 -61.128 -9 QT
cp
-60.006 -12.203 M
-57.381 -12.203 L
-55.178 -6.641 L
-53.303 -12.203 L
-50.694 -12.203 L
-54.131 -3.219 L
-54.663 -1.859 -55.35 -1.313 QT
-56.038 -0.766 -57.178 -0.766 QT
-58.694 -0.766 L
-58.694 -2.484 L
-57.866 -2.484 L
-57.209 -2.484 -56.905 -2.695 QT
-56.6 -2.906 -56.428 -3.453 QT
-56.35 -3.688 L
-60.006 -12.203 L
cp
-36.038 -9 M
-36.038 -4 L
-38.663 -4 L
-38.663 -4.813 L
-38.663 -7.828 L
-38.663 -8.891 -38.709 -9.289 QT
-38.756 -9.688 -38.881 -9.875 QT
-39.038 -10.141 -39.295 -10.281 QT
-39.553 -10.422 -39.897 -10.422 QT
-40.725 -10.422 -41.194 -9.789 QT
-41.663 -9.156 -41.663 -8.031 QT
-41.663 -4 L
-44.272 -4 L
-44.272 -12.203 L
-41.663 -12.203 L
-41.663 -11 L
-41.069 -11.719 -40.397 -12.063 QT
-39.725 -12.406 -38.928 -12.406 QT
-37.506 -12.406 -36.772 -11.531 QT
-36.038 -10.656 -36.038 -9 QT
cp
-25.65 -8.125 M
-25.65 -7.375 L
-31.791 -7.375 L
-31.697 -6.453 -31.119 -5.992 QT
-30.541 -5.531 -29.525 -5.531 QT
-28.697 -5.531 -27.83 -5.773 QT
-26.963 -6.016 -26.041 -6.516 QT
-26.041 -4.5 L
-26.979 -4.141 -27.908 -3.961 QT
-28.838 -3.781 -29.76 -3.781 QT
-31.994 -3.781 -33.229 -4.914 QT
-34.463 -6.047 -34.463 -8.094 QT
-34.463 -10.094 -33.252 -11.25 QT
-32.041 -12.406 -29.916 -12.406 QT
-27.979 -12.406 -26.815 -11.242 QT
-25.65 -10.078 -25.65 -8.125 QT
cp
-28.354 -9 M
-28.354 -9.75 -28.791 -10.203 QT
-29.229 -10.656 -29.932 -10.656 QT
-30.682 -10.656 -31.158 -10.227 QT
-31.635 -9.797 -31.76 -9 QT
-28.354 -9 L
cp
-24.304 -12.203 M
-17.148 -12.203 L
-17.148 -10.375 L
-21.476 -5.875 L
-17.148 -5.875 L
-17.148 -4 L
-24.492 -4 L
-24.492 -5.828 L
-20.163 -10.328 L
-24.304 -10.328 L
-24.304 -12.203 L
cp
-9.274 -9.969 M
-9.617 -10.125 -9.961 -10.203 QT
-10.305 -10.281 -10.649 -10.281 QT
-11.664 -10.281 -12.211 -9.633 QT
-12.758 -8.984 -12.758 -7.781 QT
-12.758 -4 L
-15.367 -4 L
-15.367 -12.203 L
-12.758 -12.203 L
-12.758 -10.859 L
-12.242 -11.656 -11.586 -12.031 QT
-10.93 -12.406 -10.024 -12.406 QT
-9.883 -12.406 -9.735 -12.391 QT
-9.586 -12.375 -9.289 -12.344 QT
-9.274 -9.969 L
cp
-9.218 -12.203 M
-6.593 -12.203 L
-4.389 -6.641 L
-2.514 -12.203 L
0.095 -12.203 L
-3.343 -3.219 L
-3.874 -1.859 -4.561 -1.313 QT
-5.249 -0.766 -6.389 -0.766 QT
-7.905 -0.766 L
-7.905 -2.484 L
-7.077 -2.484 L
-6.421 -2.484 -6.116 -2.695 QT
-5.811 -2.906 -5.639 -3.453 QT
-5.561 -3.688 L
-9.218 -12.203 L
cp
8.039 -11.953 M
8.039 -9.813 L
7.508 -10.172 6.969 -10.352 QT
6.43 -10.531 5.852 -10.531 QT
4.742 -10.531 4.133 -9.891 QT
3.524 -9.25 3.524 -8.094 QT
3.524 -6.938 4.133 -6.297 QT
4.742 -5.656 5.852 -5.656 QT
6.461 -5.656 7.016 -5.844 QT
7.571 -6.031 8.039 -6.391 QT
8.039 -4.234 L
7.414 -4.016 6.781 -3.898 QT
6.149 -3.781 5.524 -3.781 QT
3.305 -3.781 2.047 -4.922 QT
0.789 -6.063 0.789 -8.094 QT
0.789 -10.125 2.047 -11.266 QT
3.305 -12.406 5.524 -12.406 QT
6.164 -12.406 6.789 -12.289 QT
7.414 -12.172 8.039 -11.953 QT
cp
18.337 -9 M
18.337 -4 L
15.712 -4 L
15.712 -4.813 L
15.712 -7.813 L
15.712 -8.891 15.665 -9.289 QT
15.618 -9.688 15.493 -9.875 QT
15.337 -10.141 15.079 -10.281 QT
14.821 -10.422 14.477 -10.422 QT
13.649 -10.422 13.18 -9.789 QT
12.712 -9.156 12.712 -8.031 QT
12.712 -4 L
10.102 -4 L
10.102 -15.391 L
12.712 -15.391 L
12.712 -11 L
13.305 -11.719 13.977 -12.063 QT
14.649 -12.406 15.446 -12.406 QT
16.868 -12.406 17.602 -11.531 QT
18.337 -10.656 18.337 -9 QT
cp
20.536 -15.391 M
23.145 -15.391 L
23.145 -4 L
20.536 -4 L
20.536 -15.391 L
cp
33.747 -8.125 M
33.747 -7.375 L
27.607 -7.375 L
27.701 -6.453 28.279 -5.992 QT
28.857 -5.531 29.872 -5.531 QT
30.701 -5.531 31.568 -5.773 QT
32.435 -6.016 33.357 -6.516 QT
33.357 -4.5 L
32.419 -4.141 31.49 -3.961 QT
30.56 -3.781 29.638 -3.781 QT
27.404 -3.781 26.169 -4.914 QT
24.935 -6.047 24.935 -8.094 QT
24.935 -10.094 26.146 -11.25 QT
27.357 -12.406 29.482 -12.406 QT
31.419 -12.406 32.583 -11.242 QT
33.747 -10.078 33.747 -8.125 QT
cp
31.044 -9 M
31.044 -9.75 30.607 -10.203 QT
30.169 -10.656 29.466 -10.656 QT
28.716 -10.656 28.24 -10.227 QT
27.763 -9.797 27.638 -9 QT
31.044 -9 L
cp
43.734 -9 M
43.734 -4 L
41.109 -4 L
41.109 -4.813 L
41.109 -7.828 L
41.109 -8.891 41.063 -9.289 QT
41.016 -9.688 40.891 -9.875 QT
40.734 -10.141 40.477 -10.281 QT
40.219 -10.422 39.875 -10.422 QT
39.047 -10.422 38.578 -9.789 QT
38.109 -9.156 38.109 -8.031 QT
38.109 -4 L
35.5 -4 L
35.5 -12.203 L
38.109 -12.203 L
38.109 -11 L
38.703 -11.719 39.375 -12.063 QT
40.047 -12.406 40.844 -12.406 QT
42.266 -12.406 43 -11.531 QT
43.734 -10.656 43.734 -9 QT
cp
54.122 -8.125 M
54.122 -7.375 L
47.981 -7.375 L
48.075 -6.453 48.653 -5.992 QT
49.231 -5.531 50.247 -5.531 QT
51.075 -5.531 51.942 -5.773 QT
52.809 -6.016 53.731 -6.516 QT
53.731 -4.5 L
52.793 -4.141 51.864 -3.961 QT
50.934 -3.781 50.012 -3.781 QT
47.778 -3.781 46.543 -4.914 QT
45.309 -6.047 45.309 -8.094 QT
45.309 -10.094 46.52 -11.25 QT
47.731 -12.406 49.856 -12.406 QT
51.793 -12.406 52.958 -11.242 QT
54.122 -10.078 54.122 -8.125 QT
cp
51.418 -9 M
51.418 -9.75 50.981 -10.203 QT
50.543 -10.656 49.84 -10.656 QT
49.09 -10.656 48.614 -10.227 QT
48.137 -9.797 48.012 -9 QT
51.418 -9 L
cp
51.403 -16 M
53.481 -16 L
50.778 -13.25 L
49.34 -13.25 L
51.403 -16 L
cp
64.109 -9 M
64.109 -4 L
61.484 -4 L
61.484 -4.813 L
61.484 -7.813 L
61.484 -8.891 61.437 -9.289 QT
61.39 -9.688 61.265 -9.875 QT
61.109 -10.141 60.851 -10.281 QT
60.593 -10.422 60.249 -10.422 QT
59.421 -10.422 58.952 -9.789 QT
58.484 -9.156 58.484 -8.031 QT
58.484 -4 L
55.874 -4 L
55.874 -15.391 L
58.484 -15.391 L
58.484 -11 L
59.077 -11.719 59.749 -12.063 QT
60.421 -12.406 61.218 -12.406 QT
62.64 -12.406 63.374 -11.531 QT
64.109 -10.656 64.109 -9 QT
cp
70.199 -10.531 M
69.34 -10.531 68.879 -9.906 QT
68.418 -9.281 68.418 -8.094 QT
68.418 -6.922 68.879 -6.289 QT
69.34 -5.656 70.199 -5.656 QT
71.058 -5.656 71.511 -6.289 QT
71.965 -6.922 71.965 -8.094 QT
71.965 -9.281 71.511 -9.906 QT
71.058 -10.531 70.199 -10.531 QT
cp
70.199 -12.406 M
72.324 -12.406 73.511 -11.258 QT
74.699 -10.109 74.699 -8.094 QT
74.699 -6.078 73.511 -4.93 QT
72.324 -3.781 70.199 -3.781 QT
68.09 -3.781 66.886 -4.93 QT
65.683 -6.078 65.683 -8.094 QT
65.683 -10.109 66.886 -11.258 QT
68.09 -12.406 70.199 -12.406 QT
cp
87.886 -11.953 M
87.886 -9.953 L
87.042 -10.313 86.261 -10.484 QT
85.48 -10.656 84.777 -10.656 QT
84.027 -10.656 83.667 -10.469 QT
83.308 -10.281 83.308 -9.891 QT
83.308 -9.578 83.581 -9.414 QT
83.855 -9.25 84.558 -9.156 QT
85.027 -9.094 L
87.042 -8.844 87.738 -8.258 QT
88.433 -7.672 88.433 -6.422 QT
88.433 -5.109 87.464 -4.445 QT
86.495 -3.781 84.574 -3.781 QT
83.761 -3.781 82.894 -3.914 QT
82.027 -4.047 81.12 -4.297 QT
81.12 -6.297 L
81.902 -5.906 82.722 -5.719 QT
83.542 -5.531 84.402 -5.531 QT
85.167 -5.531 85.558 -5.742 QT
85.949 -5.953 85.949 -6.375 QT
85.949 -6.719 85.675 -6.891 QT
85.402 -7.063 84.605 -7.172 QT
84.152 -7.219 L
82.402 -7.438 81.699 -8.031 QT
80.995 -8.625 80.995 -9.844 QT
80.995 -11.141 81.886 -11.773 QT
82.777 -12.406 84.62 -12.406 QT
85.355 -12.406 86.152 -12.297 QT
86.949 -12.188 87.886 -11.953 QT
cp
89.125 -12.203 M
91.75 -12.203 L
93.953 -6.641 L
95.828 -12.203 L
98.438 -12.203 L
95 -3.219 L
94.469 -1.859 93.782 -1.313 QT
93.094 -0.766 91.953 -0.766 QT
90.438 -0.766 L
90.438 -2.484 L
91.266 -2.484 L
91.922 -2.484 92.227 -2.695 QT
92.532 -2.906 92.703 -3.453 QT
92.782 -3.688 L
89.125 -12.203 L
cp
106.163 -11.953 M
106.163 -9.953 L
105.32 -10.313 104.538 -10.484 QT
103.757 -10.656 103.054 -10.656 QT
102.304 -10.656 101.945 -10.469 QT
101.585 -10.281 101.585 -9.891 QT
101.585 -9.578 101.859 -9.414 QT
102.132 -9.25 102.835 -9.156 QT
103.304 -9.094 L
105.32 -8.844 106.015 -8.258 QT
106.71 -7.672 106.71 -6.422 QT
106.71 -5.109 105.742 -4.445 QT
104.773 -3.781 102.851 -3.781 QT
102.038 -3.781 101.171 -3.914 QT
100.304 -4.047 99.398 -4.297 QT
99.398 -6.297 L
100.179 -5.906 100.999 -5.719 QT
101.82 -5.531 102.679 -5.531 QT
103.445 -5.531 103.835 -5.742 QT
104.226 -5.953 104.226 -6.375 QT
104.226 -6.719 103.952 -6.891 QT
103.679 -7.063 102.882 -7.172 QT
102.429 -7.219 L
100.679 -7.438 99.976 -8.031 QT
99.273 -8.625 99.273 -9.844 QT
99.273 -11.141 100.163 -11.773 QT
101.054 -12.406 102.898 -12.406 QT
103.632 -12.406 104.429 -12.297 QT
105.226 -12.188 106.163 -11.953 QT
cp
111.34 -14.531 M
111.34 -12.203 L
114.043 -12.203 L
114.043 -10.328 L
111.34 -10.328 L
111.34 -6.844 L
111.34 -6.281 111.567 -6.078 QT
111.793 -5.875 112.465 -5.875 QT
113.809 -5.875 L
113.809 -4 L
111.559 -4 L
110.012 -4 109.364 -4.648 QT
108.715 -5.297 108.715 -6.844 QT
108.715 -10.328 L
107.418 -10.328 L
107.418 -12.203 L
108.715 -12.203 L
108.715 -14.531 L
111.34 -14.531 L
cp
123.674 -8.125 M
123.674 -7.375 L
117.534 -7.375 L
117.628 -6.453 118.206 -5.992 QT
118.784 -5.531 119.799 -5.531 QT
120.628 -5.531 121.495 -5.773 QT
122.362 -6.016 123.284 -6.516 QT
123.284 -4.5 L
122.346 -4.141 121.417 -3.961 QT
120.487 -3.781 119.565 -3.781 QT
117.331 -3.781 116.096 -4.914 QT
114.862 -6.047 114.862 -8.094 QT
114.862 -10.094 116.073 -11.25 QT
117.284 -12.406 119.409 -12.406 QT
121.346 -12.406 122.51 -11.242 QT
123.674 -10.078 123.674 -8.125 QT
cp
120.971 -9 M
120.971 -9.75 120.534 -10.203 QT
120.096 -10.656 119.393 -10.656 QT
118.643 -10.656 118.167 -10.227 QT
117.69 -9.797 117.565 -9 QT
120.971 -9 L
cp
120.956 -16 M
123.034 -16 L
120.331 -13.25 L
118.893 -13.25 L
120.956 -16 L
cp
133.021 -10.844 M
133.521 -11.609 134.208 -12.008 QT
134.896 -12.406 135.708 -12.406 QT
137.13 -12.406 137.865 -11.531 QT
138.599 -10.656 138.599 -9 QT
138.599 -4 L
135.974 -4 L
135.974 -8.281 L
135.974 -8.375 135.982 -8.477 QT
135.99 -8.578 135.99 -8.766 QT
135.99 -9.641 135.732 -10.031 QT
135.474 -10.422 134.896 -10.422 QT
134.146 -10.422 133.74 -9.805 QT
133.333 -9.188 133.318 -8.031 QT
133.318 -4 L
130.693 -4 L
130.693 -8.281 L
130.693 -9.641 130.458 -10.031 QT
130.224 -10.422 129.615 -10.422 QT
128.865 -10.422 128.451 -9.805 QT
128.036 -9.188 128.036 -8.031 QT
128.036 -4 L
125.411 -4 L
125.411 -12.203 L
128.036 -12.203 L
128.036 -11 L
128.521 -11.703 129.154 -12.055 QT
129.786 -12.406 130.536 -12.406 QT
131.38 -12.406 132.036 -11.992 QT
132.693 -11.578 133.021 -10.844 QT
cp
140.605 -7.188 M
140.605 -12.203 L
143.246 -12.203 L
143.246 -11.391 L
143.246 -10.719 143.238 -9.711 QT
143.23 -8.703 143.23 -8.359 QT
143.23 -7.375 143.277 -6.938 QT
143.324 -6.5 143.449 -6.313 QT
143.621 -6.047 143.878 -5.906 QT
144.136 -5.766 144.48 -5.766 QT
145.293 -5.766 145.761 -6.398 QT
146.23 -7.031 146.23 -8.156 QT
146.23 -12.203 L
148.855 -12.203 L
148.855 -4 L
146.23 -4 L
146.23 -5.188 L
145.636 -4.469 144.972 -4.125 QT
144.308 -3.781 143.511 -3.781 QT
142.089 -3.781 141.347 -4.656 QT
140.605 -5.531 140.605 -7.188 QT
cp
f
GR
GS
[0.75 0 0 0.75 0 -0.25] CT
0 0.447 0.741 RC
1 LJ
0.667 LW
N
128 485 M
128 485 L
128.001 485 L
128.001 485 L
128.003 485 L
128.005 484.999 L
128.007 484.998 L
128.009 484.997 L
128.018 484.991 L
128.028 484.98 L
128.037 484.965 L
128.047 484.947 L
128.069 484.888 L
128.092 484.809 L
128.114 484.712 L
128.137 484.597 L
128.159 484.466 L
128.213 484.087 L
128.267 483.63 L
128.32 483.105 L
128.374 482.52 L
128.428 481.884 L
128.482 481.203 L
128.612 479.404 L
128.743 477.447 L
128.873 475.378 L
129.004 473.233 L
129.134 471.038 L
129.264 468.812 L
129.505 464.657 L
129.746 460.487 L
129.987 456.33 L
130.228 452.201 L
130.469 448.109 L
130.71 444.06 L
131.322 433.981 L
131.934 424.19 L
132.546 414.681 L
133.158 405.457 L
133.77 396.519 L
134.381 387.858 L
135.771 369.194 L
137.16 351.851 L
138.549 335.781 L
139.939 320.939 L
141.328 307.267 L
142.717 294.708 L
144.632 279.131 L
146.546 265.446 L
148.461 253.528 L
150.376 243.26 L
152.291 234.529 L
154.205 227.229 L
158.458 215.619 L
162.71 209.521 L
166.963 208.011 L
171.215 210.28 L
175.467 215.613 L
179.72 223.381 L
186.84 240.361 L
193.959 260.558 L
201.079 282.402 L
208.199 304.727 L
215.319 326.683 L
222.438 347.682 L
232.453 374.889 L
242.468 398.925 L
252.483 419.652 L
262.498 437.164 L
272.513 451.691 L
282.528 463.546 L
297.635 477.107 L
312.743 486.477 L
327.85 492.638 L
342.958 496.387 L
358.066 498.359 L
373.173 499.052 L
388.413 498.869 L
403.653 498.123 L
418.893 497.054 L
434.133 495.833 L
449.373 494.582 L
464.613 493.387 L
479.853 492.303 L
495.093 491.352 L
510.333 490.545 L
525.573 489.899 L
540.813 489.411 L
556.053 489.035 L
571.293 488.745 L
586.533 488.532 L
601.773 488.394 L
617.013 488.316 L
632.253 488.274 L
647.493 488.251 L
662.733 488.244 L
677.973 488.256 L
693.213 488.279 L
708.453 488.302 L
723.693 488.32 L
738.933 488.337 L
754.173 488.354 L
769.413 488.364 L
784.653 488.368 L
799.893 488.373 L
815.133 488.377 L
830.373 488.379 L
845.613 488.38 L
860.853 488.381 L
876.093 488.381 L
890 488.382 L
S
GR
GS
[0.75 0 0 0.75 0 -0.25] CT
0.851 0.325 0.098 RC
1 LJ
0.667 LW
N
128 485 M
128 485 L
128.001 485 L
128.001 485 L
128.003 485 L
128.005 485 L
128.007 485 L
128.009 485 L
128.018 484.998 L
128.028 484.997 L
128.037 484.994 L
128.047 484.991 L
128.069 484.981 L
128.092 484.967 L
128.114 484.951 L
128.137 484.931 L
128.159 484.908 L
128.213 484.843 L
128.267 484.765 L
128.32 484.674 L
128.374 484.573 L
128.428 484.463 L
128.482 484.345 L
128.612 484.033 L
128.743 483.691 L
128.873 483.329 L
129.004 482.952 L
129.134 482.564 L
129.264 482.168 L
129.505 481.425 L
129.746 480.671 L
129.987 479.913 L
130.228 479.151 L
130.469 478.389 L
130.71 477.627 L
131.322 475.692 L
131.934 473.761 L
132.546 471.832 L
133.158 469.908 L
133.77 467.988 L
134.381 466.073 L
135.771 461.739 L
137.16 457.423 L
138.549 453.124 L
139.939 448.844 L
141.328 444.58 L
142.717 440.33 L
144.632 434.496 L
146.546 428.685 L
148.461 422.894 L
150.376 417.121 L
152.291 411.363 L
154.205 405.618 L
158.458 392.894 L
162.71 380.202 L
166.963 367.528 L
171.215 354.868 L
175.467 342.223 L
179.72 329.597 L
186.84 308.536 L
193.959 287.651 L
201.079 267.061 L
208.199 246.903 L
215.319 227.319 L
222.438 208.447 L
232.453 183.353 L
242.468 160.23 L
252.483 139.31 L
262.498 120.733 L
272.513 104.555 L
282.528 90.752 L
297.635 74.226 L
312.743 62.392 L
327.85 54.568 L
342.958 50.008 L
358.066 47.976 L
373.173 47.802 L
388.413 48.916 L
403.653 50.839 L
418.893 53.184 L
434.133 55.662 L
449.373 58.074 L
464.613 60.291 L
479.853 62.241 L
495.093 63.891 L
510.333 65.239 L
525.573 66.308 L
540.813 67.131 L
556.053 67.74 L
571.293 68.17 L
586.533 68.458 L
601.773 68.639 L
617.013 68.74 L
632.253 68.784 L
647.493 68.789 L
662.733 68.77 L
677.973 68.74 L
693.213 68.706 L
708.453 68.673 L
723.693 68.641 L
738.933 68.615 L
754.173 68.596 L
769.413 68.581 L
784.653 68.57 L
799.893 68.562 L
815.133 68.557 L
830.373 68.555 L
845.613 68.554 L
860.853 68.555 L
876.093 68.556 L
890 68.558 L
S
GR
GS
[0.75 0 0 0.75 0 -0.25] CT
1 GC
N
817 107 M
817 60 L
877 60 L
877 107 L
cp
f
GR
GS
[0.75 0 0 0.75 640.5 56] CT
/Helvetica 12 F
GS
[1 0 0 1 0 0] CT
0 0 moveto 
1 -1 scale
(u) t 
GR
GR
GS
[0.75 0 0 0.75 646.5 60.5] CT
/Helvetica 9.6 F
GS
[1 0 0 1 0 0] CT
0 0 moveto 
1 -1 scale
(r1) t 
GR
GR
GS
[0.75 0 0 0.75 0 -0.25] CT
0 0.447 0.741 RC
1 LJ
0.667 LW
N
821 72.634 M
851 72.634 L
S
GR
GS
[0.75 0 0 0.75 640.5 71.75] CT
/Helvetica 12 F
GS
[1 0 0 1 0 0] CT
0 0 moveto 
1 -1 scale
(u) t 
GR
GR
GS
[0.75 0 0 0.75 646.5 76.25] CT
/Helvetica 9.6 F
GS
[1 0 0 1 0 0] CT
0 0 moveto 
1 -1 scale
(r2) t 
GR
GR
GS
[0.75 0 0 0.75 0 -0.25] CT
0.851 0.325 0.098 RC
1 LJ
0.667 LW
N
821 94.366 M
851 94.366 L
S
GR
GS
[0.75 0 0 0.75 0 -0.25] CT
0.149 GC
10.0 ML
0.667 LW
N
817 107 M
817 60 L
877 60 L
877 107 L
cp
S
GR
%%Trailer
%%Pages: 1
%%EOF
