%!PS-Adobe-3.0 EPSF-3.0
%%Creator: MATLAB, The MathWorks, Inc. Version 8.3.0.532 (R2014a). Operating System: Microsoft Windows 7 Professional .
%%Title: C:\Users\Julie\Documents\GitKraken\rls-2017\sp3\figures\sigmaK.eps
%%CreationDate: 11/07/2017  21:56:00
%%DocumentNeededFonts: Helvetica
%%DocumentProcessColors: Cyan Magenta Yellow Black
%%LanguageLevel: 2
%%Pages: 1
%%BoundingBox:    87   262   507   578
%%EndComments

%%BeginProlog
% MathWorks dictionary
/MathWorks 160 dict begin
% definition operators
/bdef {bind def} bind def
/ldef {load def} bind def
/xdef {exch def} bdef
/xstore {exch store} bdef
% operator abbreviations
/c  /clip ldef
/cc /concat ldef
/cp /closepath ldef
/gr /grestore ldef
/gs /gsave ldef
/mt /moveto ldef
/np /newpath ldef
/cm /currentmatrix ldef
/sm /setmatrix ldef
/rm /rmoveto ldef
/rl /rlineto ldef
/s {show newpath} bdef
/sc {setcmykcolor} bdef
/sr /setrgbcolor ldef
/sg /setgray ldef
/w /setlinewidth ldef
/j /setlinejoin ldef
/cap /setlinecap ldef
/rc {rectclip} bdef
/rf {rectfill} bdef
% page state control
/pgsv () def
/bpage {/pgsv save def} bdef
/epage {pgsv restore} bdef
/bplot /gsave ldef
/eplot {stroke grestore} bdef
% orientation switch
/portraitMode 0 def /landscapeMode 1 def /rotateMode 2 def
% coordinate system mappings
/dpi2point 0 def
% font control
/FontSize 0 def
/FMS {/FontSize xstore findfont [FontSize 0 0 FontSize neg 0 0]
  makefont setfont} bdef
/ISOLatin1Encoding where {pop /WindowsLatin1Encoding 256 array bdef
ISOLatin1Encoding WindowsLatin1Encoding copy pop
/.notdef/.notdef/quotesinglbase/florin/quotedblbase/ellipsis/dagger
/daggerdbl/circumflex/perthousand/Scaron/guilsinglleft/OE/.notdef/.notdef
/.notdef/.notdef/quoteleft/quoteright/quotedblleft/quotedblright/bullet
/endash/emdash/tilde/trademark/scaron/guilsinglright/oe/.notdef/.notdef
/Ydieresis WindowsLatin1Encoding 128 32 getinterval astore pop}
{/WindowsLatin1Encoding StandardEncoding bdef} ifelse
/reencode {exch dup where {pop load} {pop StandardEncoding} ifelse
  exch dup 3 1 roll findfont dup length dict begin
  { 1 index /FID ne {def}{pop pop} ifelse } forall
  /Encoding exch def currentdict end definefont pop} bdef
/isroman {findfont /CharStrings get /Agrave known} bdef
/FMSR {3 1 roll 1 index dup isroman {reencode} {pop pop} ifelse
  exch FMS} bdef
/csm {1 dpi2point div -1 dpi2point div scale neg translate
 dup landscapeMode eq {pop -90 rotate}
  {rotateMode eq {90 rotate} if} ifelse} bdef
% line types: solid, dotted, dashed, dotdash
/SO { [] 0 setdash } bdef
/DO { [.5 dpi2point mul 4 dpi2point mul] 0 setdash } bdef
/DA { [6 dpi2point mul] 0 setdash } bdef
/DD { [.5 dpi2point mul 4 dpi2point mul 6 dpi2point mul 4
  dpi2point mul] 0 setdash } bdef
% macros for lines and objects
/L {lineto stroke} bdef
/MP {3 1 roll moveto 1 sub {rlineto} repeat} bdef
/AP {{rlineto} repeat} bdef
/PDlw -1 def
/W {/PDlw currentlinewidth def setlinewidth} def
/PP {closepath eofill} bdef
/DP {closepath stroke} bdef
/MR {4 -2 roll moveto dup  0 exch rlineto exch 0 rlineto
  neg 0 exch rlineto closepath} bdef
/FR {MR stroke} bdef
/PR {MR fill} bdef
/L1i {{currentfile picstr readhexstring pop} image} bdef
/tMatrix matrix def
/MakeOval {newpath tMatrix currentmatrix pop translate scale
0 0 1 0 360 arc tMatrix setmatrix} bdef
/FO {MakeOval stroke} bdef
/PO {MakeOval fill} bdef
/PD {currentlinewidth 2 div 0 360 arc fill
   PDlw -1 eq not {PDlw w /PDlw -1 def} if} def
/FA {newpath tMatrix currentmatrix pop translate scale
  0 0 1 5 -2 roll arc tMatrix setmatrix stroke} bdef
/PA {newpath tMatrix currentmatrix pop	translate 0 0 moveto scale
  0 0 1 5 -2 roll arc closepath tMatrix setmatrix fill} bdef
/FAn {newpath tMatrix currentmatrix pop translate scale
  0 0 1 5 -2 roll arcn tMatrix setmatrix stroke} bdef
/PAn {newpath tMatrix currentmatrix pop translate 0 0 moveto scale
  0 0 1 5 -2 roll arcn closepath tMatrix setmatrix fill} bdef
/vradius 0 def /hradius 0 def /lry 0 def
/lrx 0 def /uly 0 def /ulx 0 def /rad 0 def
/MRR {/vradius xdef /hradius xdef /lry xdef /lrx xdef /uly xdef
  /ulx xdef newpath tMatrix currentmatrix pop ulx hradius add uly
  vradius add translate hradius vradius scale 0 0 1 180 270 arc 
  tMatrix setmatrix lrx hradius sub uly vradius add translate
  hradius vradius scale 0 0 1 270 360 arc tMatrix setmatrix
  lrx hradius sub lry vradius sub translate hradius vradius scale
  0 0 1 0 90 arc tMatrix setmatrix ulx hradius add lry vradius sub
  translate hradius vradius scale 0 0 1 90 180 arc tMatrix setmatrix
  closepath} bdef
/FRR {MRR stroke } bdef
/PRR {MRR fill } bdef
/MlrRR {/lry xdef /lrx xdef /uly xdef /ulx xdef /rad lry uly sub 2 div def
  newpath tMatrix currentmatrix pop ulx rad add uly rad add translate
  rad rad scale 0 0 1 90 270 arc tMatrix setmatrix lrx rad sub lry rad
  sub translate rad rad scale 0 0 1 270 90 arc tMatrix setmatrix
  closepath} bdef
/FlrRR {MlrRR stroke } bdef
/PlrRR {MlrRR fill } bdef
/MtbRR {/lry xdef /lrx xdef /uly xdef /ulx xdef /rad lrx ulx sub 2 div def
  newpath tMatrix currentmatrix pop ulx rad add uly rad add translate
  rad rad scale 0 0 1 180 360 arc tMatrix setmatrix lrx rad sub lry rad
  sub translate rad rad scale 0 0 1 0 180 arc tMatrix setmatrix
  closepath} bdef
/FtbRR {MtbRR stroke } bdef
/PtbRR {MtbRR fill } bdef
/stri 6 array def /dtri 6 array def
/smat 6 array def /dmat 6 array def
/tmat1 6 array def /tmat2 6 array def /dif 3 array def
/asub {/ind2 exch def /ind1 exch def dup dup
  ind1 get exch ind2 get sub exch } bdef
/tri_to_matrix {
  2 0 asub 3 1 asub 4 0 asub 5 1 asub
  dup 0 get exch 1 get 7 -1 roll astore } bdef
/compute_transform {
  dmat dtri tri_to_matrix tmat1 invertmatrix 
  smat stri tri_to_matrix tmat2 concatmatrix } bdef
/ds {stri astore pop} bdef
/dt {dtri astore pop} bdef
/db {2 copy /cols xdef /rows xdef mul dup 3 mul string
  currentfile 
  3 index 0 eq {/ASCIIHexDecode filter}
  {/ASCII85Decode filter 3 index 2 eq {/RunLengthDecode filter} if }
  ifelse exch readstring pop
  dup 0 3 index getinterval /rbmap xdef
  dup 2 index dup getinterval /gbmap xdef
  1 index dup 2 mul exch getinterval /bbmap xdef pop pop}bdef
/it {gs np dtri aload pop moveto lineto lineto cp c
  cols rows 8 compute_transform 
  rbmap gbmap bbmap true 3 colorimage gr}bdef
/il {newpath moveto lineto stroke}bdef
currentdict end def
%%EndProlog

%%BeginSetup
MathWorks begin

0 cap

end
%%EndSetup

%%Page: 1 1
%%BeginPageSetup
%%PageBoundingBox:    87   262   507   578
MathWorks begin
bpage
%%EndPageSetup

%%BeginObject: obj1
bplot

/dpi2point 12 def
portraitMode 1044 6936 csm

    0     0  5045  3782 rc
87 dict begin %Colortable dictionary
/c0 { 0.000000 0.000000 0.000000 sr} bdef
/c1 { 1.000000 1.000000 1.000000 sr} bdef
/c2 { 0.900000 0.000000 0.000000 sr} bdef
/c3 { 0.000000 0.820000 0.000000 sr} bdef
/c4 { 0.000000 0.000000 0.800000 sr} bdef
/c5 { 0.910000 0.820000 0.320000 sr} bdef
/c6 { 1.000000 0.260000 0.820000 sr} bdef
/c7 { 0.000000 0.820000 0.820000 sr} bdef
c0
1 j
1 sg
   0    0 5046 3783 rf
6 w
0 2902 3803 0 0 -2902 763 3366 4 MP
PP
-3803 0 0 2902 3803 0 0 -2902 763 3366 5 MP stroke
4 w
DO
SO
6 w
0.4 sg
 763  464 mt 4566  464 L
 763 3366 mt 4566 3366 L
4566 3366 mt 4566  464 L
 763 3366 mt  763  464 L
 763 3366 mt 4566 3366 L
 763 3366 mt  763  464 L
 763 3366 mt  763 3346 L
 763  464 mt  763  483 L
 763 3366 mt  763 3327 L
 763  464 mt  763  502 L
%%IncludeResource: font Helvetica
/Helvetica /WindowsLatin1Encoding 120 FMSR

 651 3548 mt 
(10) s
%%IncludeResource: font Helvetica
/Helvetica /WindowsLatin1Encoding 80 FMSR

 784 3474 mt 
(-3) s
 992 3366 mt  992 3346 L
 992  464 mt  992  483 L
1126 3366 mt 1126 3346 L
1126  464 mt 1126  483 L
1221 3366 mt 1221 3346 L
1221  464 mt 1221  483 L
1295 3366 mt 1295 3346 L
1295  464 mt 1295  483 L
1355 3366 mt 1355 3346 L
1355  464 mt 1355  483 L
1406 3366 mt 1406 3346 L
1406  464 mt 1406  483 L
1450 3366 mt 1450 3346 L
1450  464 mt 1450  483 L
1489 3366 mt 1489 3346 L
1489  464 mt 1489  483 L
1524 3366 mt 1524 3346 L
1524  464 mt 1524  483 L
1524 3366 mt 1524 3327 L
1524  464 mt 1524  502 L
%%IncludeResource: font Helvetica
/Helvetica /WindowsLatin1Encoding 120 FMSR

1412 3548 mt 
(10) s
%%IncludeResource: font Helvetica
/Helvetica /WindowsLatin1Encoding 80 FMSR

1545 3474 mt 
(-2) s
1753 3366 mt 1753 3346 L
1753  464 mt 1753  483 L
1887 3366 mt 1887 3346 L
1887  464 mt 1887  483 L
1982 3366 mt 1982 3346 L
1982  464 mt 1982  483 L
2055 3366 mt 2055 3346 L
2055  464 mt 2055  483 L
2116 3366 mt 2116 3346 L
2116  464 mt 2116  483 L
2167 3366 mt 2167 3346 L
2167  464 mt 2167  483 L
2211 3366 mt 2211 3346 L
2211  464 mt 2211  483 L
2250 3366 mt 2250 3346 L
2250  464 mt 2250  483 L
2284 3366 mt 2284 3346 L
2284  464 mt 2284  483 L
2284 3366 mt 2284 3327 L
2284  464 mt 2284  502 L
%%IncludeResource: font Helvetica
/Helvetica /WindowsLatin1Encoding 120 FMSR

2172 3548 mt 
(10) s
%%IncludeResource: font Helvetica
/Helvetica /WindowsLatin1Encoding 80 FMSR

2305 3474 mt 
(-1) s
2513 3366 mt 2513 3346 L
2513  464 mt 2513  483 L
2647 3366 mt 2647 3346 L
2647  464 mt 2647  483 L
2742 3366 mt 2742 3346 L
2742  464 mt 2742  483 L
2816 3366 mt 2816 3346 L
2816  464 mt 2816  483 L
2876 3366 mt 2876 3346 L
2876  464 mt 2876  483 L
2927 3366 mt 2927 3346 L
2927  464 mt 2927  483 L
2971 3366 mt 2971 3346 L
2971  464 mt 2971  483 L
3010 3366 mt 3010 3346 L
3010  464 mt 3010  483 L
3045 3366 mt 3045 3346 L
3045  464 mt 3045  483 L
3045 3366 mt 3045 3327 L
3045  464 mt 3045  502 L
%%IncludeResource: font Helvetica
/Helvetica /WindowsLatin1Encoding 120 FMSR

2957 3548 mt 
(10) s
%%IncludeResource: font Helvetica
/Helvetica /WindowsLatin1Encoding 80 FMSR

3090 3474 mt 
(0) s
3274 3366 mt 3274 3346 L
3274  464 mt 3274  483 L
3408 3366 mt 3408 3346 L
3408  464 mt 3408  483 L
3503 3366 mt 3503 3346 L
3503  464 mt 3503  483 L
3576 3366 mt 3576 3346 L
3576  464 mt 3576  483 L
3636 3366 mt 3636 3346 L
3636  464 mt 3636  483 L
3687 3366 mt 3687 3346 L
3687  464 mt 3687  483 L
3731 3366 mt 3731 3346 L
3731  464 mt 3731  483 L
3770 3366 mt 3770 3346 L
3770  464 mt 3770  483 L
3805 3366 mt 3805 3346 L
3805  464 mt 3805  483 L
3805 3366 mt 3805 3327 L
3805  464 mt 3805  502 L
%%IncludeResource: font Helvetica
/Helvetica /WindowsLatin1Encoding 120 FMSR

3717 3548 mt 
(10) s
%%IncludeResource: font Helvetica
/Helvetica /WindowsLatin1Encoding 80 FMSR

3850 3474 mt 
(1) s
4034 3366 mt 4034 3346 L
4034  464 mt 4034  483 L
4168 3366 mt 4168 3346 L
4168  464 mt 4168  483 L
4263 3366 mt 4263 3346 L
4263  464 mt 4263  483 L
4337 3366 mt 4337 3346 L
4337  464 mt 4337  483 L
4397 3366 mt 4397 3346 L
4397  464 mt 4397  483 L
4448 3366 mt 4448 3346 L
4448  464 mt 4448  483 L
4492 3366 mt 4492 3346 L
4492  464 mt 4492  483 L
4531 3366 mt 4531 3346 L
4531  464 mt 4531  483 L
4566 3366 mt 4566 3346 L
4566  464 mt 4566  483 L
4566 3366 mt 4566 3327 L
4566  464 mt 4566  502 L
%%IncludeResource: font Helvetica
/Helvetica /WindowsLatin1Encoding 120 FMSR

4478 3548 mt 
(10) s
%%IncludeResource: font Helvetica
/Helvetica /WindowsLatin1Encoding 80 FMSR

4611 3474 mt 
(2) s
 763 3366 mt  802 3366 L
4566 3366 mt 4527 3366 L
%%IncludeResource: font Helvetica
/Helvetica /WindowsLatin1Encoding 120 FMSR

 526 3410 mt 
(-30) s
 763 3075 mt  802 3075 L
4566 3075 mt 4527 3075 L
 526 3119 mt 
(-20) s
 763 2785 mt  802 2785 L
4566 2785 mt 4527 2785 L
 526 2829 mt 
(-10) s
 763 2495 mt  802 2495 L
4566 2495 mt 4527 2495 L
 663 2539 mt 
(0) s
 763 2205 mt  802 2205 L
4566 2205 mt 4527 2205 L
 596 2249 mt 
(10) s
 763 1915 mt  802 1915 L
4566 1915 mt 4527 1915 L
 596 1959 mt 
(20) s
 763 1624 mt  802 1624 L
4566 1624 mt 4527 1624 L
 596 1668 mt 
(30) s
 763 1334 mt  802 1334 L
4566 1334 mt 4527 1334 L
 596 1378 mt 
(40) s
 763 1044 mt  802 1044 L
4566 1044 mt 4527 1044 L
 596 1088 mt 
(50) s
 763  754 mt  802  754 L
4566  754 mt 4527  754 L
 596  798 mt 
(60) s
 763  464 mt  802  464 L
4566  464 mt 4527  464 L
 596  508 mt 
(70) s
 763  464 mt 4566  464 L
 763 3366 mt 4566 3366 L
4566 3366 mt 4566  464 L
 763 3366 mt  763  464 L
gs 763 464 3804 2903 rc
/c8 { 0.000000 0.000000 1.000000 sr} bdef
c8
230 0 51 0 51 0 52 0 51 0 51 0 51 0 51 0 
51 0 52 0 51 0 51 0 51 0 51 1 52 0 51 0 
51 0 51 0 51 1 51 0 52 1 51 1 51 1 51 2 
51 3 52 3 51 5 51 6 51 6 51 9 51 9 52 11 
51 12 51 12 51 13 51 12 51 12 52 11 51 10 51 9 
51 7 51 7 52 6 51 5 51 5 51 6 51 6 51 8 
52 9 51 11 51 14 51 16 51 20 52 22 51 25 51 28 
51 30 51 32 51 33 52 35 51 36 51 37 51 37 51 38 
52 38 51 38 51 39 51 38 51 39 51 39 43 33 763 665 72 MP stroke
230 0 51 0 51 0 52 0 51 0 51 0 51 0 51 0 
51 0 52 0 51 0 51 0 51 0 51 0 52 -1 51 0 
51 0 51 -1 51 -1 51 -1 52 -1 51 -2 51 -2 51 -3 
51 -4 52 -4 51 -5 51 -5 51 -6 51 -6 51 -6 52 -5 
51 -6 51 -5 51 -5 51 -4 51 -4 52 -2 51 -2 51 -1 
51 -1 51 0 52 1 51 1 51 3 51 3 51 5 51 7 
52 8 51 11 51 13 51 16 51 19 52 22 51 25 51 28 
51 30 51 32 51 34 52 34 51 36 51 37 51 37 51 38 
52 38 51 39 51 38 51 39 51 39 51 38 43 33 763 970 72 MP stroke
/c9 { 0.000000 0.650000 0.000000 sr} bdef
c9
230 175 51 39 51 39 52 39 51 39 51 39 51 39 51 39 
51 39 52 40 51 39 51 39 51 39 51 39 52 39 51 39 
51 40 51 39 51 39 51 40 52 40 51 40 51 40 51 41 
51 42 52 42 51 43 51 45 51 45 51 47 51 48 52 49 
51 50 51 49 51 50 51 48 51 47 52 45 51 42 51 39 
51 35 51 32 52 28 51 24 51 22 51 19 51 18 51 16 
52 16 51 16 51 18 51 19 51 21 52 24 51 27 51 28 
51 31 51 32 51 34 52 35 51 37 51 36 51 38 51 38 
52 38 51 38 51 39 51 38 51 39 51 39 43 33 763 616 72 MP stroke
219 168 51 39 51 39 52 39 51 39 51 39 51 39 51 39 
51 39 52 39 51 39 51 39 51 39 51 39 52 39 51 39 
51 38 51 39 51 38 51 38 52 38 51 37 51 36 51 37 
51 35 52 35 51 34 51 33 51 33 51 33 51 32 52 33 
51 32 51 32 51 32 51 32 51 31 52 31 51 30 51 29 
51 28 51 25 52 23 51 21 51 19 51 17 51 15 51 15 
52 16 51 15 51 18 51 19 51 21 52 24 51 26 51 29 
51 30 51 33 51 34 52 35 51 36 51 37 51 37 51 38 
52 38 51 39 51 38 51 39 51 39 51 39 43 32 763 921 72 MP stroke
gr

c9
0 sg
 746 3409 mt 
( ) s
4550  506 mt 
( ) s
2203  271 mt 
(Singular Values) s
2146 3694 mt 
(Frequency \(rad/s\)) s
 348 2380 mt  -90 rotate
(Singular Values \(dB\)) s
90 rotate
1 sg
0 442 640 0 0 -442 3867 966 4 MP
PP
-640 0 0 442 640 0 0 -442 3867 966 5 MP stroke
4 w
DO
SO
6 w
0 sg
3867  524 mt 4507  524 L
3867  966 mt 4507  966 L
4507  966 mt 4507  524 L
3867  966 mt 3867  524 L
3867  966 mt 4507  966 L
3867  966 mt 3867  524 L
3867  524 mt 4507  524 L
3867  966 mt 4507  966 L
4507  966 mt 4507  524 L
3867  966 mt 3867  524 L
4324  659 mt 
(K) s
%%IncludeResource: font Helvetica
/Helvetica /WindowsLatin1Encoding 96 FMSR

4404  719 mt 
(1) s
gs 3867 524 641 443 rc
c8
350 0 3937 644 2 MP stroke
gr

c8
0 sg
%%IncludeResource: font Helvetica
/Helvetica /WindowsLatin1Encoding 120 FMSR

4324  862 mt 
(K) s
%%IncludeResource: font Helvetica
/Helvetica /WindowsLatin1Encoding 96 FMSR

4404  922 mt 
(2) s
gs 3867 524 641 443 rc
c9
350 0 3937 845 2 MP stroke
gr

c9

end %%Color Dict

eplot
%%EndObject

epage
end

showpage

%%Trailer
%%EOF
