%!PS-Adobe-3.0 EPSF-3.0
%%Creator: (MATLAB, The Mathworks, Inc. Version 9.1.0.441655 \(R2016b\). Operating System: Linux)
%%Title: /home/frdm/Documents/RLS/rls-2017/sp5/figures/reg1_nonboosted.eps
%%CreationDate: 2018-02-09T20:54:39
%%Pages: (atend)
%%BoundingBox: 0 0 737 470
%%LanguageLevel: 3
%%EndComments
%%BeginProlog
%%BeginResource: procset (Apache XML Graphics Std ProcSet) 1.2 0
%%Version: 1.2 0
%%Copyright: (Copyright 2001-2003,2010 The Apache Software Foundation. License terms: http://www.apache.org/licenses/LICENSE-2.0)
/bd{bind def}bind def
/ld{load def}bd
/GR/grestore ld
/M/moveto ld
/LJ/setlinejoin ld
/C/curveto ld
/f/fill ld
/LW/setlinewidth ld
/GC/setgray ld
/t/show ld
/N/newpath ld
/CT/concat ld
/cp/closepath ld
/S/stroke ld
/L/lineto ld
/CC/setcmykcolor ld
/A/ashow ld
/GS/gsave ld
/RC/setrgbcolor ld
/RM/rmoveto ld
/ML/setmiterlimit ld
/re {4 2 roll M
1 index 0 rlineto
0 exch rlineto
neg 0 rlineto
cp } bd
/_ctm matrix def
/_tm matrix def
/BT { _ctm currentmatrix pop matrix _tm copy pop 0 0 moveto } bd
/ET { _ctm setmatrix } bd
/iTm { _ctm setmatrix _tm concat } bd
/Tm { _tm astore pop iTm 0 0 moveto } bd
/ux 0.0 def
/uy 0.0 def
/F {
  /Tp exch def
  /Tf exch def
  Tf findfont Tp scalefont setfont
  /cf Tf def  /cs Tp def
} bd
/ULS {currentpoint /uy exch def /ux exch def} bd
/ULE {
  /Tcx currentpoint pop def
  gsave
  newpath
  cf findfont cs scalefont dup
  /FontMatrix get 0 get /Ts exch def /FontInfo get dup
  /UnderlinePosition get Ts mul /To exch def
  /UnderlineThickness get Ts mul /Tt exch def
  ux uy To add moveto  Tcx uy To add lineto
  Tt setlinewidth stroke
  grestore
} bd
/OLE {
  /Tcx currentpoint pop def
  gsave
  newpath
  cf findfont cs scalefont dup
  /FontMatrix get 0 get /Ts exch def /FontInfo get dup
  /UnderlinePosition get Ts mul /To exch def
  /UnderlineThickness get Ts mul /Tt exch def
  ux uy To add cs add moveto Tcx uy To add cs add lineto
  Tt setlinewidth stroke
  grestore
} bd
/SOE {
  /Tcx currentpoint pop def
  gsave
  newpath
  cf findfont cs scalefont dup
  /FontMatrix get 0 get /Ts exch def /FontInfo get dup
  /UnderlinePosition get Ts mul /To exch def
  /UnderlineThickness get Ts mul /Tt exch def
  ux uy To add cs 10 mul 26 idiv add moveto Tcx uy To add cs 10 mul 26 idiv add lineto
  Tt setlinewidth stroke
  grestore
} bd
/QT {
/Y22 exch store
/X22 exch store
/Y21 exch store
/X21 exch store
currentpoint
/Y21 load 2 mul add 3 div exch
/X21 load 2 mul add 3 div exch
/X21 load 2 mul /X22 load add 3 div
/Y21 load 2 mul /Y22 load add 3 div
/X22 load /Y22 load curveto
} bd
/SSPD {
dup length /d exch dict def
{
/v exch def
/k exch def
currentpagedevice k known {
/cpdv currentpagedevice k get def
v cpdv ne {
/upd false def
/nullv v type /nulltype eq def
/nullcpdv cpdv type /nulltype eq def
nullv nullcpdv or
{
/upd true def
} {
/sametype v type cpdv type eq def
sametype {
v type /arraytype eq {
/vlen v length def
/cpdvlen cpdv length def
vlen cpdvlen eq {
0 1 vlen 1 sub {
/i exch def
/obj v i get def
/cpdobj cpdv i get def
obj cpdobj ne {
/upd true def
exit
} if
} for
} {
/upd true def
} ifelse
} {
v type /dicttype eq {
v {
/dv exch def
/dk exch def
/cpddv cpdv dk get def
dv cpddv ne {
/upd true def
exit
} if
} forall
} {
/upd true def
} ifelse
} ifelse
} if
} ifelse
upd true eq {
d k v put
} if
} if
} if
} forall
d length 0 gt {
d setpagedevice
} if
} bd
/RE { % /NewFontName [NewEncodingArray] /FontName RE -
  findfont dup length dict begin
  {
    1 index /FID ne
    {def} {pop pop} ifelse
  } forall
  /Encoding exch def
  /FontName 1 index def
  currentdict definefont pop
  end
} bind def
%%EndResource
%%BeginResource: procset (Apache XML Graphics EPS ProcSet) 1.0 0
%%Version: 1.0 0
%%Copyright: (Copyright 2002-2003 The Apache Software Foundation. License terms: http://www.apache.org/licenses/LICENSE-2.0)
/BeginEPSF { %def
/b4_Inc_state save def         % Save state for cleanup
/dict_count countdictstack def % Count objects on dict stack
/op_count count 1 sub def      % Count objects on operand stack
userdict begin                 % Push userdict on dict stack
/showpage { } def              % Redefine showpage, { } = null proc
0 setgray 0 setlinecap         % Prepare graphics state
1 setlinewidth 0 setlinejoin
10 setmiterlimit [ ] 0 setdash newpath
/languagelevel where           % If level not equal to 1 then
{pop languagelevel             % set strokeadjust and
1 ne                           % overprint to their defaults.
{false setstrokeadjust false setoverprint
} if
} if
} bd
/EndEPSF { %def
count op_count sub {pop} repeat            % Clean up stacks
countdictstack dict_count sub {end} repeat
b4_Inc_state restore
} bd
%%EndResource
%FOPBeginFontDict
%%IncludeResource: font Courier-Bold
%%IncludeResource: font Helvetica
%%IncludeResource: font Courier-BoldOblique
%%IncludeResource: font Courier-Oblique
%%IncludeResource: font Times-Roman
%%IncludeResource: font Helvetica-BoldOblique
%%IncludeResource: font Helvetica-Bold
%%IncludeResource: font Helvetica-Oblique
%%IncludeResource: font Times-BoldItalic
%%IncludeResource: font Courier
%%IncludeResource: font Times-Italic
%%IncludeResource: font Times-Bold
%%IncludeResource: font Symbol
%%IncludeResource: font ZapfDingbats
%FOPEndFontDict
%%BeginResource: encoding WinAnsiEncoding
/WinAnsiEncoding [
/.notdef /.notdef /.notdef /.notdef /.notdef
/.notdef /.notdef /.notdef /.notdef /.notdef
/.notdef /.notdef /.notdef /.notdef /.notdef
/.notdef /.notdef /.notdef /.notdef /.notdef
/.notdef /.notdef /.notdef /.notdef /.notdef
/.notdef /.notdef /.notdef /.notdef /.notdef
/.notdef /.notdef /space /exclam /quotedbl
/numbersign /dollar /percent /ampersand /quotesingle
/parenleft /parenright /asterisk /plus /comma
/hyphen /period /slash /zero /one
/two /three /four /five /six
/seven /eight /nine /colon /semicolon
/less /equal /greater /question /at
/A /B /C /D /E
/F /G /H /I /J
/K /L /M /N /O
/P /Q /R /S /T
/U /V /W /X /Y
/Z /bracketleft /backslash /bracketright /asciicircum
/underscore /quoteleft /a /b /c
/d /e /f /g /h
/i /j /k /l /m
/n /o /p /q /r
/s /t /u /v /w
/x /y /z /braceleft /bar
/braceright /asciitilde /bullet /Euro /bullet
/quotesinglbase /florin /quotedblbase /ellipsis /dagger
/daggerdbl /circumflex /perthousand /Scaron /guilsinglleft
/OE /bullet /Zcaron /bullet /bullet
/quoteleft /quoteright /quotedblleft /quotedblright /bullet
/endash /emdash /asciitilde /trademark /scaron
/guilsinglright /oe /bullet /zcaron /Ydieresis
/space /exclamdown /cent /sterling /currency
/yen /brokenbar /section /dieresis /copyright
/ordfeminine /guillemotleft /logicalnot /sfthyphen /registered
/macron /degree /plusminus /twosuperior /threesuperior
/acute /mu /paragraph /middot /cedilla
/onesuperior /ordmasculine /guillemotright /onequarter /onehalf
/threequarters /questiondown /Agrave /Aacute /Acircumflex
/Atilde /Adieresis /Aring /AE /Ccedilla
/Egrave /Eacute /Ecircumflex /Edieresis /Igrave
/Iacute /Icircumflex /Idieresis /Eth /Ntilde
/Ograve /Oacute /Ocircumflex /Otilde /Odieresis
/multiply /Oslash /Ugrave /Uacute /Ucircumflex
/Udieresis /Yacute /Thorn /germandbls /agrave
/aacute /acircumflex /atilde /adieresis /aring
/ae /ccedilla /egrave /eacute /ecircumflex
/edieresis /igrave /iacute /icircumflex /idieresis
/eth /ntilde /ograve /oacute /ocircumflex
/otilde /odieresis /divide /oslash /ugrave
/uacute /ucircumflex /udieresis /yacute /thorn
/ydieresis
] def
%%EndResource
%FOPBeginFontReencode
/Courier-Bold findfont
dup length dict begin
  {1 index /FID ne {def} {pop pop} ifelse} forall
  /Encoding WinAnsiEncoding def
  currentdict
end
/Courier-Bold exch definefont pop
/Helvetica findfont
dup length dict begin
  {1 index /FID ne {def} {pop pop} ifelse} forall
  /Encoding WinAnsiEncoding def
  currentdict
end
/Helvetica exch definefont pop
/Courier-BoldOblique findfont
dup length dict begin
  {1 index /FID ne {def} {pop pop} ifelse} forall
  /Encoding WinAnsiEncoding def
  currentdict
end
/Courier-BoldOblique exch definefont pop
/Courier-Oblique findfont
dup length dict begin
  {1 index /FID ne {def} {pop pop} ifelse} forall
  /Encoding WinAnsiEncoding def
  currentdict
end
/Courier-Oblique exch definefont pop
/Times-Roman findfont
dup length dict begin
  {1 index /FID ne {def} {pop pop} ifelse} forall
  /Encoding WinAnsiEncoding def
  currentdict
end
/Times-Roman exch definefont pop
/Helvetica-BoldOblique findfont
dup length dict begin
  {1 index /FID ne {def} {pop pop} ifelse} forall
  /Encoding WinAnsiEncoding def
  currentdict
end
/Helvetica-BoldOblique exch definefont pop
/Helvetica-Bold findfont
dup length dict begin
  {1 index /FID ne {def} {pop pop} ifelse} forall
  /Encoding WinAnsiEncoding def
  currentdict
end
/Helvetica-Bold exch definefont pop
/Helvetica-Oblique findfont
dup length dict begin
  {1 index /FID ne {def} {pop pop} ifelse} forall
  /Encoding WinAnsiEncoding def
  currentdict
end
/Helvetica-Oblique exch definefont pop
/Times-BoldItalic findfont
dup length dict begin
  {1 index /FID ne {def} {pop pop} ifelse} forall
  /Encoding WinAnsiEncoding def
  currentdict
end
/Times-BoldItalic exch definefont pop
/Courier findfont
dup length dict begin
  {1 index /FID ne {def} {pop pop} ifelse} forall
  /Encoding WinAnsiEncoding def
  currentdict
end
/Courier exch definefont pop
/Times-Italic findfont
dup length dict begin
  {1 index /FID ne {def} {pop pop} ifelse} forall
  /Encoding WinAnsiEncoding def
  currentdict
end
/Times-Italic exch definefont pop
/Times-Bold findfont
dup length dict begin
  {1 index /FID ne {def} {pop pop} ifelse} forall
  /Encoding WinAnsiEncoding def
  currentdict
end
/Times-Bold exch definefont pop
%FOPEndFontReencode
%%EndProlog
%%Page: 1 1
%%PageBoundingBox: 0 0 737 470
%%BeginPageSetup
[1 0 0 -1 0 470] CT
%%EndPageSetup
GS
[0.75 0 0 0.75 0 -0.25] CT
1 GC
N
0 0 983 627 re
f
GR
GS
[0.75 0 0 0.75 0 -0.25] CT
1 GC
N
0 0 983 627 re
f
GR
GS
[0.75 0 0 0.75 0 -0.25] CT
1 GC
N
128 558 M
890 558 L
890 47 L
128 47 L
cp
f
GR
GS
[0.75 0 0 0.75 0 -0.25] CT
0.149 GC
2 setlinecap
1 LJ
0.667 LW
N
128 558 M
890 558 L
S
GR
GS
[0.75 0 0 0.75 0 -0.25] CT
0.149 GC
2 setlinecap
1 LJ
0.667 LW
N
128 558 M
128 550.38 L
S
GR
GS
[0.75 0 0 0.75 0 -0.25] CT
0.149 GC
2 setlinecap
1 LJ
0.667 LW
N
204.2 558 M
204.2 550.38 L
S
GR
GS
[0.75 0 0 0.75 0 -0.25] CT
0.149 GC
2 setlinecap
1 LJ
0.667 LW
N
280.4 558 M
280.4 550.38 L
S
GR
GS
[0.75 0 0 0.75 0 -0.25] CT
0.149 GC
2 setlinecap
1 LJ
0.667 LW
N
356.6 558 M
356.6 550.38 L
S
GR
GS
[0.75 0 0 0.75 0 -0.25] CT
0.149 GC
2 setlinecap
1 LJ
0.667 LW
N
432.8 558 M
432.8 550.38 L
S
GR
GS
[0.75 0 0 0.75 0 -0.25] CT
0.149 GC
2 setlinecap
1 LJ
0.667 LW
N
509 558 M
509 550.38 L
S
GR
GS
[0.75 0 0 0.75 0 -0.25] CT
0.149 GC
2 setlinecap
1 LJ
0.667 LW
N
585.2 558 M
585.2 550.38 L
S
GR
GS
[0.75 0 0 0.75 0 -0.25] CT
0.149 GC
2 setlinecap
1 LJ
0.667 LW
N
661.4 558 M
661.4 550.38 L
S
GR
GS
[0.75 0 0 0.75 0 -0.25] CT
0.149 GC
2 setlinecap
1 LJ
0.667 LW
N
737.6 558 M
737.6 550.38 L
S
GR
GS
[0.75 0 0 0.75 0 -0.25] CT
0.149 GC
2 setlinecap
1 LJ
0.667 LW
N
813.8 558 M
813.8 550.38 L
S
GR
GS
[0.75 0 0 0.75 0 -0.25] CT
0.149 GC
2 setlinecap
1 LJ
0.667 LW
N
890 558 M
890 550.38 L
S
GR
GS
[0.75 0 0 0.75 96 422.24998] CT
0.149 GC
/Helvetica 13.333 F
GS
[1 0 0 1 0 0] CT
-4.5 13 moveto 
1 -1 scale
(0) t 
GR
GR
GS
[0.75 0 0 0.75 153.15 422.24998] CT
0.149 GC
/Helvetica 13.333 F
GS
[1 0 0 1 0 0] CT
-8.5 13 moveto 
1 -1 scale
(50) t 
GR
GR
GS
[0.75 0 0 0.75 210.3 422.24998] CT
0.149 GC
/Helvetica 13.333 F
GS
[1 0 0 1 0 0] CT
-12.5 13 moveto 
1 -1 scale
(100) t 
GR
GR
GS
[0.75 0 0 0.75 267.45 422.24998] CT
0.149 GC
/Helvetica 13.333 F
GS
[1 0 0 1 0 0] CT
-12.5 13 moveto 
1 -1 scale
(150) t 
GR
GR
GS
[0.75 0 0 0.75 324.59999 422.24998] CT
0.149 GC
/Helvetica 13.333 F
GS
[1 0 0 1 0 0] CT
-12.5 13 moveto 
1 -1 scale
(200) t 
GR
GR
GS
[0.75 0 0 0.75 381.75 422.24998] CT
0.149 GC
/Helvetica 13.333 F
GS
[1 0 0 1 0 0] CT
-12.5 13 moveto 
1 -1 scale
(250) t 
GR
GR
GS
[0.75 0 0 0.75 438.90001 422.24998] CT
0.149 GC
/Helvetica 13.333 F
GS
[1 0 0 1 0 0] CT
-12.5 13 moveto 
1 -1 scale
(300) t 
GR
GR
GS
[0.75 0 0 0.75 496.05002 422.24998] CT
0.149 GC
/Helvetica 13.333 F
GS
[1 0 0 1 0 0] CT
-12.5 13 moveto 
1 -1 scale
(350) t 
GR
GR
GS
[0.75 0 0 0.75 553.19998 422.24998] CT
0.149 GC
/Helvetica 13.333 F
GS
[1 0 0 1 0 0] CT
-12.5 13 moveto 
1 -1 scale
(400) t 
GR
GR
GS
[0.75 0 0 0.75 610.34999 422.24998] CT
0.149 GC
/Helvetica 13.333 F
GS
[1 0 0 1 0 0] CT
-12.5 13 moveto 
1 -1 scale
(450) t 
GR
GR
GS
[0.75 0 0 0.75 667.5 422.24998] CT
0.149 GC
/Helvetica 13.333 F
GS
[1 0 0 1 0 0] CT
-12.5 13 moveto 
1 -1 scale
(500) t 
GR
GR
GS
[0.75 0 0 0.75 381.75027 436.00002] CT
0.149 GC
/Helvetica 14.667 F
GS
[1 0 0 1 0 0] CT
-57.5 14 moveto 
1 -1 scale
(Time \(seconds\)) t 
GR
GR
GS
[0.75 0 0 0.75 0 -0.25] CT
0.149 GC
2 setlinecap
1 LJ
0.667 LW
N
128 558 M
128 47 L
S
GR
GS
[0.75 0 0 0.75 0 -0.25] CT
0.149 GC
2 setlinecap
1 LJ
0.667 LW
N
128 558 M
135.62 558 L
S
GR
GS
[0.75 0 0 0.75 0 -0.25] CT
0.149 GC
2 setlinecap
1 LJ
0.667 LW
N
128 472.833 M
135.62 472.833 L
S
GR
GS
[0.75 0 0 0.75 0 -0.25] CT
0.149 GC
2 setlinecap
1 LJ
0.667 LW
N
128 387.667 M
135.62 387.667 L
S
GR
GS
[0.75 0 0 0.75 0 -0.25] CT
0.149 GC
2 setlinecap
1 LJ
0.667 LW
N
128 302.5 M
135.62 302.5 L
S
GR
GS
[0.75 0 0 0.75 0 -0.25] CT
0.149 GC
2 setlinecap
1 LJ
0.667 LW
N
128 217.333 M
135.62 217.333 L
S
GR
GS
[0.75 0 0 0.75 0 -0.25] CT
0.149 GC
2 setlinecap
1 LJ
0.667 LW
N
128 132.167 M
135.62 132.167 L
S
GR
GS
[0.75 0 0 0.75 0 -0.25] CT
0.149 GC
2 setlinecap
1 LJ
0.667 LW
N
128 47 M
135.62 47 L
S
GR
GS
[0.75 0 0 0.75 92 418.25] CT
0.149 GC
/Helvetica 13.333 F
GS
[1 0 0 1 0 0] CT
-34 4.5 moveto 
1 -1 scale
(-0.05) t 
GR
GR
GS
[0.75 0 0 0.75 92 354.37501] CT
0.149 GC
/Helvetica 13.333 F
GS
[1 0 0 1 0 0] CT
-9 4.5 moveto 
1 -1 scale
(0) t 
GR
GR
GS
[0.75 0 0 0.75 92 290.49999] CT
0.149 GC
/Helvetica 13.333 F
GS
[1 0 0 1 0 0] CT
-29 4.5 moveto 
1 -1 scale
(0.05) t 
GR
GR
GS
[0.75 0 0 0.75 92 226.625] CT
0.149 GC
/Helvetica 13.333 F
GS
[1 0 0 1 0 0] CT
-21 4.5 moveto 
1 -1 scale
(0.1) t 
GR
GR
GS
[0.75 0 0 0.75 92 162.75] CT
0.149 GC
/Helvetica 13.333 F
GS
[1 0 0 1 0 0] CT
-29 4.5 moveto 
1 -1 scale
(0.15) t 
GR
GR
GS
[0.75 0 0 0.75 92 98.87499] CT
0.149 GC
/Helvetica 13.333 F
GS
[1 0 0 1 0 0] CT
-21 4.5 moveto 
1 -1 scale
(0.2) t 
GR
GR
GS
[0.75 0 0 0.75 92 35] CT
0.149 GC
/Helvetica 13.333 F
GS
[1 0 0 1 0 0] CT
-29 4.5 moveto 
1 -1 scale
(0.25) t 
GR
GR
GS
[0 -0.75 0.75 0 63.5 226.62482] CT
0.149 GC
/Helvetica 14.667 F
GS
[1 0 0 1 0 0] CT
-17 -4 moveto 
1 -1 scale
(data) t 
GR
GR
GS
[0.75 0 0 0.75 381.75037 32.9375] CT
/Helvetica-Bold 14.667 F
GS
[1 0 0 1 0 0] CT
-161 -4 moveto 
1 -1 scale
(V\375stup regulace nezrychlen\351 syst\351mu) t 
GR
GR
GS
[0.75 0 0 0.75 0 -0.25] CT
0 0.447 0.741 RC
1 LJ
0.667 LW
N
128 472.833 M
128.001 472.833 L
128.005 472.833 L
128.028 472.833 L
128.143 472.833 L
128.664 472.834 L
129.606 472.84 L
130.803 472.861 L
132.136 472.903 L
133.641 472.968 L
135.546 473.06 L
137.734 473.145 L
140.788 473.162 L
144.884 472.866 L
149.978 471.806 L
154.924 469.921 L
160.393 466.815 L
167.423 461.329 L
177.466 451.051 L
189.809 435.807 L
202.376 419.089 L
208.09 411.526 L
213.803 404.148 L
222.319 393.675 L
233.144 381.529 L
239.393 375.19 L
245.641 369.358 L
254.084 362.274 L
264.26 354.891 L
270.742 350.799 L
277.223 347.137 L
285.585 342.986 L
295.4 338.836 L
302.038 336.414 L
308.676 334.26 L
316.981 331.894 L
326.55 329.555 L
333.298 328.119 L
340.047 326.832 L
348.306 325.436 L
357.694 324.053 L
366.2 322.96 L
373.035 322.177 L
379.375 321.518 L
386.81 320.818 L
395.876 320.059 L
405.104 319.378 L
412.692 318.882 L
419.027 318.507 L
425.736 318.143 L
434.098 317.734 L
443.713 317.317 L
450.512 317.056 L
457.311 316.817 L
465.605 316.554 L
475.032 316.289 L
483.597 316.076 L
490.488 315.923 L
496.86 315.794 L
504.31 315.655 L
513.406 315.504 L
522.705 315.367 L
530.361 315.267 L
536.727 315.192 L
543.43 315.12 L
551.749 315.037 L
561.302 314.953 L
568.113 314.9 L
574.924 314.851 L
583.185 314.797 L
592.496 314.742 L
600.944 314.698 L
607.802 314.667 L
614.205 314.64 L
621.683 314.611 L
630.719 314.578 L
639.872 314.548 L
647.435 314.527 L
653.81 314.512 L
660.577 314.496 L
668.915 314.478 L
678.354 314.458 L
685.117 314.448 L
691.879 314.437 L
700.112 314.425 L
709.458 314.412 L
717.962 314.401 L
724.829 314.395 L
731.195 314.389 L
738.626 314.383 L
747.656 314.375 L
756.863 314.367 L
764.467 314.362 L
770.831 314.36 L
777.549 314.357 L
785.849 314.352 L
795.313 314.347 L
802.096 314.345 L
808.879 314.343 L
817.117 314.34 L
826.442 314.336 L
834.925 314.333 L
841.795 314.332 L
848.179 314.332 L
855.626 314.33 L
864.652 314.328 L
873.835 314.325 L
881.427 314.324 L
887.801 314.325 L
890 314.325 L
S
GR
GS
[0.75 0 0 0.75 0 -0.25] CT
0.851 0.325 0.098 RC
1 LJ
0.667 LW
N
128 472.833 M
128.001 472.833 L
128.005 472.833 L
128.028 472.833 L
128.143 472.833 L
128.664 472.832 L
129.606 472.821 L
130.803 472.777 L
132.136 472.671 L
133.641 472.466 L
135.546 472.061 L
137.734 471.377 L
140.788 470.004 L
144.884 467.351 L
149.978 462.69 L
154.924 456.702 L
160.393 448.463 L
167.423 435.608 L
177.466 413.676 L
189.809 383.045 L
202.376 350.354 L
208.09 335.632 L
213.803 321.245 L
222.319 300.694 L
233.144 276.51 L
239.393 263.659 L
245.641 251.655 L
254.084 236.774 L
264.26 220.81 L
270.742 211.7 L
277.223 203.354 L
285.585 193.629 L
295.4 183.562 L
302.038 177.492 L
308.676 171.955 L
316.981 165.703 L
326.55 159.325 L
333.298 155.296 L
340.047 151.612 L
348.306 147.529 L
357.694 143.392 L
366.2 140.053 L
373.035 137.621 L
379.375 135.547 L
386.81 133.319 L
395.876 130.873 L
405.104 128.656 L
412.692 127.017 L
419.027 125.765 L
425.736 124.545 L
434.098 123.163 L
443.713 121.748 L
450.512 120.847 L
457.311 120.021 L
465.605 119.108 L
475.032 118.184 L
483.597 117.436 L
490.488 116.891 L
496.86 116.429 L
504.31 115.936 L
513.406 115.396 L
522.705 114.908 L
530.361 114.547 L
536.727 114.272 L
543.43 114.008 L
551.749 113.711 L
561.302 113.408 L
568.113 113.213 L
574.924 113.036 L
583.185 112.841 L
592.496 112.646 L
600.944 112.489 L
607.802 112.372 L
614.205 112.272 L
621.683 112.166 L
630.719 112.052 L
639.872 111.951 L
647.435 111.875 L
653.81 111.815 L
660.577 111.758 L
668.915 111.695 L
678.354 111.632 L
685.117 111.59 L
691.879 111.552 L
700.112 111.511 L
709.458 111.47 L
717.962 111.438 L
724.829 111.412 L
731.195 111.39 L
738.626 111.368 L
747.656 111.344 L
756.863 111.324 L
764.467 111.307 L
770.831 111.294 L
777.549 111.281 L
785.849 111.268 L
795.313 111.256 L
802.096 111.246 L
808.879 111.238 L
817.117 111.229 L
826.442 111.222 L
834.925 111.216 L
841.795 111.209 L
848.179 111.204 L
855.626 111.199 L
864.652 111.195 L
873.835 111.192 L
881.427 111.188 L
887.801 111.184 L
890 111.183 L
S
GR
GS
[0.75 0 0 0.75 0 -0.25] CT
0.929 0.694 0.125 RC
1 LJ
0.667 LW
N
128 314.221 M
128.001 314.221 L
128.005 314.221 L
128.028 314.221 L
128.143 314.221 L
128.664 314.221 L
129.606 314.221 L
130.803 314.221 L
132.136 314.221 L
133.641 314.221 L
135.546 314.221 L
137.734 314.221 L
140.788 314.221 L
144.884 314.221 L
149.978 314.221 L
154.924 314.221 L
160.393 314.221 L
167.423 314.221 L
177.466 314.221 L
189.809 314.221 L
202.376 314.221 L
208.09 314.221 L
213.803 314.221 L
222.319 314.221 L
233.144 314.221 L
239.393 314.221 L
245.641 314.221 L
254.084 314.221 L
264.26 314.221 L
270.742 314.221 L
277.223 314.221 L
285.585 314.221 L
295.4 314.221 L
302.038 314.221 L
308.676 314.221 L
316.981 314.221 L
326.55 314.221 L
333.298 314.221 L
340.047 314.221 L
348.306 314.221 L
357.694 314.221 L
366.2 314.221 L
373.035 314.221 L
379.375 314.221 L
386.81 314.221 L
395.876 314.221 L
405.104 314.221 L
412.692 314.221 L
419.027 314.221 L
425.736 314.221 L
434.098 314.221 L
443.713 314.221 L
450.512 314.221 L
457.311 314.221 L
465.605 314.221 L
475.032 314.221 L
483.597 314.221 L
490.488 314.221 L
496.86 314.221 L
504.31 314.221 L
513.406 314.221 L
522.705 314.221 L
530.361 314.221 L
536.727 314.221 L
543.43 314.221 L
551.749 314.221 L
561.302 314.221 L
568.113 314.221 L
574.924 314.221 L
583.185 314.221 L
592.496 314.221 L
600.944 314.221 L
607.802 314.221 L
614.205 314.221 L
621.683 314.221 L
630.719 314.221 L
639.872 314.221 L
647.435 314.221 L
653.81 314.221 L
660.577 314.221 L
668.915 314.221 L
678.354 314.221 L
685.117 314.221 L
691.879 314.221 L
700.112 314.221 L
709.458 314.221 L
717.962 314.221 L
724.829 314.221 L
731.195 314.221 L
738.626 314.221 L
747.656 314.221 L
756.863 314.221 L
764.467 314.221 L
770.831 314.221 L
777.549 314.221 L
785.849 314.221 L
795.313 314.221 L
802.096 314.221 L
808.879 314.221 L
817.117 314.221 L
826.442 314.221 L
834.925 314.221 L
841.795 314.221 L
848.179 314.221 L
855.626 314.221 L
864.652 314.221 L
873.835 314.221 L
881.427 314.221 L
887.801 314.221 L
890 314.221 L
S
GR
GS
[0.75 0 0 0.75 0 -0.25] CT
0.494 0.184 0.557 RC
1 LJ
0.667 LW
N
128 111.11 M
128.001 111.11 L
128.005 111.11 L
128.028 111.11 L
128.143 111.11 L
128.664 111.11 L
129.606 111.11 L
130.803 111.11 L
132.136 111.11 L
133.641 111.11 L
135.546 111.11 L
137.734 111.11 L
140.788 111.11 L
144.884 111.11 L
149.978 111.11 L
154.924 111.11 L
160.393 111.11 L
167.423 111.11 L
177.466 111.11 L
189.809 111.11 L
202.376 111.11 L
208.09 111.11 L
213.803 111.11 L
222.319 111.11 L
233.144 111.11 L
239.393 111.11 L
245.641 111.11 L
254.084 111.11 L
264.26 111.11 L
270.742 111.11 L
277.223 111.11 L
285.585 111.11 L
295.4 111.11 L
302.038 111.11 L
308.676 111.11 L
316.981 111.11 L
326.55 111.11 L
333.298 111.11 L
340.047 111.11 L
348.306 111.11 L
357.694 111.11 L
366.2 111.11 L
373.035 111.11 L
379.375 111.11 L
386.81 111.11 L
395.876 111.11 L
405.104 111.11 L
412.692 111.11 L
419.027 111.11 L
425.736 111.11 L
434.098 111.11 L
443.713 111.11 L
450.512 111.11 L
457.311 111.11 L
465.605 111.11 L
475.032 111.11 L
483.597 111.11 L
490.488 111.11 L
496.86 111.11 L
504.31 111.11 L
513.406 111.11 L
522.705 111.11 L
530.361 111.11 L
536.727 111.11 L
543.43 111.11 L
551.749 111.11 L
561.302 111.11 L
568.113 111.11 L
574.924 111.11 L
583.185 111.11 L
592.496 111.11 L
600.944 111.11 L
607.802 111.11 L
614.205 111.11 L
621.683 111.11 L
630.719 111.11 L
639.872 111.11 L
647.435 111.11 L
653.81 111.11 L
660.577 111.11 L
668.915 111.11 L
678.354 111.11 L
685.117 111.11 L
691.879 111.11 L
700.112 111.11 L
709.458 111.11 L
717.962 111.11 L
724.829 111.11 L
731.195 111.11 L
738.626 111.11 L
747.656 111.11 L
756.863 111.11 L
764.467 111.11 L
770.831 111.11 L
777.549 111.11 L
785.849 111.11 L
795.313 111.11 L
802.096 111.11 L
808.879 111.11 L
817.117 111.11 L
826.442 111.11 L
834.925 111.11 L
841.795 111.11 L
848.179 111.11 L
855.626 111.11 L
864.652 111.11 L
873.835 111.11 L
881.427 111.11 L
887.801 111.11 L
890 111.11 L
S
GR
GS
[0.75 0 0 0.75 0 -0.25] CT
1 GC
N
814 138 M
814 60 L
877 60 L
877 138 L
cp
f
GR
GS
[0.75 0 0 0.75 638.25 56] CT
/Helvetica 12 F
GS
[1 0 0 1 0 0] CT
0 0 moveto 
1 -1 scale
(h) t 
GR
GR
GS
[0.75 0 0 0.75 644.25 60.5] CT
/Helvetica 9.6 F
GS
[1 0 0 1 0 0] CT
0 0 moveto 
1 -1 scale
(1) t 
GR
GR
GS
[0.75 0 0 0.75 0 -0.25] CT
0 0.447 0.741 RC
1 LJ
0.667 LW
N
818 72.581 M
848 72.581 L
S
GR
GS
[0.75 0 0 0.75 638.25 71.75] CT
/Helvetica 12 F
GS
[1 0 0 1 0 0] CT
0 0 moveto 
1 -1 scale
(h) t 
GR
GR
GS
[0.75 0 0 0.75 644.25 76.25] CT
/Helvetica 9.6 F
GS
[1 0 0 1 0 0] CT
0 0 moveto 
1 -1 scale
(2) t 
GR
GR
GS
[0.75 0 0 0.75 0 -0.25] CT
0.851 0.325 0.098 RC
1 LJ
0.667 LW
N
818 94.219 M
848 94.219 L
S
GR
GS
[0.75 0 0 0.75 638.25 84.37903] CT
/Helvetica 12 F
GS
[1 0 0 1 0 0] CT
0 4.5 moveto 
1 -1 scale
(sp1) t 
GR
GR
GS
[0.75 0 0 0.75 0 -0.25] CT
0.929 0.694 0.125 RC
1 LJ
0.667 LW
N
818 112.839 M
848 112.839 L
S
GR
GS
[0.75 0 0 0.75 638.25 96.07903] CT
/Helvetica 12 F
GS
[1 0 0 1 0 0] CT
0 4.5 moveto 
1 -1 scale
(sp2) t 
GR
GR
GS
[0.75 0 0 0.75 0 -0.25] CT
0.494 0.184 0.557 RC
1 LJ
0.667 LW
N
818 128.439 M
848 128.439 L
S
GR
GS
[0.75 0 0 0.75 0 -0.25] CT
0.149 GC
10.0 ML
0.667 LW
N
814 138 M
814 60 L
877 60 L
877 138 L
cp
S
GR
%%Trailer
%%Pages: 1
%%EOF
