%!PS-Adobe-3.0 EPSF-3.0
%%Creator: (MATLAB, The Mathworks, Inc. Version 9.1.0.441655 \(R2016b\). Operating System: Windows 7)
%%Title: C:/Users/June/Documents/GitKraken/rls-2017/sp6/figures/rs.eps
%%CreationDate: 2018-03-04T20:33:05
%%Pages: (atend)
%%BoundingBox: 0 0 420 315
%%LanguageLevel: 3
%%EndComments
%%BeginProlog
%%BeginResource: procset (Apache XML Graphics Std ProcSet) 1.2 0
%%Version: 1.2 0
%%Copyright: (Copyright 2001-2003,2010 The Apache Software Foundation. License terms: http://www.apache.org/licenses/LICENSE-2.0)
/bd{bind def}bind def
/ld{load def}bd
/GR/grestore ld
/M/moveto ld
/LJ/setlinejoin ld
/C/curveto ld
/f/fill ld
/LW/setlinewidth ld
/GC/setgray ld
/t/show ld
/N/newpath ld
/CT/concat ld
/cp/closepath ld
/S/stroke ld
/L/lineto ld
/CC/setcmykcolor ld
/A/ashow ld
/GS/gsave ld
/RC/setrgbcolor ld
/RM/rmoveto ld
/ML/setmiterlimit ld
/re {4 2 roll M
1 index 0 rlineto
0 exch rlineto
neg 0 rlineto
cp } bd
/_ctm matrix def
/_tm matrix def
/BT { _ctm currentmatrix pop matrix _tm copy pop 0 0 moveto } bd
/ET { _ctm setmatrix } bd
/iTm { _ctm setmatrix _tm concat } bd
/Tm { _tm astore pop iTm 0 0 moveto } bd
/ux 0.0 def
/uy 0.0 def
/F {
  /Tp exch def
  /Tf exch def
  Tf findfont Tp scalefont setfont
  /cf Tf def  /cs Tp def
} bd
/ULS {currentpoint /uy exch def /ux exch def} bd
/ULE {
  /Tcx currentpoint pop def
  gsave
  newpath
  cf findfont cs scalefont dup
  /FontMatrix get 0 get /Ts exch def /FontInfo get dup
  /UnderlinePosition get Ts mul /To exch def
  /UnderlineThickness get Ts mul /Tt exch def
  ux uy To add moveto  Tcx uy To add lineto
  Tt setlinewidth stroke
  grestore
} bd
/OLE {
  /Tcx currentpoint pop def
  gsave
  newpath
  cf findfont cs scalefont dup
  /FontMatrix get 0 get /Ts exch def /FontInfo get dup
  /UnderlinePosition get Ts mul /To exch def
  /UnderlineThickness get Ts mul /Tt exch def
  ux uy To add cs add moveto Tcx uy To add cs add lineto
  Tt setlinewidth stroke
  grestore
} bd
/SOE {
  /Tcx currentpoint pop def
  gsave
  newpath
  cf findfont cs scalefont dup
  /FontMatrix get 0 get /Ts exch def /FontInfo get dup
  /UnderlinePosition get Ts mul /To exch def
  /UnderlineThickness get Ts mul /Tt exch def
  ux uy To add cs 10 mul 26 idiv add moveto Tcx uy To add cs 10 mul 26 idiv add lineto
  Tt setlinewidth stroke
  grestore
} bd
/QT {
/Y22 exch store
/X22 exch store
/Y21 exch store
/X21 exch store
currentpoint
/Y21 load 2 mul add 3 div exch
/X21 load 2 mul add 3 div exch
/X21 load 2 mul /X22 load add 3 div
/Y21 load 2 mul /Y22 load add 3 div
/X22 load /Y22 load curveto
} bd
/SSPD {
dup length /d exch dict def
{
/v exch def
/k exch def
currentpagedevice k known {
/cpdv currentpagedevice k get def
v cpdv ne {
/upd false def
/nullv v type /nulltype eq def
/nullcpdv cpdv type /nulltype eq def
nullv nullcpdv or
{
/upd true def
} {
/sametype v type cpdv type eq def
sametype {
v type /arraytype eq {
/vlen v length def
/cpdvlen cpdv length def
vlen cpdvlen eq {
0 1 vlen 1 sub {
/i exch def
/obj v i get def
/cpdobj cpdv i get def
obj cpdobj ne {
/upd true def
exit
} if
} for
} {
/upd true def
} ifelse
} {
v type /dicttype eq {
v {
/dv exch def
/dk exch def
/cpddv cpdv dk get def
dv cpddv ne {
/upd true def
exit
} if
} forall
} {
/upd true def
} ifelse
} ifelse
} if
} ifelse
upd true eq {
d k v put
} if
} if
} if
} forall
d length 0 gt {
d setpagedevice
} if
} bd
/RE { % /NewFontName [NewEncodingArray] /FontName RE -
  findfont dup length dict begin
  {
    1 index /FID ne
    {def} {pop pop} ifelse
  } forall
  /Encoding exch def
  /FontName 1 index def
  currentdict definefont pop
  end
} bind def
%%EndResource
%%BeginResource: procset (Apache XML Graphics EPS ProcSet) 1.0 0
%%Version: 1.0 0
%%Copyright: (Copyright 2002-2003 The Apache Software Foundation. License terms: http://www.apache.org/licenses/LICENSE-2.0)
/BeginEPSF { %def
/b4_Inc_state save def         % Save state for cleanup
/dict_count countdictstack def % Count objects on dict stack
/op_count count 1 sub def      % Count objects on operand stack
userdict begin                 % Push userdict on dict stack
/showpage { } def              % Redefine showpage, { } = null proc
0 setgray 0 setlinecap         % Prepare graphics state
1 setlinewidth 0 setlinejoin
10 setmiterlimit [ ] 0 setdash newpath
/languagelevel where           % If level not equal to 1 then
{pop languagelevel             % set strokeadjust and
1 ne                           % overprint to their defaults.
{false setstrokeadjust false setoverprint
} if
} if
} bd
/EndEPSF { %def
count op_count sub {pop} repeat            % Clean up stacks
countdictstack dict_count sub {end} repeat
b4_Inc_state restore
} bd
%%EndResource
%FOPBeginFontDict
%%IncludeResource: font Courier-Bold
%%IncludeResource: font Helvetica
%%IncludeResource: font Courier-BoldOblique
%%IncludeResource: font Courier-Oblique
%%IncludeResource: font Times-Roman
%%IncludeResource: font Helvetica-BoldOblique
%%IncludeResource: font Helvetica-Bold
%%IncludeResource: font Helvetica-Oblique
%%IncludeResource: font Times-BoldItalic
%%IncludeResource: font Courier
%%IncludeResource: font Times-Italic
%%IncludeResource: font Times-Bold
%%IncludeResource: font Symbol
%%IncludeResource: font ZapfDingbats
%FOPEndFontDict
%%BeginResource: encoding WinAnsiEncoding
/WinAnsiEncoding [
/.notdef /.notdef /.notdef /.notdef /.notdef
/.notdef /.notdef /.notdef /.notdef /.notdef
/.notdef /.notdef /.notdef /.notdef /.notdef
/.notdef /.notdef /.notdef /.notdef /.notdef
/.notdef /.notdef /.notdef /.notdef /.notdef
/.notdef /.notdef /.notdef /.notdef /.notdef
/.notdef /.notdef /space /exclam /quotedbl
/numbersign /dollar /percent /ampersand /quotesingle
/parenleft /parenright /asterisk /plus /comma
/hyphen /period /slash /zero /one
/two /three /four /five /six
/seven /eight /nine /colon /semicolon
/less /equal /greater /question /at
/A /B /C /D /E
/F /G /H /I /J
/K /L /M /N /O
/P /Q /R /S /T
/U /V /W /X /Y
/Z /bracketleft /backslash /bracketright /asciicircum
/underscore /quoteleft /a /b /c
/d /e /f /g /h
/i /j /k /l /m
/n /o /p /q /r
/s /t /u /v /w
/x /y /z /braceleft /bar
/braceright /asciitilde /bullet /Euro /bullet
/quotesinglbase /florin /quotedblbase /ellipsis /dagger
/daggerdbl /circumflex /perthousand /Scaron /guilsinglleft
/OE /bullet /Zcaron /bullet /bullet
/quoteleft /quoteright /quotedblleft /quotedblright /bullet
/endash /emdash /asciitilde /trademark /scaron
/guilsinglright /oe /bullet /zcaron /Ydieresis
/space /exclamdown /cent /sterling /currency
/yen /brokenbar /section /dieresis /copyright
/ordfeminine /guillemotleft /logicalnot /sfthyphen /registered
/macron /degree /plusminus /twosuperior /threesuperior
/acute /mu /paragraph /middot /cedilla
/onesuperior /ordmasculine /guillemotright /onequarter /onehalf
/threequarters /questiondown /Agrave /Aacute /Acircumflex
/Atilde /Adieresis /Aring /AE /Ccedilla
/Egrave /Eacute /Ecircumflex /Edieresis /Igrave
/Iacute /Icircumflex /Idieresis /Eth /Ntilde
/Ograve /Oacute /Ocircumflex /Otilde /Odieresis
/multiply /Oslash /Ugrave /Uacute /Ucircumflex
/Udieresis /Yacute /Thorn /germandbls /agrave
/aacute /acircumflex /atilde /adieresis /aring
/ae /ccedilla /egrave /eacute /ecircumflex
/edieresis /igrave /iacute /icircumflex /idieresis
/eth /ntilde /ograve /oacute /ocircumflex
/otilde /odieresis /divide /oslash /ugrave
/uacute /ucircumflex /udieresis /yacute /thorn
/ydieresis
] def
%%EndResource
%FOPBeginFontReencode
/Courier-Bold findfont
dup length dict begin
  {1 index /FID ne {def} {pop pop} ifelse} forall
  /Encoding WinAnsiEncoding def
  currentdict
end
/Courier-Bold exch definefont pop
/Helvetica findfont
dup length dict begin
  {1 index /FID ne {def} {pop pop} ifelse} forall
  /Encoding WinAnsiEncoding def
  currentdict
end
/Helvetica exch definefont pop
/Courier-BoldOblique findfont
dup length dict begin
  {1 index /FID ne {def} {pop pop} ifelse} forall
  /Encoding WinAnsiEncoding def
  currentdict
end
/Courier-BoldOblique exch definefont pop
/Courier-Oblique findfont
dup length dict begin
  {1 index /FID ne {def} {pop pop} ifelse} forall
  /Encoding WinAnsiEncoding def
  currentdict
end
/Courier-Oblique exch definefont pop
/Times-Roman findfont
dup length dict begin
  {1 index /FID ne {def} {pop pop} ifelse} forall
  /Encoding WinAnsiEncoding def
  currentdict
end
/Times-Roman exch definefont pop
/Helvetica-BoldOblique findfont
dup length dict begin
  {1 index /FID ne {def} {pop pop} ifelse} forall
  /Encoding WinAnsiEncoding def
  currentdict
end
/Helvetica-BoldOblique exch definefont pop
/Helvetica-Bold findfont
dup length dict begin
  {1 index /FID ne {def} {pop pop} ifelse} forall
  /Encoding WinAnsiEncoding def
  currentdict
end
/Helvetica-Bold exch definefont pop
/Helvetica-Oblique findfont
dup length dict begin
  {1 index /FID ne {def} {pop pop} ifelse} forall
  /Encoding WinAnsiEncoding def
  currentdict
end
/Helvetica-Oblique exch definefont pop
/Times-BoldItalic findfont
dup length dict begin
  {1 index /FID ne {def} {pop pop} ifelse} forall
  /Encoding WinAnsiEncoding def
  currentdict
end
/Times-BoldItalic exch definefont pop
/Courier findfont
dup length dict begin
  {1 index /FID ne {def} {pop pop} ifelse} forall
  /Encoding WinAnsiEncoding def
  currentdict
end
/Courier exch definefont pop
/Times-Italic findfont
dup length dict begin
  {1 index /FID ne {def} {pop pop} ifelse} forall
  /Encoding WinAnsiEncoding def
  currentdict
end
/Times-Italic exch definefont pop
/Times-Bold findfont
dup length dict begin
  {1 index /FID ne {def} {pop pop} ifelse} forall
  /Encoding WinAnsiEncoding def
  currentdict
end
/Times-Bold exch definefont pop
%FOPEndFontReencode
%%EndProlog
%%Page: 1 1
%%PageBoundingBox: 0 0 420 315
%%BeginPageSetup
[1 0 0 -1 0 315] CT
%%EndPageSetup
GS
[0.75 0 0 0.75 0 0] CT
1 GC
N
0 0 560 420 re
f
GR
GS
[0.75 0 0 0.75 0 0] CT
1 GC
N
0 0 560 420 re
f
GR
GS
[0.75 0 0 0.75 0 0] CT
1 GC
N
73 374 M
507 374 L
507 31 L
73 31 L
cp
f
GR
GS
[0.75 0 0 0.75 0 0] CT
0.873 GC
1 LJ
0.667 LW
N
73 374 M
73 31 L
S
GR
GS
[0.75 0 0 0.75 0 0] CT
0.873 GC
1 LJ
0.667 LW
N
116.4 374 M
116.4 31 L
S
GR
GS
[0.75 0 0 0.75 0 0] CT
0.873 GC
1 LJ
0.667 LW
N
159.8 374 M
159.8 31 L
S
GR
GS
[0.75 0 0 0.75 0 0] CT
0.873 GC
1 LJ
0.667 LW
N
203.2 374 M
203.2 31 L
S
GR
GS
[0.75 0 0 0.75 0 0] CT
0.873 GC
1 LJ
0.667 LW
N
246.6 374 M
246.6 31 L
S
GR
GS
[0.75 0 0 0.75 0 0] CT
0.873 GC
1 LJ
0.667 LW
N
290 374 M
290 31 L
S
GR
GS
[0.75 0 0 0.75 0 0] CT
0.873 GC
1 LJ
0.667 LW
N
333.4 374 M
333.4 31 L
S
GR
GS
[0.75 0 0 0.75 0 0] CT
0.873 GC
1 LJ
0.667 LW
N
376.8 374 M
376.8 31 L
S
GR
GS
[0.75 0 0 0.75 0 0] CT
0.873 GC
1 LJ
0.667 LW
N
420.2 374 M
420.2 31 L
S
GR
GS
[0.75 0 0 0.75 0 0] CT
0.873 GC
1 LJ
0.667 LW
N
463.6 374 M
463.6 31 L
S
GR
GS
[0.75 0 0 0.75 0 0] CT
0.873 GC
1 LJ
0.667 LW
N
507 374 M
507 31 L
S
GR
GS
[0.75 0 0 0.75 0 0] CT
0.873 GC
1 LJ
0.667 LW
N
507 374 M
73 374 L
S
GR
GS
[0.75 0 0 0.75 0 0] CT
0.873 GC
1 LJ
0.667 LW
N
507 325 M
73 325 L
S
GR
GS
[0.75 0 0 0.75 0 0] CT
0.873 GC
1 LJ
0.667 LW
N
507 276 M
73 276 L
S
GR
GS
[0.75 0 0 0.75 0 0] CT
0.873 GC
1 LJ
0.667 LW
N
507 227 M
73 227 L
S
GR
GS
[0.75 0 0 0.75 0 0] CT
0.873 GC
1 LJ
0.667 LW
N
507 178 M
73 178 L
S
GR
GS
[0.75 0 0 0.75 0 0] CT
0.873 GC
1 LJ
0.667 LW
N
507 129 M
73 129 L
S
GR
GS
[0.75 0 0 0.75 0 0] CT
0.873 GC
1 LJ
0.667 LW
N
507 80 M
73 80 L
S
GR
GS
[0.75 0 0 0.75 0 0] CT
0.873 GC
1 LJ
0.667 LW
N
507 31 M
73 31 L
S
GR
GS
[0.75 0 0 0.75 0 0] CT
0.149 GC
2 setlinecap
1 LJ
0.667 LW
N
73 374 M
507 374 L
S
GR
GS
[0.75 0 0 0.75 0 0] CT
0.149 GC
2 setlinecap
1 LJ
0.667 LW
N
73 31 M
507 31 L
S
GR
GS
[0.75 0 0 0.75 0 0] CT
0.149 GC
2 setlinecap
1 LJ
0.667 LW
N
73 374 M
73 369.66 L
S
GR
GS
[0.75 0 0 0.75 0 0] CT
0.149 GC
2 setlinecap
1 LJ
0.667 LW
N
116.4 374 M
116.4 369.66 L
S
GR
GS
[0.75 0 0 0.75 0 0] CT
0.149 GC
2 setlinecap
1 LJ
0.667 LW
N
159.8 374 M
159.8 369.66 L
S
GR
GS
[0.75 0 0 0.75 0 0] CT
0.149 GC
2 setlinecap
1 LJ
0.667 LW
N
203.2 374 M
203.2 369.66 L
S
GR
GS
[0.75 0 0 0.75 0 0] CT
0.149 GC
2 setlinecap
1 LJ
0.667 LW
N
246.6 374 M
246.6 369.66 L
S
GR
GS
[0.75 0 0 0.75 0 0] CT
0.149 GC
2 setlinecap
1 LJ
0.667 LW
N
290 374 M
290 369.66 L
S
GR
GS
[0.75 0 0 0.75 0 0] CT
0.149 GC
2 setlinecap
1 LJ
0.667 LW
N
333.4 374 M
333.4 369.66 L
S
GR
GS
[0.75 0 0 0.75 0 0] CT
0.149 GC
2 setlinecap
1 LJ
0.667 LW
N
376.8 374 M
376.8 369.66 L
S
GR
GS
[0.75 0 0 0.75 0 0] CT
0.149 GC
2 setlinecap
1 LJ
0.667 LW
N
420.2 374 M
420.2 369.66 L
S
GR
GS
[0.75 0 0 0.75 0 0] CT
0.149 GC
2 setlinecap
1 LJ
0.667 LW
N
463.6 374 M
463.6 369.66 L
S
GR
GS
[0.75 0 0 0.75 0 0] CT
0.149 GC
2 setlinecap
1 LJ
0.667 LW
N
507 374 M
507 369.66 L
S
GR
GS
[0.75 0 0 0.75 0 0] CT
0.149 GC
2 setlinecap
1 LJ
0.667 LW
N
73 31 M
73 35.34 L
S
GR
GS
[0.75 0 0 0.75 0 0] CT
0.149 GC
2 setlinecap
1 LJ
0.667 LW
N
116.4 31 M
116.4 35.34 L
S
GR
GS
[0.75 0 0 0.75 0 0] CT
0.149 GC
2 setlinecap
1 LJ
0.667 LW
N
159.8 31 M
159.8 35.34 L
S
GR
GS
[0.75 0 0 0.75 0 0] CT
0.149 GC
2 setlinecap
1 LJ
0.667 LW
N
203.2 31 M
203.2 35.34 L
S
GR
GS
[0.75 0 0 0.75 0 0] CT
0.149 GC
2 setlinecap
1 LJ
0.667 LW
N
246.6 31 M
246.6 35.34 L
S
GR
GS
[0.75 0 0 0.75 0 0] CT
0.149 GC
2 setlinecap
1 LJ
0.667 LW
N
290 31 M
290 35.34 L
S
GR
GS
[0.75 0 0 0.75 0 0] CT
0.149 GC
2 setlinecap
1 LJ
0.667 LW
N
333.4 31 M
333.4 35.34 L
S
GR
GS
[0.75 0 0 0.75 0 0] CT
0.149 GC
2 setlinecap
1 LJ
0.667 LW
N
376.8 31 M
376.8 35.34 L
S
GR
GS
[0.75 0 0 0.75 0 0] CT
0.149 GC
2 setlinecap
1 LJ
0.667 LW
N
420.2 31 M
420.2 35.34 L
S
GR
GS
[0.75 0 0 0.75 0 0] CT
0.149 GC
2 setlinecap
1 LJ
0.667 LW
N
463.6 31 M
463.6 35.34 L
S
GR
GS
[0.75 0 0 0.75 0 0] CT
0.149 GC
2 setlinecap
1 LJ
0.667 LW
N
507 31 M
507 35.34 L
S
GR
GS
[0.75 0 0 0.75 54.75 284.50001] CT
0.149 GC
/Helvetica 13.333 F
GS
[1 0 0 1 0 0] CT
-4 14 moveto 
1 -1 scale
(0) t 
GR
GR
GS
[0.75 0 0 0.75 87.3 284.50001] CT
0.149 GC
/Helvetica 13.333 F
GS
[1 0 0 1 0 0] CT
-11 14 moveto 
1 -1 scale
(200) t 
GR
GR
GS
[0.75 0 0 0.75 119.85 284.50001] CT
0.149 GC
/Helvetica 13.333 F
GS
[1 0 0 1 0 0] CT
-11 14 moveto 
1 -1 scale
(400) t 
GR
GR
GS
[0.75 0 0 0.75 152.4 284.50001] CT
0.149 GC
/Helvetica 13.333 F
GS
[1 0 0 1 0 0] CT
-11 14 moveto 
1 -1 scale
(600) t 
GR
GR
GS
[0.75 0 0 0.75 184.95 284.50001] CT
0.149 GC
/Helvetica 13.333 F
GS
[1 0 0 1 0 0] CT
-11 14 moveto 
1 -1 scale
(800) t 
GR
GR
GS
[0.75 0 0 0.75 217.5 284.50001] CT
0.149 GC
/Helvetica 13.333 F
GS
[1 0 0 1 0 0] CT
-14.5 14 moveto 
1 -1 scale
(1000) t 
GR
GR
GS
[0.75 0 0 0.75 250.05 284.50001] CT
0.149 GC
/Helvetica 13.333 F
GS
[1 0 0 1 0 0] CT
-14.5 14 moveto 
1 -1 scale
(1200) t 
GR
GR
GS
[0.75 0 0 0.75 282.59999 284.50001] CT
0.149 GC
/Helvetica 13.333 F
GS
[1 0 0 1 0 0] CT
-14.5 14 moveto 
1 -1 scale
(1400) t 
GR
GR
GS
[0.75 0 0 0.75 315.15001 284.50001] CT
0.149 GC
/Helvetica 13.333 F
GS
[1 0 0 1 0 0] CT
-14.5 14 moveto 
1 -1 scale
(1600) t 
GR
GR
GS
[0.75 0 0 0.75 347.7 284.50001] CT
0.149 GC
/Helvetica 13.333 F
GS
[1 0 0 1 0 0] CT
-14.5 14 moveto 
1 -1 scale
(1800) t 
GR
GR
GS
[0.75 0 0 0.75 380.25 284.50001] CT
0.149 GC
/Helvetica 13.333 F
GS
[1 0 0 1 0 0] CT
-14.5 14 moveto 
1 -1 scale
(2000) t 
GR
GR
GS
[0.75 0 0 0.75 0 0] CT
0.149 GC
2 setlinecap
1 LJ
0.667 LW
N
73 374 M
73 31 L
S
GR
GS
[0.75 0 0 0.75 0 0] CT
0.149 GC
2 setlinecap
1 LJ
0.667 LW
N
507 374 M
507 31 L
S
GR
GS
[0.75 0 0 0.75 0 0] CT
0.149 GC
2 setlinecap
1 LJ
0.667 LW
N
73 374 M
77.34 374 L
S
GR
GS
[0.75 0 0 0.75 0 0] CT
0.149 GC
2 setlinecap
1 LJ
0.667 LW
N
73 325 M
77.34 325 L
S
GR
GS
[0.75 0 0 0.75 0 0] CT
0.149 GC
2 setlinecap
1 LJ
0.667 LW
N
73 276 M
77.34 276 L
S
GR
GS
[0.75 0 0 0.75 0 0] CT
0.149 GC
2 setlinecap
1 LJ
0.667 LW
N
73 227 M
77.34 227 L
S
GR
GS
[0.75 0 0 0.75 0 0] CT
0.149 GC
2 setlinecap
1 LJ
0.667 LW
N
73 178 M
77.34 178 L
S
GR
GS
[0.75 0 0 0.75 0 0] CT
0.149 GC
2 setlinecap
1 LJ
0.667 LW
N
73 129 M
77.34 129 L
S
GR
GS
[0.75 0 0 0.75 0 0] CT
0.149 GC
2 setlinecap
1 LJ
0.667 LW
N
73 80 M
77.34 80 L
S
GR
GS
[0.75 0 0 0.75 0 0] CT
0.149 GC
2 setlinecap
1 LJ
0.667 LW
N
73 31 M
77.34 31 L
S
GR
GS
[0.75 0 0 0.75 0 0] CT
0.149 GC
2 setlinecap
1 LJ
0.667 LW
N
507 374 M
502.66 374 L
S
GR
GS
[0.75 0 0 0.75 0 0] CT
0.149 GC
2 setlinecap
1 LJ
0.667 LW
N
507 325 M
502.66 325 L
S
GR
GS
[0.75 0 0 0.75 0 0] CT
0.149 GC
2 setlinecap
1 LJ
0.667 LW
N
507 276 M
502.66 276 L
S
GR
GS
[0.75 0 0 0.75 0 0] CT
0.149 GC
2 setlinecap
1 LJ
0.667 LW
N
507 227 M
502.66 227 L
S
GR
GS
[0.75 0 0 0.75 0 0] CT
0.149 GC
2 setlinecap
1 LJ
0.667 LW
N
507 178 M
502.66 178 L
S
GR
GS
[0.75 0 0 0.75 0 0] CT
0.149 GC
2 setlinecap
1 LJ
0.667 LW
N
507 129 M
502.66 129 L
S
GR
GS
[0.75 0 0 0.75 0 0] CT
0.149 GC
2 setlinecap
1 LJ
0.667 LW
N
507 80 M
502.66 80 L
S
GR
GS
[0.75 0 0 0.75 0 0] CT
0.149 GC
2 setlinecap
1 LJ
0.667 LW
N
507 31 M
502.66 31 L
S
GR
GS
[0.75 0 0 0.75 50.75 280.5] CT
0.149 GC
/Helvetica 13.333 F
GS
[1 0 0 1 0 0] CT
-8 5.5 moveto 
1 -1 scale
(0) t 
GR
GR
GS
[0.75 0 0 0.75 50.75 243.75] CT
0.149 GC
/Helvetica 13.333 F
GS
[1 0 0 1 0 0] CT
-19 5.5 moveto 
1 -1 scale
(0.1) t 
GR
GR
GS
[0.75 0 0 0.75 50.75 207] CT
0.149 GC
/Helvetica 13.333 F
GS
[1 0 0 1 0 0] CT
-19 5.5 moveto 
1 -1 scale
(0.2) t 
GR
GR
GS
[0.75 0 0 0.75 50.75 170.25] CT
0.149 GC
/Helvetica 13.333 F
GS
[1 0 0 1 0 0] CT
-19 5.5 moveto 
1 -1 scale
(0.3) t 
GR
GR
GS
[0.75 0 0 0.75 50.75 133.5] CT
0.149 GC
/Helvetica 13.333 F
GS
[1 0 0 1 0 0] CT
-19 5.5 moveto 
1 -1 scale
(0.4) t 
GR
GR
GS
[0.75 0 0 0.75 50.75 96.75] CT
0.149 GC
/Helvetica 13.333 F
GS
[1 0 0 1 0 0] CT
-19 5.5 moveto 
1 -1 scale
(0.5) t 
GR
GR
GS
[0.75 0 0 0.75 50.75 59.99999] CT
0.149 GC
/Helvetica 13.333 F
GS
[1 0 0 1 0 0] CT
-19 5.5 moveto 
1 -1 scale
(0.6) t 
GR
GR
GS
[0.75 0 0 0.75 50.75 23.25] CT
0.149 GC
/Helvetica 13.333 F
GS
[1 0 0 1 0 0] CT
-19 5.5 moveto 
1 -1 scale
(0.7) t 
GR
GR
GS
[0.75 0 0 0.75 217.50021 21.1875] CT
/Helvetica-Bold 14.667 F
GS
[1 0 0 1 0 0] CT
-98.5 -4 moveto 
1 -1 scale
(Podminka robustni stability) t 
GR
GR
GS
[0.75 0 0 0.75 0 0] CT
0 0.447 0.741 RC
1 LJ
0.667 LW
N
73.217 65.758 M
73.434 65.761 L
73.651 65.764 L
73.868 65.768 L
74.085 65.771 L
74.302 65.774 L
74.519 65.778 L
74.736 65.781 L
74.953 65.785 L
75.17 65.788 L
75.387 65.792 L
75.604 65.796 L
75.821 65.799 L
76.038 65.803 L
76.255 65.807 L
76.472 65.811 L
76.689 65.815 L
76.906 65.819 L
77.123 65.823 L
77.34 65.827 L
77.557 65.831 L
77.774 65.835 L
77.991 65.84 L
78.208 65.844 L
78.425 65.849 L
78.642 65.853 L
78.859 65.858 L
79.076 65.862 L
79.293 65.867 L
79.51 65.872 L
79.727 65.876 L
79.944 65.881 L
80.161 65.886 L
80.378 65.891 L
80.595 65.896 L
80.812 65.901 L
81.029 65.907 L
81.246 65.912 L
81.463 65.917 L
81.68 65.923 L
81.897 65.928 L
82.114 65.934 L
82.331 65.94 L
82.548 65.945 L
82.765 65.951 L
82.982 65.957 L
83.199 65.963 L
83.416 65.969 L
83.633 65.975 L
83.85 65.982 L
84.067 65.988 L
84.284 65.994 L
84.501 66.001 L
84.718 66.008 L
84.935 66.014 L
85.152 66.021 L
85.369 66.028 L
85.586 66.035 L
85.803 66.042 L
86.02 66.049 L
86.237 66.057 L
86.454 66.064 L
86.671 66.072 L
86.888 66.079 L
87.105 66.087 L
87.322 66.095 L
87.539 66.103 L
87.756 66.111 L
87.973 66.119 L
88.19 66.127 L
88.407 66.136 L
88.624 66.144 L
88.841 66.153 L
89.058 66.162 L
89.275 66.17 L
89.492 66.179 L
89.709 66.189 L
89.926 66.198 L
90.143 66.207 L
90.36 66.217 L
90.577 66.226 L
90.794 66.236 L
91.011 66.246 L
91.228 66.256 L
91.445 66.266 L
91.662 66.277 L
91.879 66.287 L
92.096 66.298 L
92.313 66.308 L
92.53 66.319 L
92.747 66.331 L
92.964 66.342 L
93.181 66.353 L
93.398 66.365 L
93.615 66.376 L
93.832 66.388 L
94.049 66.4 L
94.266 66.413 L
94.483 66.425 L
94.7 66.437 L
94.917 66.45 L
95.134 66.463 L
95.351 66.476 L
95.568 66.489 L
95.785 66.503 L
96.002 66.517 L
96.219 66.53 L
96.436 66.544 L
96.653 66.559 L
96.87 66.573 L
97.087 66.588 L
97.304 66.602 L
97.521 66.617 L
97.738 66.633 L
97.955 66.648 L
98.172 66.664 L
98.389 66.68 L
98.606 66.696 L
98.823 66.712 L
99.04 66.729 L
99.257 66.745 L
99.474 66.762 L
99.691 66.78 L
99.908 66.797 L
100.125 66.815 L
100.342 66.833 L
100.559 66.851 L
100.776 66.869 L
100.993 66.888 L
101.21 66.907 L
101.427 66.926 L
101.644 66.946 L
101.861 66.966 L
102.078 66.986 L
102.295 67.006 L
102.512 67.027 L
102.729 67.048 L
102.946 67.069 L
103.163 67.09 L
103.38 67.112 L
103.597 67.134 L
103.814 67.157 L
104.031 67.18 L
104.248 67.203 L
104.465 67.226 L
104.682 67.25 L
104.899 67.274 L
105.116 67.298 L
105.333 67.323 L
105.55 67.348 L
105.767 67.373 L
105.984 67.399 L
106.201 67.425 L
106.418 67.451 L
106.635 67.478 L
106.852 67.505 L
107.069 67.533 L
107.286 67.561 L
107.503 67.589 L
107.72 67.618 L
107.937 67.647 L
108.154 67.676 L
108.371 67.706 L
108.588 67.737 L
108.805 67.768 L
109.022 67.799 L
109.239 67.83 L
109.456 67.862 L
109.673 67.895 L
109.89 67.928 L
110.107 67.961 L
110.324 67.995 L
110.541 68.03 L
110.758 68.064 L
110.975 68.1 L
111.192 68.135 L
111.409 68.172 L
111.626 68.209 L
111.843 68.246 L
112.06 68.284 L
112.277 68.322 L
112.494 68.361 L
112.711 68.4 L
112.928 68.44 L
113.145 68.481 L
113.362 68.522 L
113.579 68.563 L
113.796 68.606 L
114.013 68.648 L
114.23 68.692 L
114.447 68.736 L
114.664 68.78 L
114.881 68.825 L
115.098 68.871 L
115.315 68.918 L
115.532 68.965 L
115.749 69.013 L
115.966 69.061 L
116.183 69.11 L
116.4 69.16 L
116.617 69.21 L
116.834 69.261 L
117.051 69.313 L
117.268 69.366 L
117.485 69.419 L
117.702 69.473 L
117.919 69.528 L
118.136 69.583 L
118.353 69.64 L
118.57 69.697 L
118.787 69.755 L
119.004 69.813 L
119.221 69.873 L
119.438 69.933 L
119.655 69.994 L
119.872 70.056 L
120.089 70.119 L
120.306 70.182 L
120.523 70.247 L
120.74 70.312 L
120.957 70.379 L
121.174 70.446 L
121.391 70.514 L
121.608 70.583 L
121.825 70.653 L
122.042 70.724 L
122.259 70.796 L
122.476 70.869 L
122.693 70.943 L
122.91 71.018 L
123.127 71.094 L
123.344 71.171 L
123.561 71.249 L
123.778 71.328 L
123.995 71.409 L
124.212 71.49 L
124.429 71.573 L
124.646 71.656 L
124.863 71.741 L
125.08 71.827 L
125.297 71.914 L
125.514 72.002 L
125.731 72.092 L
125.948 72.183 L
126.165 72.275 L
126.382 72.368 L
126.599 72.462 L
126.816 72.558 L
127.033 72.655 L
127.25 72.754 L
127.467 72.853 L
127.684 72.955 L
127.901 73.057 L
128.118 73.161 L
128.335 73.266 L
128.552 73.373 L
128.769 73.481 L
128.986 73.591 L
129.203 73.702 L
129.42 73.815 L
129.637 73.929 L
129.854 74.045 L
130.071 74.163 L
130.288 74.282 L
130.505 74.402 L
130.722 74.524 L
130.939 74.648 L
131.156 74.774 L
131.373 74.901 L
131.59 75.03 L
131.807 75.161 L
132.024 75.294 L
132.241 75.428 L
132.458 75.564 L
132.675 75.702 L
132.892 75.842 L
133.109 75.984 L
133.326 76.127 L
133.543 76.273 L
133.76 76.421 L
133.977 76.57 L
134.194 76.722 L
134.411 76.876 L
134.628 77.031 L
134.845 77.189 L
135.062 77.349 L
135.279 77.511 L
135.496 77.676 L
135.713 77.842 L
135.93 78.011 L
136.147 78.182 L
136.364 78.355 L
136.581 78.531 L
136.798 78.709 L
137.015 78.889 L
137.232 79.072 L
137.449 79.257 L
137.666 79.445 L
137.883 79.636 L
138.1 79.828 L
138.317 80.024 L
138.534 80.222 L
138.751 80.422 L
138.968 80.626 L
139.185 80.832 L
139.402 81.041 L
139.619 81.252 L
139.836 81.467 L
140.053 81.684 L
140.27 81.904 L
140.487 82.127 L
140.704 82.353 L
140.921 82.582 L
141.138 82.814 L
141.355 83.049 L
141.572 83.287 L
141.789 83.529 L
142.006 83.773 L
142.223 84.021 L
142.44 84.272 L
142.657 84.526 L
142.874 84.784 L
143.091 85.045 L
143.308 85.31 L
143.525 85.578 L
143.742 85.849 L
143.959 86.124 L
144.176 86.403 L
144.393 86.685 L
144.61 86.971 L
144.827 87.261 L
145.044 87.554 L
145.261 87.852 L
145.478 88.153 L
145.695 88.458 L
145.912 88.767 L
146.129 89.08 L
146.346 89.397 L
146.563 89.718 L
146.78 90.044 L
146.997 90.373 L
147.214 90.707 L
147.431 91.045 L
147.648 91.388 L
147.865 91.734 L
148.082 92.086 L
148.299 92.442 L
148.516 92.802 L
148.733 93.167 L
148.95 93.536 L
149.167 93.911 L
149.384 94.29 L
149.601 94.674 L
149.818 95.062 L
150.035 95.456 L
150.252 95.854 L
150.469 96.258 L
150.686 96.667 L
150.903 97.081 L
151.12 97.5 L
151.337 97.924 L
151.554 98.353 L
151.771 98.788 L
151.988 99.229 L
152.205 99.675 L
152.422 100.126 L
152.639 100.583 L
152.856 101.045 L
153.073 101.514 L
153.29 101.988 L
153.507 102.468 L
153.724 102.953 L
153.941 103.445 L
154.158 103.943 L
154.375 104.447 L
154.592 104.957 L
154.809 105.473 L
155.026 105.995 L
155.243 106.523 L
155.46 107.058 L
155.677 107.6 L
155.894 108.148 L
156.111 108.702 L
156.328 109.263 L
156.545 109.831 L
156.762 110.405 L
156.979 110.986 L
157.196 111.574 L
157.413 112.169 L
157.63 112.771 L
157.847 113.38 L
158.064 113.996 L
158.281 114.619 L
158.498 115.249 L
158.715 115.887 L
158.932 116.532 L
159.149 117.184 L
159.366 117.843 L
159.583 118.511 L
159.8 119.185 L
160.017 119.868 L
160.234 120.557 L
160.451 121.255 L
160.668 121.961 L
160.885 122.674 L
161.102 123.395 L
161.319 124.124 L
161.536 124.861 L
161.753 125.606 L
161.97 126.359 L
162.187 127.12 L
162.404 127.89 L
162.621 128.667 L
162.838 129.453 L
163.055 130.247 L
163.272 131.05 L
163.489 131.861 L
163.706 132.68 L
163.923 133.508 L
164.14 134.345 L
164.357 135.19 L
164.574 136.043 L
164.791 136.906 L
165.008 137.776 L
165.225 138.656 L
165.442 139.544 L
165.659 140.441 L
165.876 141.347 L
166.093 142.262 L
166.31 143.185 L
166.527 144.117 L
166.744 145.059 L
166.961 146.009 L
167.178 146.967 L
167.395 147.935 L
167.612 148.912 L
167.829 149.897 L
168.046 150.892 L
168.263 151.895 L
168.48 152.908 L
168.697 153.929 L
168.914 154.959 L
169.131 155.998 L
169.348 157.046 L
169.565 158.102 L
169.782 159.168 L
169.999 160.242 L
170.216 161.325 L
170.433 162.417 L
170.65 163.517 L
170.867 164.626 L
171.084 165.744 L
171.301 166.871 L
171.518 168.006 L
171.735 169.149 L
171.952 170.301 L
172.169 171.461 L
172.386 172.629 L
172.603 173.806 L
172.82 174.991 L
173.037 176.184 L
173.254 177.385 L
173.471 178.593 L
173.688 179.81 L
173.905 181.034 L
174.122 182.266 L
174.339 183.505 L
174.556 184.752 L
174.773 186.006 L
174.99 187.268 L
175.207 188.536 L
175.424 189.811 L
175.641 191.093 L
175.858 192.382 L
176.075 193.677 L
176.292 194.978 L
176.509 196.286 L
176.726 197.6 L
176.943 198.919 L
177.16 200.245 L
177.377 201.576 L
177.594 202.912 L
177.811 204.253 L
178.028 205.6 L
178.245 206.951 L
178.462 208.307 L
178.679 209.667 L
178.896 211.032 L
179.113 212.401 L
179.33 213.773 L
179.547 215.149 L
179.764 216.528 L
179.981 217.911 L
180.198 219.296 L
180.415 220.684 L
180.632 222.075 L
180.849 223.468 L
181.066 224.862 L
181.283 226.259 L
181.5 227.657 L
181.717 229.056 L
181.934 230.456 L
182.151 231.857 L
182.368 233.258 L
182.585 234.66 L
182.802 236.061 L
183.019 237.462 L
183.236 238.863 L
183.453 240.262 L
183.67 241.661 L
183.887 243.058 L
184.104 244.453 L
184.321 245.846 L
184.538 247.237 L
184.755 248.626 L
184.972 250.011 L
185.189 251.394 L
185.406 252.773 L
185.623 254.148 L
185.84 255.519 L
186.057 256.886 L
186.274 258.249 L
186.491 259.607 L
186.708 260.959 L
186.925 262.306 L
187.142 263.647 L
187.359 264.983 L
187.576 266.311 L
187.793 267.634 L
188.01 268.949 L
188.227 270.257 L
188.444 271.558 L
188.661 272.851 L
188.878 274.136 L
189.095 275.412 L
189.312 276.68 L
189.529 277.939 L
189.746 279.188 L
189.963 280.428 L
190.18 281.657 L
190.397 282.877 L
190.614 284.086 L
190.831 285.284 L
191.048 286.471 L
191.265 287.646 L
191.482 288.809 L
191.699 289.96 L
191.916 291.099 L
192.133 292.224 L
192.35 293.337 L
192.567 294.436 L
192.784 295.52 L
193.001 296.591 L
193.218 297.647 L
193.435 298.689 L
193.652 299.715 L
193.869 300.726 L
194.086 301.721 L
194.303 302.701 L
194.52 303.665 L
194.737 304.613 L
194.954 305.546 L
195.171 306.462 L
195.388 307.362 L
195.605 308.247 L
195.822 309.116 L
196.039 309.97 L
196.256 310.809 L
196.473 311.633 L
196.69 312.443 L
196.907 313.239 L
197.124 314.021 L
197.341 314.789 L
197.558 315.545 L
197.775 316.288 L
197.992 317.02 L
198.209 317.739 L
198.426 318.447 L
198.643 319.143 L
198.86 319.829 L
199.077 320.505 L
199.294 321.17 L
199.511 321.826 L
199.728 322.472 L
199.945 323.108 L
200.162 323.736 L
200.379 324.354 L
200.596 324.964 L
200.813 325.565 L
201.03 326.158 L
201.247 326.743 L
201.464 327.32 L
201.681 327.889 L
201.898 328.45 L
202.115 329.003 L
202.332 329.549 L
202.549 330.088 L
202.766 330.619 L
202.983 331.144 L
203.2 331.661 L
203.417 332.171 L
203.634 332.656 L
203.851 333.081 L
204.068 333.5 L
204.285 333.914 L
204.502 334.323 L
204.719 334.726 L
204.936 335.124 L
205.153 335.517 L
205.37 335.905 L
205.587 336.288 L
205.804 336.666 L
206.021 337.039 L
206.238 337.408 L
206.455 337.771 L
206.672 338.131 L
206.889 338.485 L
207.106 338.836 L
207.323 339.181 L
207.54 339.523 L
207.757 339.86 L
207.974 340.193 L
208.191 340.522 L
208.408 340.847 L
208.625 341.168 L
208.842 341.484 L
209.059 341.797 L
209.276 342.106 L
209.493 342.412 L
209.71 342.713 L
209.927 343.011 L
210.144 343.305 L
210.361 343.596 L
210.578 343.883 L
210.795 344.167 L
211.012 344.447 L
211.229 344.724 L
211.446 344.998 L
211.663 345.268 L
211.88 345.535 L
212.097 345.799 L
212.314 346.06 L
212.531 346.318 L
212.748 346.573 L
212.965 346.825 L
213.182 347.074 L
213.399 347.32 L
213.616 347.563 L
213.833 347.803 L
214.05 348.041 L
214.267 348.276 L
214.484 348.508 L
214.701 348.738 L
214.918 348.965 L
215.135 349.19 L
215.352 349.412 L
215.569 349.632 L
215.786 349.849 L
216.003 350.064 L
216.22 350.277 L
216.437 350.487 L
216.654 350.695 L
216.871 350.901 L
217.088 351.104 L
217.305 351.301 L
217.522 351.477 L
217.739 351.653 L
217.956 351.827 L
218.173 352 L
218.39 352.171 L
218.607 352.341 L
218.824 352.511 L
219.041 352.678 L
219.258 352.845 L
219.475 353.011 L
219.692 353.175 L
219.909 353.338 L
220.126 353.5 L
220.343 353.661 L
220.56 353.821 L
220.777 353.979 L
220.994 354.137 L
221.211 354.293 L
221.428 354.449 L
221.645 354.603 L
221.862 354.756 L
222.079 354.909 L
222.296 355.06 L
222.513 355.21 L
222.73 355.359 L
222.947 355.507 L
223.164 355.654 L
223.381 355.8 L
223.598 355.945 L
223.815 356.089 L
224.032 356.233 L
224.249 356.375 L
224.466 356.516 L
224.683 356.656 L
224.9 356.796 L
225.117 356.934 L
225.334 357.072 L
225.551 357.208 L
225.768 357.344 L
225.985 357.479 L
226.202 357.613 L
226.419 357.746 L
226.636 357.878 L
226.853 358.01 L
227.07 358.14 L
227.287 358.27 L
227.504 358.399 L
227.721 358.527 L
227.938 358.654 L
228.155 358.781 L
228.372 358.906 L
228.589 359.031 L
228.806 359.155 L
229.023 359.278 L
229.24 359.4 L
229.457 359.522 L
229.674 359.643 L
229.891 359.763 L
230.108 359.882 L
230.325 360.001 L
230.542 360.118 L
230.759 360.235 L
230.976 360.352 L
231.193 360.467 L
231.41 360.582 L
231.627 360.696 L
231.844 360.809 L
232.061 360.922 L
232.278 361.034 L
232.495 361.145 L
232.712 361.256 L
232.929 361.366 L
233.146 361.475 L
233.363 361.583 L
233.58 361.691 L
233.797 361.798 L
234.014 361.904 L
234.231 362.01 L
234.448 362.115 L
234.665 362.219 L
234.882 362.323 L
235.099 362.426 L
235.316 362.528 L
235.533 362.63 L
235.75 362.731 L
235.967 362.831 L
236.184 362.931 L
236.401 363.03 L
236.618 363.129 L
236.835 363.226 L
237.052 363.324 L
237.269 363.42 L
237.486 363.516 L
237.703 363.611 L
237.92 363.706 L
238.137 363.8 L
238.354 363.893 L
238.571 363.986 L
238.788 364.079 L
239.005 364.17 L
239.222 364.261 L
239.439 364.352 L
239.656 364.441 L
239.873 364.531 L
240.09 364.619 L
240.307 364.707 L
240.524 364.795 L
240.741 364.881 L
240.958 364.968 L
241.175 365.053 L
241.392 365.138 L
241.609 365.223 L
241.826 365.307 L
242.043 365.39 L
242.26 365.473 L
242.477 365.555 L
242.694 365.637 L
242.911 365.718 L
243.128 365.798 L
243.345 365.878 L
243.562 365.957 L
243.779 366.036 L
243.996 366.114 L
244.213 366.192 L
244.43 366.269 L
244.647 366.346 L
244.864 366.422 L
245.081 366.497 L
245.298 366.572 L
245.515 366.646 L
245.732 366.72 L
245.949 366.793 L
246.166 366.866 L
246.383 366.938 L
246.6 367.01 L
246.817 367.081 L
247.034 367.151 L
247.251 367.221 L
247.468 367.291 L
247.685 367.36 L
247.902 367.428 L
248.119 367.496 L
248.336 367.563 L
248.553 367.63 L
248.77 367.697 L
248.987 367.762 L
249.204 367.828 L
249.421 367.892 L
249.638 367.957 L
249.855 368.02 L
250.072 368.084 L
250.289 368.146 L
250.506 368.209 L
250.723 368.27 L
250.94 368.331 L
251.157 368.392 L
251.374 368.452 L
251.591 368.512 L
251.808 368.571 L
252.025 368.63 L
252.242 368.688 L
252.459 368.746 L
252.676 368.803 L
252.893 368.86 L
253.11 368.916 L
253.327 368.972 L
253.544 369.027 L
253.761 369.082 L
253.978 369.136 L
254.195 369.19 L
254.412 369.244 L
254.629 369.297 L
254.846 369.349 L
255.063 369.401 L
255.28 369.452 L
255.497 369.503 L
255.714 369.553 L
255.931 369.603 L
256.148 369.653 L
256.365 369.702 L
256.582 369.75 L
256.799 369.798 L
257.016 369.846 L
257.233 369.893 L
257.45 369.94 L
257.667 369.986 L
257.884 370.032 L
258.101 370.078 L
258.318 370.123 L
258.535 370.168 L
258.752 370.212 L
258.969 370.256 L
259.186 370.299 L
259.403 370.342 L
259.62 370.385 L
259.837 370.427 L
260.054 370.468 L
260.271 370.51 L
260.488 370.551 L
260.705 370.591 L
260.922 370.632 L
261.139 370.671 L
261.356 370.711 L
261.573 370.75 L
261.79 370.788 L
262.007 370.827 L
262.224 370.864 L
262.441 370.902 L
262.658 370.939 L
262.875 370.976 L
263.092 371.012 L
263.309 371.048 L
263.526 371.083 L
263.743 371.119 L
263.96 371.154 L
264.177 371.188 L
264.394 371.222 L
264.611 371.256 L
264.828 371.29 L
265.045 371.323 L
265.262 371.355 L
265.479 371.388 L
265.696 371.42 L
265.913 371.452 L
266.13 371.483 L
266.347 371.514 L
266.564 371.545 L
266.781 371.575 L
266.998 371.605 L
267.215 371.635 L
267.432 371.665 L
267.649 371.694 L
267.866 371.723 L
268.083 371.751 L
268.3 371.779 L
268.517 371.807 L
268.734 371.835 L
268.951 371.862 L
269.168 371.889 L
269.385 371.916 L
269.602 371.942 L
269.819 371.968 L
270.036 371.994 L
270.253 372.02 L
270.47 372.045 L
270.687 372.07 L
270.904 372.094 L
271.121 372.119 L
271.338 372.143 L
271.555 372.167 L
271.772 372.19 L
271.989 372.214 L
272.206 372.237 L
272.423 372.26 L
272.64 372.282 L
272.857 372.304 L
273.074 372.326 L
273.291 372.348 L
273.508 372.37 L
273.725 372.391 L
273.942 372.412 L
274.159 372.433 L
274.376 372.453 L
274.593 372.474 L
274.81 372.494 L
275.027 372.514 L
275.244 372.533 L
275.461 372.552 L
275.678 372.572 L
275.895 372.591 L
276.112 372.609 L
276.329 372.628 L
276.546 372.646 L
276.763 372.664 L
276.98 372.682 L
277.197 372.7 L
277.414 372.717 L
277.631 372.734 L
277.848 372.751 L
278.065 372.768 L
278.282 372.785 L
278.499 372.801 L
278.716 372.817 L
278.933 372.833 L
279.15 372.849 L
279.367 372.865 L
279.584 372.88 L
279.801 372.895 L
280.018 372.91 L
280.235 372.925 L
280.452 372.94 L
280.669 372.954 L
280.886 372.969 L
281.103 372.983 L
281.32 372.997 L
281.537 373.011 L
281.754 373.024 L
281.971 373.038 L
282.188 373.051 L
282.405 373.064 L
282.622 373.077 L
282.839 373.09 L
283.056 373.103 L
283.273 373.115 L
283.49 373.128 L
283.707 373.14 L
283.924 373.152 L
284.141 373.164 L
284.358 373.176 L
284.575 373.187 L
284.792 373.199 L
285.009 373.21 L
285.226 373.221 L
285.443 373.232 L
285.66 373.243 L
285.877 373.254 L
286.094 373.265 L
286.311 373.275 L
286.528 373.286 L
286.745 373.296 L
286.962 373.306 L
287.179 373.316 L
287.396 373.326 L
287.613 373.335 L
287.83 373.345 L
288.047 373.354 L
288.264 373.364 L
288.481 373.373 L
288.698 373.382 L
288.915 373.391 L
289.132 373.4 L
289.349 373.409 L
289.566 373.418 L
289.783 373.426 L
290 373.434 L
290.217 373.443 L
290.434 373.451 L
290.651 373.459 L
290.868 373.467 L
291.085 373.475 L
291.302 373.483 L
291.519 373.49 L
291.736 373.498 L
291.953 373.506 L
292.17 373.513 L
292.387 373.52 L
292.604 373.527 L
292.821 373.535 L
293.038 373.542 L
293.255 373.548 L
293.472 373.555 L
293.689 373.562 L
293.906 373.569 L
294.123 373.575 L
294.34 373.582 L
294.557 373.588 L
294.774 373.594 L
294.991 373.601 L
295.208 373.607 L
295.425 373.613 L
295.642 373.619 L
295.859 373.625 L
296.076 373.63 L
296.293 373.636 L
296.51 373.642 L
296.727 373.647 L
296.944 373.653 L
297.161 373.658 L
297.378 373.663 L
297.595 373.669 L
297.812 373.674 L
298.029 373.679 L
298.246 373.684 L
298.463 373.689 L
298.68 373.694 L
298.897 373.699 L
299.114 373.704 L
299.331 373.708 L
299.548 373.713 L
299.765 373.717 L
299.982 373.722 L
300.199 373.726 L
300.416 373.731 L
300.633 373.735 L
300.85 373.739 L
301.067 373.744 L
301.284 373.748 L
301.501 373.752 L
301.718 373.756 L
301.935 373.76 L
302.152 373.764 L
302.369 373.768 L
302.586 373.771 L
302.803 373.775 L
303.02 373.779 L
303.237 373.782 L
303.454 373.786 L
303.671 373.789 L
303.888 373.793 L
304.105 373.796 L
304.322 373.8 L
304.539 373.803 L
304.756 373.806 L
304.973 373.81 L
305.19 373.813 L
305.407 373.816 L
305.624 373.819 L
305.841 373.822 L
306.058 373.825 L
306.275 373.828 L
306.492 373.831 L
306.709 373.834 L
306.926 373.836 L
307.143 373.839 L
307.36 373.842 L
307.577 373.845 L
307.794 373.847 L
308.011 373.85 L
308.228 373.852 L
308.445 373.855 L
308.662 373.857 L
308.879 373.86 L
309.096 373.862 L
309.313 373.865 L
309.53 373.867 L
309.747 373.869 L
309.964 373.872 L
310.181 373.874 L
310.398 373.876 L
310.615 373.878 L
310.832 373.88 L
311.049 373.882 L
311.266 373.884 L
311.483 373.886 L
311.7 373.888 L
311.917 373.89 L
312.134 373.892 L
312.351 373.894 L
312.568 373.896 L
312.785 373.898 L
313.002 373.9 L
313.219 373.902 L
313.436 373.903 L
313.653 373.905 L
313.87 373.907 L
314.087 373.908 L
314.304 373.91 L
314.521 373.912 L
314.738 373.913 L
314.955 373.915 L
315.172 373.916 L
315.389 373.918 L
315.606 373.919 L
315.823 373.921 L
316.04 373.922 L
316.257 373.924 L
316.474 373.925 L
316.691 373.926 L
316.908 373.928 L
317.125 373.929 L
317.342 373.93 L
317.559 373.932 L
317.776 373.933 L
317.993 373.934 L
318.21 373.935 L
318.427 373.936 L
318.644 373.938 L
318.861 373.939 L
319.078 373.94 L
319.295 373.941 L
319.512 373.942 L
319.729 373.943 L
319.946 373.944 L
320.163 373.945 L
320.38 373.946 L
320.597 373.947 L
320.814 373.948 L
321.031 373.949 L
321.248 373.95 L
321.465 373.951 L
321.682 373.952 L
321.899 373.953 L
322.116 373.954 L
322.333 373.955 L
322.55 373.956 L
322.767 373.956 L
322.984 373.957 L
323.201 373.958 L
323.418 373.959 L
323.635 373.96 L
323.852 373.96 L
324.069 373.961 L
324.286 373.962 L
324.503 373.963 L
324.72 373.963 L
324.937 373.964 L
325.154 373.965 L
325.371 373.965 L
325.588 373.966 L
325.805 373.967 L
326.022 373.967 L
326.239 373.968 L
326.456 373.969 L
326.673 373.969 L
326.89 373.97 L
327.107 373.97 L
327.324 373.971 L
327.541 373.971 L
327.758 373.972 L
327.975 373.973 L
328.192 373.973 L
328.409 373.974 L
328.626 373.974 L
328.843 373.975 L
329.06 373.975 L
329.277 373.976 L
329.494 373.976 L
329.711 373.977 L
329.928 373.977 L
330.145 373.977 L
330.362 373.978 L
330.579 373.978 L
330.796 373.979 L
331.013 373.979 L
331.23 373.98 L
331.447 373.98 L
331.664 373.98 L
331.881 373.981 L
332.098 373.981 L
332.315 373.982 L
332.532 373.982 L
332.749 373.982 L
332.966 373.983 L
333.183 373.983 L
333.4 373.983 L
333.617 373.984 L
333.834 373.984 L
334.051 373.984 L
334.268 373.985 L
334.485 373.985 L
334.702 373.985 L
334.919 373.985 L
335.136 373.986 L
335.353 373.986 L
335.57 373.986 L
335.787 373.987 L
336.004 373.987 L
336.221 373.987 L
336.438 373.987 L
336.655 373.988 L
336.872 373.988 L
337.089 373.988 L
337.306 373.988 L
337.523 373.989 L
337.74 373.989 L
337.957 373.989 L
338.174 373.989 L
338.391 373.99 L
338.608 373.99 L
338.825 373.99 L
339.042 373.99 L
339.259 373.99 L
339.476 373.991 L
339.693 373.991 L
339.91 373.991 L
340.127 373.991 L
340.344 373.991 L
340.561 373.991 L
340.778 373.992 L
340.995 373.992 L
341.212 373.992 L
341.429 373.992 L
341.646 373.992 L
341.863 373.992 L
342.08 373.993 L
342.297 373.993 L
342.514 373.993 L
342.731 373.993 L
342.948 373.993 L
343.165 373.993 L
343.382 373.993 L
343.599 373.994 L
343.816 373.994 L
344.033 373.994 L
344.25 373.994 L
344.467 373.994 L
344.684 373.994 L
344.901 373.994 L
345.118 373.994 L
345.335 373.995 L
345.552 373.995 L
345.769 373.995 L
345.986 373.995 L
346.203 373.995 L
346.42 373.995 L
346.637 373.995 L
346.854 373.995 L
347.071 373.995 L
347.288 373.996 L
347.505 373.996 L
347.722 373.996 L
347.939 373.996 L
348.156 373.996 L
348.373 373.996 L
348.59 373.996 L
348.807 373.996 L
349.024 373.996 L
349.241 373.996 L
349.458 373.996 L
349.675 373.996 L
349.892 373.997 L
350.109 373.997 L
350.326 373.997 L
350.543 373.997 L
350.76 373.997 L
350.977 373.997 L
351.194 373.997 L
351.411 373.997 L
351.628 373.997 L
351.845 373.997 L
352.062 373.997 L
352.279 373.997 L
352.496 373.997 L
352.713 373.997 L
352.93 373.997 L
353.147 373.997 L
353.364 373.998 L
353.581 373.998 L
353.798 373.998 L
354.015 373.998 L
354.232 373.998 L
354.449 373.998 L
354.666 373.998 L
354.883 373.998 L
355.1 373.998 L
355.317 373.998 L
355.534 373.998 L
355.751 373.998 L
355.968 373.998 L
356.185 373.998 L
356.402 373.998 L
356.619 373.998 L
356.836 373.998 L
357.053 373.998 L
357.27 373.998 L
357.487 373.998 L
357.704 373.998 L
357.921 373.998 L
358.138 373.998 L
358.355 373.999 L
358.572 373.999 L
358.789 373.999 L
359.006 373.999 L
359.223 373.999 L
359.44 373.999 L
359.657 373.999 L
359.874 373.999 L
360.091 373.999 L
360.308 373.999 L
360.525 373.999 L
360.742 373.999 L
360.959 373.999 L
361.176 373.999 L
361.393 373.999 L
361.61 373.999 L
361.827 373.999 L
362.044 373.999 L
362.261 373.999 L
362.478 373.999 L
362.695 373.999 L
362.912 373.999 L
363.129 373.999 L
363.346 373.999 L
363.563 373.999 L
363.78 373.999 L
363.997 373.999 L
364.214 373.999 L
364.431 373.999 L
364.648 373.999 L
364.865 373.999 L
365.082 373.999 L
365.299 373.999 L
365.516 373.999 L
365.733 373.999 L
365.95 373.999 L
366.167 373.999 L
366.384 373.999 L
366.601 373.999 L
366.818 373.999 L
367.035 373.999 L
367.252 373.999 L
367.469 373.999 L
367.686 373.999 L
367.903 373.999 L
368.12 373.999 L
368.337 373.999 L
368.554 373.999 L
368.771 373.999 L
368.988 374 L
369.205 374 L
369.422 374 L
369.639 374 L
369.856 374 L
370.073 374 L
370.29 374 L
370.507 374 L
370.724 374 L
370.941 374 L
371.158 374 L
371.375 374 L
371.592 374 L
371.809 374 L
372.026 374 L
372.243 374 L
372.46 374 L
372.677 374 L
372.894 374 L
373.111 374 L
373.328 374 L
373.545 374 L
373.762 374 L
373.979 374 L
374.196 374 L
374.413 374 L
374.63 374 L
374.847 374 L
375.064 374 L
375.281 374 L
375.498 374 L
375.715 374 L
375.932 374 L
376.149 374 L
376.366 374 L
376.583 374 L
376.8 374 L
377.017 374 L
377.234 374 L
377.451 374 L
377.668 374 L
377.885 374 L
378.102 374 L
378.319 374 L
378.536 374 L
378.753 374 L
378.97 374 L
379.187 374 L
379.404 374 L
379.621 374 L
379.838 374 L
380.055 374 L
380.272 374 L
380.489 374 L
380.706 374 L
380.923 374 L
381.14 374 L
381.357 374 L
381.574 374 L
381.791 374 L
382.008 374 L
382.225 374 L
382.442 374 L
382.659 374 L
382.876 374 L
383.093 374 L
383.31 374 L
383.527 374 L
383.744 374 L
383.961 374 L
384.178 374 L
384.395 374 L
384.612 374 L
384.829 374 L
385.046 374 L
385.263 374 L
385.48 374 L
385.697 374 L
385.914 374 L
386.131 374 L
386.348 374 L
386.565 374 L
386.782 374 L
386.999 374 L
387.216 374 L
387.433 374 L
387.65 374 L
387.867 374 L
388.084 374 L
388.301 374 L
388.518 374 L
388.735 374 L
388.952 374 L
389.169 374 L
389.386 374 L
389.603 374 L
389.82 374 L
390.037 374 L
390.254 374 L
390.471 374 L
390.688 374 L
390.905 374 L
391.122 374 L
391.339 374 L
391.556 374 L
391.773 374 L
391.99 374 L
392.207 374 L
392.424 374 L
392.641 374 L
392.858 374 L
393.075 374 L
393.292 374 L
393.509 374 L
393.726 374 L
393.943 374 L
394.16 374 L
394.377 374 L
394.594 374 L
394.811 374 L
395.028 374 L
395.245 374 L
395.462 374 L
395.679 374 L
395.896 374 L
396.113 374 L
396.33 374 L
396.547 374 L
396.764 374 L
396.981 374 L
397.198 374 L
397.415 374 L
397.632 374 L
397.849 374 L
398.066 374 L
398.283 374 L
398.5 374 L
398.717 374 L
398.934 374 L
399.151 374 L
399.368 374 L
399.585 374 L
399.802 374 L
400.019 374 L
400.236 374 L
400.453 374 L
400.67 374 L
400.887 374 L
401.104 374 L
401.321 374 L
401.538 374 L
401.755 374 L
401.972 374 L
402.189 374 L
402.406 374 L
402.623 374 L
402.84 374 L
403.057 374 L
403.274 374 L
403.491 374 L
403.708 374 L
403.925 374 L
404.142 374 L
404.359 374 L
404.576 374 L
404.793 374 L
405.01 374 L
405.227 374 L
405.444 374 L
405.661 374 L
405.878 374 L
406.095 374 L
406.312 374 L
406.529 374 L
406.746 374 L
406.963 374 L
407.18 374 L
407.397 374 L
407.614 374 L
407.831 374 L
408.048 374 L
408.265 374 L
408.482 374 L
408.699 374 L
408.916 374 L
409.133 374 L
409.35 374 L
409.567 374 L
409.784 374 L
410.001 374 L
410.218 374 L
410.435 374 L
410.652 374 L
410.869 374 L
411.086 374 L
411.303 374 L
411.52 374 L
411.737 374 L
411.954 374 L
412.171 374 L
412.388 374 L
412.605 374 L
412.822 374 L
413.039 374 L
413.256 374 L
413.473 374 L
413.69 374 L
413.907 374 L
414.124 374 L
414.341 374 L
414.558 374 L
414.775 374 L
414.992 374 L
415.209 374 L
415.426 374 L
415.643 374 L
415.86 374 L
416.077 374 L
416.294 374 L
416.511 374 L
416.728 374 L
416.945 374 L
417.162 374 L
417.379 374 L
417.596 374 L
417.813 374 L
418.03 374 L
418.247 374 L
418.464 374 L
418.681 374 L
418.898 374 L
419.115 374 L
419.332 374 L
419.549 374 L
419.766 374 L
419.983 374 L
420.2 374 L
420.417 374 L
420.634 374 L
420.851 374 L
421.068 374 L
421.285 374 L
421.502 374 L
421.719 374 L
421.936 374 L
422.153 374 L
422.37 374 L
422.587 374 L
422.804 374 L
423.021 374 L
423.238 374 L
423.455 374 L
423.672 374 L
423.889 374 L
424.106 374 L
424.323 374 L
424.54 374 L
424.757 374 L
424.974 374 L
425.191 374 L
425.408 374 L
425.625 374 L
425.842 374 L
426.059 374 L
426.276 374 L
426.493 374 L
426.71 374 L
426.927 374 L
427.144 374 L
427.361 374 L
427.578 374 L
427.795 374 L
428.012 374 L
428.229 374 L
428.446 374 L
428.663 374 L
428.88 374 L
429.097 374 L
429.314 374 L
429.531 374 L
429.748 374 L
429.965 374 L
430.182 374 L
430.399 374 L
430.616 374 L
430.833 374 L
431.05 374 L
431.267 374 L
431.484 374 L
431.701 374 L
431.918 374 L
432.135 374 L
432.352 374 L
432.569 374 L
432.786 374 L
433.003 374 L
433.22 374 L
433.437 374 L
433.654 374 L
433.871 374 L
434.088 374 L
434.305 374 L
434.522 374 L
434.739 374 L
434.956 374 L
435.173 374 L
435.39 374 L
435.607 374 L
435.824 374 L
436.041 374 L
436.258 374 L
436.475 374 L
436.692 374 L
436.909 374 L
437.126 374 L
437.343 374 L
437.56 374 L
437.777 374 L
437.994 374 L
438.211 374 L
438.428 374 L
438.645 374 L
438.862 374 L
439.079 374 L
439.296 374 L
439.513 374 L
439.73 374 L
439.947 374 L
440.164 374 L
440.381 374 L
440.598 374 L
440.815 374 L
441.032 374 L
441.249 374 L
441.466 374 L
441.683 374 L
441.9 374 L
442.117 374 L
442.334 374 L
442.551 374 L
442.768 374 L
442.985 374 L
443.202 374 L
443.419 374 L
443.636 374 L
443.853 374 L
444.07 374 L
444.287 374 L
444.504 374 L
444.721 374 L
444.938 374 L
445.155 374 L
445.372 374 L
445.589 374 L
445.806 374 L
446.023 374 L
446.24 374 L
446.457 374 L
446.674 374 L
446.891 374 L
447.108 374 L
447.325 374 L
447.542 374 L
447.759 374 L
447.976 374 L
448.193 374 L
448.41 374 L
448.627 374 L
448.844 374 L
449.061 374 L
449.278 374 L
449.495 374 L
449.712 374 L
449.929 374 L
450.146 374 L
450.363 374 L
450.58 374 L
450.797 374 L
451.014 374 L
451.231 374 L
451.448 374 L
451.665 374 L
451.882 374 L
452.099 374 L
452.316 374 L
452.533 374 L
452.75 374 L
452.967 374 L
453.184 374 L
453.401 374 L
453.618 374 L
453.835 374 L
454.052 374 L
454.269 374 L
454.486 374 L
454.703 374 L
454.92 374 L
455.137 374 L
455.354 374 L
455.571 374 L
455.788 374 L
456.005 374 L
456.222 374 L
456.439 374 L
456.656 374 L
456.873 374 L
457.09 374 L
457.307 374 L
457.524 374 L
457.741 374 L
457.958 374 L
458.175 374 L
458.392 374 L
458.609 374 L
458.826 374 L
459.043 374 L
459.26 374 L
459.477 374 L
459.694 374 L
459.911 374 L
460.128 374 L
460.345 374 L
460.562 374 L
460.779 374 L
460.996 374 L
461.213 374 L
461.43 374 L
461.647 374 L
461.864 374 L
462.081 374 L
462.298 374 L
462.515 374 L
462.732 374 L
462.949 374 L
463.166 374 L
463.383 374 L
463.6 374 L
463.817 374 L
464.034 374 L
464.251 374 L
464.468 374 L
464.685 374 L
464.902 374 L
465.119 374 L
465.336 374 L
465.553 374 L
465.77 374 L
465.987 374 L
466.204 374 L
466.421 374 L
466.638 374 L
466.855 374 L
467.072 374 L
467.289 374 L
467.506 374 L
467.723 374 L
467.94 374 L
468.157 374 L
468.374 374 L
468.591 374 L
468.808 374 L
469.025 374 L
469.242 374 L
469.459 374 L
469.676 374 L
469.893 374 L
470.11 374 L
470.327 374 L
470.544 374 L
470.761 374 L
470.978 374 L
471.195 374 L
471.412 374 L
471.629 374 L
471.846 374 L
472.063 374 L
472.28 374 L
472.497 374 L
472.714 374 L
472.931 374 L
473.148 374 L
473.365 374 L
473.582 374 L
473.799 374 L
474.016 374 L
474.233 374 L
474.45 374 L
474.667 374 L
474.884 374 L
475.101 374 L
475.318 374 L
475.535 374 L
475.752 374 L
475.969 374 L
476.186 374 L
476.403 374 L
476.62 374 L
476.837 374 L
477.054 374 L
477.271 374 L
477.488 374 L
477.705 374 L
477.922 374 L
478.139 374 L
478.356 374 L
478.573 374 L
478.79 374 L
479.007 374 L
479.224 374 L
479.441 374 L
479.658 374 L
479.875 374 L
480.092 374 L
480.309 374 L
480.526 374 L
480.743 374 L
480.96 374 L
481.177 374 L
481.394 374 L
481.611 374 L
481.828 374 L
482.045 374 L
482.262 374 L
482.479 374 L
482.696 374 L
482.913 374 L
483.13 374 L
483.347 374 L
483.564 374 L
483.781 374 L
483.998 374 L
484.215 374 L
484.432 374 L
484.649 374 L
484.866 374 L
485.083 374 L
485.3 374 L
485.517 374 L
485.734 374 L
485.951 374 L
486.168 374 L
486.385 374 L
486.602 374 L
486.819 374 L
487.036 374 L
487.253 374 L
487.47 374 L
487.687 374 L
487.904 374 L
488.121 374 L
488.338 374 L
488.555 374 L
488.772 374 L
488.989 374 L
489.206 374 L
489.423 374 L
489.64 374 L
489.857 374 L
490.074 374 L
490.291 374 L
490.508 374 L
490.725 374 L
490.942 374 L
491.159 374 L
491.376 374 L
491.593 374 L
491.81 374 L
492.027 374 L
492.244 374 L
492.461 374 L
492.678 374 L
492.895 374 L
493.112 374 L
493.329 374 L
493.546 374 L
493.763 374 L
493.98 374 L
494.197 374 L
494.414 374 L
494.631 374 L
494.848 374 L
495.065 374 L
495.282 374 L
495.499 374 L
495.716 374 L
495.933 374 L
496.15 374 L
496.367 374 L
496.584 374 L
496.801 374 L
497.018 374 L
497.235 374 L
497.452 374 L
497.669 374 L
497.886 374 L
498.103 374 L
498.32 374 L
498.537 374 L
498.754 374 L
498.971 374 L
499.188 374 L
499.405 374 L
499.622 374 L
499.839 374 L
500.056 374 L
500.273 374 L
500.49 374 L
500.707 374 L
500.924 374 L
501.141 374 L
501.358 374 L
501.575 374 L
501.792 374 L
502.009 374 L
502.226 374 L
502.443 374 L
502.66 374 L
502.877 374 L
503.094 374 L
503.311 374 L
503.528 374 L
503.745 374 L
503.962 374 L
504.179 374 L
504.396 374 L
504.613 374 L
504.83 374 L
505.047 374 L
505.264 374 L
505.481 374 L
505.698 374 L
505.915 374 L
506.132 374 L
506.349 374 L
506.566 374 L
506.783 374 L
507 374 L
S
GR
%%Trailer
%%Pages: 1
%%EOF
