%!PS-Adobe-3.0 EPSF-3.0
%%Creator: (MATLAB, The Mathworks, Inc. Version 9.1.0.441655 \(R2016b\). Operating System: Windows 7)
%%Title: C:/Users/June/Documents/GitKraken/rls-2017/sp6/figures/w1s_v2.eps
%%CreationDate: 2018-03-04T19:55:30
%%Pages: (atend)
%%BoundingBox: 0 0 420 315
%%LanguageLevel: 3
%%EndComments
%%BeginProlog
%%BeginResource: procset (Apache XML Graphics Std ProcSet) 1.2 0
%%Version: 1.2 0
%%Copyright: (Copyright 2001-2003,2010 The Apache Software Foundation. License terms: http://www.apache.org/licenses/LICENSE-2.0)
/bd{bind def}bind def
/ld{load def}bd
/GR/grestore ld
/M/moveto ld
/LJ/setlinejoin ld
/C/curveto ld
/f/fill ld
/LW/setlinewidth ld
/GC/setgray ld
/t/show ld
/N/newpath ld
/CT/concat ld
/cp/closepath ld
/S/stroke ld
/L/lineto ld
/CC/setcmykcolor ld
/A/ashow ld
/GS/gsave ld
/RC/setrgbcolor ld
/RM/rmoveto ld
/ML/setmiterlimit ld
/re {4 2 roll M
1 index 0 rlineto
0 exch rlineto
neg 0 rlineto
cp } bd
/_ctm matrix def
/_tm matrix def
/BT { _ctm currentmatrix pop matrix _tm copy pop 0 0 moveto } bd
/ET { _ctm setmatrix } bd
/iTm { _ctm setmatrix _tm concat } bd
/Tm { _tm astore pop iTm 0 0 moveto } bd
/ux 0.0 def
/uy 0.0 def
/F {
  /Tp exch def
  /Tf exch def
  Tf findfont Tp scalefont setfont
  /cf Tf def  /cs Tp def
} bd
/ULS {currentpoint /uy exch def /ux exch def} bd
/ULE {
  /Tcx currentpoint pop def
  gsave
  newpath
  cf findfont cs scalefont dup
  /FontMatrix get 0 get /Ts exch def /FontInfo get dup
  /UnderlinePosition get Ts mul /To exch def
  /UnderlineThickness get Ts mul /Tt exch def
  ux uy To add moveto  Tcx uy To add lineto
  Tt setlinewidth stroke
  grestore
} bd
/OLE {
  /Tcx currentpoint pop def
  gsave
  newpath
  cf findfont cs scalefont dup
  /FontMatrix get 0 get /Ts exch def /FontInfo get dup
  /UnderlinePosition get Ts mul /To exch def
  /UnderlineThickness get Ts mul /Tt exch def
  ux uy To add cs add moveto Tcx uy To add cs add lineto
  Tt setlinewidth stroke
  grestore
} bd
/SOE {
  /Tcx currentpoint pop def
  gsave
  newpath
  cf findfont cs scalefont dup
  /FontMatrix get 0 get /Ts exch def /FontInfo get dup
  /UnderlinePosition get Ts mul /To exch def
  /UnderlineThickness get Ts mul /Tt exch def
  ux uy To add cs 10 mul 26 idiv add moveto Tcx uy To add cs 10 mul 26 idiv add lineto
  Tt setlinewidth stroke
  grestore
} bd
/QT {
/Y22 exch store
/X22 exch store
/Y21 exch store
/X21 exch store
currentpoint
/Y21 load 2 mul add 3 div exch
/X21 load 2 mul add 3 div exch
/X21 load 2 mul /X22 load add 3 div
/Y21 load 2 mul /Y22 load add 3 div
/X22 load /Y22 load curveto
} bd
/SSPD {
dup length /d exch dict def
{
/v exch def
/k exch def
currentpagedevice k known {
/cpdv currentpagedevice k get def
v cpdv ne {
/upd false def
/nullv v type /nulltype eq def
/nullcpdv cpdv type /nulltype eq def
nullv nullcpdv or
{
/upd true def
} {
/sametype v type cpdv type eq def
sametype {
v type /arraytype eq {
/vlen v length def
/cpdvlen cpdv length def
vlen cpdvlen eq {
0 1 vlen 1 sub {
/i exch def
/obj v i get def
/cpdobj cpdv i get def
obj cpdobj ne {
/upd true def
exit
} if
} for
} {
/upd true def
} ifelse
} {
v type /dicttype eq {
v {
/dv exch def
/dk exch def
/cpddv cpdv dk get def
dv cpddv ne {
/upd true def
exit
} if
} forall
} {
/upd true def
} ifelse
} ifelse
} if
} ifelse
upd true eq {
d k v put
} if
} if
} if
} forall
d length 0 gt {
d setpagedevice
} if
} bd
/RE { % /NewFontName [NewEncodingArray] /FontName RE -
  findfont dup length dict begin
  {
    1 index /FID ne
    {def} {pop pop} ifelse
  } forall
  /Encoding exch def
  /FontName 1 index def
  currentdict definefont pop
  end
} bind def
%%EndResource
%%BeginResource: procset (Apache XML Graphics EPS ProcSet) 1.0 0
%%Version: 1.0 0
%%Copyright: (Copyright 2002-2003 The Apache Software Foundation. License terms: http://www.apache.org/licenses/LICENSE-2.0)
/BeginEPSF { %def
/b4_Inc_state save def         % Save state for cleanup
/dict_count countdictstack def % Count objects on dict stack
/op_count count 1 sub def      % Count objects on operand stack
userdict begin                 % Push userdict on dict stack
/showpage { } def              % Redefine showpage, { } = null proc
0 setgray 0 setlinecap         % Prepare graphics state
1 setlinewidth 0 setlinejoin
10 setmiterlimit [ ] 0 setdash newpath
/languagelevel where           % If level not equal to 1 then
{pop languagelevel             % set strokeadjust and
1 ne                           % overprint to their defaults.
{false setstrokeadjust false setoverprint
} if
} if
} bd
/EndEPSF { %def
count op_count sub {pop} repeat            % Clean up stacks
countdictstack dict_count sub {end} repeat
b4_Inc_state restore
} bd
%%EndResource
%FOPBeginFontDict
%%IncludeResource: font Courier-Bold
%%IncludeResource: font Helvetica
%%IncludeResource: font Courier-BoldOblique
%%IncludeResource: font Courier-Oblique
%%IncludeResource: font Times-Roman
%%IncludeResource: font Helvetica-BoldOblique
%%IncludeResource: font Helvetica-Bold
%%IncludeResource: font Helvetica-Oblique
%%IncludeResource: font Times-BoldItalic
%%IncludeResource: font Courier
%%IncludeResource: font Times-Italic
%%IncludeResource: font Times-Bold
%%IncludeResource: font Symbol
%%IncludeResource: font ZapfDingbats
%FOPEndFontDict
%%BeginResource: encoding WinAnsiEncoding
/WinAnsiEncoding [
/.notdef /.notdef /.notdef /.notdef /.notdef
/.notdef /.notdef /.notdef /.notdef /.notdef
/.notdef /.notdef /.notdef /.notdef /.notdef
/.notdef /.notdef /.notdef /.notdef /.notdef
/.notdef /.notdef /.notdef /.notdef /.notdef
/.notdef /.notdef /.notdef /.notdef /.notdef
/.notdef /.notdef /space /exclam /quotedbl
/numbersign /dollar /percent /ampersand /quotesingle
/parenleft /parenright /asterisk /plus /comma
/hyphen /period /slash /zero /one
/two /three /four /five /six
/seven /eight /nine /colon /semicolon
/less /equal /greater /question /at
/A /B /C /D /E
/F /G /H /I /J
/K /L /M /N /O
/P /Q /R /S /T
/U /V /W /X /Y
/Z /bracketleft /backslash /bracketright /asciicircum
/underscore /quoteleft /a /b /c
/d /e /f /g /h
/i /j /k /l /m
/n /o /p /q /r
/s /t /u /v /w
/x /y /z /braceleft /bar
/braceright /asciitilde /bullet /Euro /bullet
/quotesinglbase /florin /quotedblbase /ellipsis /dagger
/daggerdbl /circumflex /perthousand /Scaron /guilsinglleft
/OE /bullet /Zcaron /bullet /bullet
/quoteleft /quoteright /quotedblleft /quotedblright /bullet
/endash /emdash /asciitilde /trademark /scaron
/guilsinglright /oe /bullet /zcaron /Ydieresis
/space /exclamdown /cent /sterling /currency
/yen /brokenbar /section /dieresis /copyright
/ordfeminine /guillemotleft /logicalnot /sfthyphen /registered
/macron /degree /plusminus /twosuperior /threesuperior
/acute /mu /paragraph /middot /cedilla
/onesuperior /ordmasculine /guillemotright /onequarter /onehalf
/threequarters /questiondown /Agrave /Aacute /Acircumflex
/Atilde /Adieresis /Aring /AE /Ccedilla
/Egrave /Eacute /Ecircumflex /Edieresis /Igrave
/Iacute /Icircumflex /Idieresis /Eth /Ntilde
/Ograve /Oacute /Ocircumflex /Otilde /Odieresis
/multiply /Oslash /Ugrave /Uacute /Ucircumflex
/Udieresis /Yacute /Thorn /germandbls /agrave
/aacute /acircumflex /atilde /adieresis /aring
/ae /ccedilla /egrave /eacute /ecircumflex
/edieresis /igrave /iacute /icircumflex /idieresis
/eth /ntilde /ograve /oacute /ocircumflex
/otilde /odieresis /divide /oslash /ugrave
/uacute /ucircumflex /udieresis /yacute /thorn
/ydieresis
] def
%%EndResource
%FOPBeginFontReencode
/Courier-Bold findfont
dup length dict begin
  {1 index /FID ne {def} {pop pop} ifelse} forall
  /Encoding WinAnsiEncoding def
  currentdict
end
/Courier-Bold exch definefont pop
/Helvetica findfont
dup length dict begin
  {1 index /FID ne {def} {pop pop} ifelse} forall
  /Encoding WinAnsiEncoding def
  currentdict
end
/Helvetica exch definefont pop
/Courier-BoldOblique findfont
dup length dict begin
  {1 index /FID ne {def} {pop pop} ifelse} forall
  /Encoding WinAnsiEncoding def
  currentdict
end
/Courier-BoldOblique exch definefont pop
/Courier-Oblique findfont
dup length dict begin
  {1 index /FID ne {def} {pop pop} ifelse} forall
  /Encoding WinAnsiEncoding def
  currentdict
end
/Courier-Oblique exch definefont pop
/Times-Roman findfont
dup length dict begin
  {1 index /FID ne {def} {pop pop} ifelse} forall
  /Encoding WinAnsiEncoding def
  currentdict
end
/Times-Roman exch definefont pop
/Helvetica-BoldOblique findfont
dup length dict begin
  {1 index /FID ne {def} {pop pop} ifelse} forall
  /Encoding WinAnsiEncoding def
  currentdict
end
/Helvetica-BoldOblique exch definefont pop
/Helvetica-Bold findfont
dup length dict begin
  {1 index /FID ne {def} {pop pop} ifelse} forall
  /Encoding WinAnsiEncoding def
  currentdict
end
/Helvetica-Bold exch definefont pop
/Helvetica-Oblique findfont
dup length dict begin
  {1 index /FID ne {def} {pop pop} ifelse} forall
  /Encoding WinAnsiEncoding def
  currentdict
end
/Helvetica-Oblique exch definefont pop
/Times-BoldItalic findfont
dup length dict begin
  {1 index /FID ne {def} {pop pop} ifelse} forall
  /Encoding WinAnsiEncoding def
  currentdict
end
/Times-BoldItalic exch definefont pop
/Courier findfont
dup length dict begin
  {1 index /FID ne {def} {pop pop} ifelse} forall
  /Encoding WinAnsiEncoding def
  currentdict
end
/Courier exch definefont pop
/Times-Italic findfont
dup length dict begin
  {1 index /FID ne {def} {pop pop} ifelse} forall
  /Encoding WinAnsiEncoding def
  currentdict
end
/Times-Italic exch definefont pop
/Times-Bold findfont
dup length dict begin
  {1 index /FID ne {def} {pop pop} ifelse} forall
  /Encoding WinAnsiEncoding def
  currentdict
end
/Times-Bold exch definefont pop
%FOPEndFontReencode
%%EndProlog
%%Page: 1 1
%%PageBoundingBox: 0 0 420 315
%%BeginPageSetup
[1 0 0 -1 0 315] CT
%%EndPageSetup
GS
[0.75 0 0 0.75 0 0] CT
1 GC
N
0 0 560 420 re
f
GR
GS
[0.75 0 0 0.75 0 0] CT
1 GC
N
0 0 560 420 re
f
GR
GS
[0.75 0 0 0.75 0 0] CT
1 GC
N
85 374 M
507 374 L
507 51 L
85 51 L
cp
f
GR
GS
[0.75 0 0 0.75 0 0] CT
0.849 GC
[1 3] 0 setdash
2 LJ
0.667 LW
N
97.703 374 M
97.703 51 L
S
GR
GS
[0.75 0 0 0.75 0 0] CT
0.849 GC
[1 3] 0 setdash
2 LJ
0.667 LW
N
105.135 374 M
105.135 51 L
S
GR
GS
[0.75 0 0 0.75 0 0] CT
0.849 GC
[1 3] 0 setdash
2 LJ
0.667 LW
N
110.407 374 M
110.407 51 L
S
GR
GS
[0.75 0 0 0.75 0 0] CT
0.849 GC
[1 3] 0 setdash
2 LJ
0.667 LW
N
114.497 374 M
114.497 51 L
S
GR
GS
[0.75 0 0 0.75 0 0] CT
0.849 GC
[1 3] 0 setdash
2 LJ
0.667 LW
N
117.838 374 M
117.838 51 L
S
GR
GS
[0.75 0 0 0.75 0 0] CT
0.849 GC
[1 3] 0 setdash
2 LJ
0.667 LW
N
120.663 374 M
120.663 51 L
S
GR
GS
[0.75 0 0 0.75 0 0] CT
0.849 GC
[1 3] 0 setdash
2 LJ
0.667 LW
N
123.11 374 M
123.11 51 L
S
GR
GS
[0.75 0 0 0.75 0 0] CT
0.849 GC
[1 3] 0 setdash
2 LJ
0.667 LW
N
125.269 374 M
125.269 51 L
S
GR
GS
[0.75 0 0 0.75 0 0] CT
0.849 GC
[1 3] 0 setdash
2 LJ
0.667 LW
N
127.2 374 M
127.2 51 L
S
GR
GS
[0.75 0 0 0.75 0 0] CT
0.849 GC
[1 3] 0 setdash
2 LJ
0.667 LW
N
139.903 374 M
139.903 51 L
S
GR
GS
[0.75 0 0 0.75 0 0] CT
0.849 GC
[1 3] 0 setdash
2 LJ
0.667 LW
N
147.335 374 M
147.335 51 L
S
GR
GS
[0.75 0 0 0.75 0 0] CT
0.849 GC
[1 3] 0 setdash
2 LJ
0.667 LW
N
152.607 374 M
152.607 51 L
S
GR
GS
[0.75 0 0 0.75 0 0] CT
0.849 GC
[1 3] 0 setdash
2 LJ
0.667 LW
N
156.697 374 M
156.697 51 L
S
GR
GS
[0.75 0 0 0.75 0 0] CT
0.849 GC
[1 3] 0 setdash
2 LJ
0.667 LW
N
160.038 374 M
160.038 51 L
S
GR
GS
[0.75 0 0 0.75 0 0] CT
0.849 GC
[1 3] 0 setdash
2 LJ
0.667 LW
N
162.863 374 M
162.863 51 L
S
GR
GS
[0.75 0 0 0.75 0 0] CT
0.849 GC
[1 3] 0 setdash
2 LJ
0.667 LW
N
165.31 374 M
165.31 51 L
S
GR
GS
[0.75 0 0 0.75 0 0] CT
0.849 GC
[1 3] 0 setdash
2 LJ
0.667 LW
N
167.469 374 M
167.469 51 L
S
GR
GS
[0.75 0 0 0.75 0 0] CT
0.849 GC
[1 3] 0 setdash
2 LJ
0.667 LW
N
182.103 374 M
182.103 51 L
S
GR
GS
[0.75 0 0 0.75 0 0] CT
0.849 GC
[1 3] 0 setdash
2 LJ
0.667 LW
N
189.535 374 M
189.535 51 L
S
GR
GS
[0.75 0 0 0.75 0 0] CT
0.849 GC
[1 3] 0 setdash
2 LJ
0.667 LW
N
194.807 374 M
194.807 51 L
S
GR
GS
[0.75 0 0 0.75 0 0] CT
0.849 GC
[1 3] 0 setdash
2 LJ
0.667 LW
N
198.897 374 M
198.897 51 L
S
GR
GS
[0.75 0 0 0.75 0 0] CT
0.849 GC
[1 3] 0 setdash
2 LJ
0.667 LW
N
202.238 374 M
202.238 51 L
S
GR
GS
[0.75 0 0 0.75 0 0] CT
0.849 GC
[1 3] 0 setdash
2 LJ
0.667 LW
N
205.063 374 M
205.063 51 L
S
GR
GS
[0.75 0 0 0.75 0 0] CT
0.849 GC
[1 3] 0 setdash
2 LJ
0.667 LW
N
207.51 374 M
207.51 51 L
S
GR
GS
[0.75 0 0 0.75 0 0] CT
0.849 GC
[1 3] 0 setdash
2 LJ
0.667 LW
N
209.669 374 M
209.669 51 L
S
GR
GS
[0.75 0 0 0.75 0 0] CT
0.849 GC
[1 3] 0 setdash
2 LJ
0.667 LW
N
211.6 374 M
211.6 51 L
S
GR
GS
[0.75 0 0 0.75 0 0] CT
0.849 GC
[1 3] 0 setdash
2 LJ
0.667 LW
N
224.303 374 M
224.303 51 L
S
GR
GS
[0.75 0 0 0.75 0 0] CT
0.849 GC
[1 3] 0 setdash
2 LJ
0.667 LW
N
231.735 374 M
231.735 51 L
S
GR
GS
[0.75 0 0 0.75 0 0] CT
0.849 GC
[1 3] 0 setdash
2 LJ
0.667 LW
N
237.007 374 M
237.007 51 L
S
GR
GS
[0.75 0 0 0.75 0 0] CT
0.849 GC
[1 3] 0 setdash
2 LJ
0.667 LW
N
241.097 374 M
241.097 51 L
S
GR
GS
[0.75 0 0 0.75 0 0] CT
0.849 GC
[1 3] 0 setdash
2 LJ
0.667 LW
N
244.438 374 M
244.438 51 L
S
GR
GS
[0.75 0 0 0.75 0 0] CT
0.849 GC
[1 3] 0 setdash
2 LJ
0.667 LW
N
247.263 374 M
247.263 51 L
S
GR
GS
[0.75 0 0 0.75 0 0] CT
0.849 GC
[1 3] 0 setdash
2 LJ
0.667 LW
N
249.71 374 M
249.71 51 L
S
GR
GS
[0.75 0 0 0.75 0 0] CT
0.849 GC
[1 3] 0 setdash
2 LJ
0.667 LW
N
251.869 374 M
251.869 51 L
S
GR
GS
[0.75 0 0 0.75 0 0] CT
0.849 GC
[1 3] 0 setdash
2 LJ
0.667 LW
N
253.8 374 M
253.8 51 L
S
GR
GS
[0.75 0 0 0.75 0 0] CT
0.849 GC
[1 3] 0 setdash
2 LJ
0.667 LW
N
266.503 374 M
266.503 51 L
S
GR
GS
[0.75 0 0 0.75 0 0] CT
0.849 GC
[1 3] 0 setdash
2 LJ
0.667 LW
N
273.935 374 M
273.935 51 L
S
GR
GS
[0.75 0 0 0.75 0 0] CT
0.849 GC
[1 3] 0 setdash
2 LJ
0.667 LW
N
279.207 374 M
279.207 51 L
S
GR
GS
[0.75 0 0 0.75 0 0] CT
0.849 GC
[1 3] 0 setdash
2 LJ
0.667 LW
N
283.297 374 M
283.297 51 L
S
GR
GS
[0.75 0 0 0.75 0 0] CT
0.849 GC
[1 3] 0 setdash
2 LJ
0.667 LW
N
286.638 374 M
286.638 51 L
S
GR
GS
[0.75 0 0 0.75 0 0] CT
0.849 GC
[1 3] 0 setdash
2 LJ
0.667 LW
N
289.463 374 M
289.463 51 L
S
GR
GS
[0.75 0 0 0.75 0 0] CT
0.849 GC
[1 3] 0 setdash
2 LJ
0.667 LW
N
291.91 374 M
291.91 51 L
S
GR
GS
[0.75 0 0 0.75 0 0] CT
0.849 GC
[1 3] 0 setdash
2 LJ
0.667 LW
N
294.069 374 M
294.069 51 L
S
GR
GS
[0.75 0 0 0.75 0 0] CT
0.849 GC
[1 3] 0 setdash
2 LJ
0.667 LW
N
296 374 M
296 51 L
S
GR
GS
[0.75 0 0 0.75 0 0] CT
0.849 GC
[1 3] 0 setdash
2 LJ
0.667 LW
N
308.703 374 M
308.703 51 L
S
GR
GS
[0.75 0 0 0.75 0 0] CT
0.849 GC
[1 3] 0 setdash
2 LJ
0.667 LW
N
316.135 374 M
316.135 51 L
S
GR
GS
[0.75 0 0 0.75 0 0] CT
0.849 GC
[1 3] 0 setdash
2 LJ
0.667 LW
N
321.407 374 M
321.407 51 L
S
GR
GS
[0.75 0 0 0.75 0 0] CT
0.849 GC
[1 3] 0 setdash
2 LJ
0.667 LW
N
325.497 374 M
325.497 51 L
S
GR
GS
[0.75 0 0 0.75 0 0] CT
0.849 GC
[1 3] 0 setdash
2 LJ
0.667 LW
N
328.838 374 M
328.838 51 L
S
GR
GS
[0.75 0 0 0.75 0 0] CT
0.849 GC
[1 3] 0 setdash
2 LJ
0.667 LW
N
331.663 374 M
331.663 51 L
S
GR
GS
[0.75 0 0 0.75 0 0] CT
0.849 GC
[1 3] 0 setdash
2 LJ
0.667 LW
N
334.11 374 M
334.11 51 L
S
GR
GS
[0.75 0 0 0.75 0 0] CT
0.849 GC
[1 3] 0 setdash
2 LJ
0.667 LW
N
336.269 374 M
336.269 51 L
S
GR
GS
[0.75 0 0 0.75 0 0] CT
0.849 GC
[1 3] 0 setdash
2 LJ
0.667 LW
N
350.903 374 M
350.903 51 L
S
GR
GS
[0.75 0 0 0.75 0 0] CT
0.849 GC
[1 3] 0 setdash
2 LJ
0.667 LW
N
358.335 374 M
358.335 51 L
S
GR
GS
[0.75 0 0 0.75 0 0] CT
0.849 GC
[1 3] 0 setdash
2 LJ
0.667 LW
N
363.607 374 M
363.607 51 L
S
GR
GS
[0.75 0 0 0.75 0 0] CT
0.849 GC
[1 3] 0 setdash
2 LJ
0.667 LW
N
367.697 374 M
367.697 51 L
S
GR
GS
[0.75 0 0 0.75 0 0] CT
0.849 GC
[1 3] 0 setdash
2 LJ
0.667 LW
N
371.038 374 M
371.038 51 L
S
GR
GS
[0.75 0 0 0.75 0 0] CT
0.849 GC
[1 3] 0 setdash
2 LJ
0.667 LW
N
373.863 374 M
373.863 51 L
S
GR
GS
[0.75 0 0 0.75 0 0] CT
0.849 GC
[1 3] 0 setdash
2 LJ
0.667 LW
N
376.31 374 M
376.31 51 L
S
GR
GS
[0.75 0 0 0.75 0 0] CT
0.849 GC
[1 3] 0 setdash
2 LJ
0.667 LW
N
378.469 374 M
378.469 51 L
S
GR
GS
[0.75 0 0 0.75 0 0] CT
0.849 GC
[1 3] 0 setdash
2 LJ
0.667 LW
N
380.4 374 M
380.4 51 L
S
GR
GS
[0.75 0 0 0.75 0 0] CT
0.849 GC
[1 3] 0 setdash
2 LJ
0.667 LW
N
393.103 374 M
393.103 51 L
S
GR
GS
[0.75 0 0 0.75 0 0] CT
0.849 GC
[1 3] 0 setdash
2 LJ
0.667 LW
N
400.535 374 M
400.535 51 L
S
GR
GS
[0.75 0 0 0.75 0 0] CT
0.849 GC
[1 3] 0 setdash
2 LJ
0.667 LW
N
405.807 374 M
405.807 51 L
S
GR
GS
[0.75 0 0 0.75 0 0] CT
0.849 GC
[1 3] 0 setdash
2 LJ
0.667 LW
N
409.897 374 M
409.897 51 L
S
GR
GS
[0.75 0 0 0.75 0 0] CT
0.849 GC
[1 3] 0 setdash
2 LJ
0.667 LW
N
413.238 374 M
413.238 51 L
S
GR
GS
[0.75 0 0 0.75 0 0] CT
0.849 GC
[1 3] 0 setdash
2 LJ
0.667 LW
N
416.063 374 M
416.063 51 L
S
GR
GS
[0.75 0 0 0.75 0 0] CT
0.849 GC
[1 3] 0 setdash
2 LJ
0.667 LW
N
418.51 374 M
418.51 51 L
S
GR
GS
[0.75 0 0 0.75 0 0] CT
0.849 GC
[1 3] 0 setdash
2 LJ
0.667 LW
N
420.669 374 M
420.669 51 L
S
GR
GS
[0.75 0 0 0.75 0 0] CT
0.849 GC
[1 3] 0 setdash
2 LJ
0.667 LW
N
435.303 374 M
435.303 51 L
S
GR
GS
[0.75 0 0 0.75 0 0] CT
0.849 GC
[1 3] 0 setdash
2 LJ
0.667 LW
N
442.734 374 M
442.734 51 L
S
GR
GS
[0.75 0 0 0.75 0 0] CT
0.849 GC
[1 3] 0 setdash
2 LJ
0.667 LW
N
448.007 374 M
448.007 51 L
S
GR
GS
[0.75 0 0 0.75 0 0] CT
0.849 GC
[1 3] 0 setdash
2 LJ
0.667 LW
N
452.097 374 M
452.097 51 L
S
GR
GS
[0.75 0 0 0.75 0 0] CT
0.849 GC
[1 3] 0 setdash
2 LJ
0.667 LW
N
455.438 374 M
455.438 51 L
S
GR
GS
[0.75 0 0 0.75 0 0] CT
0.849 GC
[1 3] 0 setdash
2 LJ
0.667 LW
N
458.263 374 M
458.263 51 L
S
GR
GS
[0.75 0 0 0.75 0 0] CT
0.849 GC
[1 3] 0 setdash
2 LJ
0.667 LW
N
460.71 374 M
460.71 51 L
S
GR
GS
[0.75 0 0 0.75 0 0] CT
0.849 GC
[1 3] 0 setdash
2 LJ
0.667 LW
N
462.869 374 M
462.869 51 L
S
GR
GS
[0.75 0 0 0.75 0 0] CT
0.849 GC
[1 3] 0 setdash
2 LJ
0.667 LW
N
464.8 374 M
464.8 51 L
S
GR
GS
[0.75 0 0 0.75 0 0] CT
0.849 GC
[1 3] 0 setdash
2 LJ
0.667 LW
N
477.503 374 M
477.503 51 L
S
GR
GS
[0.75 0 0 0.75 0 0] CT
0.849 GC
[1 3] 0 setdash
2 LJ
0.667 LW
N
484.935 374 M
484.935 51 L
S
GR
GS
[0.75 0 0 0.75 0 0] CT
0.849 GC
[1 3] 0 setdash
2 LJ
0.667 LW
N
490.207 374 M
490.207 51 L
S
GR
GS
[0.75 0 0 0.75 0 0] CT
0.849 GC
[1 3] 0 setdash
2 LJ
0.667 LW
N
494.297 374 M
494.297 51 L
S
GR
GS
[0.75 0 0 0.75 0 0] CT
0.849 GC
[1 3] 0 setdash
2 LJ
0.667 LW
N
497.638 374 M
497.638 51 L
S
GR
GS
[0.75 0 0 0.75 0 0] CT
0.849 GC
[1 3] 0 setdash
2 LJ
0.667 LW
N
500.463 374 M
500.463 51 L
S
GR
GS
[0.75 0 0 0.75 0 0] CT
0.849 GC
[1 3] 0 setdash
2 LJ
0.667 LW
N
502.91 374 M
502.91 51 L
S
GR
GS
[0.75 0 0 0.75 0 0] CT
0.849 GC
[1 3] 0 setdash
2 LJ
0.667 LW
N
505.069 374 M
505.069 51 L
S
GR
GS
[0.75 0 0 0.75 0 0] CT
0.873 GC
1 LJ
0.667 LW
N
85 374 M
85 51 L
S
GR
GS
[0.75 0 0 0.75 0 0] CT
0.873 GC
1 LJ
0.667 LW
N
169.4 374 M
169.4 51 L
S
GR
GS
[0.75 0 0 0.75 0 0] CT
0.873 GC
1 LJ
0.667 LW
N
253.8 374 M
253.8 51 L
S
GR
GS
[0.75 0 0 0.75 0 0] CT
0.873 GC
1 LJ
0.667 LW
N
338.2 374 M
338.2 51 L
S
GR
GS
[0.75 0 0 0.75 0 0] CT
0.873 GC
1 LJ
0.667 LW
N
422.6 374 M
422.6 51 L
S
GR
GS
[0.75 0 0 0.75 0 0] CT
0.873 GC
1 LJ
0.667 LW
N
507 374 M
507 51 L
S
GR
GS
[0.75 0 0 0.75 0 0] CT
0.873 GC
1 LJ
0.667 LW
N
507 374 M
85 374 L
S
GR
GS
[0.75 0 0 0.75 0 0] CT
0.873 GC
1 LJ
0.667 LW
N
507 333.625 M
85 333.625 L
S
GR
GS
[0.75 0 0 0.75 0 0] CT
0.873 GC
1 LJ
0.667 LW
N
507 293.25 M
85 293.25 L
S
GR
GS
[0.75 0 0 0.75 0 0] CT
0.873 GC
1 LJ
0.667 LW
N
507 252.875 M
85 252.875 L
S
GR
GS
[0.75 0 0 0.75 0 0] CT
0.873 GC
1 LJ
0.667 LW
N
507 212.5 M
85 212.5 L
S
GR
GS
[0.75 0 0 0.75 0 0] CT
0.873 GC
1 LJ
0.667 LW
N
507 172.125 M
85 172.125 L
S
GR
GS
[0.75 0 0 0.75 0 0] CT
0.873 GC
1 LJ
0.667 LW
N
507 131.75 M
85 131.75 L
S
GR
GS
[0.75 0 0 0.75 0 0] CT
0.873 GC
1 LJ
0.667 LW
N
507 91.375 M
85 91.375 L
S
GR
GS
[0.75 0 0 0.75 0 0] CT
0.873 GC
1 LJ
0.667 LW
N
507 51 M
85 51 L
S
GR
GS
[0.75 0 0 0.75 0 0] CT
0.4 GC
2 setlinecap
1 LJ
0.667 LW
N
85 374 M
507 374 L
S
GR
GS
[0.75 0 0 0.75 0 0] CT
0.4 GC
2 setlinecap
1 LJ
0.667 LW
N
85 51 M
507 51 L
S
GR
GS
[0.75 0 0 0.75 0 0] CT
0.4 GC
2 setlinecap
1 LJ
0.667 LW
N
85 374 M
85 369.78 L
S
GR
GS
[0.75 0 0 0.75 0 0] CT
0.4 GC
2 setlinecap
1 LJ
0.667 LW
N
169.4 374 M
169.4 369.78 L
S
GR
GS
[0.75 0 0 0.75 0 0] CT
0.4 GC
2 setlinecap
1 LJ
0.667 LW
N
253.8 374 M
253.8 369.78 L
S
GR
GS
[0.75 0 0 0.75 0 0] CT
0.4 GC
2 setlinecap
1 LJ
0.667 LW
N
338.2 374 M
338.2 369.78 L
S
GR
GS
[0.75 0 0 0.75 0 0] CT
0.4 GC
2 setlinecap
1 LJ
0.667 LW
N
422.6 374 M
422.6 369.78 L
S
GR
GS
[0.75 0 0 0.75 0 0] CT
0.4 GC
2 setlinecap
1 LJ
0.667 LW
N
507 374 M
507 369.78 L
S
GR
GS
[0.75 0 0 0.75 0 0] CT
0.4 GC
2 setlinecap
1 LJ
0.667 LW
N
85 51 M
85 55.22 L
S
GR
GS
[0.75 0 0 0.75 0 0] CT
0.4 GC
2 setlinecap
1 LJ
0.667 LW
N
169.4 51 M
169.4 55.22 L
S
GR
GS
[0.75 0 0 0.75 0 0] CT
0.4 GC
2 setlinecap
1 LJ
0.667 LW
N
253.8 51 M
253.8 55.22 L
S
GR
GS
[0.75 0 0 0.75 0 0] CT
0.4 GC
2 setlinecap
1 LJ
0.667 LW
N
338.2 51 M
338.2 55.22 L
S
GR
GS
[0.75 0 0 0.75 0 0] CT
0.4 GC
2 setlinecap
1 LJ
0.667 LW
N
422.6 51 M
422.6 55.22 L
S
GR
GS
[0.75 0 0 0.75 0 0] CT
0.4 GC
2 setlinecap
1 LJ
0.667 LW
N
507 51 M
507 55.22 L
S
GR
GS
[0.75 0 0 0.75 0 0] CT
0.4 GC
2 setlinecap
1 LJ
0.667 LW
N
85 374 M
85 371.89 L
S
GR
GS
[0.75 0 0 0.75 0 0] CT
0.4 GC
2 setlinecap
1 LJ
0.667 LW
N
97.703 374 M
97.703 371.89 L
S
GR
GS
[0.75 0 0 0.75 0 0] CT
0.4 GC
2 setlinecap
1 LJ
0.667 LW
N
105.135 374 M
105.135 371.89 L
S
GR
GS
[0.75 0 0 0.75 0 0] CT
0.4 GC
2 setlinecap
1 LJ
0.667 LW
N
110.407 374 M
110.407 371.89 L
S
GR
GS
[0.75 0 0 0.75 0 0] CT
0.4 GC
2 setlinecap
1 LJ
0.667 LW
N
114.497 374 M
114.497 371.89 L
S
GR
GS
[0.75 0 0 0.75 0 0] CT
0.4 GC
2 setlinecap
1 LJ
0.667 LW
N
117.838 374 M
117.838 371.89 L
S
GR
GS
[0.75 0 0 0.75 0 0] CT
0.4 GC
2 setlinecap
1 LJ
0.667 LW
N
120.663 374 M
120.663 371.89 L
S
GR
GS
[0.75 0 0 0.75 0 0] CT
0.4 GC
2 setlinecap
1 LJ
0.667 LW
N
123.11 374 M
123.11 371.89 L
S
GR
GS
[0.75 0 0 0.75 0 0] CT
0.4 GC
2 setlinecap
1 LJ
0.667 LW
N
125.269 374 M
125.269 371.89 L
S
GR
GS
[0.75 0 0 0.75 0 0] CT
0.4 GC
2 setlinecap
1 LJ
0.667 LW
N
127.2 374 M
127.2 371.89 L
S
GR
GS
[0.75 0 0 0.75 0 0] CT
0.4 GC
2 setlinecap
1 LJ
0.667 LW
N
139.903 374 M
139.903 371.89 L
S
GR
GS
[0.75 0 0 0.75 0 0] CT
0.4 GC
2 setlinecap
1 LJ
0.667 LW
N
147.335 374 M
147.335 371.89 L
S
GR
GS
[0.75 0 0 0.75 0 0] CT
0.4 GC
2 setlinecap
1 LJ
0.667 LW
N
152.607 374 M
152.607 371.89 L
S
GR
GS
[0.75 0 0 0.75 0 0] CT
0.4 GC
2 setlinecap
1 LJ
0.667 LW
N
156.697 374 M
156.697 371.89 L
S
GR
GS
[0.75 0 0 0.75 0 0] CT
0.4 GC
2 setlinecap
1 LJ
0.667 LW
N
160.038 374 M
160.038 371.89 L
S
GR
GS
[0.75 0 0 0.75 0 0] CT
0.4 GC
2 setlinecap
1 LJ
0.667 LW
N
162.863 374 M
162.863 371.89 L
S
GR
GS
[0.75 0 0 0.75 0 0] CT
0.4 GC
2 setlinecap
1 LJ
0.667 LW
N
165.31 374 M
165.31 371.89 L
S
GR
GS
[0.75 0 0 0.75 0 0] CT
0.4 GC
2 setlinecap
1 LJ
0.667 LW
N
167.469 374 M
167.469 371.89 L
S
GR
GS
[0.75 0 0 0.75 0 0] CT
0.4 GC
2 setlinecap
1 LJ
0.667 LW
N
169.4 374 M
169.4 371.89 L
S
GR
GS
[0.75 0 0 0.75 0 0] CT
0.4 GC
2 setlinecap
1 LJ
0.667 LW
N
182.103 374 M
182.103 371.89 L
S
GR
GS
[0.75 0 0 0.75 0 0] CT
0.4 GC
2 setlinecap
1 LJ
0.667 LW
N
189.535 374 M
189.535 371.89 L
S
GR
GS
[0.75 0 0 0.75 0 0] CT
0.4 GC
2 setlinecap
1 LJ
0.667 LW
N
194.807 374 M
194.807 371.89 L
S
GR
GS
[0.75 0 0 0.75 0 0] CT
0.4 GC
2 setlinecap
1 LJ
0.667 LW
N
198.897 374 M
198.897 371.89 L
S
GR
GS
[0.75 0 0 0.75 0 0] CT
0.4 GC
2 setlinecap
1 LJ
0.667 LW
N
202.238 374 M
202.238 371.89 L
S
GR
GS
[0.75 0 0 0.75 0 0] CT
0.4 GC
2 setlinecap
1 LJ
0.667 LW
N
205.063 374 M
205.063 371.89 L
S
GR
GS
[0.75 0 0 0.75 0 0] CT
0.4 GC
2 setlinecap
1 LJ
0.667 LW
N
207.51 374 M
207.51 371.89 L
S
GR
GS
[0.75 0 0 0.75 0 0] CT
0.4 GC
2 setlinecap
1 LJ
0.667 LW
N
209.669 374 M
209.669 371.89 L
S
GR
GS
[0.75 0 0 0.75 0 0] CT
0.4 GC
2 setlinecap
1 LJ
0.667 LW
N
211.6 374 M
211.6 371.89 L
S
GR
GS
[0.75 0 0 0.75 0 0] CT
0.4 GC
2 setlinecap
1 LJ
0.667 LW
N
224.303 374 M
224.303 371.89 L
S
GR
GS
[0.75 0 0 0.75 0 0] CT
0.4 GC
2 setlinecap
1 LJ
0.667 LW
N
231.735 374 M
231.735 371.89 L
S
GR
GS
[0.75 0 0 0.75 0 0] CT
0.4 GC
2 setlinecap
1 LJ
0.667 LW
N
237.007 374 M
237.007 371.89 L
S
GR
GS
[0.75 0 0 0.75 0 0] CT
0.4 GC
2 setlinecap
1 LJ
0.667 LW
N
241.097 374 M
241.097 371.89 L
S
GR
GS
[0.75 0 0 0.75 0 0] CT
0.4 GC
2 setlinecap
1 LJ
0.667 LW
N
244.438 374 M
244.438 371.89 L
S
GR
GS
[0.75 0 0 0.75 0 0] CT
0.4 GC
2 setlinecap
1 LJ
0.667 LW
N
247.263 374 M
247.263 371.89 L
S
GR
GS
[0.75 0 0 0.75 0 0] CT
0.4 GC
2 setlinecap
1 LJ
0.667 LW
N
249.71 374 M
249.71 371.89 L
S
GR
GS
[0.75 0 0 0.75 0 0] CT
0.4 GC
2 setlinecap
1 LJ
0.667 LW
N
251.869 374 M
251.869 371.89 L
S
GR
GS
[0.75 0 0 0.75 0 0] CT
0.4 GC
2 setlinecap
1 LJ
0.667 LW
N
253.8 374 M
253.8 371.89 L
S
GR
GS
[0.75 0 0 0.75 0 0] CT
0.4 GC
2 setlinecap
1 LJ
0.667 LW
N
253.8 374 M
253.8 371.89 L
S
GR
GS
[0.75 0 0 0.75 0 0] CT
0.4 GC
2 setlinecap
1 LJ
0.667 LW
N
266.503 374 M
266.503 371.89 L
S
GR
GS
[0.75 0 0 0.75 0 0] CT
0.4 GC
2 setlinecap
1 LJ
0.667 LW
N
273.935 374 M
273.935 371.89 L
S
GR
GS
[0.75 0 0 0.75 0 0] CT
0.4 GC
2 setlinecap
1 LJ
0.667 LW
N
279.207 374 M
279.207 371.89 L
S
GR
GS
[0.75 0 0 0.75 0 0] CT
0.4 GC
2 setlinecap
1 LJ
0.667 LW
N
283.297 374 M
283.297 371.89 L
S
GR
GS
[0.75 0 0 0.75 0 0] CT
0.4 GC
2 setlinecap
1 LJ
0.667 LW
N
286.638 374 M
286.638 371.89 L
S
GR
GS
[0.75 0 0 0.75 0 0] CT
0.4 GC
2 setlinecap
1 LJ
0.667 LW
N
289.463 374 M
289.463 371.89 L
S
GR
GS
[0.75 0 0 0.75 0 0] CT
0.4 GC
2 setlinecap
1 LJ
0.667 LW
N
291.91 374 M
291.91 371.89 L
S
GR
GS
[0.75 0 0 0.75 0 0] CT
0.4 GC
2 setlinecap
1 LJ
0.667 LW
N
294.069 374 M
294.069 371.89 L
S
GR
GS
[0.75 0 0 0.75 0 0] CT
0.4 GC
2 setlinecap
1 LJ
0.667 LW
N
296 374 M
296 371.89 L
S
GR
GS
[0.75 0 0 0.75 0 0] CT
0.4 GC
2 setlinecap
1 LJ
0.667 LW
N
308.703 374 M
308.703 371.89 L
S
GR
GS
[0.75 0 0 0.75 0 0] CT
0.4 GC
2 setlinecap
1 LJ
0.667 LW
N
316.135 374 M
316.135 371.89 L
S
GR
GS
[0.75 0 0 0.75 0 0] CT
0.4 GC
2 setlinecap
1 LJ
0.667 LW
N
321.407 374 M
321.407 371.89 L
S
GR
GS
[0.75 0 0 0.75 0 0] CT
0.4 GC
2 setlinecap
1 LJ
0.667 LW
N
325.497 374 M
325.497 371.89 L
S
GR
GS
[0.75 0 0 0.75 0 0] CT
0.4 GC
2 setlinecap
1 LJ
0.667 LW
N
328.838 374 M
328.838 371.89 L
S
GR
GS
[0.75 0 0 0.75 0 0] CT
0.4 GC
2 setlinecap
1 LJ
0.667 LW
N
331.663 374 M
331.663 371.89 L
S
GR
GS
[0.75 0 0 0.75 0 0] CT
0.4 GC
2 setlinecap
1 LJ
0.667 LW
N
334.11 374 M
334.11 371.89 L
S
GR
GS
[0.75 0 0 0.75 0 0] CT
0.4 GC
2 setlinecap
1 LJ
0.667 LW
N
336.269 374 M
336.269 371.89 L
S
GR
GS
[0.75 0 0 0.75 0 0] CT
0.4 GC
2 setlinecap
1 LJ
0.667 LW
N
338.2 374 M
338.2 371.89 L
S
GR
GS
[0.75 0 0 0.75 0 0] CT
0.4 GC
2 setlinecap
1 LJ
0.667 LW
N
350.903 374 M
350.903 371.89 L
S
GR
GS
[0.75 0 0 0.75 0 0] CT
0.4 GC
2 setlinecap
1 LJ
0.667 LW
N
358.335 374 M
358.335 371.89 L
S
GR
GS
[0.75 0 0 0.75 0 0] CT
0.4 GC
2 setlinecap
1 LJ
0.667 LW
N
363.607 374 M
363.607 371.89 L
S
GR
GS
[0.75 0 0 0.75 0 0] CT
0.4 GC
2 setlinecap
1 LJ
0.667 LW
N
367.697 374 M
367.697 371.89 L
S
GR
GS
[0.75 0 0 0.75 0 0] CT
0.4 GC
2 setlinecap
1 LJ
0.667 LW
N
371.038 374 M
371.038 371.89 L
S
GR
GS
[0.75 0 0 0.75 0 0] CT
0.4 GC
2 setlinecap
1 LJ
0.667 LW
N
373.863 374 M
373.863 371.89 L
S
GR
GS
[0.75 0 0 0.75 0 0] CT
0.4 GC
2 setlinecap
1 LJ
0.667 LW
N
376.31 374 M
376.31 371.89 L
S
GR
GS
[0.75 0 0 0.75 0 0] CT
0.4 GC
2 setlinecap
1 LJ
0.667 LW
N
378.469 374 M
378.469 371.89 L
S
GR
GS
[0.75 0 0 0.75 0 0] CT
0.4 GC
2 setlinecap
1 LJ
0.667 LW
N
380.4 374 M
380.4 371.89 L
S
GR
GS
[0.75 0 0 0.75 0 0] CT
0.4 GC
2 setlinecap
1 LJ
0.667 LW
N
393.103 374 M
393.103 371.89 L
S
GR
GS
[0.75 0 0 0.75 0 0] CT
0.4 GC
2 setlinecap
1 LJ
0.667 LW
N
400.535 374 M
400.535 371.89 L
S
GR
GS
[0.75 0 0 0.75 0 0] CT
0.4 GC
2 setlinecap
1 LJ
0.667 LW
N
405.807 374 M
405.807 371.89 L
S
GR
GS
[0.75 0 0 0.75 0 0] CT
0.4 GC
2 setlinecap
1 LJ
0.667 LW
N
409.897 374 M
409.897 371.89 L
S
GR
GS
[0.75 0 0 0.75 0 0] CT
0.4 GC
2 setlinecap
1 LJ
0.667 LW
N
413.238 374 M
413.238 371.89 L
S
GR
GS
[0.75 0 0 0.75 0 0] CT
0.4 GC
2 setlinecap
1 LJ
0.667 LW
N
416.063 374 M
416.063 371.89 L
S
GR
GS
[0.75 0 0 0.75 0 0] CT
0.4 GC
2 setlinecap
1 LJ
0.667 LW
N
418.51 374 M
418.51 371.89 L
S
GR
GS
[0.75 0 0 0.75 0 0] CT
0.4 GC
2 setlinecap
1 LJ
0.667 LW
N
420.669 374 M
420.669 371.89 L
S
GR
GS
[0.75 0 0 0.75 0 0] CT
0.4 GC
2 setlinecap
1 LJ
0.667 LW
N
422.6 374 M
422.6 371.89 L
S
GR
GS
[0.75 0 0 0.75 0 0] CT
0.4 GC
2 setlinecap
1 LJ
0.667 LW
N
435.303 374 M
435.303 371.89 L
S
GR
GS
[0.75 0 0 0.75 0 0] CT
0.4 GC
2 setlinecap
1 LJ
0.667 LW
N
442.734 374 M
442.734 371.89 L
S
GR
GS
[0.75 0 0 0.75 0 0] CT
0.4 GC
2 setlinecap
1 LJ
0.667 LW
N
448.007 374 M
448.007 371.89 L
S
GR
GS
[0.75 0 0 0.75 0 0] CT
0.4 GC
2 setlinecap
1 LJ
0.667 LW
N
452.097 374 M
452.097 371.89 L
S
GR
GS
[0.75 0 0 0.75 0 0] CT
0.4 GC
2 setlinecap
1 LJ
0.667 LW
N
455.438 374 M
455.438 371.89 L
S
GR
GS
[0.75 0 0 0.75 0 0] CT
0.4 GC
2 setlinecap
1 LJ
0.667 LW
N
458.263 374 M
458.263 371.89 L
S
GR
GS
[0.75 0 0 0.75 0 0] CT
0.4 GC
2 setlinecap
1 LJ
0.667 LW
N
460.71 374 M
460.71 371.89 L
S
GR
GS
[0.75 0 0 0.75 0 0] CT
0.4 GC
2 setlinecap
1 LJ
0.667 LW
N
462.869 374 M
462.869 371.89 L
S
GR
GS
[0.75 0 0 0.75 0 0] CT
0.4 GC
2 setlinecap
1 LJ
0.667 LW
N
464.8 374 M
464.8 371.89 L
S
GR
GS
[0.75 0 0 0.75 0 0] CT
0.4 GC
2 setlinecap
1 LJ
0.667 LW
N
477.503 374 M
477.503 371.89 L
S
GR
GS
[0.75 0 0 0.75 0 0] CT
0.4 GC
2 setlinecap
1 LJ
0.667 LW
N
484.935 374 M
484.935 371.89 L
S
GR
GS
[0.75 0 0 0.75 0 0] CT
0.4 GC
2 setlinecap
1 LJ
0.667 LW
N
490.207 374 M
490.207 371.89 L
S
GR
GS
[0.75 0 0 0.75 0 0] CT
0.4 GC
2 setlinecap
1 LJ
0.667 LW
N
494.297 374 M
494.297 371.89 L
S
GR
GS
[0.75 0 0 0.75 0 0] CT
0.4 GC
2 setlinecap
1 LJ
0.667 LW
N
497.638 374 M
497.638 371.89 L
S
GR
GS
[0.75 0 0 0.75 0 0] CT
0.4 GC
2 setlinecap
1 LJ
0.667 LW
N
500.463 374 M
500.463 371.89 L
S
GR
GS
[0.75 0 0 0.75 0 0] CT
0.4 GC
2 setlinecap
1 LJ
0.667 LW
N
502.91 374 M
502.91 371.89 L
S
GR
GS
[0.75 0 0 0.75 0 0] CT
0.4 GC
2 setlinecap
1 LJ
0.667 LW
N
505.069 374 M
505.069 371.89 L
S
GR
GS
[0.75 0 0 0.75 0 0] CT
0.4 GC
2 setlinecap
1 LJ
0.667 LW
N
507 374 M
507 371.89 L
S
GR
GS
[0.75 0 0 0.75 0 0] CT
0.4 GC
2 setlinecap
1 LJ
0.667 LW
N
85 51 M
85 53.11 L
S
GR
GS
[0.75 0 0 0.75 0 0] CT
0.4 GC
2 setlinecap
1 LJ
0.667 LW
N
97.703 51 M
97.703 53.11 L
S
GR
GS
[0.75 0 0 0.75 0 0] CT
0.4 GC
2 setlinecap
1 LJ
0.667 LW
N
105.135 51 M
105.135 53.11 L
S
GR
GS
[0.75 0 0 0.75 0 0] CT
0.4 GC
2 setlinecap
1 LJ
0.667 LW
N
110.407 51 M
110.407 53.11 L
S
GR
GS
[0.75 0 0 0.75 0 0] CT
0.4 GC
2 setlinecap
1 LJ
0.667 LW
N
114.497 51 M
114.497 53.11 L
S
GR
GS
[0.75 0 0 0.75 0 0] CT
0.4 GC
2 setlinecap
1 LJ
0.667 LW
N
117.838 51 M
117.838 53.11 L
S
GR
GS
[0.75 0 0 0.75 0 0] CT
0.4 GC
2 setlinecap
1 LJ
0.667 LW
N
120.663 51 M
120.663 53.11 L
S
GR
GS
[0.75 0 0 0.75 0 0] CT
0.4 GC
2 setlinecap
1 LJ
0.667 LW
N
123.11 51 M
123.11 53.11 L
S
GR
GS
[0.75 0 0 0.75 0 0] CT
0.4 GC
2 setlinecap
1 LJ
0.667 LW
N
125.269 51 M
125.269 53.11 L
S
GR
GS
[0.75 0 0 0.75 0 0] CT
0.4 GC
2 setlinecap
1 LJ
0.667 LW
N
127.2 51 M
127.2 53.11 L
S
GR
GS
[0.75 0 0 0.75 0 0] CT
0.4 GC
2 setlinecap
1 LJ
0.667 LW
N
139.903 51 M
139.903 53.11 L
S
GR
GS
[0.75 0 0 0.75 0 0] CT
0.4 GC
2 setlinecap
1 LJ
0.667 LW
N
147.335 51 M
147.335 53.11 L
S
GR
GS
[0.75 0 0 0.75 0 0] CT
0.4 GC
2 setlinecap
1 LJ
0.667 LW
N
152.607 51 M
152.607 53.11 L
S
GR
GS
[0.75 0 0 0.75 0 0] CT
0.4 GC
2 setlinecap
1 LJ
0.667 LW
N
156.697 51 M
156.697 53.11 L
S
GR
GS
[0.75 0 0 0.75 0 0] CT
0.4 GC
2 setlinecap
1 LJ
0.667 LW
N
160.038 51 M
160.038 53.11 L
S
GR
GS
[0.75 0 0 0.75 0 0] CT
0.4 GC
2 setlinecap
1 LJ
0.667 LW
N
162.863 51 M
162.863 53.11 L
S
GR
GS
[0.75 0 0 0.75 0 0] CT
0.4 GC
2 setlinecap
1 LJ
0.667 LW
N
165.31 51 M
165.31 53.11 L
S
GR
GS
[0.75 0 0 0.75 0 0] CT
0.4 GC
2 setlinecap
1 LJ
0.667 LW
N
167.469 51 M
167.469 53.11 L
S
GR
GS
[0.75 0 0 0.75 0 0] CT
0.4 GC
2 setlinecap
1 LJ
0.667 LW
N
169.4 51 M
169.4 53.11 L
S
GR
GS
[0.75 0 0 0.75 0 0] CT
0.4 GC
2 setlinecap
1 LJ
0.667 LW
N
182.103 51 M
182.103 53.11 L
S
GR
GS
[0.75 0 0 0.75 0 0] CT
0.4 GC
2 setlinecap
1 LJ
0.667 LW
N
189.535 51 M
189.535 53.11 L
S
GR
GS
[0.75 0 0 0.75 0 0] CT
0.4 GC
2 setlinecap
1 LJ
0.667 LW
N
194.807 51 M
194.807 53.11 L
S
GR
GS
[0.75 0 0 0.75 0 0] CT
0.4 GC
2 setlinecap
1 LJ
0.667 LW
N
198.897 51 M
198.897 53.11 L
S
GR
GS
[0.75 0 0 0.75 0 0] CT
0.4 GC
2 setlinecap
1 LJ
0.667 LW
N
202.238 51 M
202.238 53.11 L
S
GR
GS
[0.75 0 0 0.75 0 0] CT
0.4 GC
2 setlinecap
1 LJ
0.667 LW
N
205.063 51 M
205.063 53.11 L
S
GR
GS
[0.75 0 0 0.75 0 0] CT
0.4 GC
2 setlinecap
1 LJ
0.667 LW
N
207.51 51 M
207.51 53.11 L
S
GR
GS
[0.75 0 0 0.75 0 0] CT
0.4 GC
2 setlinecap
1 LJ
0.667 LW
N
209.669 51 M
209.669 53.11 L
S
GR
GS
[0.75 0 0 0.75 0 0] CT
0.4 GC
2 setlinecap
1 LJ
0.667 LW
N
211.6 51 M
211.6 53.11 L
S
GR
GS
[0.75 0 0 0.75 0 0] CT
0.4 GC
2 setlinecap
1 LJ
0.667 LW
N
224.303 51 M
224.303 53.11 L
S
GR
GS
[0.75 0 0 0.75 0 0] CT
0.4 GC
2 setlinecap
1 LJ
0.667 LW
N
231.735 51 M
231.735 53.11 L
S
GR
GS
[0.75 0 0 0.75 0 0] CT
0.4 GC
2 setlinecap
1 LJ
0.667 LW
N
237.007 51 M
237.007 53.11 L
S
GR
GS
[0.75 0 0 0.75 0 0] CT
0.4 GC
2 setlinecap
1 LJ
0.667 LW
N
241.097 51 M
241.097 53.11 L
S
GR
GS
[0.75 0 0 0.75 0 0] CT
0.4 GC
2 setlinecap
1 LJ
0.667 LW
N
244.438 51 M
244.438 53.11 L
S
GR
GS
[0.75 0 0 0.75 0 0] CT
0.4 GC
2 setlinecap
1 LJ
0.667 LW
N
247.263 51 M
247.263 53.11 L
S
GR
GS
[0.75 0 0 0.75 0 0] CT
0.4 GC
2 setlinecap
1 LJ
0.667 LW
N
249.71 51 M
249.71 53.11 L
S
GR
GS
[0.75 0 0 0.75 0 0] CT
0.4 GC
2 setlinecap
1 LJ
0.667 LW
N
251.869 51 M
251.869 53.11 L
S
GR
GS
[0.75 0 0 0.75 0 0] CT
0.4 GC
2 setlinecap
1 LJ
0.667 LW
N
253.8 51 M
253.8 53.11 L
S
GR
GS
[0.75 0 0 0.75 0 0] CT
0.4 GC
2 setlinecap
1 LJ
0.667 LW
N
253.8 51 M
253.8 53.11 L
S
GR
GS
[0.75 0 0 0.75 0 0] CT
0.4 GC
2 setlinecap
1 LJ
0.667 LW
N
266.503 51 M
266.503 53.11 L
S
GR
GS
[0.75 0 0 0.75 0 0] CT
0.4 GC
2 setlinecap
1 LJ
0.667 LW
N
273.935 51 M
273.935 53.11 L
S
GR
GS
[0.75 0 0 0.75 0 0] CT
0.4 GC
2 setlinecap
1 LJ
0.667 LW
N
279.207 51 M
279.207 53.11 L
S
GR
GS
[0.75 0 0 0.75 0 0] CT
0.4 GC
2 setlinecap
1 LJ
0.667 LW
N
283.297 51 M
283.297 53.11 L
S
GR
GS
[0.75 0 0 0.75 0 0] CT
0.4 GC
2 setlinecap
1 LJ
0.667 LW
N
286.638 51 M
286.638 53.11 L
S
GR
GS
[0.75 0 0 0.75 0 0] CT
0.4 GC
2 setlinecap
1 LJ
0.667 LW
N
289.463 51 M
289.463 53.11 L
S
GR
GS
[0.75 0 0 0.75 0 0] CT
0.4 GC
2 setlinecap
1 LJ
0.667 LW
N
291.91 51 M
291.91 53.11 L
S
GR
GS
[0.75 0 0 0.75 0 0] CT
0.4 GC
2 setlinecap
1 LJ
0.667 LW
N
294.069 51 M
294.069 53.11 L
S
GR
GS
[0.75 0 0 0.75 0 0] CT
0.4 GC
2 setlinecap
1 LJ
0.667 LW
N
296 51 M
296 53.11 L
S
GR
GS
[0.75 0 0 0.75 0 0] CT
0.4 GC
2 setlinecap
1 LJ
0.667 LW
N
308.703 51 M
308.703 53.11 L
S
GR
GS
[0.75 0 0 0.75 0 0] CT
0.4 GC
2 setlinecap
1 LJ
0.667 LW
N
316.135 51 M
316.135 53.11 L
S
GR
GS
[0.75 0 0 0.75 0 0] CT
0.4 GC
2 setlinecap
1 LJ
0.667 LW
N
321.407 51 M
321.407 53.11 L
S
GR
GS
[0.75 0 0 0.75 0 0] CT
0.4 GC
2 setlinecap
1 LJ
0.667 LW
N
325.497 51 M
325.497 53.11 L
S
GR
GS
[0.75 0 0 0.75 0 0] CT
0.4 GC
2 setlinecap
1 LJ
0.667 LW
N
328.838 51 M
328.838 53.11 L
S
GR
GS
[0.75 0 0 0.75 0 0] CT
0.4 GC
2 setlinecap
1 LJ
0.667 LW
N
331.663 51 M
331.663 53.11 L
S
GR
GS
[0.75 0 0 0.75 0 0] CT
0.4 GC
2 setlinecap
1 LJ
0.667 LW
N
334.11 51 M
334.11 53.11 L
S
GR
GS
[0.75 0 0 0.75 0 0] CT
0.4 GC
2 setlinecap
1 LJ
0.667 LW
N
336.269 51 M
336.269 53.11 L
S
GR
GS
[0.75 0 0 0.75 0 0] CT
0.4 GC
2 setlinecap
1 LJ
0.667 LW
N
338.2 51 M
338.2 53.11 L
S
GR
GS
[0.75 0 0 0.75 0 0] CT
0.4 GC
2 setlinecap
1 LJ
0.667 LW
N
350.903 51 M
350.903 53.11 L
S
GR
GS
[0.75 0 0 0.75 0 0] CT
0.4 GC
2 setlinecap
1 LJ
0.667 LW
N
358.335 51 M
358.335 53.11 L
S
GR
GS
[0.75 0 0 0.75 0 0] CT
0.4 GC
2 setlinecap
1 LJ
0.667 LW
N
363.607 51 M
363.607 53.11 L
S
GR
GS
[0.75 0 0 0.75 0 0] CT
0.4 GC
2 setlinecap
1 LJ
0.667 LW
N
367.697 51 M
367.697 53.11 L
S
GR
GS
[0.75 0 0 0.75 0 0] CT
0.4 GC
2 setlinecap
1 LJ
0.667 LW
N
371.038 51 M
371.038 53.11 L
S
GR
GS
[0.75 0 0 0.75 0 0] CT
0.4 GC
2 setlinecap
1 LJ
0.667 LW
N
373.863 51 M
373.863 53.11 L
S
GR
GS
[0.75 0 0 0.75 0 0] CT
0.4 GC
2 setlinecap
1 LJ
0.667 LW
N
376.31 51 M
376.31 53.11 L
S
GR
GS
[0.75 0 0 0.75 0 0] CT
0.4 GC
2 setlinecap
1 LJ
0.667 LW
N
378.469 51 M
378.469 53.11 L
S
GR
GS
[0.75 0 0 0.75 0 0] CT
0.4 GC
2 setlinecap
1 LJ
0.667 LW
N
380.4 51 M
380.4 53.11 L
S
GR
GS
[0.75 0 0 0.75 0 0] CT
0.4 GC
2 setlinecap
1 LJ
0.667 LW
N
393.103 51 M
393.103 53.11 L
S
GR
GS
[0.75 0 0 0.75 0 0] CT
0.4 GC
2 setlinecap
1 LJ
0.667 LW
N
400.535 51 M
400.535 53.11 L
S
GR
GS
[0.75 0 0 0.75 0 0] CT
0.4 GC
2 setlinecap
1 LJ
0.667 LW
N
405.807 51 M
405.807 53.11 L
S
GR
GS
[0.75 0 0 0.75 0 0] CT
0.4 GC
2 setlinecap
1 LJ
0.667 LW
N
409.897 51 M
409.897 53.11 L
S
GR
GS
[0.75 0 0 0.75 0 0] CT
0.4 GC
2 setlinecap
1 LJ
0.667 LW
N
413.238 51 M
413.238 53.11 L
S
GR
GS
[0.75 0 0 0.75 0 0] CT
0.4 GC
2 setlinecap
1 LJ
0.667 LW
N
416.063 51 M
416.063 53.11 L
S
GR
GS
[0.75 0 0 0.75 0 0] CT
0.4 GC
2 setlinecap
1 LJ
0.667 LW
N
418.51 51 M
418.51 53.11 L
S
GR
GS
[0.75 0 0 0.75 0 0] CT
0.4 GC
2 setlinecap
1 LJ
0.667 LW
N
420.669 51 M
420.669 53.11 L
S
GR
GS
[0.75 0 0 0.75 0 0] CT
0.4 GC
2 setlinecap
1 LJ
0.667 LW
N
422.6 51 M
422.6 53.11 L
S
GR
GS
[0.75 0 0 0.75 0 0] CT
0.4 GC
2 setlinecap
1 LJ
0.667 LW
N
435.303 51 M
435.303 53.11 L
S
GR
GS
[0.75 0 0 0.75 0 0] CT
0.4 GC
2 setlinecap
1 LJ
0.667 LW
N
442.734 51 M
442.734 53.11 L
S
GR
GS
[0.75 0 0 0.75 0 0] CT
0.4 GC
2 setlinecap
1 LJ
0.667 LW
N
448.007 51 M
448.007 53.11 L
S
GR
GS
[0.75 0 0 0.75 0 0] CT
0.4 GC
2 setlinecap
1 LJ
0.667 LW
N
452.097 51 M
452.097 53.11 L
S
GR
GS
[0.75 0 0 0.75 0 0] CT
0.4 GC
2 setlinecap
1 LJ
0.667 LW
N
455.438 51 M
455.438 53.11 L
S
GR
GS
[0.75 0 0 0.75 0 0] CT
0.4 GC
2 setlinecap
1 LJ
0.667 LW
N
458.263 51 M
458.263 53.11 L
S
GR
GS
[0.75 0 0 0.75 0 0] CT
0.4 GC
2 setlinecap
1 LJ
0.667 LW
N
460.71 51 M
460.71 53.11 L
S
GR
GS
[0.75 0 0 0.75 0 0] CT
0.4 GC
2 setlinecap
1 LJ
0.667 LW
N
462.869 51 M
462.869 53.11 L
S
GR
GS
[0.75 0 0 0.75 0 0] CT
0.4 GC
2 setlinecap
1 LJ
0.667 LW
N
464.8 51 M
464.8 53.11 L
S
GR
GS
[0.75 0 0 0.75 0 0] CT
0.4 GC
2 setlinecap
1 LJ
0.667 LW
N
477.503 51 M
477.503 53.11 L
S
GR
GS
[0.75 0 0 0.75 0 0] CT
0.4 GC
2 setlinecap
1 LJ
0.667 LW
N
484.935 51 M
484.935 53.11 L
S
GR
GS
[0.75 0 0 0.75 0 0] CT
0.4 GC
2 setlinecap
1 LJ
0.667 LW
N
490.207 51 M
490.207 53.11 L
S
GR
GS
[0.75 0 0 0.75 0 0] CT
0.4 GC
2 setlinecap
1 LJ
0.667 LW
N
494.297 51 M
494.297 53.11 L
S
GR
GS
[0.75 0 0 0.75 0 0] CT
0.4 GC
2 setlinecap
1 LJ
0.667 LW
N
497.638 51 M
497.638 53.11 L
S
GR
GS
[0.75 0 0 0.75 0 0] CT
0.4 GC
2 setlinecap
1 LJ
0.667 LW
N
500.463 51 M
500.463 53.11 L
S
GR
GS
[0.75 0 0 0.75 0 0] CT
0.4 GC
2 setlinecap
1 LJ
0.667 LW
N
502.91 51 M
502.91 53.11 L
S
GR
GS
[0.75 0 0 0.75 0 0] CT
0.4 GC
2 setlinecap
1 LJ
0.667 LW
N
505.069 51 M
505.069 53.11 L
S
GR
GS
[0.75 0 0 0.75 0 0] CT
0.4 GC
2 setlinecap
1 LJ
0.667 LW
N
507 51 M
507 53.11 L
S
GR
GS
[0.75 0 0 0.75 54 297.75] CT
0.4 GC
/Helvetica 13.333 F
GS
[1 0 0 1 0 0] CT
0 0 moveto 
1 -1 scale
(10) t 
GR
GR
GS
[0.75 0 0 0.75 65.25 293.25] CT
0.4 GC
/Helvetica 10.667 F
GS
[1 0 0 1 0 0] CT
0 0 moveto 
1 -1 scale
(-8) t 
GR
GR
GS
[0.75 0 0 0.75 117 297.75] CT
0.4 GC
/Helvetica 13.333 F
GS
[1 0 0 1 0 0] CT
0 0 moveto 
1 -1 scale
(10) t 
GR
GR
GS
[0.75 0 0 0.75 128.25 293.25] CT
0.4 GC
/Helvetica 10.667 F
GS
[1 0 0 1 0 0] CT
0 0 moveto 
1 -1 scale
(-6) t 
GR
GR
GS
[0.75 0 0 0.75 180.75 297.75] CT
0.4 GC
/Helvetica 13.333 F
GS
[1 0 0 1 0 0] CT
0 0 moveto 
1 -1 scale
(10) t 
GR
GR
GS
[0.75 0 0 0.75 192 293.25] CT
0.4 GC
/Helvetica 10.667 F
GS
[1 0 0 1 0 0] CT
0 0 moveto 
1 -1 scale
(-4) t 
GR
GR
GS
[0.75 0 0 0.75 243.75 297.75] CT
0.4 GC
/Helvetica 13.333 F
GS
[1 0 0 1 0 0] CT
0 0 moveto 
1 -1 scale
(10) t 
GR
GR
GS
[0.75 0 0 0.75 255 293.25] CT
0.4 GC
/Helvetica 10.667 F
GS
[1 0 0 1 0 0] CT
0 0 moveto 
1 -1 scale
(-2) t 
GR
GR
GS
[0.75 0 0 0.75 309 297.75] CT
0.4 GC
/Helvetica 13.333 F
GS
[1 0 0 1 0 0] CT
0 0 moveto 
1 -1 scale
(10) t 
GR
GR
GS
[0.75 0 0 0.75 320.25 293.25] CT
0.4 GC
/Helvetica 10.667 F
GS
[1 0 0 1 0 0] CT
0 0 moveto 
1 -1 scale
(0) t 
GR
GR
GS
[0.75 0 0 0.75 372 297.75] CT
0.4 GC
/Helvetica 13.333 F
GS
[1 0 0 1 0 0] CT
0 0 moveto 
1 -1 scale
(10) t 
GR
GR
GS
[0.75 0 0 0.75 383.25 293.25] CT
0.4 GC
/Helvetica 10.667 F
GS
[1 0 0 1 0 0] CT
0 0 moveto 
1 -1 scale
(2) t 
GR
GR
GS
[0.75 0 0 0.75 0 0] CT
0.4 GC
2 setlinecap
1 LJ
0.667 LW
N
85 374 M
85 51 L
S
GR
GS
[0.75 0 0 0.75 0 0] CT
0.4 GC
2 setlinecap
1 LJ
0.667 LW
N
507 374 M
507 51 L
S
GR
GS
[0.75 0 0 0.75 0 0] CT
0.4 GC
2 setlinecap
1 LJ
0.667 LW
N
85 374 M
89.22 374 L
S
GR
GS
[0.75 0 0 0.75 0 0] CT
0.4 GC
2 setlinecap
1 LJ
0.667 LW
N
85 333.625 M
89.22 333.625 L
S
GR
GS
[0.75 0 0 0.75 0 0] CT
0.4 GC
2 setlinecap
1 LJ
0.667 LW
N
85 293.25 M
89.22 293.25 L
S
GR
GS
[0.75 0 0 0.75 0 0] CT
0.4 GC
2 setlinecap
1 LJ
0.667 LW
N
85 252.875 M
89.22 252.875 L
S
GR
GS
[0.75 0 0 0.75 0 0] CT
0.4 GC
2 setlinecap
1 LJ
0.667 LW
N
85 212.5 M
89.22 212.5 L
S
GR
GS
[0.75 0 0 0.75 0 0] CT
0.4 GC
2 setlinecap
1 LJ
0.667 LW
N
85 172.125 M
89.22 172.125 L
S
GR
GS
[0.75 0 0 0.75 0 0] CT
0.4 GC
2 setlinecap
1 LJ
0.667 LW
N
85 131.75 M
89.22 131.75 L
S
GR
GS
[0.75 0 0 0.75 0 0] CT
0.4 GC
2 setlinecap
1 LJ
0.667 LW
N
85 91.375 M
89.22 91.375 L
S
GR
GS
[0.75 0 0 0.75 0 0] CT
0.4 GC
2 setlinecap
1 LJ
0.667 LW
N
85 51 M
89.22 51 L
S
GR
GS
[0.75 0 0 0.75 0 0] CT
0.4 GC
2 setlinecap
1 LJ
0.667 LW
N
507 374 M
502.78 374 L
S
GR
GS
[0.75 0 0 0.75 0 0] CT
0.4 GC
2 setlinecap
1 LJ
0.667 LW
N
507 333.625 M
502.78 333.625 L
S
GR
GS
[0.75 0 0 0.75 0 0] CT
0.4 GC
2 setlinecap
1 LJ
0.667 LW
N
507 293.25 M
502.78 293.25 L
S
GR
GS
[0.75 0 0 0.75 0 0] CT
0.4 GC
2 setlinecap
1 LJ
0.667 LW
N
507 252.875 M
502.78 252.875 L
S
GR
GS
[0.75 0 0 0.75 0 0] CT
0.4 GC
2 setlinecap
1 LJ
0.667 LW
N
507 212.5 M
502.78 212.5 L
S
GR
GS
[0.75 0 0 0.75 0 0] CT
0.4 GC
2 setlinecap
1 LJ
0.667 LW
N
507 172.125 M
502.78 172.125 L
S
GR
GS
[0.75 0 0 0.75 0 0] CT
0.4 GC
2 setlinecap
1 LJ
0.667 LW
N
507 131.75 M
502.78 131.75 L
S
GR
GS
[0.75 0 0 0.75 0 0] CT
0.4 GC
2 setlinecap
1 LJ
0.667 LW
N
507 91.375 M
502.78 91.375 L
S
GR
GS
[0.75 0 0 0.75 0 0] CT
0.4 GC
2 setlinecap
1 LJ
0.667 LW
N
507 51 M
502.78 51 L
S
GR
GS
[0.75 0 0 0.75 59.75 280.5] CT
0.4 GC
/Helvetica 13.333 F
GS
[1 0 0 1 0 0] CT
-27 5.5 moveto 
1 -1 scale
(-140) t 
GR
GR
GS
[0.75 0 0 0.75 59.75 250.21875] CT
0.4 GC
/Helvetica 13.333 F
GS
[1 0 0 1 0 0] CT
-27 5.5 moveto 
1 -1 scale
(-120) t 
GR
GR
GS
[0.75 0 0 0.75 59.75 219.9375] CT
0.4 GC
/Helvetica 13.333 F
GS
[1 0 0 1 0 0] CT
-27 5.5 moveto 
1 -1 scale
(-100) t 
GR
GR
GS
[0.75 0 0 0.75 59.75 189.65625] CT
0.4 GC
/Helvetica 13.333 F
GS
[1 0 0 1 0 0] CT
-19 5.5 moveto 
1 -1 scale
(-80) t 
GR
GR
GS
[0.75 0 0 0.75 59.75 159.375] CT
0.4 GC
/Helvetica 13.333 F
GS
[1 0 0 1 0 0] CT
-19 5.5 moveto 
1 -1 scale
(-60) t 
GR
GR
GS
[0.75 0 0 0.75 59.75 129.09375] CT
0.4 GC
/Helvetica 13.333 F
GS
[1 0 0 1 0 0] CT
-19 5.5 moveto 
1 -1 scale
(-40) t 
GR
GR
GS
[0.75 0 0 0.75 59.75 98.8125] CT
0.4 GC
/Helvetica 13.333 F
GS
[1 0 0 1 0 0] CT
-19 5.5 moveto 
1 -1 scale
(-20) t 
GR
GR
GS
[0.75 0 0 0.75 59.75 68.53125] CT
0.4 GC
/Helvetica 13.333 F
GS
[1 0 0 1 0 0] CT
-8 5.5 moveto 
1 -1 scale
(0) t 
GR
GR
GS
[0.75 0 0 0.75 59.75 38.25] CT
0.4 GC
/Helvetica 13.333 F
GS
[1 0 0 1 0 0] CT
-15 5.5 moveto 
1 -1 scale
(20) t 
GR
GR
GS
[0.75 0 0 0.75 0 0] CT
0 0.447 0.741 RC
1 LJ
0.667 LW
N
84.95 340.744 M
92.02 333.979 L
113.12 313.792 L
134.22 293.604 L
155.32 273.417 L
176.42 253.229 L
197.52 233.042 L
218.62 212.854 L
239.72 192.667 L
260.82 172.48 L
281.92 152.294 L
288.454 146.044 L
291.269 143.352 L
294.084 140.661 L
296.898 137.97 L
299.713 135.281 L
302.528 132.592 L
305.342 129.905 L
308.157 127.22 L
310.972 124.538 L
313.786 121.86 L
316.601 119.187 L
319.416 116.521 L
322.23 113.863 L
325.045 111.219 L
327.86 108.591 L
330.674 105.985 L
333.489 103.41 L
336.304 100.877 L
339.119 98.402 L
341.933 96.009 L
344.748 93.729 L
347.563 91.607 L
350.377 89.706 L
353.192 88.103 L
356.007 86.891 L
358.821 86.159 L
361.636 85.961 L
364.451 86.273 L
367.265 86.981 L
370.08 87.899 L
372.895 88.818 L
375.709 89.541 L
378.524 89.927 L
381.339 90.171 L
384.153 90.375 L
386.968 90.552 L
389.783 90.703 L
392.598 90.831 L
395.412 90.938 L
398.227 91.027 L
401.042 91.101 L
403.856 91.161 L
406.671 91.21 L
409.486 91.249 L
412.3 91.28 L
415.115 91.305 L
417.93 91.324 L
420.744 91.338 L
423.559 91.349 L
426.374 91.357 L
429.188 91.363 L
432.003 91.367 L
434.818 91.37 L
437.632 91.372 L
440.447 91.373 L
443.262 91.374 L
446.076 91.374 L
448.891 91.375 L
451.706 91.375 L
454.52 91.375 L
457.335 91.375 L
460.15 91.375 L
462.965 91.375 L
465.779 91.375 L
468.594 91.375 L
471.409 91.375 L
474.223 91.375 L
477.038 91.375 L
479.853 91.375 L
482.667 91.375 L
485.482 91.375 L
488.297 91.375 L
491.111 91.375 L
493.926 91.375 L
496.741 91.375 L
499.555 91.375 L
502.37 91.375 L
507.05 91.375 L
S
GR
GS
[0.75 0 0 0.75 0 0] CT
0 0.447 0.741 RC
1 LJ
0.667 LW
N
84.95 341.447 M
92.02 334.683 L
113.12 314.495 L
134.22 294.308 L
155.32 274.12 L
176.42 253.933 L
197.52 233.745 L
218.62 213.558 L
239.72 193.37 L
260.82 173.183 L
281.92 152.999 L
288.454 146.752 L
291.269 144.062 L
294.084 141.373 L
296.898 138.686 L
299.713 136.001 L
302.528 133.319 L
305.342 130.64 L
308.157 127.967 L
310.972 125.3 L
313.786 122.644 L
316.601 120 L
319.416 117.374 L
322.23 114.771 L
325.045 112.201 L
327.86 109.672 L
330.674 107.2 L
333.489 104.801 L
336.304 102.496 L
339.119 100.31 L
341.933 98.268 L
344.748 96.4 L
347.563 94.733 L
350.377 93.29 L
353.192 92.088 L
356.007 91.132 L
358.821 90.418 L
361.636 89.933 L
364.451 89.652 L
367.265 89.544 L
370.08 89.574 L
372.895 89.714 L
375.709 89.979 L
378.524 90.41 L
381.339 90.793 L
384.153 91.048 L
386.968 91.201 L
389.783 91.287 L
392.598 91.334 L
395.412 91.358 L
398.227 91.37 L
401.042 91.375 L
403.856 91.377 L
406.671 91.377 L
409.486 91.377 L
412.3 91.377 L
415.115 91.376 L
417.93 91.376 L
420.744 91.376 L
423.559 91.375 L
426.374 91.375 L
429.188 91.375 L
432.003 91.375 L
434.818 91.375 L
437.632 91.375 L
440.447 91.375 L
443.262 91.375 L
446.076 91.375 L
448.891 91.375 L
451.706 91.375 L
454.52 91.375 L
457.335 91.375 L
460.15 91.375 L
462.965 91.375 L
465.779 91.375 L
468.594 91.375 L
471.409 91.375 L
474.223 91.375 L
477.038 91.375 L
479.853 91.375 L
482.667 91.375 L
485.482 91.375 L
488.297 91.375 L
491.111 91.375 L
493.926 91.375 L
496.741 91.375 L
499.555 91.375 L
502.37 91.375 L
507.05 91.375 L
S
GR
GS
[0.75 0 0 0.75 0 0] CT
0.851 0.325 0.098 RC
1 LJ
0.667 LW
N
84.95 252.873 M
97.703 252.871 L
100.529 252.87 L
103.354 252.868 L
106.179 252.866 L
109.004 252.863 L
111.829 252.859 L
114.655 252.853 L
117.48 252.845 L
120.305 252.834 L
123.13 252.819 L
125.955 252.799 L
128.781 252.771 L
131.606 252.734 L
134.431 252.684 L
137.256 252.616 L
140.081 252.525 L
142.906 252.401 L
145.732 252.236 L
148.557 252.017 L
151.382 251.726 L
154.207 251.346 L
157.032 250.853 L
159.858 250.225 L
162.683 249.435 L
165.508 248.464 L
168.333 247.293 L
171.158 245.917 L
173.984 244.334 L
176.809 242.556 L
179.634 240.601 L
182.459 238.491 L
185.284 236.251 L
188.109 233.905 L
190.935 231.473 L
193.76 228.975 L
196.585 226.426 L
199.41 223.837 L
202.235 221.219 L
205.061 218.579 L
207.886 215.923 L
210.711 213.255 L
213.536 210.577 L
216.361 207.893 L
219.187 205.203 L
222.012 202.51 L
224.837 199.815 L
227.662 197.117 L
232.7 192.304 L
253.8 172.124 L
274.9 151.94 L
281.341 145.78 L
284.166 143.078 L
286.991 140.378 L
289.816 137.678 L
292.641 134.979 L
295.467 132.281 L
298.292 129.585 L
301.117 126.893 L
303.942 124.203 L
306.767 121.519 L
309.593 118.841 L
312.418 116.173 L
315.243 113.516 L
318.068 110.877 L
320.893 108.259 L
323.718 105.67 L
326.544 103.121 L
329.369 100.623 L
332.194 98.191 L
335.019 95.845 L
337.844 93.605 L
340.67 91.495 L
343.495 89.54 L
346.32 87.762 L
349.145 86.179 L
351.97 84.802 L
354.796 83.632 L
357.621 82.661 L
360.446 81.871 L
363.271 81.242 L
366.096 80.75 L
368.921 80.37 L
371.747 80.079 L
374.572 79.86 L
377.397 79.695 L
380.222 79.571 L
383.047 79.48 L
385.873 79.412 L
388.698 79.362 L
391.523 79.324 L
394.348 79.297 L
397.173 79.277 L
399.999 79.262 L
402.824 79.251 L
405.649 79.243 L
408.474 79.237 L
411.299 79.233 L
414.124 79.23 L
416.95 79.227 L
419.775 79.226 L
422.6 79.224 L
464.8 79.221 L
507.05 79.221 L
S
GR
GS
[0.75 0 0 0.75 0 0] CT
1 GC
N
426 105 M
426 64 L
494 64 L
494 105 L
cp
f
GR
GS
[0.75 0 0 0.75 347.25 55.59259] CT
/Helvetica 12 F
GS
[1 0 0 1 0 0] CT
0 5 moveto 
1 -1 scale
(S) t 
GR
GR
GS
[0.75 0 0 0.75 0 0] CT
0 0.447 0.741 RC
1 LJ
0.667 LW
N
430 74.123 M
460 74.123 L
S
GR
GS
[0.75 0 0 0.75 347.25 75] CT
/Helvetica 12 F
GS
[1 0 0 1 0 0] CT
0 0 moveto 
1 -1 scale
(W1) t 
GR
GR
GS
[0.75 0 0 0.75 360.75 70.5] CT
/Helvetica 9.6 F
GS
[1 0 0 1 0 0] CT
0 0 moveto 
1 -1 scale
(-1) t 
GR
GR
GS
[0.75 0 0 0.75 0 0] CT
0.851 0.325 0.098 RC
1 LJ
0.667 LW
N
430 92.852 M
460 92.852 L
S
GR
GS
[0.75 0 0 0.75 0 0] CT
0.149 GC
10.0 ML
0.667 LW
N
426 105 M
426 64 L
494 64 L
494 105 L
cp
S
GR
GS
[0.75 0 0 0.75 221.25 33.52501] CT
/Helvetica-Bold 14.667 F
GS
[1 0 0 1 0 0] CT
-56.5 -4 moveto 
1 -1 scale
(Singular Values) t 
GR
GR
GS
[0.75 0 0 0.75 221.25 299.74999] CT
/Helvetica 14.667 F
GS
[1 0 0 1 0 0] CT
-59.5 16 moveto 
1 -1 scale
(Frequency \(rad/s\)) t 
GR
GR
GS
[0 -0.75 0.75 0 36.5 160.3875] CT
/Helvetica 14.667 F
GS
[1 0 0 1 0 0] CT
-69 -4 moveto 
1 -1 scale
(Singular Values \(dB\)) t 
GR
GR
%%Trailer
%%Pages: 1
%%EOF
