%!PS-Adobe-3.0 EPSF-3.0
%%Creator: (MATLAB, The Mathworks, Inc. Version 9.1.0.441655 \(R2016b\). Operating System: Linux)
%%Title: /home/frdm/Documents/RLS/rls-2017/sp5/figures/01.eps
%%CreationDate: 2018-02-01T18:26:20
%%Pages: (atend)
%%BoundingBox: 0 0 737 471
%%LanguageLevel: 3
%%EndComments
%%BeginProlog
%%BeginResource: procset (Apache XML Graphics Std ProcSet) 1.2 0
%%Version: 1.2 0
%%Copyright: (Copyright 2001-2003,2010 The Apache Software Foundation. License terms: http://www.apache.org/licenses/LICENSE-2.0)
/bd{bind def}bind def
/ld{load def}bd
/GR/grestore ld
/M/moveto ld
/LJ/setlinejoin ld
/C/curveto ld
/f/fill ld
/LW/setlinewidth ld
/GC/setgray ld
/t/show ld
/N/newpath ld
/CT/concat ld
/cp/closepath ld
/S/stroke ld
/L/lineto ld
/CC/setcmykcolor ld
/A/ashow ld
/GS/gsave ld
/RC/setrgbcolor ld
/RM/rmoveto ld
/ML/setmiterlimit ld
/re {4 2 roll M
1 index 0 rlineto
0 exch rlineto
neg 0 rlineto
cp } bd
/_ctm matrix def
/_tm matrix def
/BT { _ctm currentmatrix pop matrix _tm copy pop 0 0 moveto } bd
/ET { _ctm setmatrix } bd
/iTm { _ctm setmatrix _tm concat } bd
/Tm { _tm astore pop iTm 0 0 moveto } bd
/ux 0.0 def
/uy 0.0 def
/F {
  /Tp exch def
  /Tf exch def
  Tf findfont Tp scalefont setfont
  /cf Tf def  /cs Tp def
} bd
/ULS {currentpoint /uy exch def /ux exch def} bd
/ULE {
  /Tcx currentpoint pop def
  gsave
  newpath
  cf findfont cs scalefont dup
  /FontMatrix get 0 get /Ts exch def /FontInfo get dup
  /UnderlinePosition get Ts mul /To exch def
  /UnderlineThickness get Ts mul /Tt exch def
  ux uy To add moveto  Tcx uy To add lineto
  Tt setlinewidth stroke
  grestore
} bd
/OLE {
  /Tcx currentpoint pop def
  gsave
  newpath
  cf findfont cs scalefont dup
  /FontMatrix get 0 get /Ts exch def /FontInfo get dup
  /UnderlinePosition get Ts mul /To exch def
  /UnderlineThickness get Ts mul /Tt exch def
  ux uy To add cs add moveto Tcx uy To add cs add lineto
  Tt setlinewidth stroke
  grestore
} bd
/SOE {
  /Tcx currentpoint pop def
  gsave
  newpath
  cf findfont cs scalefont dup
  /FontMatrix get 0 get /Ts exch def /FontInfo get dup
  /UnderlinePosition get Ts mul /To exch def
  /UnderlineThickness get Ts mul /Tt exch def
  ux uy To add cs 10 mul 26 idiv add moveto Tcx uy To add cs 10 mul 26 idiv add lineto
  Tt setlinewidth stroke
  grestore
} bd
/QT {
/Y22 exch store
/X22 exch store
/Y21 exch store
/X21 exch store
currentpoint
/Y21 load 2 mul add 3 div exch
/X21 load 2 mul add 3 div exch
/X21 load 2 mul /X22 load add 3 div
/Y21 load 2 mul /Y22 load add 3 div
/X22 load /Y22 load curveto
} bd
/SSPD {
dup length /d exch dict def
{
/v exch def
/k exch def
currentpagedevice k known {
/cpdv currentpagedevice k get def
v cpdv ne {
/upd false def
/nullv v type /nulltype eq def
/nullcpdv cpdv type /nulltype eq def
nullv nullcpdv or
{
/upd true def
} {
/sametype v type cpdv type eq def
sametype {
v type /arraytype eq {
/vlen v length def
/cpdvlen cpdv length def
vlen cpdvlen eq {
0 1 vlen 1 sub {
/i exch def
/obj v i get def
/cpdobj cpdv i get def
obj cpdobj ne {
/upd true def
exit
} if
} for
} {
/upd true def
} ifelse
} {
v type /dicttype eq {
v {
/dv exch def
/dk exch def
/cpddv cpdv dk get def
dv cpddv ne {
/upd true def
exit
} if
} forall
} {
/upd true def
} ifelse
} ifelse
} if
} ifelse
upd true eq {
d k v put
} if
} if
} if
} forall
d length 0 gt {
d setpagedevice
} if
} bd
/RE { % /NewFontName [NewEncodingArray] /FontName RE -
  findfont dup length dict begin
  {
    1 index /FID ne
    {def} {pop pop} ifelse
  } forall
  /Encoding exch def
  /FontName 1 index def
  currentdict definefont pop
  end
} bind def
%%EndResource
%%BeginResource: procset (Apache XML Graphics EPS ProcSet) 1.0 0
%%Version: 1.0 0
%%Copyright: (Copyright 2002-2003 The Apache Software Foundation. License terms: http://www.apache.org/licenses/LICENSE-2.0)
/BeginEPSF { %def
/b4_Inc_state save def         % Save state for cleanup
/dict_count countdictstack def % Count objects on dict stack
/op_count count 1 sub def      % Count objects on operand stack
userdict begin                 % Push userdict on dict stack
/showpage { } def              % Redefine showpage, { } = null proc
0 setgray 0 setlinecap         % Prepare graphics state
1 setlinewidth 0 setlinejoin
10 setmiterlimit [ ] 0 setdash newpath
/languagelevel where           % If level not equal to 1 then
{pop languagelevel             % set strokeadjust and
1 ne                           % overprint to their defaults.
{false setstrokeadjust false setoverprint
} if
} if
} bd
/EndEPSF { %def
count op_count sub {pop} repeat            % Clean up stacks
countdictstack dict_count sub {end} repeat
b4_Inc_state restore
} bd
%%EndResource
%FOPBeginFontDict
%%IncludeResource: font Courier-Bold
%%IncludeResource: font Helvetica
%%IncludeResource: font Courier-BoldOblique
%%IncludeResource: font Courier-Oblique
%%IncludeResource: font Times-Roman
%%IncludeResource: font Helvetica-BoldOblique
%%IncludeResource: font Helvetica-Bold
%%IncludeResource: font Helvetica-Oblique
%%IncludeResource: font Times-BoldItalic
%%IncludeResource: font Courier
%%IncludeResource: font Times-Italic
%%IncludeResource: font Times-Bold
%%IncludeResource: font Symbol
%%IncludeResource: font ZapfDingbats
%FOPEndFontDict
%%BeginResource: encoding WinAnsiEncoding
/WinAnsiEncoding [
/.notdef /.notdef /.notdef /.notdef /.notdef
/.notdef /.notdef /.notdef /.notdef /.notdef
/.notdef /.notdef /.notdef /.notdef /.notdef
/.notdef /.notdef /.notdef /.notdef /.notdef
/.notdef /.notdef /.notdef /.notdef /.notdef
/.notdef /.notdef /.notdef /.notdef /.notdef
/.notdef /.notdef /space /exclam /quotedbl
/numbersign /dollar /percent /ampersand /quotesingle
/parenleft /parenright /asterisk /plus /comma
/hyphen /period /slash /zero /one
/two /three /four /five /six
/seven /eight /nine /colon /semicolon
/less /equal /greater /question /at
/A /B /C /D /E
/F /G /H /I /J
/K /L /M /N /O
/P /Q /R /S /T
/U /V /W /X /Y
/Z /bracketleft /backslash /bracketright /asciicircum
/underscore /quoteleft /a /b /c
/d /e /f /g /h
/i /j /k /l /m
/n /o /p /q /r
/s /t /u /v /w
/x /y /z /braceleft /bar
/braceright /asciitilde /bullet /Euro /bullet
/quotesinglbase /florin /quotedblbase /ellipsis /dagger
/daggerdbl /circumflex /perthousand /Scaron /guilsinglleft
/OE /bullet /Zcaron /bullet /bullet
/quoteleft /quoteright /quotedblleft /quotedblright /bullet
/endash /emdash /asciitilde /trademark /scaron
/guilsinglright /oe /bullet /zcaron /Ydieresis
/space /exclamdown /cent /sterling /currency
/yen /brokenbar /section /dieresis /copyright
/ordfeminine /guillemotleft /logicalnot /sfthyphen /registered
/macron /degree /plusminus /twosuperior /threesuperior
/acute /mu /paragraph /middot /cedilla
/onesuperior /ordmasculine /guillemotright /onequarter /onehalf
/threequarters /questiondown /Agrave /Aacute /Acircumflex
/Atilde /Adieresis /Aring /AE /Ccedilla
/Egrave /Eacute /Ecircumflex /Edieresis /Igrave
/Iacute /Icircumflex /Idieresis /Eth /Ntilde
/Ograve /Oacute /Ocircumflex /Otilde /Odieresis
/multiply /Oslash /Ugrave /Uacute /Ucircumflex
/Udieresis /Yacute /Thorn /germandbls /agrave
/aacute /acircumflex /atilde /adieresis /aring
/ae /ccedilla /egrave /eacute /ecircumflex
/edieresis /igrave /iacute /icircumflex /idieresis
/eth /ntilde /ograve /oacute /ocircumflex
/otilde /odieresis /divide /oslash /ugrave
/uacute /ucircumflex /udieresis /yacute /thorn
/ydieresis
] def
%%EndResource
%FOPBeginFontReencode
/Courier-Bold findfont
dup length dict begin
  {1 index /FID ne {def} {pop pop} ifelse} forall
  /Encoding WinAnsiEncoding def
  currentdict
end
/Courier-Bold exch definefont pop
/Helvetica findfont
dup length dict begin
  {1 index /FID ne {def} {pop pop} ifelse} forall
  /Encoding WinAnsiEncoding def
  currentdict
end
/Helvetica exch definefont pop
/Courier-BoldOblique findfont
dup length dict begin
  {1 index /FID ne {def} {pop pop} ifelse} forall
  /Encoding WinAnsiEncoding def
  currentdict
end
/Courier-BoldOblique exch definefont pop
/Courier-Oblique findfont
dup length dict begin
  {1 index /FID ne {def} {pop pop} ifelse} forall
  /Encoding WinAnsiEncoding def
  currentdict
end
/Courier-Oblique exch definefont pop
/Times-Roman findfont
dup length dict begin
  {1 index /FID ne {def} {pop pop} ifelse} forall
  /Encoding WinAnsiEncoding def
  currentdict
end
/Times-Roman exch definefont pop
/Helvetica-BoldOblique findfont
dup length dict begin
  {1 index /FID ne {def} {pop pop} ifelse} forall
  /Encoding WinAnsiEncoding def
  currentdict
end
/Helvetica-BoldOblique exch definefont pop
/Helvetica-Bold findfont
dup length dict begin
  {1 index /FID ne {def} {pop pop} ifelse} forall
  /Encoding WinAnsiEncoding def
  currentdict
end
/Helvetica-Bold exch definefont pop
/Helvetica-Oblique findfont
dup length dict begin
  {1 index /FID ne {def} {pop pop} ifelse} forall
  /Encoding WinAnsiEncoding def
  currentdict
end
/Helvetica-Oblique exch definefont pop
/Times-BoldItalic findfont
dup length dict begin
  {1 index /FID ne {def} {pop pop} ifelse} forall
  /Encoding WinAnsiEncoding def
  currentdict
end
/Times-BoldItalic exch definefont pop
/Courier findfont
dup length dict begin
  {1 index /FID ne {def} {pop pop} ifelse} forall
  /Encoding WinAnsiEncoding def
  currentdict
end
/Courier exch definefont pop
/Times-Italic findfont
dup length dict begin
  {1 index /FID ne {def} {pop pop} ifelse} forall
  /Encoding WinAnsiEncoding def
  currentdict
end
/Times-Italic exch definefont pop
/Times-Bold findfont
dup length dict begin
  {1 index /FID ne {def} {pop pop} ifelse} forall
  /Encoding WinAnsiEncoding def
  currentdict
end
/Times-Bold exch definefont pop
%FOPEndFontReencode
%%EndProlog
%%Page: 1 1
%%PageBoundingBox: 0 0 737 471
%%BeginPageSetup
[1 0 0 -1 0 471] CT
%%EndPageSetup
GS
[0.75 0 0 0.75 0 0] CT
1 GC
N
0 0 983 628 re
f
GR
GS
[0.75 0 0 0.75 0 0] CT
1 GC
N
0 0 983 628 re
f
GR
GS
[0.75 0 0 0.75 0 0] CT
1 GC
N
128 559 M
890 559 L
890 47 L
128 47 L
cp
f
GR
GS
[0.75 0 0 0.75 0 0] CT
0.149 GC
2 setlinecap
1 LJ
0.667 LW
N
128 559 M
890 559 L
S
GR
GS
[0.75 0 0 0.75 0 0] CT
0.149 GC
2 setlinecap
1 LJ
0.667 LW
N
128 559 M
128 551.38 L
S
GR
GS
[0.75 0 0 0.75 0 0] CT
0.149 GC
2 setlinecap
1 LJ
0.667 LW
N
204.2 559 M
204.2 551.38 L
S
GR
GS
[0.75 0 0 0.75 0 0] CT
0.149 GC
2 setlinecap
1 LJ
0.667 LW
N
280.4 559 M
280.4 551.38 L
S
GR
GS
[0.75 0 0 0.75 0 0] CT
0.149 GC
2 setlinecap
1 LJ
0.667 LW
N
356.6 559 M
356.6 551.38 L
S
GR
GS
[0.75 0 0 0.75 0 0] CT
0.149 GC
2 setlinecap
1 LJ
0.667 LW
N
432.8 559 M
432.8 551.38 L
S
GR
GS
[0.75 0 0 0.75 0 0] CT
0.149 GC
2 setlinecap
1 LJ
0.667 LW
N
509 559 M
509 551.38 L
S
GR
GS
[0.75 0 0 0.75 0 0] CT
0.149 GC
2 setlinecap
1 LJ
0.667 LW
N
585.2 559 M
585.2 551.38 L
S
GR
GS
[0.75 0 0 0.75 0 0] CT
0.149 GC
2 setlinecap
1 LJ
0.667 LW
N
661.4 559 M
661.4 551.38 L
S
GR
GS
[0.75 0 0 0.75 0 0] CT
0.149 GC
2 setlinecap
1 LJ
0.667 LW
N
737.6 559 M
737.6 551.38 L
S
GR
GS
[0.75 0 0 0.75 0 0] CT
0.149 GC
2 setlinecap
1 LJ
0.667 LW
N
813.8 559 M
813.8 551.38 L
S
GR
GS
[0.75 0 0 0.75 0 0] CT
0.149 GC
2 setlinecap
1 LJ
0.667 LW
N
890 559 M
890 551.38 L
S
GR
GS
[0.75 0 0 0.75 96 423.24998] CT
0.149 GC
/Helvetica 13.333 F
GS
[1 0 0 1 0 0] CT
-4.5 13 moveto 
1 -1 scale
(0) t 
GR
GR
GS
[0.75 0 0 0.75 153.15 423.24998] CT
0.149 GC
/Helvetica 13.333 F
GS
[1 0 0 1 0 0] CT
-8.5 13 moveto 
1 -1 scale
(50) t 
GR
GR
GS
[0.75 0 0 0.75 210.3 423.24998] CT
0.149 GC
/Helvetica 13.333 F
GS
[1 0 0 1 0 0] CT
-12.5 13 moveto 
1 -1 scale
(100) t 
GR
GR
GS
[0.75 0 0 0.75 267.45 423.24998] CT
0.149 GC
/Helvetica 13.333 F
GS
[1 0 0 1 0 0] CT
-12.5 13 moveto 
1 -1 scale
(150) t 
GR
GR
GS
[0.75 0 0 0.75 324.59999 423.24998] CT
0.149 GC
/Helvetica 13.333 F
GS
[1 0 0 1 0 0] CT
-12.5 13 moveto 
1 -1 scale
(200) t 
GR
GR
GS
[0.75 0 0 0.75 381.75 423.24998] CT
0.149 GC
/Helvetica 13.333 F
GS
[1 0 0 1 0 0] CT
-12.5 13 moveto 
1 -1 scale
(250) t 
GR
GR
GS
[0.75 0 0 0.75 438.90001 423.24998] CT
0.149 GC
/Helvetica 13.333 F
GS
[1 0 0 1 0 0] CT
-12.5 13 moveto 
1 -1 scale
(300) t 
GR
GR
GS
[0.75 0 0 0.75 496.05002 423.24998] CT
0.149 GC
/Helvetica 13.333 F
GS
[1 0 0 1 0 0] CT
-12.5 13 moveto 
1 -1 scale
(350) t 
GR
GR
GS
[0.75 0 0 0.75 553.19998 423.24998] CT
0.149 GC
/Helvetica 13.333 F
GS
[1 0 0 1 0 0] CT
-12.5 13 moveto 
1 -1 scale
(400) t 
GR
GR
GS
[0.75 0 0 0.75 610.34999 423.24998] CT
0.149 GC
/Helvetica 13.333 F
GS
[1 0 0 1 0 0] CT
-12.5 13 moveto 
1 -1 scale
(450) t 
GR
GR
GS
[0.75 0 0 0.75 667.5 423.24998] CT
0.149 GC
/Helvetica 13.333 F
GS
[1 0 0 1 0 0] CT
-12.5 13 moveto 
1 -1 scale
(500) t 
GR
GR
GS
[0.75 0 0 0.75 381.75027 437.00002] CT
0.149 GC
/Helvetica 14.667 F
GS
[1 0 0 1 0 0] CT
-57.5 14 moveto 
1 -1 scale
(Time \(seconds\)) t 
GR
GR
GS
[0.75 0 0 0.75 0 0] CT
0.149 GC
2 setlinecap
1 LJ
0.667 LW
N
128 559 M
128 47 L
S
GR
GS
[0.75 0 0 0.75 0 0] CT
0.149 GC
2 setlinecap
1 LJ
0.667 LW
N
128 559 M
135.62 559 L
S
GR
GS
[0.75 0 0 0.75 0 0] CT
0.149 GC
2 setlinecap
1 LJ
0.667 LW
N
128 456.6 M
135.62 456.6 L
S
GR
GS
[0.75 0 0 0.75 0 0] CT
0.149 GC
2 setlinecap
1 LJ
0.667 LW
N
128 354.2 M
135.62 354.2 L
S
GR
GS
[0.75 0 0 0.75 0 0] CT
0.149 GC
2 setlinecap
1 LJ
0.667 LW
N
128 251.8 M
135.62 251.8 L
S
GR
GS
[0.75 0 0 0.75 0 0] CT
0.149 GC
2 setlinecap
1 LJ
0.667 LW
N
128 149.4 M
135.62 149.4 L
S
GR
GS
[0.75 0 0 0.75 0 0] CT
0.149 GC
2 setlinecap
1 LJ
0.667 LW
N
128 47 M
135.62 47 L
S
GR
GS
[0.75 0 0 0.75 92 419.25] CT
0.149 GC
/Helvetica 13.333 F
GS
[1 0 0 1 0 0] CT
-9 4.5 moveto 
1 -1 scale
(0) t 
GR
GR
GS
[0.75 0 0 0.75 92 342.45] CT
0.149 GC
/Helvetica 13.333 F
GS
[1 0 0 1 0 0] CT
-29 4.5 moveto 
1 -1 scale
(0.05) t 
GR
GR
GS
[0.75 0 0 0.75 92 265.65001] CT
0.149 GC
/Helvetica 13.333 F
GS
[1 0 0 1 0 0] CT
-21 4.5 moveto 
1 -1 scale
(0.1) t 
GR
GR
GS
[0.75 0 0 0.75 92 188.84999] CT
0.149 GC
/Helvetica 13.333 F
GS
[1 0 0 1 0 0] CT
-29 4.5 moveto 
1 -1 scale
(0.15) t 
GR
GR
GS
[0.75 0 0 0.75 92 112.05] CT
0.149 GC
/Helvetica 13.333 F
GS
[1 0 0 1 0 0] CT
-21 4.5 moveto 
1 -1 scale
(0.2) t 
GR
GR
GS
[0.75 0 0 0.75 92 35.25] CT
0.149 GC
/Helvetica 13.333 F
GS
[1 0 0 1 0 0] CT
-29 4.5 moveto 
1 -1 scale
(0.25) t 
GR
GR
GS
[0 -0.75 0.75 0 67.25 227.24982] CT
0.149 GC
N
-48.203 -4 M
-52.375 -14.938 L
-50.844 -14.938 L
-47.375 -5.734 L
-43.906 -14.938 L
-42.359 -14.938 L
-46.531 -4 L
-48.203 -4 L
cp
-37.646 -3.234 M
-38.224 -1.766 -38.763 -1.32 QT
-39.302 -0.875 -40.208 -0.875 QT
-41.286 -0.875 L
-41.286 -2 L
-40.49 -2 L
-39.943 -2 -39.63 -2.266 QT
-39.318 -2.531 -38.958 -3.516 QT
-38.708 -4.125 L
-42.021 -12.203 L
-40.599 -12.203 L
-38.036 -5.781 L
-35.474 -12.203 L
-34.036 -12.203 L
-37.646 -3.234 L
cp
-36.708 -16 M
-35.255 -16 L
-37.63 -13.25 L
-38.755 -13.25 L
-36.708 -16 L
cp
-27.16 -11.969 M
-27.16 -10.688 L
-27.722 -10.984 -28.339 -11.125 QT
-28.957 -11.266 -29.613 -11.266 QT
-30.629 -11.266 -31.129 -10.961 QT
-31.629 -10.656 -31.629 -10.047 QT
-31.629 -9.578 -31.269 -9.313 QT
-30.91 -9.047 -29.816 -8.797 QT
-29.363 -8.688 L
-27.925 -8.391 -27.324 -7.828 QT
-26.722 -7.266 -26.722 -6.266 QT
-26.722 -5.125 -27.621 -4.453 QT
-28.519 -3.781 -30.113 -3.781 QT
-30.769 -3.781 -31.48 -3.914 QT
-32.191 -4.047 -32.988 -4.297 QT
-32.988 -5.688 L
-32.238 -5.297 -31.511 -5.109 QT
-30.785 -4.922 -30.082 -4.922 QT
-29.129 -4.922 -28.613 -5.242 QT
-28.097 -5.563 -28.097 -6.156 QT
-28.097 -6.703 -28.472 -7 QT
-28.847 -7.297 -30.097 -7.563 QT
-30.566 -7.672 L
-31.816 -7.938 -32.371 -8.484 QT
-32.925 -9.031 -32.925 -9.984 QT
-32.925 -11.141 -32.105 -11.773 QT
-31.285 -12.406 -29.785 -12.406 QT
-29.035 -12.406 -28.371 -12.297 QT
-27.707 -12.188 -27.16 -11.969 QT
cp
-30.363 -13.25 M
-32.16 -16 L
-31.144 -16 L
-29.816 -14.203 L
-28.504 -16 L
-27.488 -16 L
-29.269 -13.25 L
-30.363 -13.25 L
cp
-24.805 -15.391 M
-23.446 -15.391 L
-23.446 -8.672 L
-19.43 -12.203 L
-17.711 -12.203 L
-22.055 -8.359 L
-17.524 -4 L
-19.274 -4 L
-23.446 -8 L
-23.446 -4 L
-24.805 -4 L
-24.805 -15.391 L
cp
-12.536 -8.125 M
-14.161 -8.125 -14.794 -7.75 QT
-15.427 -7.375 -15.427 -6.469 QT
-15.427 -5.766 -14.958 -5.344 QT
-14.49 -4.922 -13.677 -4.922 QT
-12.552 -4.922 -11.872 -5.711 QT
-11.193 -6.5 -11.193 -7.828 QT
-11.193 -8.125 L
-12.536 -8.125 L
cp
-9.849 -8.688 M
-9.849 -4 L
-11.193 -4 L
-11.193 -5.25 L
-11.661 -4.5 -12.349 -4.141 QT
-13.036 -3.781 -14.036 -3.781 QT
-15.286 -3.781 -16.029 -4.492 QT
-16.771 -5.203 -16.771 -6.391 QT
-16.771 -7.766 -15.849 -8.469 QT
-14.927 -9.172 -13.083 -9.172 QT
-11.193 -9.172 L
-11.193 -9.313 L
-11.193 -10.234 -11.802 -10.75 QT
-12.411 -11.266 -13.521 -11.266 QT
-14.224 -11.266 -14.896 -11.094 QT
-15.568 -10.922 -16.177 -10.578 QT
-16.177 -11.828 L
-15.443 -12.109 -14.74 -12.258 QT
-14.036 -12.406 -13.38 -12.406 QT
-11.599 -12.406 -10.724 -11.484 QT
-9.849 -10.563 -9.849 -8.688 QT
cp
4.197 -8.953 M
4.197 -4 L
2.854 -4 L
2.854 -8.906 L
2.854 -10.078 2.4 -10.656 QT
1.947 -11.234 1.025 -11.234 QT
-0.053 -11.234 -0.685 -10.539 QT
-1.318 -9.844 -1.318 -8.641 QT
-1.318 -4 L
-2.678 -4 L
-2.678 -15.391 L
-1.318 -15.391 L
-1.318 -10.922 L
-0.834 -11.672 -0.178 -12.039 QT
0.479 -12.406 1.338 -12.406 QT
2.744 -12.406 3.471 -11.531 QT
4.197 -10.656 4.197 -8.953 QT
cp
6.658 -15.391 M
8.018 -15.391 L
8.018 -4 L
6.658 -4 L
6.658 -15.391 L
cp
14.465 -8.125 M
12.84 -8.125 12.207 -7.75 QT
11.574 -7.375 11.574 -6.469 QT
11.574 -5.766 12.043 -5.344 QT
12.511 -4.922 13.324 -4.922 QT
14.449 -4.922 15.129 -5.711 QT
15.808 -6.5 15.808 -7.828 QT
15.808 -8.125 L
14.465 -8.125 L
cp
17.152 -8.688 M
17.152 -4 L
15.808 -4 L
15.808 -5.25 L
15.34 -4.5 14.652 -4.141 QT
13.965 -3.781 12.965 -3.781 QT
11.715 -3.781 10.972 -4.492 QT
10.23 -5.203 10.23 -6.391 QT
10.23 -7.766 11.152 -8.469 QT
12.074 -9.172 13.918 -9.172 QT
15.808 -9.172 L
15.808 -9.313 L
15.808 -10.234 15.199 -10.75 QT
14.59 -11.266 13.48 -11.266 QT
12.777 -11.266 12.105 -11.094 QT
11.433 -10.922 10.824 -10.578 QT
10.824 -11.828 L
11.558 -12.109 12.261 -12.258 QT
12.965 -12.406 13.621 -12.406 QT
15.402 -12.406 16.277 -11.484 QT
17.152 -10.563 17.152 -8.688 QT
cp
25.118 -10.953 M
25.118 -15.391 L
26.461 -15.391 L
26.461 -4 L
25.118 -4 L
25.118 -5.234 L
24.696 -4.5 24.047 -4.141 QT
23.399 -3.781 22.493 -3.781 QT
21.008 -3.781 20.071 -4.969 QT
19.133 -6.156 19.133 -8.094 QT
19.133 -10.031 20.071 -11.219 QT
21.008 -12.406 22.493 -12.406 QT
23.399 -12.406 24.047 -12.047 QT
24.696 -11.688 25.118 -10.953 QT
cp
20.524 -8.094 M
20.524 -6.609 21.133 -5.766 QT
21.743 -4.922 22.821 -4.922 QT
23.883 -4.922 24.5 -5.766 QT
25.118 -6.609 25.118 -8.094 QT
25.118 -9.578 24.5 -10.422 QT
23.883 -11.266 22.821 -11.266 QT
21.743 -11.266 21.133 -10.422 QT
20.524 -9.578 20.524 -8.094 QT
cp
29.015 -12.203 M
30.374 -12.203 L
30.374 -4 L
29.015 -4 L
29.015 -12.203 L
cp
29.015 -15.391 M
30.374 -15.391 L
30.374 -13.688 L
29.015 -13.688 L
29.015 -15.391 L
cp
39.915 -8.953 M
39.915 -4 L
38.571 -4 L
38.571 -8.906 L
38.571 -10.078 38.118 -10.656 QT
37.665 -11.234 36.743 -11.234 QT
35.665 -11.234 35.032 -10.539 QT
34.399 -9.844 34.399 -8.641 QT
34.399 -4 L
33.04 -4 L
33.04 -12.203 L
34.399 -12.203 L
34.399 -10.922 L
34.884 -11.672 35.54 -12.039 QT
36.196 -12.406 37.055 -12.406 QT
38.462 -12.406 39.188 -11.531 QT
39.915 -10.656 39.915 -8.953 QT
cp
45.798 -3.234 M
45.219 -1.766 44.68 -1.32 QT
44.141 -0.875 43.235 -0.875 QT
42.157 -0.875 L
42.157 -2 L
42.954 -2 L
43.501 -2 43.813 -2.266 QT
44.126 -2.531 44.485 -3.516 QT
44.735 -4.125 L
41.423 -12.203 L
42.844 -12.203 L
45.407 -5.781 L
47.969 -12.203 L
49.407 -12.203 L
45.798 -3.234 L
cp
f
GR
GS
[0.75 0 0 0.75 381.75037 33.1875] CT
/Helvetica-Bold 14.667 F
GS
[1 0 0 1 0 0] CT
-103 -4 moveto 
1 -1 scale
(H2 optimal, Q-param, T*) t 
GR
GR
GS
[0.75 0 0 0.75 0 0] CT
0 0.447 0.741 RC
1 LJ
8 LW
N
128 559 M
128.001 559 L
128.004 559 L
128.022 559 L
128.112 558.994 L
128.498 558.885 L
128.91 558.648 L
129.517 558.13 L
130.323 557.234 L
131.327 555.924 L
132.551 554.18 L
134.069 551.93 L
135.86 549.251 L
138.033 546.025 L
140.776 542.023 L
144.392 536.883 L
148.947 530.623 L
154.447 523.373 L
158.802 517.863 L
163.156 512.549 L
168.167 506.667 L
173.65 500.506 L
178.827 494.941 L
183.354 490.266 L
187.691 485.95 L
192.514 481.329 L
198.022 476.273 L
203.573 471.407 L
208.436 467.324 L
212.768 463.824 L
217.301 460.293 L
222.577 456.348 L
228.322 452.245 L
233.595 448.646 L
238.085 445.704 L
242.395 442.982 L
247.305 439.996 L
252.996 436.685 L
258.66 433.542 L
263.485 430.978 L
267.735 428.804 L
272.265 426.569 L
277.659 424.015 L
283.548 421.355 L
288.833 419.075 L
293.236 417.252 L
297.484 415.554 L
302.444 413.646 L
308.273 411.502 L
314.01 409.491 L
318.776 407.892 L
322.939 406.546 L
327.457 405.137 L
332.945 403.495 L
338.946 401.783 L
344.227 400.345 L
348.548 399.215 L
352.741 398.157 L
357.737 396.943 L
363.675 395.563 L
369.465 394.283 L
374.18 393.285 L
378.27 392.45 L
382.777 391.562 L
388.335 390.512 L
394.419 389.417 L
399.695 388.511 L
403.953 387.808 L
408.104 387.147 L
413.125 386.377 L
419.142 385.495 L
424.969 384.682 L
429.647 384.057 L
433.685 383.537 L
438.183 382.978 L
443.787 382.31 L
449.93 381.613 L
454.146 381.154 L
458.362 380.712 L
463.686 380.174 L
469.925 379.574 L
474.309 379.171 L
478.693 378.782 L
484.047 378.325 L
490.106 377.833 L
495.588 377.408 L
500.006 377.08 L
504.122 376.784 L
508.951 376.45 L
514.819 376.062 L
520.77 375.687 L
525.663 375.393 L
529.768 375.155 L
534.127 374.911 L
539.525 374.621 L
545.659 374.306 L
550.027 374.092 L
554.395 373.885 L
559.728 373.643 L
565.792 373.38 L
571.302 373.152 L
575.738 372.976 L
579.848 372.819 L
584.655 372.642 L
590.509 372.436 L
596.48 372.235 L
601.402 372.077 L
605.512 371.95 L
609.854 371.82 L
615.228 371.666 L
621.365 371.499 L
625.752 371.384 L
630.139 371.273 L
635.475 371.144 L
641.52 371.004 L
647.015 370.883 L
651.459 370.789 L
655.587 370.705 L
660.407 370.611 L
666.256 370.501 L
672.207 370.394 L
677.123 370.31 L
681.246 370.242 L
685.605 370.173 L
690.986 370.091 L
697.111 370.001 L
701.499 369.94 L
705.887 369.881 L
711.221 369.812 L
717.264 369.738 L
722.762 369.673 L
727.21 369.623 L
731.341 369.578 L
736.16 369.528 L
742.007 369.469 L
747.958 369.413 L
752.878 369.368 L
757.004 369.331 L
761.363 369.295 L
766.744 369.251 L
772.867 369.203 L
777.258 369.171 L
781.65 369.139 L
786.984 369.102 L
793.025 369.063 L
798.522 369.028 L
802.972 369.002 L
807.106 368.978 L
811.928 368.951 L
817.774 368.92 L
823.723 368.889 L
828.643 368.865 L
832.771 368.846 L
837.134 368.826 L
842.515 368.803 L
848.637 368.778 L
853.03 368.76 L
857.422 368.744 L
862.757 368.724 L
868.798 368.703 L
874.295 368.685 L
878.746 368.67 L
882.882 368.658 L
887.704 368.643 L
890 368.637 L
S
GR
GS
[0.75 0 0 0.75 0 0] CT
0.851 0.325 0.098 RC
1 LJ
8 LW
N
128 559 M
128.001 559 L
128.004 559 L
128.022 558.999 L
128.112 558.986 L
128.498 558.739 L
128.91 558.198 L
129.517 557.017 L
130.323 554.974 L
131.327 551.986 L
132.551 548.008 L
134.069 542.877 L
135.86 536.768 L
138.033 529.41 L
140.776 520.284 L
144.392 508.56 L
148.947 494.284 L
154.447 477.751 L
158.802 465.185 L
163.156 453.066 L
168.167 439.653 L
173.65 425.602 L
178.827 412.91 L
183.354 402.248 L
187.691 392.406 L
192.514 381.868 L
198.022 370.338 L
203.573 359.24 L
208.436 349.929 L
212.768 341.945 L
217.301 333.895 L
222.577 324.898 L
228.322 315.539 L
233.595 307.333 L
238.085 300.623 L
242.395 294.415 L
247.305 287.607 L
252.996 280.056 L
258.66 272.886 L
263.485 267.04 L
267.735 262.081 L
272.265 256.985 L
277.659 251.16 L
283.548 245.093 L
288.833 239.895 L
293.236 235.736 L
297.484 231.865 L
302.444 227.514 L
308.273 222.625 L
314.01 218.038 L
318.776 214.391 L
322.939 211.321 L
327.457 208.108 L
332.945 204.363 L
338.946 200.459 L
344.227 197.181 L
348.548 194.604 L
352.741 192.189 L
357.737 189.42 L
363.675 186.275 L
369.465 183.355 L
374.18 181.078 L
378.27 179.174 L
382.777 177.15 L
388.335 174.755 L
394.419 172.257 L
399.695 170.192 L
403.953 168.589 L
408.104 167.081 L
413.125 165.324 L
419.142 163.313 L
424.969 161.459 L
429.647 160.035 L
433.685 158.849 L
438.183 157.574 L
443.787 156.05 L
449.93 154.46 L
454.146 153.414 L
458.362 152.405 L
463.686 151.179 L
469.925 149.811 L
474.309 148.891 L
478.693 148.003 L
484.047 146.963 L
490.106 145.84 L
495.588 144.871 L
500.006 144.122 L
504.122 143.448 L
508.951 142.687 L
514.819 141.802 L
520.77 140.947 L
525.663 140.275 L
529.768 139.732 L
534.127 139.176 L
539.525 138.514 L
545.659 137.797 L
550.027 137.308 L
554.395 136.837 L
559.728 136.284 L
565.792 135.685 L
571.302 135.165 L
575.738 134.764 L
579.848 134.406 L
584.655 134.002 L
590.509 133.531 L
596.48 133.074 L
601.402 132.713 L
605.512 132.424 L
609.854 132.128 L
615.228 131.777 L
621.365 131.394 L
625.752 131.133 L
630.139 130.88 L
635.475 130.586 L
641.52 130.267 L
647.015 129.991 L
651.459 129.777 L
655.587 129.585 L
660.407 129.369 L
666.256 129.118 L
672.207 128.875 L
677.123 128.684 L
681.246 128.529 L
685.605 128.371 L
690.986 128.183 L
697.111 127.98 L
701.499 127.84 L
705.887 127.706 L
711.221 127.549 L
717.264 127.379 L
722.762 127.232 L
727.21 127.117 L
731.341 127.015 L
736.16 126.9 L
742.007 126.766 L
747.958 126.637 L
752.878 126.535 L
757.004 126.452 L
761.363 126.368 L
766.744 126.268 L
772.867 126.159 L
777.258 126.085 L
781.65 126.013 L
786.984 125.93 L
793.025 125.839 L
798.522 125.761 L
802.972 125.7 L
807.106 125.645 L
811.928 125.584 L
817.774 125.513 L
823.723 125.444 L
828.643 125.389 L
832.771 125.345 L
837.134 125.3 L
842.515 125.247 L
848.637 125.189 L
853.03 125.149 L
857.422 125.111 L
862.757 125.067 L
868.798 125.018 L
874.295 124.977 L
878.746 124.944 L
882.882 124.915 L
887.704 124.882 L
890 124.867 L
S
GR
GS
[0.75 0 0 0.75 0 0] CT
0.929 0.694 0.125 RC
1 LJ
4 LW
N
128 559 M
128.001 559 L
128.004 559 L
128.022 559 L
128.112 558.994 L
128.498 558.885 L
128.91 558.649 L
129.517 558.133 L
130.323 557.243 L
131.327 555.944 L
132.551 554.216 L
134.069 551.991 L
135.86 549.343 L
138.033 546.155 L
140.776 542.2 L
144.392 537.118 L
148.947 530.928 L
154.447 523.754 L
158.802 518.299 L
163.156 513.036 L
168.167 507.208 L
173.65 501.099 L
178.827 495.578 L
183.354 490.938 L
187.691 486.652 L
192.514 482.062 L
198.022 477.036 L
203.573 472.196 L
208.436 468.133 L
212.768 464.648 L
217.301 461.131 L
222.577 457.199 L
228.322 453.107 L
233.595 449.517 L
238.085 446.58 L
242.395 443.861 L
247.305 440.878 L
252.996 437.568 L
258.66 434.423 L
263.485 431.857 L
267.735 429.68 L
272.265 427.441 L
277.659 424.88 L
283.548 422.212 L
288.833 419.925 L
293.236 418.094 L
297.484 416.388 L
302.444 414.471 L
308.273 412.315 L
314.01 410.292 L
318.776 408.681 L
322.939 407.326 L
327.457 405.906 L
332.945 404.25 L
338.946 402.523 L
344.227 401.072 L
348.548 399.931 L
352.741 398.861 L
357.737 397.634 L
363.675 396.239 L
369.465 394.943 L
374.18 393.932 L
378.27 393.086 L
382.777 392.186 L
388.335 391.121 L
394.419 390.01 L
399.695 389.09 L
403.953 388.376 L
408.104 387.704 L
413.125 386.921 L
419.142 386.024 L
424.969 385.196 L
429.647 384.56 L
433.685 384.03 L
438.183 383.46 L
443.787 382.779 L
449.93 382.067 L
454.146 381.599 L
458.362 381.146 L
463.686 380.597 L
469.925 379.983 L
474.309 379.57 L
478.693 379.172 L
484.047 378.705 L
490.106 378.2 L
495.588 377.764 L
500.006 377.427 L
504.122 377.124 L
508.951 376.781 L
514.819 376.382 L
520.77 375.997 L
525.663 375.694 L
529.768 375.449 L
534.127 375.197 L
539.525 374.898 L
545.659 374.574 L
550.027 374.353 L
554.395 374.14 L
559.728 373.889 L
565.792 373.618 L
571.302 373.383 L
575.738 373.201 L
579.848 373.038 L
584.655 372.855 L
590.509 372.641 L
596.48 372.433 L
601.402 372.269 L
605.512 372.137 L
609.854 372.003 L
615.228 371.843 L
621.365 371.668 L
625.752 371.549 L
630.139 371.434 L
635.475 371.299 L
641.52 371.154 L
647.015 371.028 L
651.459 370.93 L
655.587 370.842 L
660.407 370.743 L
666.256 370.629 L
672.207 370.517 L
677.123 370.429 L
681.246 370.358 L
685.605 370.286 L
690.986 370.2 L
697.111 370.106 L
701.499 370.042 L
705.887 369.98 L
711.221 369.908 L
717.264 369.83 L
722.762 369.762 L
727.21 369.709 L
731.341 369.662 L
736.16 369.609 L
742.007 369.547 L
747.958 369.488 L
752.878 369.44 L
757.004 369.402 L
761.363 369.363 L
766.744 369.317 L
772.867 369.267 L
777.258 369.232 L
781.65 369.199 L
786.984 369.16 L
793.025 369.118 L
798.522 369.082 L
802.972 369.054 L
807.106 369.028 L
811.928 369 L
817.774 368.967 L
823.723 368.934 L
828.643 368.909 L
832.771 368.889 L
837.134 368.868 L
842.515 368.843 L
848.637 368.816 L
853.03 368.797 L
857.422 368.779 L
862.757 368.759 L
868.798 368.736 L
874.295 368.716 L
878.746 368.701 L
882.882 368.688 L
887.704 368.672 L
890 368.665 L
S
GR
GS
[0.75 0 0 0.75 0 0] CT
0.494 0.184 0.557 RC
1 LJ
5.333 LW
N
128 559 M
128.001 559 L
128.004 559 L
128.022 558.999 L
128.112 558.986 L
128.498 558.739 L
128.91 558.2 L
129.517 557.024 L
130.323 554.993 L
131.327 552.03 L
132.551 548.09 L
134.069 543.015 L
135.86 536.977 L
138.033 529.706 L
140.776 520.688 L
144.392 509.098 L
148.947 494.98 L
154.447 478.62 L
158.802 466.18 L
163.156 454.177 L
168.167 440.885 L
173.65 426.954 L
178.827 414.363 L
183.354 403.781 L
187.691 394.008 L
192.514 383.538 L
198.022 372.077 L
203.573 361.039 L
208.436 351.774 L
212.768 343.825 L
217.301 335.806 L
222.577 326.839 L
228.322 317.507 L
233.595 309.319 L
238.085 302.621 L
242.395 296.42 L
247.305 289.617 L
252.996 282.068 L
258.66 274.896 L
263.485 269.044 L
267.735 264.079 L
272.265 258.973 L
277.659 253.134 L
283.548 247.049 L
288.833 241.832 L
293.236 237.657 L
297.484 233.767 L
302.444 229.395 L
308.273 224.478 L
314.01 219.863 L
318.776 216.191 L
322.939 213.099 L
327.457 209.861 L
332.945 206.085 L
338.946 202.147 L
344.227 198.838 L
348.548 196.235 L
352.741 193.796 L
357.737 190.996 L
363.675 187.815 L
369.465 184.86 L
374.18 182.554 L
378.27 180.625 L
382.777 178.573 L
388.335 176.145 L
394.419 173.61 L
399.695 171.513 L
403.953 169.885 L
408.104 168.352 L
413.125 166.566 L
419.142 164.52 L
424.969 162.633 L
429.647 161.182 L
433.685 159.973 L
438.183 158.673 L
443.787 157.119 L
449.93 155.496 L
454.146 154.428 L
458.362 153.397 L
463.686 152.144 L
469.925 150.744 L
474.309 149.802 L
478.693 148.894 L
484.047 147.828 L
490.106 146.677 L
495.588 145.683 L
500.006 144.915 L
504.122 144.223 L
508.951 143.441 L
514.819 142.531 L
520.77 141.652 L
525.663 140.961 L
529.768 140.402 L
534.127 139.829 L
539.525 139.147 L
545.659 138.408 L
550.027 137.904 L
554.395 137.417 L
559.728 136.847 L
565.792 136.227 L
571.302 135.691 L
575.738 135.276 L
579.848 134.905 L
584.655 134.486 L
590.509 133.999 L
596.48 133.525 L
601.402 133.151 L
605.512 132.85 L
609.854 132.544 L
615.228 132.179 L
621.365 131.781 L
625.752 131.509 L
630.139 131.247 L
635.475 130.94 L
641.52 130.608 L
647.015 130.321 L
651.459 130.097 L
655.587 129.897 L
660.407 129.672 L
666.256 129.41 L
672.207 129.156 L
677.123 128.956 L
681.246 128.794 L
685.605 128.628 L
690.986 128.432 L
697.111 128.219 L
701.499 128.072 L
705.887 127.931 L
711.221 127.767 L
717.264 127.588 L
722.762 127.434 L
727.21 127.314 L
731.341 127.206 L
736.16 127.085 L
742.007 126.944 L
747.958 126.808 L
752.878 126.7 L
757.004 126.613 L
761.363 126.524 L
766.744 126.419 L
772.867 126.304 L
777.258 126.226 L
781.65 126.15 L
786.984 126.061 L
793.025 125.966 L
798.522 125.883 L
802.972 125.818 L
807.106 125.76 L
811.928 125.695 L
817.774 125.62 L
823.723 125.547 L
828.643 125.489 L
832.771 125.442 L
837.134 125.394 L
842.515 125.337 L
848.637 125.276 L
853.03 125.234 L
857.422 125.193 L
862.757 125.145 L
868.798 125.094 L
874.295 125.049 L
878.746 125.015 L
882.882 124.984 L
887.704 124.949 L
890 124.932 L
S
GR
GS
[0.75 0 0 0.75 0 0] CT
0.467 0.675 0.188 RC
1 LJ
2.667 LW
N
128 559 M
128.001 558.999 L
128.004 558.993 L
128.022 558.965 L
128.112 558.824 L
128.498 558.222 L
128.91 557.582 L
129.517 556.641 L
130.323 555.4 L
131.327 553.867 L
132.551 552.013 L
134.069 549.739 L
135.86 547.094 L
138.033 543.935 L
140.776 540.027 L
144.392 535.008 L
148.947 528.895 L
154.447 521.811 L
158.802 516.424 L
163.156 511.227 L
168.167 505.471 L
173.65 499.439 L
178.827 493.987 L
183.354 489.405 L
187.691 485.173 L
192.514 480.639 L
198.022 475.677 L
203.573 470.897 L
208.436 466.885 L
212.768 463.443 L
217.301 459.971 L
222.577 456.088 L
228.322 452.047 L
233.595 448.502 L
238.085 445.601 L
242.395 442.916 L
247.305 439.971 L
252.996 436.702 L
258.66 433.596 L
263.485 431.063 L
267.735 428.912 L
272.265 426.701 L
277.659 424.173 L
283.548 421.538 L
288.833 419.279 L
293.236 417.471 L
297.484 415.787 L
302.444 413.894 L
308.273 411.765 L
314.01 409.767 L
318.776 408.176 L
322.939 406.838 L
327.457 405.435 L
332.945 403.801 L
338.946 402.095 L
344.227 400.662 L
348.548 399.535 L
352.741 398.479 L
357.737 397.267 L
363.675 395.889 L
369.465 394.61 L
374.18 393.611 L
378.27 392.776 L
382.777 391.887 L
388.335 390.836 L
394.419 389.738 L
399.695 388.83 L
403.953 388.125 L
408.104 387.462 L
413.125 386.688 L
419.142 385.802 L
424.969 384.985 L
429.647 384.357 L
433.685 383.833 L
438.183 383.271 L
443.787 382.598 L
449.93 381.895 L
454.146 381.432 L
458.362 380.986 L
463.686 380.443 L
469.925 379.837 L
474.309 379.429 L
478.693 379.036 L
484.047 378.575 L
490.106 378.076 L
495.588 377.646 L
500.006 377.313 L
504.122 377.014 L
508.951 376.675 L
514.819 376.281 L
520.77 375.9 L
525.663 375.601 L
529.768 375.359 L
534.127 375.111 L
539.525 374.816 L
545.659 374.496 L
550.027 374.277 L
554.395 374.067 L
559.728 373.82 L
565.792 373.551 L
571.302 373.319 L
575.738 373.139 L
579.848 372.979 L
584.655 372.798 L
590.509 372.586 L
596.48 372.381 L
601.402 372.219 L
605.512 372.089 L
609.854 371.956 L
615.228 371.798 L
621.365 371.626 L
625.752 371.508 L
630.139 371.395 L
635.475 371.262 L
641.52 371.118 L
647.015 370.994 L
651.459 370.897 L
655.587 370.81 L
660.407 370.713 L
666.256 370.599 L
672.207 370.489 L
677.123 370.403 L
681.246 370.332 L
685.605 370.261 L
690.986 370.176 L
697.111 370.084 L
701.499 370.02 L
705.887 369.959 L
711.221 369.888 L
717.264 369.811 L
722.762 369.744 L
727.21 369.692 L
731.341 369.645 L
736.16 369.593 L
742.007 369.532 L
747.958 369.473 L
752.878 369.426 L
757.004 369.388 L
761.363 369.35 L
766.744 369.304 L
772.867 369.255 L
777.258 369.221 L
781.65 369.188 L
786.984 369.149 L
793.025 369.108 L
798.522 369.072 L
802.972 369.044 L
807.106 369.019 L
811.928 368.991 L
817.774 368.958 L
823.723 368.926 L
828.643 368.901 L
832.771 368.881 L
837.134 368.86 L
842.515 368.836 L
848.637 368.809 L
853.03 368.791 L
857.422 368.773 L
862.757 368.753 L
868.798 368.73 L
874.295 368.711 L
878.746 368.696 L
882.882 368.683 L
887.704 368.668 L
890 368.661 L
S
GR
GS
[0.75 0 0 0.75 0 0] CT
0.302 0.745 0.933 RC
1 LJ
2.667 LW
N
128 559 M
128.001 558.997 L
128.004 558.985 L
128.022 558.92 L
128.112 558.599 L
128.498 557.226 L
128.91 555.766 L
129.517 553.621 L
130.323 550.791 L
131.327 547.293 L
132.551 543.065 L
134.069 537.88 L
135.86 531.847 L
138.033 524.643 L
140.776 515.731 L
144.392 504.285 L
148.947 490.344 L
154.447 474.189 L
158.802 461.904 L
163.156 450.051 L
168.167 436.925 L
173.65 423.168 L
178.827 410.735 L
183.354 400.285 L
187.691 390.634 L
192.514 380.295 L
198.022 368.977 L
203.573 358.077 L
208.436 348.928 L
212.768 341.078 L
217.301 333.159 L
222.577 324.305 L
228.322 315.089 L
233.595 307.003 L
238.085 300.389 L
242.395 294.266 L
247.305 287.548 L
252.996 280.093 L
258.66 273.011 L
263.485 267.232 L
267.735 262.329 L
272.265 257.287 L
277.659 251.521 L
283.548 245.512 L
288.833 240.361 L
293.236 236.237 L
297.484 232.396 L
302.444 228.078 L
308.273 223.223 L
314.01 218.666 L
318.776 215.04 L
322.939 211.987 L
327.457 208.789 L
332.945 205.06 L
338.946 201.171 L
344.227 197.903 L
348.548 195.333 L
352.741 192.924 L
357.737 190.16 L
363.675 187.019 L
369.465 184.1 L
374.18 181.823 L
378.27 179.918 L
382.777 177.892 L
388.335 175.494 L
394.419 172.991 L
399.695 170.92 L
403.953 169.312 L
408.104 167.798 L
413.125 166.035 L
419.142 164.014 L
424.969 162.151 L
429.647 160.718 L
433.685 159.524 L
438.183 158.241 L
443.787 156.706 L
449.93 155.103 L
454.146 154.049 L
458.362 153.03 L
463.686 151.793 L
469.925 150.411 L
474.309 149.481 L
478.693 148.584 L
484.047 147.531 L
490.106 146.394 L
495.588 145.413 L
500.006 144.654 L
504.122 143.971 L
508.951 143.199 L
514.819 142.301 L
520.77 141.433 L
525.663 140.75 L
529.768 140.198 L
534.127 139.632 L
539.525 138.959 L
545.659 138.229 L
550.027 137.731 L
554.395 137.251 L
559.728 136.687 L
565.792 136.075 L
571.302 135.546 L
575.738 135.136 L
579.848 134.77 L
584.655 134.356 L
590.509 133.875 L
596.48 133.407 L
601.402 133.038 L
605.512 132.741 L
609.854 132.438 L
615.228 132.078 L
621.365 131.685 L
625.752 131.416 L
630.139 131.157 L
635.475 130.854 L
641.52 130.527 L
647.015 130.243 L
651.459 130.022 L
655.587 129.824 L
660.407 129.602 L
666.256 129.343 L
672.207 129.093 L
677.123 128.895 L
681.246 128.735 L
685.605 128.571 L
690.986 128.377 L
697.111 128.167 L
701.499 128.023 L
705.887 127.883 L
711.221 127.721 L
717.264 127.545 L
722.762 127.392 L
727.21 127.273 L
731.341 127.167 L
736.16 127.048 L
742.007 126.909 L
747.958 126.774 L
752.878 126.668 L
757.004 126.582 L
761.363 126.494 L
766.744 126.39 L
772.867 126.277 L
777.258 126.199 L
781.65 126.124 L
786.984 126.037 L
793.025 125.942 L
798.522 125.86 L
802.972 125.797 L
807.106 125.739 L
811.928 125.675 L
817.774 125.601 L
823.723 125.528 L
828.643 125.471 L
832.771 125.425 L
837.134 125.378 L
842.515 125.322 L
848.637 125.261 L
853.03 125.219 L
857.422 125.179 L
862.757 125.132 L
868.798 125.081 L
874.295 125.037 L
878.746 125.003 L
882.882 124.972 L
887.704 124.938 L
890 124.922 L
S
GR
GS
[0.75 0 0 0.75 0 0] CT
1 GC
N
659 157 M
659 60 L
877 60 L
877 157 L
cp
f
GR
GS
[0.75 0 0 0.75 522 52.16192] CT
N
4.734 -3.453 M
3.438 -3.453 2.68 -2.492 QT
1.922 -1.531 1.922 0.141 QT
1.922 1.781 2.68 2.742 QT
3.438 3.703 4.734 3.703 QT
6.016 3.703 6.773 2.742 QT
7.531 1.781 7.531 0.141 QT
7.531 -1.531 6.773 -2.492 QT
6.016 -3.453 4.734 -3.453 QT
cp
4.734 -4.406 M
6.563 -4.406 7.664 -3.172 QT
8.766 -1.938 8.766 0.141 QT
8.766 2.203 7.664 3.438 QT
6.563 4.672 4.734 4.672 QT
2.891 4.672 1.781 3.438 QT
0.672 2.203 0.672 0.141 QT
0.672 -1.938 1.781 -3.172 QT
2.891 -4.406 4.734 -4.406 QT
cp
11.617 3.516 M
11.617 7 L
10.539 7 L
10.539 -2.063 L
11.617 -2.063 L
11.617 -1.063 L
11.961 -1.656 12.477 -1.938 QT
12.992 -2.219 13.711 -2.219 QT
14.914 -2.219 15.664 -1.273 QT
16.414 -0.328 16.414 1.219 QT
16.414 2.766 15.664 3.719 QT
14.914 4.672 13.711 4.672 QT
12.992 4.672 12.477 4.383 QT
11.961 4.094 11.617 3.516 QT
cp
15.289 1.219 M
15.289 0.031 14.797 -0.641 QT
14.305 -1.313 13.461 -1.313 QT
12.602 -1.313 12.109 -0.641 QT
11.617 0.031 11.617 1.219 QT
11.617 2.406 12.109 3.086 QT
12.602 3.766 13.461 3.766 QT
14.305 3.766 14.797 3.086 QT
15.289 2.406 15.289 1.219 QT
cp
19.266 -3.922 M
19.266 -2.063 L
21.484 -2.063 L
21.484 -1.219 L
19.266 -1.219 L
19.266 2.344 L
19.266 3.141 19.484 3.367 QT
19.703 3.594 20.375 3.594 QT
21.484 3.594 L
21.484 4.5 L
20.375 4.5 L
19.125 4.5 18.648 4.031 QT
18.172 3.563 18.172 2.344 QT
18.172 -1.219 L
17.391 -1.219 L
17.391 -2.063 L
18.172 -2.063 L
18.172 -3.922 L
19.266 -3.922 L
cp
22.893 -2.063 M
23.971 -2.063 L
23.971 4.5 L
22.893 4.5 L
22.893 -2.063 L
cp
22.893 -4.625 M
23.971 -4.625 L
23.971 -3.25 L
22.893 -3.25 L
22.893 -4.625 L
cp
31.336 -0.797 M
31.742 -1.531 32.305 -1.875 QT
32.867 -2.219 33.633 -2.219 QT
34.664 -2.219 35.219 -1.5 QT
35.773 -0.781 35.773 0.531 QT
35.773 4.5 L
34.695 4.5 L
34.695 0.578 L
34.695 -0.375 34.359 -0.828 QT
34.023 -1.281 33.336 -1.281 QT
32.492 -1.281 32.008 -0.727 QT
31.523 -0.172 31.523 0.797 QT
31.523 4.5 L
30.445 4.5 L
30.445 0.578 L
30.445 -0.375 30.109 -0.828 QT
29.773 -1.281 29.07 -1.281 QT
28.242 -1.281 27.758 -0.727 QT
27.273 -0.172 27.273 0.797 QT
27.273 4.5 L
26.195 4.5 L
26.195 -2.063 L
27.273 -2.063 L
27.273 -1.047 L
27.648 -1.641 28.164 -1.93 QT
28.68 -2.219 29.383 -2.219 QT
30.102 -2.219 30.602 -1.859 QT
31.102 -1.5 31.336 -0.797 QT
cp
40.9 1.203 M
39.604 1.203 39.096 1.5 QT
38.588 1.797 38.588 2.516 QT
38.588 3.094 38.971 3.43 QT
39.354 3.766 39.994 3.766 QT
40.9 3.766 41.439 3.133 QT
41.979 2.5 41.979 1.438 QT
41.979 1.203 L
40.9 1.203 L
cp
43.057 0.75 M
43.057 4.5 L
41.979 4.5 L
41.979 3.5 L
41.604 4.094 41.057 4.383 QT
40.51 4.672 39.713 4.672 QT
38.697 4.672 38.104 4.102 QT
37.51 3.531 37.51 2.594 QT
37.51 1.484 38.252 0.922 QT
38.994 0.359 40.463 0.359 QT
41.979 0.359 L
41.979 0.25 L
41.979 -0.5 41.486 -0.906 QT
40.994 -1.313 40.119 -1.313 QT
39.557 -1.313 39.018 -1.172 QT
38.479 -1.031 37.994 -0.766 QT
37.994 -1.766 L
38.588 -2 39.143 -2.109 QT
39.697 -2.219 40.229 -2.219 QT
41.65 -2.219 42.354 -1.484 QT
43.057 -0.75 43.057 0.75 QT
cp
41.604 -5.094 M
42.775 -5.094 L
40.869 -2.891 L
39.963 -2.891 L
41.604 -5.094 L
cp
45.27 -4.625 M
46.348 -4.625 L
46.348 4.5 L
45.27 4.5 L
45.27 -4.625 L
cp
54.072 0.531 M
54.072 4.5 L
52.994 4.5 L
52.994 0.578 L
52.994 -0.359 52.627 -0.82 QT
52.26 -1.281 51.541 -1.281 QT
50.666 -1.281 50.158 -0.727 QT
49.65 -0.172 49.65 0.797 QT
49.65 4.5 L
48.572 4.5 L
48.572 -2.063 L
49.65 -2.063 L
49.65 -1.047 L
50.041 -1.641 50.564 -1.93 QT
51.088 -2.219 51.775 -2.219 QT
52.9 -2.219 53.486 -1.523 QT
54.072 -0.828 54.072 0.531 QT
cp
57.896 -5.094 M
59.068 -5.094 L
57.162 -2.891 L
56.256 -2.891 L
57.896 -5.094 L
cp
56.209 -2.063 M
57.287 -2.063 L
57.287 4.5 L
56.209 4.5 L
56.209 -2.063 L
cp
62.889 -2.063 M
68.014 -2.063 L
68.014 -1.078 L
63.967 3.641 L
68.014 3.641 L
68.014 4.5 L
62.748 4.5 L
62.748 3.516 L
66.811 -1.203 L
62.889 -1.203 L
62.889 -2.063 L
cp
70.703 3.516 M
70.703 7 L
69.625 7 L
69.625 -2.063 L
70.703 -2.063 L
70.703 -1.063 L
71.047 -1.656 71.563 -1.938 QT
72.078 -2.219 72.797 -2.219 QT
74 -2.219 74.75 -1.273 QT
75.5 -0.328 75.5 1.219 QT
75.5 2.766 74.75 3.719 QT
74 4.672 72.797 4.672 QT
72.078 4.672 71.563 4.383 QT
71.047 4.094 70.703 3.516 QT
cp
74.375 1.219 M
74.375 0.031 73.883 -0.641 QT
73.391 -1.313 72.547 -1.313 QT
71.688 -1.313 71.195 -0.641 QT
70.703 0.031 70.703 1.219 QT
70.703 2.406 71.195 3.086 QT
71.688 3.766 72.547 3.766 QT
73.391 3.766 73.883 3.086 QT
74.375 2.406 74.375 1.219 QT
cp
82.898 0.953 M
82.898 1.469 L
77.93 1.469 L
78.008 2.594 78.609 3.172 QT
79.211 3.75 80.273 3.75 QT
80.898 3.75 81.484 3.602 QT
82.07 3.453 82.648 3.141 QT
82.648 4.172 L
82.055 4.406 81.445 4.539 QT
80.836 4.672 80.211 4.672 QT
78.648 4.672 77.727 3.758 QT
76.805 2.844 76.805 1.281 QT
76.805 -0.328 77.68 -1.273 QT
78.555 -2.219 80.023 -2.219 QT
81.352 -2.219 82.125 -1.367 QT
82.898 -0.516 82.898 0.953 QT
cp
81.82 0.625 M
81.805 -0.25 81.32 -0.781 QT
80.836 -1.313 80.039 -1.313 QT
79.133 -1.313 78.594 -0.797 QT
78.055 -0.281 77.977 0.641 QT
81.82 0.625 L
cp
79.383 -2.891 M
77.805 -5.094 L
78.695 -5.094 L
79.852 -3.656 L
81.008 -5.094 L
81.898 -5.094 L
80.32 -2.891 L
79.383 -2.891 L
cp
85.734 -3.922 M
85.734 -2.063 L
87.953 -2.063 L
87.953 -1.219 L
85.734 -1.219 L
85.734 2.344 L
85.734 3.141 85.953 3.367 QT
86.172 3.594 86.844 3.594 QT
87.953 3.594 L
87.953 4.5 L
86.844 4.5 L
85.594 4.5 85.117 4.031 QT
84.641 3.563 84.641 2.344 QT
84.641 -1.219 L
83.859 -1.219 L
83.859 -2.063 L
84.641 -2.063 L
84.641 -3.922 L
85.734 -3.922 L
cp
94.83 0.531 M
94.83 4.5 L
93.752 4.5 L
93.752 0.578 L
93.752 -0.359 93.385 -0.82 QT
93.018 -1.281 92.299 -1.281 QT
91.424 -1.281 90.916 -0.727 QT
90.408 -0.172 90.408 0.797 QT
90.408 4.5 L
89.33 4.5 L
89.33 -2.063 L
90.408 -2.063 L
90.408 -1.047 L
90.799 -1.641 91.322 -1.93 QT
91.846 -2.219 92.533 -2.219 QT
93.658 -2.219 94.244 -1.523 QT
94.83 -0.828 94.83 0.531 QT
cp
99.514 -1.313 M
98.654 -1.313 98.146 -0.633 QT
97.639 0.047 97.639 1.219 QT
97.639 2.406 98.139 3.078 QT
98.639 3.75 99.514 3.75 QT
100.373 3.75 100.881 3.07 QT
101.389 2.391 101.389 1.219 QT
101.389 0.063 100.881 -0.625 QT
100.373 -1.313 99.514 -1.313 QT
cp
99.514 -2.219 M
100.92 -2.219 101.725 -1.305 QT
102.529 -0.391 102.529 1.219 QT
102.529 2.828 101.725 3.75 QT
100.92 4.672 99.514 4.672 QT
98.107 4.672 97.303 3.75 QT
96.498 2.828 96.498 1.219 QT
96.498 -0.391 97.303 -1.305 QT
98.107 -2.219 99.514 -2.219 QT
cp
103.543 -2.063 M
104.684 -2.063 L
106.73 3.438 L
108.793 -2.063 L
109.934 -2.063 L
107.465 4.5 L
105.996 4.5 L
103.543 -2.063 L
cp
114.395 1.203 M
113.098 1.203 112.59 1.5 QT
112.082 1.797 112.082 2.516 QT
112.082 3.094 112.465 3.43 QT
112.848 3.766 113.488 3.766 QT
114.395 3.766 114.934 3.133 QT
115.473 2.5 115.473 1.438 QT
115.473 1.203 L
114.395 1.203 L
cp
116.551 0.75 M
116.551 4.5 L
115.473 4.5 L
115.473 3.5 L
115.098 4.094 114.551 4.383 QT
114.004 4.672 113.207 4.672 QT
112.191 4.672 111.598 4.102 QT
111.004 3.531 111.004 2.594 QT
111.004 1.484 111.746 0.922 QT
112.488 0.359 113.957 0.359 QT
115.473 0.359 L
115.473 0.25 L
115.473 -0.5 114.98 -0.906 QT
114.488 -1.313 113.613 -1.313 QT
113.051 -1.313 112.512 -1.172 QT
111.973 -1.031 111.488 -0.766 QT
111.488 -1.766 L
112.082 -2 112.637 -2.109 QT
113.191 -2.219 113.723 -2.219 QT
115.145 -2.219 115.848 -1.484 QT
116.551 -0.75 116.551 0.75 QT
cp
118.295 -2.063 M
123.42 -2.063 L
123.42 -1.078 L
119.373 3.641 L
123.42 3.641 L
123.42 4.5 L
118.154 4.5 L
118.154 3.516 L
122.217 -1.203 L
118.295 -1.203 L
118.295 -2.063 L
cp
130.688 0.953 M
130.688 1.469 L
125.719 1.469 L
125.797 2.594 126.398 3.172 QT
127 3.75 128.063 3.75 QT
128.688 3.75 129.273 3.602 QT
129.859 3.453 130.438 3.141 QT
130.438 4.172 L
129.844 4.406 129.234 4.539 QT
128.625 4.672 128 4.672 QT
126.438 4.672 125.516 3.758 QT
124.594 2.844 124.594 1.281 QT
124.594 -0.328 125.469 -1.273 QT
126.344 -2.219 127.813 -2.219 QT
129.141 -2.219 129.914 -1.367 QT
130.688 -0.516 130.688 0.953 QT
cp
129.609 0.625 M
129.594 -0.25 129.109 -0.781 QT
128.625 -1.313 127.828 -1.313 QT
126.922 -1.313 126.383 -0.797 QT
125.844 -0.281 125.766 0.641 QT
129.609 0.625 L
cp
137.164 1.219 M
137.164 0.031 136.672 -0.641 QT
136.18 -1.313 135.336 -1.313 QT
134.477 -1.313 133.984 -0.641 QT
133.492 0.031 133.492 1.219 QT
133.492 2.406 133.984 3.086 QT
134.477 3.766 135.336 3.766 QT
136.18 3.766 136.672 3.086 QT
137.164 2.406 137.164 1.219 QT
cp
133.492 -1.063 M
133.836 -1.656 134.352 -1.938 QT
134.867 -2.219 135.586 -2.219 QT
136.789 -2.219 137.539 -1.273 QT
138.289 -0.328 138.289 1.219 QT
138.289 2.766 137.539 3.719 QT
136.789 4.672 135.586 4.672 QT
134.867 4.672 134.352 4.383 QT
133.836 4.094 133.492 3.516 QT
133.492 4.5 L
132.414 4.5 L
132.414 -4.625 L
133.492 -4.625 L
133.492 -1.063 L
cp
145.531 0.531 M
145.531 4.5 L
144.453 4.5 L
144.453 0.578 L
144.453 -0.359 144.086 -0.82 QT
143.719 -1.281 143 -1.281 QT
142.125 -1.281 141.617 -0.727 QT
141.109 -0.172 141.109 0.797 QT
141.109 4.5 L
140.031 4.5 L
140.031 -2.063 L
141.109 -2.063 L
141.109 -1.047 L
141.5 -1.641 142.023 -1.93 QT
142.547 -2.219 143.234 -2.219 QT
144.359 -2.219 144.945 -1.523 QT
145.531 -0.828 145.531 0.531 QT
cp
149.355 -5.094 M
150.527 -5.094 L
148.621 -2.891 L
147.715 -2.891 L
149.355 -5.094 L
cp
147.668 -2.063 M
148.746 -2.063 L
148.746 4.5 L
147.668 4.5 L
147.668 -2.063 L
cp
160.285 0.531 M
160.285 4.5 L
159.207 4.5 L
159.207 0.578 L
159.207 -0.359 158.84 -0.82 QT
158.473 -1.281 157.754 -1.281 QT
156.879 -1.281 156.371 -0.727 QT
155.863 -0.172 155.863 0.797 QT
155.863 4.5 L
154.785 4.5 L
154.785 -4.625 L
155.863 -4.625 L
155.863 -1.047 L
156.254 -1.641 156.777 -1.93 QT
157.301 -2.219 157.988 -2.219 QT
159.113 -2.219 159.699 -1.523 QT
160.285 -0.828 160.285 0.531 QT
cp
166.172 -0.219 M
167.016 -0.031 167.492 0.539 QT
167.969 1.109 167.969 1.953 QT
167.969 3.25 167.078 3.961 QT
166.188 4.672 164.547 4.672 QT
164 4.672 163.414 4.563 QT
162.828 4.453 162.219 4.234 QT
162.219 3.094 L
162.703 3.375 163.289 3.523 QT
163.875 3.672 164.516 3.672 QT
165.625 3.672 166.211 3.234 QT
166.797 2.797 166.797 1.953 QT
166.797 1.188 166.25 0.75 QT
165.703 0.313 164.75 0.313 QT
163.719 0.313 L
163.719 -0.656 L
164.797 -0.656 L
165.656 -0.656 166.125 -1.008 QT
166.594 -1.359 166.594 -2.016 QT
166.594 -2.688 166.117 -3.047 QT
165.641 -3.406 164.75 -3.406 QT
164.25 -3.406 163.695 -3.305 QT
163.141 -3.203 162.469 -2.984 QT
162.469 -4.031 L
163.156 -4.219 163.742 -4.313 QT
164.328 -4.406 164.844 -4.406 QT
166.203 -4.406 166.984 -3.797 QT
167.766 -3.188 167.766 -2.141 QT
167.766 -1.406 167.352 -0.906 QT
166.938 -0.406 166.172 -0.219 QT
cp
172.744 -3.469 M
171.838 -3.469 171.377 -2.57 QT
170.916 -1.672 170.916 0.141 QT
170.916 1.938 171.377 2.836 QT
171.838 3.734 172.744 3.734 QT
173.666 3.734 174.127 2.836 QT
174.588 1.938 174.588 0.141 QT
174.588 -1.672 174.127 -2.57 QT
173.666 -3.469 172.744 -3.469 QT
cp
172.744 -4.406 M
174.213 -4.406 174.994 -3.242 QT
175.775 -2.078 175.775 0.141 QT
175.775 2.344 174.994 3.508 QT
174.213 4.672 172.744 4.672 QT
171.275 4.672 170.502 3.508 QT
169.729 2.344 169.729 0.141 QT
169.729 -2.078 170.502 -3.242 QT
171.275 -4.406 172.744 -4.406 QT
cp
f
GR
GS
[0.75 0 0 0.75 0 0] CT
0 0.447 0.741 RC
1 LJ
8 LW
N
663 69.549 M
693 69.549 L
S
GR
GS
[0.75 0 0 0.75 522 63.84715] CT
N
4.734 -3.453 M
3.438 -3.453 2.68 -2.492 QT
1.922 -1.531 1.922 0.141 QT
1.922 1.781 2.68 2.742 QT
3.438 3.703 4.734 3.703 QT
6.016 3.703 6.773 2.742 QT
7.531 1.781 7.531 0.141 QT
7.531 -1.531 6.773 -2.492 QT
6.016 -3.453 4.734 -3.453 QT
cp
4.734 -4.406 M
6.563 -4.406 7.664 -3.172 QT
8.766 -1.938 8.766 0.141 QT
8.766 2.203 7.664 3.438 QT
6.563 4.672 4.734 4.672 QT
2.891 4.672 1.781 3.438 QT
0.672 2.203 0.672 0.141 QT
0.672 -1.938 1.781 -3.172 QT
2.891 -4.406 4.734 -4.406 QT
cp
11.617 3.516 M
11.617 7 L
10.539 7 L
10.539 -2.063 L
11.617 -2.063 L
11.617 -1.063 L
11.961 -1.656 12.477 -1.938 QT
12.992 -2.219 13.711 -2.219 QT
14.914 -2.219 15.664 -1.273 QT
16.414 -0.328 16.414 1.219 QT
16.414 2.766 15.664 3.719 QT
14.914 4.672 13.711 4.672 QT
12.992 4.672 12.477 4.383 QT
11.961 4.094 11.617 3.516 QT
cp
15.289 1.219 M
15.289 0.031 14.797 -0.641 QT
14.305 -1.313 13.461 -1.313 QT
12.602 -1.313 12.109 -0.641 QT
11.617 0.031 11.617 1.219 QT
11.617 2.406 12.109 3.086 QT
12.602 3.766 13.461 3.766 QT
14.305 3.766 14.797 3.086 QT
15.289 2.406 15.289 1.219 QT
cp
19.266 -3.922 M
19.266 -2.063 L
21.484 -2.063 L
21.484 -1.219 L
19.266 -1.219 L
19.266 2.344 L
19.266 3.141 19.484 3.367 QT
19.703 3.594 20.375 3.594 QT
21.484 3.594 L
21.484 4.5 L
20.375 4.5 L
19.125 4.5 18.648 4.031 QT
18.172 3.563 18.172 2.344 QT
18.172 -1.219 L
17.391 -1.219 L
17.391 -2.063 L
18.172 -2.063 L
18.172 -3.922 L
19.266 -3.922 L
cp
22.893 -2.063 M
23.971 -2.063 L
23.971 4.5 L
22.893 4.5 L
22.893 -2.063 L
cp
22.893 -4.625 M
23.971 -4.625 L
23.971 -3.25 L
22.893 -3.25 L
22.893 -4.625 L
cp
31.336 -0.797 M
31.742 -1.531 32.305 -1.875 QT
32.867 -2.219 33.633 -2.219 QT
34.664 -2.219 35.219 -1.5 QT
35.773 -0.781 35.773 0.531 QT
35.773 4.5 L
34.695 4.5 L
34.695 0.578 L
34.695 -0.375 34.359 -0.828 QT
34.023 -1.281 33.336 -1.281 QT
32.492 -1.281 32.008 -0.727 QT
31.523 -0.172 31.523 0.797 QT
31.523 4.5 L
30.445 4.5 L
30.445 0.578 L
30.445 -0.375 30.109 -0.828 QT
29.773 -1.281 29.07 -1.281 QT
28.242 -1.281 27.758 -0.727 QT
27.273 -0.172 27.273 0.797 QT
27.273 4.5 L
26.195 4.5 L
26.195 -2.063 L
27.273 -2.063 L
27.273 -1.047 L
27.648 -1.641 28.164 -1.93 QT
28.68 -2.219 29.383 -2.219 QT
30.102 -2.219 30.602 -1.859 QT
31.102 -1.5 31.336 -0.797 QT
cp
40.9 1.203 M
39.604 1.203 39.096 1.5 QT
38.588 1.797 38.588 2.516 QT
38.588 3.094 38.971 3.43 QT
39.354 3.766 39.994 3.766 QT
40.9 3.766 41.439 3.133 QT
41.979 2.5 41.979 1.438 QT
41.979 1.203 L
40.9 1.203 L
cp
43.057 0.75 M
43.057 4.5 L
41.979 4.5 L
41.979 3.5 L
41.604 4.094 41.057 4.383 QT
40.51 4.672 39.713 4.672 QT
38.697 4.672 38.104 4.102 QT
37.51 3.531 37.51 2.594 QT
37.51 1.484 38.252 0.922 QT
38.994 0.359 40.463 0.359 QT
41.979 0.359 L
41.979 0.25 L
41.979 -0.5 41.486 -0.906 QT
40.994 -1.313 40.119 -1.313 QT
39.557 -1.313 39.018 -1.172 QT
38.479 -1.031 37.994 -0.766 QT
37.994 -1.766 L
38.588 -2 39.143 -2.109 QT
39.697 -2.219 40.229 -2.219 QT
41.65 -2.219 42.354 -1.484 QT
43.057 -0.75 43.057 0.75 QT
cp
41.604 -5.094 M
42.775 -5.094 L
40.869 -2.891 L
39.963 -2.891 L
41.604 -5.094 L
cp
45.27 -4.625 M
46.348 -4.625 L
46.348 4.5 L
45.27 4.5 L
45.27 -4.625 L
cp
54.072 0.531 M
54.072 4.5 L
52.994 4.5 L
52.994 0.578 L
52.994 -0.359 52.627 -0.82 QT
52.26 -1.281 51.541 -1.281 QT
50.666 -1.281 50.158 -0.727 QT
49.65 -0.172 49.65 0.797 QT
49.65 4.5 L
48.572 4.5 L
48.572 -2.063 L
49.65 -2.063 L
49.65 -1.047 L
50.041 -1.641 50.564 -1.93 QT
51.088 -2.219 51.775 -2.219 QT
52.9 -2.219 53.486 -1.523 QT
54.072 -0.828 54.072 0.531 QT
cp
57.896 -5.094 M
59.068 -5.094 L
57.162 -2.891 L
56.256 -2.891 L
57.896 -5.094 L
cp
56.209 -2.063 M
57.287 -2.063 L
57.287 4.5 L
56.209 4.5 L
56.209 -2.063 L
cp
62.889 -2.063 M
68.014 -2.063 L
68.014 -1.078 L
63.967 3.641 L
68.014 3.641 L
68.014 4.5 L
62.748 4.5 L
62.748 3.516 L
66.811 -1.203 L
62.889 -1.203 L
62.889 -2.063 L
cp
70.703 3.516 M
70.703 7 L
69.625 7 L
69.625 -2.063 L
70.703 -2.063 L
70.703 -1.063 L
71.047 -1.656 71.563 -1.938 QT
72.078 -2.219 72.797 -2.219 QT
74 -2.219 74.75 -1.273 QT
75.5 -0.328 75.5 1.219 QT
75.5 2.766 74.75 3.719 QT
74 4.672 72.797 4.672 QT
72.078 4.672 71.563 4.383 QT
71.047 4.094 70.703 3.516 QT
cp
74.375 1.219 M
74.375 0.031 73.883 -0.641 QT
73.391 -1.313 72.547 -1.313 QT
71.688 -1.313 71.195 -0.641 QT
70.703 0.031 70.703 1.219 QT
70.703 2.406 71.195 3.086 QT
71.688 3.766 72.547 3.766 QT
73.391 3.766 73.883 3.086 QT
74.375 2.406 74.375 1.219 QT
cp
82.898 0.953 M
82.898 1.469 L
77.93 1.469 L
78.008 2.594 78.609 3.172 QT
79.211 3.75 80.273 3.75 QT
80.898 3.75 81.484 3.602 QT
82.07 3.453 82.648 3.141 QT
82.648 4.172 L
82.055 4.406 81.445 4.539 QT
80.836 4.672 80.211 4.672 QT
78.648 4.672 77.727 3.758 QT
76.805 2.844 76.805 1.281 QT
76.805 -0.328 77.68 -1.273 QT
78.555 -2.219 80.023 -2.219 QT
81.352 -2.219 82.125 -1.367 QT
82.898 -0.516 82.898 0.953 QT
cp
81.82 0.625 M
81.805 -0.25 81.32 -0.781 QT
80.836 -1.313 80.039 -1.313 QT
79.133 -1.313 78.594 -0.797 QT
78.055 -0.281 77.977 0.641 QT
81.82 0.625 L
cp
79.383 -2.891 M
77.805 -5.094 L
78.695 -5.094 L
79.852 -3.656 L
81.008 -5.094 L
81.898 -5.094 L
80.32 -2.891 L
79.383 -2.891 L
cp
85.734 -3.922 M
85.734 -2.063 L
87.953 -2.063 L
87.953 -1.219 L
85.734 -1.219 L
85.734 2.344 L
85.734 3.141 85.953 3.367 QT
86.172 3.594 86.844 3.594 QT
87.953 3.594 L
87.953 4.5 L
86.844 4.5 L
85.594 4.5 85.117 4.031 QT
84.641 3.563 84.641 2.344 QT
84.641 -1.219 L
83.859 -1.219 L
83.859 -2.063 L
84.641 -2.063 L
84.641 -3.922 L
85.734 -3.922 L
cp
94.83 0.531 M
94.83 4.5 L
93.752 4.5 L
93.752 0.578 L
93.752 -0.359 93.385 -0.82 QT
93.018 -1.281 92.299 -1.281 QT
91.424 -1.281 90.916 -0.727 QT
90.408 -0.172 90.408 0.797 QT
90.408 4.5 L
89.33 4.5 L
89.33 -2.063 L
90.408 -2.063 L
90.408 -1.047 L
90.799 -1.641 91.322 -1.93 QT
91.846 -2.219 92.533 -2.219 QT
93.658 -2.219 94.244 -1.523 QT
94.83 -0.828 94.83 0.531 QT
cp
99.514 -1.313 M
98.654 -1.313 98.146 -0.633 QT
97.639 0.047 97.639 1.219 QT
97.639 2.406 98.139 3.078 QT
98.639 3.75 99.514 3.75 QT
100.373 3.75 100.881 3.07 QT
101.389 2.391 101.389 1.219 QT
101.389 0.063 100.881 -0.625 QT
100.373 -1.313 99.514 -1.313 QT
cp
99.514 -2.219 M
100.92 -2.219 101.725 -1.305 QT
102.529 -0.391 102.529 1.219 QT
102.529 2.828 101.725 3.75 QT
100.92 4.672 99.514 4.672 QT
98.107 4.672 97.303 3.75 QT
96.498 2.828 96.498 1.219 QT
96.498 -0.391 97.303 -1.305 QT
98.107 -2.219 99.514 -2.219 QT
cp
103.543 -2.063 M
104.684 -2.063 L
106.73 3.438 L
108.793 -2.063 L
109.934 -2.063 L
107.465 4.5 L
105.996 4.5 L
103.543 -2.063 L
cp
114.395 1.203 M
113.098 1.203 112.59 1.5 QT
112.082 1.797 112.082 2.516 QT
112.082 3.094 112.465 3.43 QT
112.848 3.766 113.488 3.766 QT
114.395 3.766 114.934 3.133 QT
115.473 2.5 115.473 1.438 QT
115.473 1.203 L
114.395 1.203 L
cp
116.551 0.75 M
116.551 4.5 L
115.473 4.5 L
115.473 3.5 L
115.098 4.094 114.551 4.383 QT
114.004 4.672 113.207 4.672 QT
112.191 4.672 111.598 4.102 QT
111.004 3.531 111.004 2.594 QT
111.004 1.484 111.746 0.922 QT
112.488 0.359 113.957 0.359 QT
115.473 0.359 L
115.473 0.25 L
115.473 -0.5 114.98 -0.906 QT
114.488 -1.313 113.613 -1.313 QT
113.051 -1.313 112.512 -1.172 QT
111.973 -1.031 111.488 -0.766 QT
111.488 -1.766 L
112.082 -2 112.637 -2.109 QT
113.191 -2.219 113.723 -2.219 QT
115.145 -2.219 115.848 -1.484 QT
116.551 -0.75 116.551 0.75 QT
cp
118.295 -2.063 M
123.42 -2.063 L
123.42 -1.078 L
119.373 3.641 L
123.42 3.641 L
123.42 4.5 L
118.154 4.5 L
118.154 3.516 L
122.217 -1.203 L
118.295 -1.203 L
118.295 -2.063 L
cp
130.688 0.953 M
130.688 1.469 L
125.719 1.469 L
125.797 2.594 126.398 3.172 QT
127 3.75 128.063 3.75 QT
128.688 3.75 129.273 3.602 QT
129.859 3.453 130.438 3.141 QT
130.438 4.172 L
129.844 4.406 129.234 4.539 QT
128.625 4.672 128 4.672 QT
126.438 4.672 125.516 3.758 QT
124.594 2.844 124.594 1.281 QT
124.594 -0.328 125.469 -1.273 QT
126.344 -2.219 127.813 -2.219 QT
129.141 -2.219 129.914 -1.367 QT
130.688 -0.516 130.688 0.953 QT
cp
129.609 0.625 M
129.594 -0.25 129.109 -0.781 QT
128.625 -1.313 127.828 -1.313 QT
126.922 -1.313 126.383 -0.797 QT
125.844 -0.281 125.766 0.641 QT
129.609 0.625 L
cp
137.164 1.219 M
137.164 0.031 136.672 -0.641 QT
136.18 -1.313 135.336 -1.313 QT
134.477 -1.313 133.984 -0.641 QT
133.492 0.031 133.492 1.219 QT
133.492 2.406 133.984 3.086 QT
134.477 3.766 135.336 3.766 QT
136.18 3.766 136.672 3.086 QT
137.164 2.406 137.164 1.219 QT
cp
133.492 -1.063 M
133.836 -1.656 134.352 -1.938 QT
134.867 -2.219 135.586 -2.219 QT
136.789 -2.219 137.539 -1.273 QT
138.289 -0.328 138.289 1.219 QT
138.289 2.766 137.539 3.719 QT
136.789 4.672 135.586 4.672 QT
134.867 4.672 134.352 4.383 QT
133.836 4.094 133.492 3.516 QT
133.492 4.5 L
132.414 4.5 L
132.414 -4.625 L
133.492 -4.625 L
133.492 -1.063 L
cp
145.531 0.531 M
145.531 4.5 L
144.453 4.5 L
144.453 0.578 L
144.453 -0.359 144.086 -0.82 QT
143.719 -1.281 143 -1.281 QT
142.125 -1.281 141.617 -0.727 QT
141.109 -0.172 141.109 0.797 QT
141.109 4.5 L
140.031 4.5 L
140.031 -2.063 L
141.109 -2.063 L
141.109 -1.047 L
141.5 -1.641 142.023 -1.93 QT
142.547 -2.219 143.234 -2.219 QT
144.359 -2.219 144.945 -1.523 QT
145.531 -0.828 145.531 0.531 QT
cp
149.355 -5.094 M
150.527 -5.094 L
148.621 -2.891 L
147.715 -2.891 L
149.355 -5.094 L
cp
147.668 -2.063 M
148.746 -2.063 L
148.746 4.5 L
147.668 4.5 L
147.668 -2.063 L
cp
160.285 0.531 M
160.285 4.5 L
159.207 4.5 L
159.207 0.578 L
159.207 -0.359 158.84 -0.82 QT
158.473 -1.281 157.754 -1.281 QT
156.879 -1.281 156.371 -0.727 QT
155.863 -0.172 155.863 0.797 QT
155.863 4.5 L
154.785 4.5 L
154.785 -4.625 L
155.863 -4.625 L
155.863 -1.047 L
156.254 -1.641 156.777 -1.93 QT
157.301 -2.219 157.988 -2.219 QT
159.113 -2.219 159.699 -1.523 QT
160.285 -0.828 160.285 0.531 QT
cp
165.828 -3.219 M
162.844 1.453 L
165.828 1.453 L
165.828 -3.219 L
cp
165.516 -4.25 M
167.016 -4.25 L
167.016 1.453 L
168.266 1.453 L
168.266 2.438 L
167.016 2.438 L
167.016 4.5 L
165.828 4.5 L
165.828 2.438 L
161.891 2.438 L
161.891 1.297 L
165.516 -4.25 L
cp
172.744 -3.469 M
171.838 -3.469 171.377 -2.57 QT
170.916 -1.672 170.916 0.141 QT
170.916 1.938 171.377 2.836 QT
171.838 3.734 172.744 3.734 QT
173.666 3.734 174.127 2.836 QT
174.588 1.938 174.588 0.141 QT
174.588 -1.672 174.127 -2.57 QT
173.666 -3.469 172.744 -3.469 QT
cp
172.744 -4.406 M
174.213 -4.406 174.994 -3.242 QT
175.775 -2.078 175.775 0.141 QT
175.775 2.344 174.994 3.508 QT
174.213 4.672 172.744 4.672 QT
171.275 4.672 170.502 3.508 QT
169.729 2.344 169.729 0.141 QT
169.729 -2.078 170.502 -3.242 QT
171.275 -4.406 172.744 -4.406 QT
cp
f
GR
GS
[0.75 0 0 0.75 0 0] CT
0.851 0.325 0.098 RC
1 LJ
8 LW
N
663 85.13 M
693 85.13 L
S
GR
GS
[0.75 0 0 0.75 522 75.53238] CT
/Helvetica 12 F
GS
[1 0 0 1 0 0] CT
0 4.5 moveto 
1 -1 scale
(Q-parametrizace h30) t 
GR
GR
GS
[0.75 0 0 0.75 0 0] CT
0.929 0.694 0.125 RC
1 LJ
4 LW
N
663 100.71 M
693 100.71 L
S
GR
GS
[0.75 0 0 0.75 522 87.21762] CT
/Helvetica 12 F
GS
[1 0 0 1 0 0] CT
0 4.5 moveto 
1 -1 scale
(Q-parametrizace h40) t 
GR
GR
GS
[0.75 0 0 0.75 0 0] CT
0.494 0.184 0.557 RC
1 LJ
5.333 LW
N
663 116.29 M
693 116.29 L
S
GR
GS
[0.75 0 0 0.75 522 98.90285] CT
/Helvetica 12 F
GS
[1 0 0 1 0 0] CT
0 4.5 moveto 
1 -1 scale
(T* h30) t 
GR
GR
GS
[0.75 0 0 0.75 0 0] CT
0.467 0.675 0.188 RC
1 LJ
2.667 LW
N
663 131.87 M
693 131.87 L
S
GR
GS
[0.75 0 0 0.75 522 110.58808] CT
/Helvetica 12 F
GS
[1 0 0 1 0 0] CT
0 4.5 moveto 
1 -1 scale
(T* h40) t 
GR
GR
GS
[0.75 0 0 0.75 0 0] CT
0.302 0.745 0.933 RC
1 LJ
2.667 LW
N
663 147.451 M
693 147.451 L
S
GR
GS
[0.75 0 0 0.75 0 0] CT
0.149 GC
10.0 ML
0.667 LW
N
659 157 M
659 60 L
877 60 L
877 157 L
cp
S
GR
%%Trailer
%%Pages: 1
%%EOF
