%!PS-Adobe-3.0 EPSF-3.0
%%Creator: (MATLAB, The Mathworks, Inc. Version 9.1.0.441655 \(R2016b\). Operating System: Linux)
%%Title: /home/frdm/Documents/RLS/rls-2017/sp5/figures/reg1_boosted.eps
%%CreationDate: 2018-02-09T20:58:14
%%Pages: (atend)
%%BoundingBox: 0 0 737 470
%%LanguageLevel: 3
%%EndComments
%%BeginProlog
%%BeginResource: procset (Apache XML Graphics Std ProcSet) 1.2 0
%%Version: 1.2 0
%%Copyright: (Copyright 2001-2003,2010 The Apache Software Foundation. License terms: http://www.apache.org/licenses/LICENSE-2.0)
/bd{bind def}bind def
/ld{load def}bd
/GR/grestore ld
/M/moveto ld
/LJ/setlinejoin ld
/C/curveto ld
/f/fill ld
/LW/setlinewidth ld
/GC/setgray ld
/t/show ld
/N/newpath ld
/CT/concat ld
/cp/closepath ld
/S/stroke ld
/L/lineto ld
/CC/setcmykcolor ld
/A/ashow ld
/GS/gsave ld
/RC/setrgbcolor ld
/RM/rmoveto ld
/ML/setmiterlimit ld
/re {4 2 roll M
1 index 0 rlineto
0 exch rlineto
neg 0 rlineto
cp } bd
/_ctm matrix def
/_tm matrix def
/BT { _ctm currentmatrix pop matrix _tm copy pop 0 0 moveto } bd
/ET { _ctm setmatrix } bd
/iTm { _ctm setmatrix _tm concat } bd
/Tm { _tm astore pop iTm 0 0 moveto } bd
/ux 0.0 def
/uy 0.0 def
/F {
  /Tp exch def
  /Tf exch def
  Tf findfont Tp scalefont setfont
  /cf Tf def  /cs Tp def
} bd
/ULS {currentpoint /uy exch def /ux exch def} bd
/ULE {
  /Tcx currentpoint pop def
  gsave
  newpath
  cf findfont cs scalefont dup
  /FontMatrix get 0 get /Ts exch def /FontInfo get dup
  /UnderlinePosition get Ts mul /To exch def
  /UnderlineThickness get Ts mul /Tt exch def
  ux uy To add moveto  Tcx uy To add lineto
  Tt setlinewidth stroke
  grestore
} bd
/OLE {
  /Tcx currentpoint pop def
  gsave
  newpath
  cf findfont cs scalefont dup
  /FontMatrix get 0 get /Ts exch def /FontInfo get dup
  /UnderlinePosition get Ts mul /To exch def
  /UnderlineThickness get Ts mul /Tt exch def
  ux uy To add cs add moveto Tcx uy To add cs add lineto
  Tt setlinewidth stroke
  grestore
} bd
/SOE {
  /Tcx currentpoint pop def
  gsave
  newpath
  cf findfont cs scalefont dup
  /FontMatrix get 0 get /Ts exch def /FontInfo get dup
  /UnderlinePosition get Ts mul /To exch def
  /UnderlineThickness get Ts mul /Tt exch def
  ux uy To add cs 10 mul 26 idiv add moveto Tcx uy To add cs 10 mul 26 idiv add lineto
  Tt setlinewidth stroke
  grestore
} bd
/QT {
/Y22 exch store
/X22 exch store
/Y21 exch store
/X21 exch store
currentpoint
/Y21 load 2 mul add 3 div exch
/X21 load 2 mul add 3 div exch
/X21 load 2 mul /X22 load add 3 div
/Y21 load 2 mul /Y22 load add 3 div
/X22 load /Y22 load curveto
} bd
/SSPD {
dup length /d exch dict def
{
/v exch def
/k exch def
currentpagedevice k known {
/cpdv currentpagedevice k get def
v cpdv ne {
/upd false def
/nullv v type /nulltype eq def
/nullcpdv cpdv type /nulltype eq def
nullv nullcpdv or
{
/upd true def
} {
/sametype v type cpdv type eq def
sametype {
v type /arraytype eq {
/vlen v length def
/cpdvlen cpdv length def
vlen cpdvlen eq {
0 1 vlen 1 sub {
/i exch def
/obj v i get def
/cpdobj cpdv i get def
obj cpdobj ne {
/upd true def
exit
} if
} for
} {
/upd true def
} ifelse
} {
v type /dicttype eq {
v {
/dv exch def
/dk exch def
/cpddv cpdv dk get def
dv cpddv ne {
/upd true def
exit
} if
} forall
} {
/upd true def
} ifelse
} ifelse
} if
} ifelse
upd true eq {
d k v put
} if
} if
} if
} forall
d length 0 gt {
d setpagedevice
} if
} bd
/RE { % /NewFontName [NewEncodingArray] /FontName RE -
  findfont dup length dict begin
  {
    1 index /FID ne
    {def} {pop pop} ifelse
  } forall
  /Encoding exch def
  /FontName 1 index def
  currentdict definefont pop
  end
} bind def
%%EndResource
%%BeginResource: procset (Apache XML Graphics EPS ProcSet) 1.0 0
%%Version: 1.0 0
%%Copyright: (Copyright 2002-2003 The Apache Software Foundation. License terms: http://www.apache.org/licenses/LICENSE-2.0)
/BeginEPSF { %def
/b4_Inc_state save def         % Save state for cleanup
/dict_count countdictstack def % Count objects on dict stack
/op_count count 1 sub def      % Count objects on operand stack
userdict begin                 % Push userdict on dict stack
/showpage { } def              % Redefine showpage, { } = null proc
0 setgray 0 setlinecap         % Prepare graphics state
1 setlinewidth 0 setlinejoin
10 setmiterlimit [ ] 0 setdash newpath
/languagelevel where           % If level not equal to 1 then
{pop languagelevel             % set strokeadjust and
1 ne                           % overprint to their defaults.
{false setstrokeadjust false setoverprint
} if
} if
} bd
/EndEPSF { %def
count op_count sub {pop} repeat            % Clean up stacks
countdictstack dict_count sub {end} repeat
b4_Inc_state restore
} bd
%%EndResource
%FOPBeginFontDict
%%IncludeResource: font Courier-Bold
%%IncludeResource: font Helvetica
%%IncludeResource: font Courier-BoldOblique
%%IncludeResource: font Courier-Oblique
%%IncludeResource: font Times-Roman
%%IncludeResource: font Helvetica-BoldOblique
%%IncludeResource: font Helvetica-Bold
%%IncludeResource: font Helvetica-Oblique
%%IncludeResource: font Times-BoldItalic
%%IncludeResource: font Courier
%%IncludeResource: font Times-Italic
%%IncludeResource: font Times-Bold
%%IncludeResource: font Symbol
%%IncludeResource: font ZapfDingbats
%FOPEndFontDict
%%BeginResource: encoding WinAnsiEncoding
/WinAnsiEncoding [
/.notdef /.notdef /.notdef /.notdef /.notdef
/.notdef /.notdef /.notdef /.notdef /.notdef
/.notdef /.notdef /.notdef /.notdef /.notdef
/.notdef /.notdef /.notdef /.notdef /.notdef
/.notdef /.notdef /.notdef /.notdef /.notdef
/.notdef /.notdef /.notdef /.notdef /.notdef
/.notdef /.notdef /space /exclam /quotedbl
/numbersign /dollar /percent /ampersand /quotesingle
/parenleft /parenright /asterisk /plus /comma
/hyphen /period /slash /zero /one
/two /three /four /five /six
/seven /eight /nine /colon /semicolon
/less /equal /greater /question /at
/A /B /C /D /E
/F /G /H /I /J
/K /L /M /N /O
/P /Q /R /S /T
/U /V /W /X /Y
/Z /bracketleft /backslash /bracketright /asciicircum
/underscore /quoteleft /a /b /c
/d /e /f /g /h
/i /j /k /l /m
/n /o /p /q /r
/s /t /u /v /w
/x /y /z /braceleft /bar
/braceright /asciitilde /bullet /Euro /bullet
/quotesinglbase /florin /quotedblbase /ellipsis /dagger
/daggerdbl /circumflex /perthousand /Scaron /guilsinglleft
/OE /bullet /Zcaron /bullet /bullet
/quoteleft /quoteright /quotedblleft /quotedblright /bullet
/endash /emdash /asciitilde /trademark /scaron
/guilsinglright /oe /bullet /zcaron /Ydieresis
/space /exclamdown /cent /sterling /currency
/yen /brokenbar /section /dieresis /copyright
/ordfeminine /guillemotleft /logicalnot /sfthyphen /registered
/macron /degree /plusminus /twosuperior /threesuperior
/acute /mu /paragraph /middot /cedilla
/onesuperior /ordmasculine /guillemotright /onequarter /onehalf
/threequarters /questiondown /Agrave /Aacute /Acircumflex
/Atilde /Adieresis /Aring /AE /Ccedilla
/Egrave /Eacute /Ecircumflex /Edieresis /Igrave
/Iacute /Icircumflex /Idieresis /Eth /Ntilde
/Ograve /Oacute /Ocircumflex /Otilde /Odieresis
/multiply /Oslash /Ugrave /Uacute /Ucircumflex
/Udieresis /Yacute /Thorn /germandbls /agrave
/aacute /acircumflex /atilde /adieresis /aring
/ae /ccedilla /egrave /eacute /ecircumflex
/edieresis /igrave /iacute /icircumflex /idieresis
/eth /ntilde /ograve /oacute /ocircumflex
/otilde /odieresis /divide /oslash /ugrave
/uacute /ucircumflex /udieresis /yacute /thorn
/ydieresis
] def
%%EndResource
%FOPBeginFontReencode
/Courier-Bold findfont
dup length dict begin
  {1 index /FID ne {def} {pop pop} ifelse} forall
  /Encoding WinAnsiEncoding def
  currentdict
end
/Courier-Bold exch definefont pop
/Helvetica findfont
dup length dict begin
  {1 index /FID ne {def} {pop pop} ifelse} forall
  /Encoding WinAnsiEncoding def
  currentdict
end
/Helvetica exch definefont pop
/Courier-BoldOblique findfont
dup length dict begin
  {1 index /FID ne {def} {pop pop} ifelse} forall
  /Encoding WinAnsiEncoding def
  currentdict
end
/Courier-BoldOblique exch definefont pop
/Courier-Oblique findfont
dup length dict begin
  {1 index /FID ne {def} {pop pop} ifelse} forall
  /Encoding WinAnsiEncoding def
  currentdict
end
/Courier-Oblique exch definefont pop
/Times-Roman findfont
dup length dict begin
  {1 index /FID ne {def} {pop pop} ifelse} forall
  /Encoding WinAnsiEncoding def
  currentdict
end
/Times-Roman exch definefont pop
/Helvetica-BoldOblique findfont
dup length dict begin
  {1 index /FID ne {def} {pop pop} ifelse} forall
  /Encoding WinAnsiEncoding def
  currentdict
end
/Helvetica-BoldOblique exch definefont pop
/Helvetica-Bold findfont
dup length dict begin
  {1 index /FID ne {def} {pop pop} ifelse} forall
  /Encoding WinAnsiEncoding def
  currentdict
end
/Helvetica-Bold exch definefont pop
/Helvetica-Oblique findfont
dup length dict begin
  {1 index /FID ne {def} {pop pop} ifelse} forall
  /Encoding WinAnsiEncoding def
  currentdict
end
/Helvetica-Oblique exch definefont pop
/Times-BoldItalic findfont
dup length dict begin
  {1 index /FID ne {def} {pop pop} ifelse} forall
  /Encoding WinAnsiEncoding def
  currentdict
end
/Times-BoldItalic exch definefont pop
/Courier findfont
dup length dict begin
  {1 index /FID ne {def} {pop pop} ifelse} forall
  /Encoding WinAnsiEncoding def
  currentdict
end
/Courier exch definefont pop
/Times-Italic findfont
dup length dict begin
  {1 index /FID ne {def} {pop pop} ifelse} forall
  /Encoding WinAnsiEncoding def
  currentdict
end
/Times-Italic exch definefont pop
/Times-Bold findfont
dup length dict begin
  {1 index /FID ne {def} {pop pop} ifelse} forall
  /Encoding WinAnsiEncoding def
  currentdict
end
/Times-Bold exch definefont pop
%FOPEndFontReencode
%%EndProlog
%%Page: 1 1
%%PageBoundingBox: 0 0 737 470
%%BeginPageSetup
[1 0 0 -1 0 470] CT
%%EndPageSetup
GS
[0.75 0 0 0.75 0 -0.25] CT
1 GC
N
0 0 983 627 re
f
GR
GS
[0.75 0 0 0.75 0 -0.25] CT
1 GC
N
0 0 983 627 re
f
GR
GS
[0.75 0 0 0.75 0 -0.25] CT
1 GC
N
128 558 M
890 558 L
890 47 L
128 47 L
cp
f
GR
GS
[0.75 0 0 0.75 0 -0.25] CT
0.149 GC
2 setlinecap
1 LJ
0.667 LW
N
128 558 M
890 558 L
S
GR
GS
[0.75 0 0 0.75 0 -0.25] CT
0.149 GC
2 setlinecap
1 LJ
0.667 LW
N
128 558 M
128 550.38 L
S
GR
GS
[0.75 0 0 0.75 0 -0.25] CT
0.149 GC
2 setlinecap
1 LJ
0.667 LW
N
204.2 558 M
204.2 550.38 L
S
GR
GS
[0.75 0 0 0.75 0 -0.25] CT
0.149 GC
2 setlinecap
1 LJ
0.667 LW
N
280.4 558 M
280.4 550.38 L
S
GR
GS
[0.75 0 0 0.75 0 -0.25] CT
0.149 GC
2 setlinecap
1 LJ
0.667 LW
N
356.6 558 M
356.6 550.38 L
S
GR
GS
[0.75 0 0 0.75 0 -0.25] CT
0.149 GC
2 setlinecap
1 LJ
0.667 LW
N
432.8 558 M
432.8 550.38 L
S
GR
GS
[0.75 0 0 0.75 0 -0.25] CT
0.149 GC
2 setlinecap
1 LJ
0.667 LW
N
509 558 M
509 550.38 L
S
GR
GS
[0.75 0 0 0.75 0 -0.25] CT
0.149 GC
2 setlinecap
1 LJ
0.667 LW
N
585.2 558 M
585.2 550.38 L
S
GR
GS
[0.75 0 0 0.75 0 -0.25] CT
0.149 GC
2 setlinecap
1 LJ
0.667 LW
N
661.4 558 M
661.4 550.38 L
S
GR
GS
[0.75 0 0 0.75 0 -0.25] CT
0.149 GC
2 setlinecap
1 LJ
0.667 LW
N
737.6 558 M
737.6 550.38 L
S
GR
GS
[0.75 0 0 0.75 0 -0.25] CT
0.149 GC
2 setlinecap
1 LJ
0.667 LW
N
813.8 558 M
813.8 550.38 L
S
GR
GS
[0.75 0 0 0.75 0 -0.25] CT
0.149 GC
2 setlinecap
1 LJ
0.667 LW
N
890 558 M
890 550.38 L
S
GR
GS
[0.75 0 0 0.75 96 422.24998] CT
0.149 GC
/Helvetica 13.333 F
GS
[1 0 0 1 0 0] CT
-4.5 13 moveto 
1 -1 scale
(0) t 
GR
GR
GS
[0.75 0 0 0.75 153.15 422.24998] CT
0.149 GC
/Helvetica 13.333 F
GS
[1 0 0 1 0 0] CT
-8.5 13 moveto 
1 -1 scale
(50) t 
GR
GR
GS
[0.75 0 0 0.75 210.3 422.24998] CT
0.149 GC
/Helvetica 13.333 F
GS
[1 0 0 1 0 0] CT
-12.5 13 moveto 
1 -1 scale
(100) t 
GR
GR
GS
[0.75 0 0 0.75 267.45 422.24998] CT
0.149 GC
/Helvetica 13.333 F
GS
[1 0 0 1 0 0] CT
-12.5 13 moveto 
1 -1 scale
(150) t 
GR
GR
GS
[0.75 0 0 0.75 324.59999 422.24998] CT
0.149 GC
/Helvetica 13.333 F
GS
[1 0 0 1 0 0] CT
-12.5 13 moveto 
1 -1 scale
(200) t 
GR
GR
GS
[0.75 0 0 0.75 381.75 422.24998] CT
0.149 GC
/Helvetica 13.333 F
GS
[1 0 0 1 0 0] CT
-12.5 13 moveto 
1 -1 scale
(250) t 
GR
GR
GS
[0.75 0 0 0.75 438.90001 422.24998] CT
0.149 GC
/Helvetica 13.333 F
GS
[1 0 0 1 0 0] CT
-12.5 13 moveto 
1 -1 scale
(300) t 
GR
GR
GS
[0.75 0 0 0.75 496.05002 422.24998] CT
0.149 GC
/Helvetica 13.333 F
GS
[1 0 0 1 0 0] CT
-12.5 13 moveto 
1 -1 scale
(350) t 
GR
GR
GS
[0.75 0 0 0.75 553.19998 422.24998] CT
0.149 GC
/Helvetica 13.333 F
GS
[1 0 0 1 0 0] CT
-12.5 13 moveto 
1 -1 scale
(400) t 
GR
GR
GS
[0.75 0 0 0.75 610.34999 422.24998] CT
0.149 GC
/Helvetica 13.333 F
GS
[1 0 0 1 0 0] CT
-12.5 13 moveto 
1 -1 scale
(450) t 
GR
GR
GS
[0.75 0 0 0.75 667.5 422.24998] CT
0.149 GC
/Helvetica 13.333 F
GS
[1 0 0 1 0 0] CT
-12.5 13 moveto 
1 -1 scale
(500) t 
GR
GR
GS
[0.75 0 0 0.75 381.75027 436.00002] CT
0.149 GC
/Helvetica 14.667 F
GS
[1 0 0 1 0 0] CT
-57.5 14 moveto 
1 -1 scale
(Time \(seconds\)) t 
GR
GR
GS
[0.75 0 0 0.75 0 -0.25] CT
0.149 GC
2 setlinecap
1 LJ
0.667 LW
N
128 558 M
128 47 L
S
GR
GS
[0.75 0 0 0.75 0 -0.25] CT
0.149 GC
2 setlinecap
1 LJ
0.667 LW
N
128 558 M
135.62 558 L
S
GR
GS
[0.75 0 0 0.75 0 -0.25] CT
0.149 GC
2 setlinecap
1 LJ
0.667 LW
N
128 455.8 M
135.62 455.8 L
S
GR
GS
[0.75 0 0 0.75 0 -0.25] CT
0.149 GC
2 setlinecap
1 LJ
0.667 LW
N
128 353.6 M
135.62 353.6 L
S
GR
GS
[0.75 0 0 0.75 0 -0.25] CT
0.149 GC
2 setlinecap
1 LJ
0.667 LW
N
128 251.4 M
135.62 251.4 L
S
GR
GS
[0.75 0 0 0.75 0 -0.25] CT
0.149 GC
2 setlinecap
1 LJ
0.667 LW
N
128 149.2 M
135.62 149.2 L
S
GR
GS
[0.75 0 0 0.75 0 -0.25] CT
0.149 GC
2 setlinecap
1 LJ
0.667 LW
N
128 47 M
135.62 47 L
S
GR
GS
[0.75 0 0 0.75 92 418.25] CT
0.149 GC
/Helvetica 13.333 F
GS
[1 0 0 1 0 0] CT
-9 4.5 moveto 
1 -1 scale
(0) t 
GR
GR
GS
[0.75 0 0 0.75 92 341.59999] CT
0.149 GC
/Helvetica 13.333 F
GS
[1 0 0 1 0 0] CT
-29 4.5 moveto 
1 -1 scale
(0.05) t 
GR
GR
GS
[0.75 0 0 0.75 92 264.95] CT
0.149 GC
/Helvetica 13.333 F
GS
[1 0 0 1 0 0] CT
-21 4.5 moveto 
1 -1 scale
(0.1) t 
GR
GR
GS
[0.75 0 0 0.75 92 188.3] CT
0.149 GC
/Helvetica 13.333 F
GS
[1 0 0 1 0 0] CT
-29 4.5 moveto 
1 -1 scale
(0.15) t 
GR
GR
GS
[0.75 0 0 0.75 92 111.65] CT
0.149 GC
/Helvetica 13.333 F
GS
[1 0 0 1 0 0] CT
-21 4.5 moveto 
1 -1 scale
(0.2) t 
GR
GR
GS
[0.75 0 0 0.75 92 35] CT
0.149 GC
/Helvetica 13.333 F
GS
[1 0 0 1 0 0] CT
-29 4.5 moveto 
1 -1 scale
(0.25) t 
GR
GR
GS
[0 -0.75 0.75 0 67.25 226.62482] CT
0.149 GC
/Helvetica 14.667 F
GS
[1 0 0 1 0 0] CT
-17 -4 moveto 
1 -1 scale
(data) t 
GR
GR
GS
[0.75 0 0 0.75 381.75037 32.93751] CT
/Helvetica-Bold 14.667 F
GS
[1 0 0 1 0 0] CT
-161 -4 moveto 
1 -1 scale
(V\375stup regulace nezrychlen\351 syst\351mu) t 
GR
GR
GS
[0.75 0 0 0.75 0 -0.25] CT
0 0.447 0.741 RC
1 LJ
0.667 LW
N
128 558 M
128 558 L
128.001 558 L
128.001 558 L
128.003 558 L
128.005 558 L
128.007 558 L
128.009 558 L
128.018 558 L
128.028 558 L
128.037 558 L
128.047 558 L
128.069 558 L
128.092 558 L
128.114 558 L
128.137 558 L
128.159 558 L
128.213 557.999 L
128.267 557.999 L
128.32 557.998 L
128.374 557.997 L
128.428 557.995 L
128.482 557.993 L
128.612 557.987 L
128.743 557.979 L
128.873 557.967 L
129.004 557.953 L
129.134 557.936 L
129.264 557.917 L
129.505 557.872 L
129.746 557.818 L
129.987 557.754 L
130.228 557.679 L
130.469 557.594 L
130.71 557.5 L
131.322 557.216 L
131.934 556.87 L
132.546 556.465 L
133.158 556.001 L
133.77 555.482 L
134.381 554.908 L
135.771 553.412 L
137.16 551.667 L
138.549 549.691 L
139.939 547.505 L
141.328 545.127 L
142.717 542.575 L
144.632 538.806 L
146.546 534.782 L
148.461 530.543 L
150.376 526.125 L
152.291 521.563 L
154.205 516.888 L
158.458 506.239 L
162.71 495.437 L
166.963 484.701 L
171.215 474.201 L
175.467 464.068 L
179.72 454.401 L
186.84 439.442 L
193.959 426.156 L
201.079 414.586 L
208.199 404.683 L
215.319 396.341 L
222.438 389.419 L
232.453 381.777 L
242.468 376.169 L
252.483 372.162 L
262.498 369.386 L
272.513 367.533 L
282.528 366.356 L
297.635 365.435 L
312.743 365.143 L
327.85 365.191 L
342.958 365.412 L
358.066 365.708 L
373.173 366.024 L
388.413 366.331 L
403.653 366.611 L
418.893 366.859 L
434.133 367.073 L
449.373 367.252 L
464.613 367.399 L
479.853 367.515 L
495.093 367.602 L
510.333 367.665 L
525.573 367.708 L
540.813 367.736 L
556.053 367.754 L
571.293 367.763 L
586.533 367.765 L
601.773 367.76 L
617.013 367.753 L
632.253 367.745 L
647.493 367.736 L
662.733 367.727 L
677.973 367.718 L
693.213 367.711 L
708.453 367.706 L
723.693 367.702 L
738.933 367.699 L
754.173 367.698 L
769.413 367.697 L
784.653 367.696 L
799.893 367.695 L
815.133 367.695 L
830.373 367.694 L
845.613 367.694 L
860.853 367.694 L
876.093 367.694 L
890 367.694 L
S
GR
GS
[0.75 0 0 0.75 0 -0.25] CT
0.851 0.325 0.098 RC
1 LJ
0.667 LW
N
128 558 M
128 558 L
128.001 558 L
128.001 558 L
128.003 558 L
128.005 558 L
128.007 558 L
128.009 558 L
128.018 558 L
128.028 558 L
128.037 558 L
128.047 558 L
128.069 558 L
128.092 558 L
128.114 558 L
128.137 558 L
128.159 558 L
128.213 558 L
128.267 558 L
128.32 558 L
128.374 557.999 L
128.428 557.999 L
128.482 557.999 L
128.612 557.997 L
128.743 557.995 L
128.873 557.993 L
129.004 557.989 L
129.134 557.985 L
129.264 557.981 L
129.505 557.969 L
129.746 557.955 L
129.987 557.938 L
130.228 557.917 L
130.469 557.892 L
130.71 557.863 L
131.322 557.773 L
131.934 557.655 L
132.546 557.507 L
133.158 557.328 L
133.77 557.117 L
134.381 556.873 L
135.771 556.188 L
137.16 555.319 L
138.549 554.263 L
139.939 553.02 L
141.328 551.593 L
142.717 549.986 L
144.632 547.489 L
146.546 544.681 L
148.461 541.584 L
150.376 538.221 L
152.291 534.616 L
154.205 530.791 L
158.458 521.625 L
162.71 511.722 L
166.963 501.29 L
171.215 490.505 L
175.467 479.513 L
179.72 468.432 L
186.84 449.938 L
193.959 431.783 L
201.079 414.163 L
208.199 397.184 L
215.319 380.894 L
222.438 365.303 L
232.453 344.527 L
242.468 325.02 L
252.483 306.69 L
262.498 289.463 L
272.513 273.286 L
282.528 258.126 L
297.635 237.131 L
312.743 218.364 L
327.85 201.803 L
342.958 187.4 L
358.066 175.065 L
373.173 164.664 L
388.413 155.961 L
403.653 148.861 L
418.893 143.159 L
434.133 138.648 L
449.373 135.134 L
464.613 132.433 L
479.853 130.386 L
495.093 128.852 L
510.333 127.715 L
525.573 126.879 L
540.813 126.269 L
556.053 125.824 L
571.293 125.497 L
586.533 125.253 L
601.773 125.065 L
617.013 124.916 L
632.253 124.794 L
647.493 124.691 L
662.733 124.6 L
677.973 124.519 L
693.213 124.446 L
708.453 124.381 L
723.693 124.323 L
738.933 124.272 L
754.173 124.228 L
769.413 124.189 L
784.653 124.154 L
799.893 124.123 L
815.133 124.097 L
830.373 124.074 L
845.613 124.054 L
860.853 124.038 L
876.093 124.024 L
890 124.014 L
S
GR
GS
[0.75 0 0 0.75 0 -0.25] CT
0.929 0.694 0.125 RC
1 LJ
0.667 LW
N
128 367.665 M
128 367.665 L
128.001 367.665 L
128.001 367.665 L
128.003 367.665 L
128.005 367.665 L
128.007 367.665 L
128.009 367.665 L
128.018 367.665 L
128.028 367.665 L
128.037 367.665 L
128.047 367.665 L
128.069 367.665 L
128.092 367.665 L
128.114 367.665 L
128.137 367.665 L
128.159 367.665 L
128.213 367.665 L
128.267 367.665 L
128.32 367.665 L
128.374 367.665 L
128.428 367.665 L
128.482 367.665 L
128.612 367.665 L
128.743 367.665 L
128.873 367.665 L
129.004 367.665 L
129.134 367.665 L
129.264 367.665 L
129.505 367.665 L
129.746 367.665 L
129.987 367.665 L
130.228 367.665 L
130.469 367.665 L
130.71 367.665 L
131.322 367.665 L
131.934 367.665 L
132.546 367.665 L
133.158 367.665 L
133.77 367.665 L
134.381 367.665 L
135.771 367.665 L
137.16 367.665 L
138.549 367.665 L
139.939 367.665 L
141.328 367.665 L
142.717 367.665 L
144.632 367.665 L
146.546 367.665 L
148.461 367.665 L
150.376 367.665 L
152.291 367.665 L
154.205 367.665 L
158.458 367.665 L
162.71 367.665 L
166.963 367.665 L
171.215 367.665 L
175.467 367.665 L
179.72 367.665 L
186.84 367.665 L
193.959 367.665 L
201.079 367.665 L
208.199 367.665 L
215.319 367.665 L
222.438 367.665 L
232.453 367.665 L
242.468 367.665 L
252.483 367.665 L
262.498 367.665 L
272.513 367.665 L
282.528 367.665 L
297.635 367.665 L
312.743 367.665 L
327.85 367.665 L
342.958 367.665 L
358.066 367.665 L
373.173 367.665 L
388.413 367.665 L
403.653 367.665 L
418.893 367.665 L
434.133 367.665 L
449.373 367.665 L
464.613 367.665 L
479.853 367.665 L
495.093 367.665 L
510.333 367.665 L
525.573 367.665 L
540.813 367.665 L
556.053 367.665 L
571.293 367.665 L
586.533 367.665 L
601.773 367.665 L
617.013 367.665 L
632.253 367.665 L
647.493 367.665 L
662.733 367.665 L
677.973 367.665 L
693.213 367.665 L
708.453 367.665 L
723.693 367.665 L
738.933 367.665 L
754.173 367.665 L
769.413 367.665 L
784.653 367.665 L
799.893 367.665 L
815.133 367.665 L
830.373 367.665 L
845.613 367.665 L
860.853 367.665 L
876.093 367.665 L
890 367.665 L
S
GR
GS
[0.75 0 0 0.75 0 -0.25] CT
0.494 0.184 0.557 RC
1 LJ
0.667 LW
N
128 123.932 M
128 123.932 L
128.001 123.932 L
128.001 123.932 L
128.003 123.932 L
128.005 123.932 L
128.007 123.932 L
128.009 123.932 L
128.018 123.932 L
128.028 123.932 L
128.037 123.932 L
128.047 123.932 L
128.069 123.932 L
128.092 123.932 L
128.114 123.932 L
128.137 123.932 L
128.159 123.932 L
128.213 123.932 L
128.267 123.932 L
128.32 123.932 L
128.374 123.932 L
128.428 123.932 L
128.482 123.932 L
128.612 123.932 L
128.743 123.932 L
128.873 123.932 L
129.004 123.932 L
129.134 123.932 L
129.264 123.932 L
129.505 123.932 L
129.746 123.932 L
129.987 123.932 L
130.228 123.932 L
130.469 123.932 L
130.71 123.932 L
131.322 123.932 L
131.934 123.932 L
132.546 123.932 L
133.158 123.932 L
133.77 123.932 L
134.381 123.932 L
135.771 123.932 L
137.16 123.932 L
138.549 123.932 L
139.939 123.932 L
141.328 123.932 L
142.717 123.932 L
144.632 123.932 L
146.546 123.932 L
148.461 123.932 L
150.376 123.932 L
152.291 123.932 L
154.205 123.932 L
158.458 123.932 L
162.71 123.932 L
166.963 123.932 L
171.215 123.932 L
175.467 123.932 L
179.72 123.932 L
186.84 123.932 L
193.959 123.932 L
201.079 123.932 L
208.199 123.932 L
215.319 123.932 L
222.438 123.932 L
232.453 123.932 L
242.468 123.932 L
252.483 123.932 L
262.498 123.932 L
272.513 123.932 L
282.528 123.932 L
297.635 123.932 L
312.743 123.932 L
327.85 123.932 L
342.958 123.932 L
358.066 123.932 L
373.173 123.932 L
388.413 123.932 L
403.653 123.932 L
418.893 123.932 L
434.133 123.932 L
449.373 123.932 L
464.613 123.932 L
479.853 123.932 L
495.093 123.932 L
510.333 123.932 L
525.573 123.932 L
540.813 123.932 L
556.053 123.932 L
571.293 123.932 L
586.533 123.932 L
601.773 123.932 L
617.013 123.932 L
632.253 123.932 L
647.493 123.932 L
662.733 123.932 L
677.973 123.932 L
693.213 123.932 L
708.453 123.932 L
723.693 123.932 L
738.933 123.932 L
754.173 123.932 L
769.413 123.932 L
784.653 123.932 L
799.893 123.932 L
815.133 123.932 L
830.373 123.932 L
845.613 123.932 L
860.853 123.932 L
876.093 123.932 L
890 123.932 L
S
GR
GS
[0.75 0 0 0.75 0 -0.25] CT
1 GC
N
814 138 M
814 60 L
877 60 L
877 138 L
cp
f
GR
GS
[0.75 0 0 0.75 638.25 56] CT
/Helvetica 12 F
GS
[1 0 0 1 0 0] CT
0 0 moveto 
1 -1 scale
(h) t 
GR
GR
GS
[0.75 0 0 0.75 644.25 60.5] CT
/Helvetica 9.6 F
GS
[1 0 0 1 0 0] CT
0 0 moveto 
1 -1 scale
(1) t 
GR
GR
GS
[0.75 0 0 0.75 0 -0.25] CT
0 0.447 0.741 RC
1 LJ
0.667 LW
N
818 72.581 M
848 72.581 L
S
GR
GS
[0.75 0 0 0.75 638.25 71.75] CT
/Helvetica 12 F
GS
[1 0 0 1 0 0] CT
0 0 moveto 
1 -1 scale
(h) t 
GR
GR
GS
[0.75 0 0 0.75 644.25 76.25] CT
/Helvetica 9.6 F
GS
[1 0 0 1 0 0] CT
0 0 moveto 
1 -1 scale
(2) t 
GR
GR
GS
[0.75 0 0 0.75 0 -0.25] CT
0.851 0.325 0.098 RC
1 LJ
0.667 LW
N
818 94.219 M
848 94.219 L
S
GR
GS
[0.75 0 0 0.75 638.25 84.37903] CT
/Helvetica 12 F
GS
[1 0 0 1 0 0] CT
0 4.5 moveto 
1 -1 scale
(sp1) t 
GR
GR
GS
[0.75 0 0 0.75 0 -0.25] CT
0.929 0.694 0.125 RC
1 LJ
0.667 LW
N
818 112.839 M
848 112.839 L
S
GR
GS
[0.75 0 0 0.75 638.25 96.07903] CT
/Helvetica 12 F
GS
[1 0 0 1 0 0] CT
0 4.5 moveto 
1 -1 scale
(sp2) t 
GR
GR
GS
[0.75 0 0 0.75 0 -0.25] CT
0.494 0.184 0.557 RC
1 LJ
0.667 LW
N
818 128.439 M
848 128.439 L
S
GR
GS
[0.75 0 0 0.75 0 -0.25] CT
0.149 GC
10.0 ML
0.667 LW
N
814 138 M
814 60 L
877 60 L
877 138 L
cp
S
GR
%%Trailer
%%Pages: 1
%%EOF
