%!PS-Adobe-3.0 EPSF-3.0
%%Creator: (MATLAB, The Mathworks, Inc. Version 9.1.0.441655 \(R2016b\). Operating System: Windows 7)
%%Title: C:/Users/June/Documents/GitKraken/rls-2017/sp6/figures/w1s.eps
%%CreationDate: 2018-03-04T19:41:47
%%Pages: (atend)
%%BoundingBox: 0 0 420 315
%%LanguageLevel: 3
%%EndComments
%%BeginProlog
%%BeginResource: procset (Apache XML Graphics Std ProcSet) 1.2 0
%%Version: 1.2 0
%%Copyright: (Copyright 2001-2003,2010 The Apache Software Foundation. License terms: http://www.apache.org/licenses/LICENSE-2.0)
/bd{bind def}bind def
/ld{load def}bd
/GR/grestore ld
/M/moveto ld
/LJ/setlinejoin ld
/C/curveto ld
/f/fill ld
/LW/setlinewidth ld
/GC/setgray ld
/t/show ld
/N/newpath ld
/CT/concat ld
/cp/closepath ld
/S/stroke ld
/L/lineto ld
/CC/setcmykcolor ld
/A/ashow ld
/GS/gsave ld
/RC/setrgbcolor ld
/RM/rmoveto ld
/ML/setmiterlimit ld
/re {4 2 roll M
1 index 0 rlineto
0 exch rlineto
neg 0 rlineto
cp } bd
/_ctm matrix def
/_tm matrix def
/BT { _ctm currentmatrix pop matrix _tm copy pop 0 0 moveto } bd
/ET { _ctm setmatrix } bd
/iTm { _ctm setmatrix _tm concat } bd
/Tm { _tm astore pop iTm 0 0 moveto } bd
/ux 0.0 def
/uy 0.0 def
/F {
  /Tp exch def
  /Tf exch def
  Tf findfont Tp scalefont setfont
  /cf Tf def  /cs Tp def
} bd
/ULS {currentpoint /uy exch def /ux exch def} bd
/ULE {
  /Tcx currentpoint pop def
  gsave
  newpath
  cf findfont cs scalefont dup
  /FontMatrix get 0 get /Ts exch def /FontInfo get dup
  /UnderlinePosition get Ts mul /To exch def
  /UnderlineThickness get Ts mul /Tt exch def
  ux uy To add moveto  Tcx uy To add lineto
  Tt setlinewidth stroke
  grestore
} bd
/OLE {
  /Tcx currentpoint pop def
  gsave
  newpath
  cf findfont cs scalefont dup
  /FontMatrix get 0 get /Ts exch def /FontInfo get dup
  /UnderlinePosition get Ts mul /To exch def
  /UnderlineThickness get Ts mul /Tt exch def
  ux uy To add cs add moveto Tcx uy To add cs add lineto
  Tt setlinewidth stroke
  grestore
} bd
/SOE {
  /Tcx currentpoint pop def
  gsave
  newpath
  cf findfont cs scalefont dup
  /FontMatrix get 0 get /Ts exch def /FontInfo get dup
  /UnderlinePosition get Ts mul /To exch def
  /UnderlineThickness get Ts mul /Tt exch def
  ux uy To add cs 10 mul 26 idiv add moveto Tcx uy To add cs 10 mul 26 idiv add lineto
  Tt setlinewidth stroke
  grestore
} bd
/QT {
/Y22 exch store
/X22 exch store
/Y21 exch store
/X21 exch store
currentpoint
/Y21 load 2 mul add 3 div exch
/X21 load 2 mul add 3 div exch
/X21 load 2 mul /X22 load add 3 div
/Y21 load 2 mul /Y22 load add 3 div
/X22 load /Y22 load curveto
} bd
/SSPD {
dup length /d exch dict def
{
/v exch def
/k exch def
currentpagedevice k known {
/cpdv currentpagedevice k get def
v cpdv ne {
/upd false def
/nullv v type /nulltype eq def
/nullcpdv cpdv type /nulltype eq def
nullv nullcpdv or
{
/upd true def
} {
/sametype v type cpdv type eq def
sametype {
v type /arraytype eq {
/vlen v length def
/cpdvlen cpdv length def
vlen cpdvlen eq {
0 1 vlen 1 sub {
/i exch def
/obj v i get def
/cpdobj cpdv i get def
obj cpdobj ne {
/upd true def
exit
} if
} for
} {
/upd true def
} ifelse
} {
v type /dicttype eq {
v {
/dv exch def
/dk exch def
/cpddv cpdv dk get def
dv cpddv ne {
/upd true def
exit
} if
} forall
} {
/upd true def
} ifelse
} ifelse
} if
} ifelse
upd true eq {
d k v put
} if
} if
} if
} forall
d length 0 gt {
d setpagedevice
} if
} bd
/RE { % /NewFontName [NewEncodingArray] /FontName RE -
  findfont dup length dict begin
  {
    1 index /FID ne
    {def} {pop pop} ifelse
  } forall
  /Encoding exch def
  /FontName 1 index def
  currentdict definefont pop
  end
} bind def
%%EndResource
%%BeginResource: procset (Apache XML Graphics EPS ProcSet) 1.0 0
%%Version: 1.0 0
%%Copyright: (Copyright 2002-2003 The Apache Software Foundation. License terms: http://www.apache.org/licenses/LICENSE-2.0)
/BeginEPSF { %def
/b4_Inc_state save def         % Save state for cleanup
/dict_count countdictstack def % Count objects on dict stack
/op_count count 1 sub def      % Count objects on operand stack
userdict begin                 % Push userdict on dict stack
/showpage { } def              % Redefine showpage, { } = null proc
0 setgray 0 setlinecap         % Prepare graphics state
1 setlinewidth 0 setlinejoin
10 setmiterlimit [ ] 0 setdash newpath
/languagelevel where           % If level not equal to 1 then
{pop languagelevel             % set strokeadjust and
1 ne                           % overprint to their defaults.
{false setstrokeadjust false setoverprint
} if
} if
} bd
/EndEPSF { %def
count op_count sub {pop} repeat            % Clean up stacks
countdictstack dict_count sub {end} repeat
b4_Inc_state restore
} bd
%%EndResource
%FOPBeginFontDict
%%IncludeResource: font Courier-Bold
%%IncludeResource: font Helvetica
%%IncludeResource: font Courier-BoldOblique
%%IncludeResource: font Courier-Oblique
%%IncludeResource: font Times-Roman
%%IncludeResource: font Helvetica-BoldOblique
%%IncludeResource: font Helvetica-Bold
%%IncludeResource: font Helvetica-Oblique
%%IncludeResource: font Times-BoldItalic
%%IncludeResource: font Courier
%%IncludeResource: font Times-Italic
%%IncludeResource: font Times-Bold
%%IncludeResource: font Symbol
%%IncludeResource: font ZapfDingbats
%FOPEndFontDict
%%BeginResource: encoding WinAnsiEncoding
/WinAnsiEncoding [
/.notdef /.notdef /.notdef /.notdef /.notdef
/.notdef /.notdef /.notdef /.notdef /.notdef
/.notdef /.notdef /.notdef /.notdef /.notdef
/.notdef /.notdef /.notdef /.notdef /.notdef
/.notdef /.notdef /.notdef /.notdef /.notdef
/.notdef /.notdef /.notdef /.notdef /.notdef
/.notdef /.notdef /space /exclam /quotedbl
/numbersign /dollar /percent /ampersand /quotesingle
/parenleft /parenright /asterisk /plus /comma
/hyphen /period /slash /zero /one
/two /three /four /five /six
/seven /eight /nine /colon /semicolon
/less /equal /greater /question /at
/A /B /C /D /E
/F /G /H /I /J
/K /L /M /N /O
/P /Q /R /S /T
/U /V /W /X /Y
/Z /bracketleft /backslash /bracketright /asciicircum
/underscore /quoteleft /a /b /c
/d /e /f /g /h
/i /j /k /l /m
/n /o /p /q /r
/s /t /u /v /w
/x /y /z /braceleft /bar
/braceright /asciitilde /bullet /Euro /bullet
/quotesinglbase /florin /quotedblbase /ellipsis /dagger
/daggerdbl /circumflex /perthousand /Scaron /guilsinglleft
/OE /bullet /Zcaron /bullet /bullet
/quoteleft /quoteright /quotedblleft /quotedblright /bullet
/endash /emdash /asciitilde /trademark /scaron
/guilsinglright /oe /bullet /zcaron /Ydieresis
/space /exclamdown /cent /sterling /currency
/yen /brokenbar /section /dieresis /copyright
/ordfeminine /guillemotleft /logicalnot /sfthyphen /registered
/macron /degree /plusminus /twosuperior /threesuperior
/acute /mu /paragraph /middot /cedilla
/onesuperior /ordmasculine /guillemotright /onequarter /onehalf
/threequarters /questiondown /Agrave /Aacute /Acircumflex
/Atilde /Adieresis /Aring /AE /Ccedilla
/Egrave /Eacute /Ecircumflex /Edieresis /Igrave
/Iacute /Icircumflex /Idieresis /Eth /Ntilde
/Ograve /Oacute /Ocircumflex /Otilde /Odieresis
/multiply /Oslash /Ugrave /Uacute /Ucircumflex
/Udieresis /Yacute /Thorn /germandbls /agrave
/aacute /acircumflex /atilde /adieresis /aring
/ae /ccedilla /egrave /eacute /ecircumflex
/edieresis /igrave /iacute /icircumflex /idieresis
/eth /ntilde /ograve /oacute /ocircumflex
/otilde /odieresis /divide /oslash /ugrave
/uacute /ucircumflex /udieresis /yacute /thorn
/ydieresis
] def
%%EndResource
%FOPBeginFontReencode
/Courier-Bold findfont
dup length dict begin
  {1 index /FID ne {def} {pop pop} ifelse} forall
  /Encoding WinAnsiEncoding def
  currentdict
end
/Courier-Bold exch definefont pop
/Helvetica findfont
dup length dict begin
  {1 index /FID ne {def} {pop pop} ifelse} forall
  /Encoding WinAnsiEncoding def
  currentdict
end
/Helvetica exch definefont pop
/Courier-BoldOblique findfont
dup length dict begin
  {1 index /FID ne {def} {pop pop} ifelse} forall
  /Encoding WinAnsiEncoding def
  currentdict
end
/Courier-BoldOblique exch definefont pop
/Courier-Oblique findfont
dup length dict begin
  {1 index /FID ne {def} {pop pop} ifelse} forall
  /Encoding WinAnsiEncoding def
  currentdict
end
/Courier-Oblique exch definefont pop
/Times-Roman findfont
dup length dict begin
  {1 index /FID ne {def} {pop pop} ifelse} forall
  /Encoding WinAnsiEncoding def
  currentdict
end
/Times-Roman exch definefont pop
/Helvetica-BoldOblique findfont
dup length dict begin
  {1 index /FID ne {def} {pop pop} ifelse} forall
  /Encoding WinAnsiEncoding def
  currentdict
end
/Helvetica-BoldOblique exch definefont pop
/Helvetica-Bold findfont
dup length dict begin
  {1 index /FID ne {def} {pop pop} ifelse} forall
  /Encoding WinAnsiEncoding def
  currentdict
end
/Helvetica-Bold exch definefont pop
/Helvetica-Oblique findfont
dup length dict begin
  {1 index /FID ne {def} {pop pop} ifelse} forall
  /Encoding WinAnsiEncoding def
  currentdict
end
/Helvetica-Oblique exch definefont pop
/Times-BoldItalic findfont
dup length dict begin
  {1 index /FID ne {def} {pop pop} ifelse} forall
  /Encoding WinAnsiEncoding def
  currentdict
end
/Times-BoldItalic exch definefont pop
/Courier findfont
dup length dict begin
  {1 index /FID ne {def} {pop pop} ifelse} forall
  /Encoding WinAnsiEncoding def
  currentdict
end
/Courier exch definefont pop
/Times-Italic findfont
dup length dict begin
  {1 index /FID ne {def} {pop pop} ifelse} forall
  /Encoding WinAnsiEncoding def
  currentdict
end
/Times-Italic exch definefont pop
/Times-Bold findfont
dup length dict begin
  {1 index /FID ne {def} {pop pop} ifelse} forall
  /Encoding WinAnsiEncoding def
  currentdict
end
/Times-Bold exch definefont pop
%FOPEndFontReencode
%%EndProlog
%%Page: 1 1
%%PageBoundingBox: 0 0 420 315
%%BeginPageSetup
[1 0 0 -1 0 315] CT
%%EndPageSetup
GS
[0.75 0 0 0.75 0 0] CT
1 GC
N
0 0 560 420 re
f
GR
GS
[0.75 0 0 0.75 0 0] CT
1 GC
N
0 0 560 420 re
f
GR
GS
[0.75 0 0 0.75 0 0] CT
1 GC
N
85 374 M
507 374 L
507 51 L
85 51 L
cp
f
GR
GS
[0.75 0 0 0.75 0 0] CT
0.849 GC
[1 3] 0 setdash
2 LJ
0.667 LW
N
97.703 374 M
97.703 51 L
S
GR
GS
[0.75 0 0 0.75 0 0] CT
0.849 GC
[1 3] 0 setdash
2 LJ
0.667 LW
N
105.135 374 M
105.135 51 L
S
GR
GS
[0.75 0 0 0.75 0 0] CT
0.849 GC
[1 3] 0 setdash
2 LJ
0.667 LW
N
110.407 374 M
110.407 51 L
S
GR
GS
[0.75 0 0 0.75 0 0] CT
0.849 GC
[1 3] 0 setdash
2 LJ
0.667 LW
N
114.497 374 M
114.497 51 L
S
GR
GS
[0.75 0 0 0.75 0 0] CT
0.849 GC
[1 3] 0 setdash
2 LJ
0.667 LW
N
117.838 374 M
117.838 51 L
S
GR
GS
[0.75 0 0 0.75 0 0] CT
0.849 GC
[1 3] 0 setdash
2 LJ
0.667 LW
N
120.663 374 M
120.663 51 L
S
GR
GS
[0.75 0 0 0.75 0 0] CT
0.849 GC
[1 3] 0 setdash
2 LJ
0.667 LW
N
123.11 374 M
123.11 51 L
S
GR
GS
[0.75 0 0 0.75 0 0] CT
0.849 GC
[1 3] 0 setdash
2 LJ
0.667 LW
N
125.269 374 M
125.269 51 L
S
GR
GS
[0.75 0 0 0.75 0 0] CT
0.849 GC
[1 3] 0 setdash
2 LJ
0.667 LW
N
127.2 374 M
127.2 51 L
S
GR
GS
[0.75 0 0 0.75 0 0] CT
0.849 GC
[1 3] 0 setdash
2 LJ
0.667 LW
N
139.903 374 M
139.903 51 L
S
GR
GS
[0.75 0 0 0.75 0 0] CT
0.849 GC
[1 3] 0 setdash
2 LJ
0.667 LW
N
147.335 374 M
147.335 51 L
S
GR
GS
[0.75 0 0 0.75 0 0] CT
0.849 GC
[1 3] 0 setdash
2 LJ
0.667 LW
N
152.607 374 M
152.607 51 L
S
GR
GS
[0.75 0 0 0.75 0 0] CT
0.849 GC
[1 3] 0 setdash
2 LJ
0.667 LW
N
156.697 374 M
156.697 51 L
S
GR
GS
[0.75 0 0 0.75 0 0] CT
0.849 GC
[1 3] 0 setdash
2 LJ
0.667 LW
N
160.038 374 M
160.038 51 L
S
GR
GS
[0.75 0 0 0.75 0 0] CT
0.849 GC
[1 3] 0 setdash
2 LJ
0.667 LW
N
162.863 374 M
162.863 51 L
S
GR
GS
[0.75 0 0 0.75 0 0] CT
0.849 GC
[1 3] 0 setdash
2 LJ
0.667 LW
N
165.31 374 M
165.31 51 L
S
GR
GS
[0.75 0 0 0.75 0 0] CT
0.849 GC
[1 3] 0 setdash
2 LJ
0.667 LW
N
167.469 374 M
167.469 51 L
S
GR
GS
[0.75 0 0 0.75 0 0] CT
0.849 GC
[1 3] 0 setdash
2 LJ
0.667 LW
N
182.103 374 M
182.103 51 L
S
GR
GS
[0.75 0 0 0.75 0 0] CT
0.849 GC
[1 3] 0 setdash
2 LJ
0.667 LW
N
189.535 374 M
189.535 51 L
S
GR
GS
[0.75 0 0 0.75 0 0] CT
0.849 GC
[1 3] 0 setdash
2 LJ
0.667 LW
N
194.807 374 M
194.807 51 L
S
GR
GS
[0.75 0 0 0.75 0 0] CT
0.849 GC
[1 3] 0 setdash
2 LJ
0.667 LW
N
198.897 374 M
198.897 51 L
S
GR
GS
[0.75 0 0 0.75 0 0] CT
0.849 GC
[1 3] 0 setdash
2 LJ
0.667 LW
N
202.238 374 M
202.238 51 L
S
GR
GS
[0.75 0 0 0.75 0 0] CT
0.849 GC
[1 3] 0 setdash
2 LJ
0.667 LW
N
205.063 374 M
205.063 51 L
S
GR
GS
[0.75 0 0 0.75 0 0] CT
0.849 GC
[1 3] 0 setdash
2 LJ
0.667 LW
N
207.51 374 M
207.51 51 L
S
GR
GS
[0.75 0 0 0.75 0 0] CT
0.849 GC
[1 3] 0 setdash
2 LJ
0.667 LW
N
209.669 374 M
209.669 51 L
S
GR
GS
[0.75 0 0 0.75 0 0] CT
0.849 GC
[1 3] 0 setdash
2 LJ
0.667 LW
N
211.6 374 M
211.6 51 L
S
GR
GS
[0.75 0 0 0.75 0 0] CT
0.849 GC
[1 3] 0 setdash
2 LJ
0.667 LW
N
224.303 374 M
224.303 51 L
S
GR
GS
[0.75 0 0 0.75 0 0] CT
0.849 GC
[1 3] 0 setdash
2 LJ
0.667 LW
N
231.735 374 M
231.735 51 L
S
GR
GS
[0.75 0 0 0.75 0 0] CT
0.849 GC
[1 3] 0 setdash
2 LJ
0.667 LW
N
237.007 374 M
237.007 51 L
S
GR
GS
[0.75 0 0 0.75 0 0] CT
0.849 GC
[1 3] 0 setdash
2 LJ
0.667 LW
N
241.097 374 M
241.097 51 L
S
GR
GS
[0.75 0 0 0.75 0 0] CT
0.849 GC
[1 3] 0 setdash
2 LJ
0.667 LW
N
244.438 374 M
244.438 51 L
S
GR
GS
[0.75 0 0 0.75 0 0] CT
0.849 GC
[1 3] 0 setdash
2 LJ
0.667 LW
N
247.263 374 M
247.263 51 L
S
GR
GS
[0.75 0 0 0.75 0 0] CT
0.849 GC
[1 3] 0 setdash
2 LJ
0.667 LW
N
249.71 374 M
249.71 51 L
S
GR
GS
[0.75 0 0 0.75 0 0] CT
0.849 GC
[1 3] 0 setdash
2 LJ
0.667 LW
N
251.869 374 M
251.869 51 L
S
GR
GS
[0.75 0 0 0.75 0 0] CT
0.849 GC
[1 3] 0 setdash
2 LJ
0.667 LW
N
253.8 374 M
253.8 51 L
S
GR
GS
[0.75 0 0 0.75 0 0] CT
0.849 GC
[1 3] 0 setdash
2 LJ
0.667 LW
N
266.503 374 M
266.503 51 L
S
GR
GS
[0.75 0 0 0.75 0 0] CT
0.849 GC
[1 3] 0 setdash
2 LJ
0.667 LW
N
273.935 374 M
273.935 51 L
S
GR
GS
[0.75 0 0 0.75 0 0] CT
0.849 GC
[1 3] 0 setdash
2 LJ
0.667 LW
N
279.207 374 M
279.207 51 L
S
GR
GS
[0.75 0 0 0.75 0 0] CT
0.849 GC
[1 3] 0 setdash
2 LJ
0.667 LW
N
283.297 374 M
283.297 51 L
S
GR
GS
[0.75 0 0 0.75 0 0] CT
0.849 GC
[1 3] 0 setdash
2 LJ
0.667 LW
N
286.638 374 M
286.638 51 L
S
GR
GS
[0.75 0 0 0.75 0 0] CT
0.849 GC
[1 3] 0 setdash
2 LJ
0.667 LW
N
289.463 374 M
289.463 51 L
S
GR
GS
[0.75 0 0 0.75 0 0] CT
0.849 GC
[1 3] 0 setdash
2 LJ
0.667 LW
N
291.91 374 M
291.91 51 L
S
GR
GS
[0.75 0 0 0.75 0 0] CT
0.849 GC
[1 3] 0 setdash
2 LJ
0.667 LW
N
294.069 374 M
294.069 51 L
S
GR
GS
[0.75 0 0 0.75 0 0] CT
0.849 GC
[1 3] 0 setdash
2 LJ
0.667 LW
N
296 374 M
296 51 L
S
GR
GS
[0.75 0 0 0.75 0 0] CT
0.849 GC
[1 3] 0 setdash
2 LJ
0.667 LW
N
308.703 374 M
308.703 51 L
S
GR
GS
[0.75 0 0 0.75 0 0] CT
0.849 GC
[1 3] 0 setdash
2 LJ
0.667 LW
N
316.135 374 M
316.135 51 L
S
GR
GS
[0.75 0 0 0.75 0 0] CT
0.849 GC
[1 3] 0 setdash
2 LJ
0.667 LW
N
321.407 374 M
321.407 51 L
S
GR
GS
[0.75 0 0 0.75 0 0] CT
0.849 GC
[1 3] 0 setdash
2 LJ
0.667 LW
N
325.497 374 M
325.497 51 L
S
GR
GS
[0.75 0 0 0.75 0 0] CT
0.849 GC
[1 3] 0 setdash
2 LJ
0.667 LW
N
328.838 374 M
328.838 51 L
S
GR
GS
[0.75 0 0 0.75 0 0] CT
0.849 GC
[1 3] 0 setdash
2 LJ
0.667 LW
N
331.663 374 M
331.663 51 L
S
GR
GS
[0.75 0 0 0.75 0 0] CT
0.849 GC
[1 3] 0 setdash
2 LJ
0.667 LW
N
334.11 374 M
334.11 51 L
S
GR
GS
[0.75 0 0 0.75 0 0] CT
0.849 GC
[1 3] 0 setdash
2 LJ
0.667 LW
N
336.269 374 M
336.269 51 L
S
GR
GS
[0.75 0 0 0.75 0 0] CT
0.849 GC
[1 3] 0 setdash
2 LJ
0.667 LW
N
350.903 374 M
350.903 51 L
S
GR
GS
[0.75 0 0 0.75 0 0] CT
0.849 GC
[1 3] 0 setdash
2 LJ
0.667 LW
N
358.335 374 M
358.335 51 L
S
GR
GS
[0.75 0 0 0.75 0 0] CT
0.849 GC
[1 3] 0 setdash
2 LJ
0.667 LW
N
363.607 374 M
363.607 51 L
S
GR
GS
[0.75 0 0 0.75 0 0] CT
0.849 GC
[1 3] 0 setdash
2 LJ
0.667 LW
N
367.697 374 M
367.697 51 L
S
GR
GS
[0.75 0 0 0.75 0 0] CT
0.849 GC
[1 3] 0 setdash
2 LJ
0.667 LW
N
371.038 374 M
371.038 51 L
S
GR
GS
[0.75 0 0 0.75 0 0] CT
0.849 GC
[1 3] 0 setdash
2 LJ
0.667 LW
N
373.863 374 M
373.863 51 L
S
GR
GS
[0.75 0 0 0.75 0 0] CT
0.849 GC
[1 3] 0 setdash
2 LJ
0.667 LW
N
376.31 374 M
376.31 51 L
S
GR
GS
[0.75 0 0 0.75 0 0] CT
0.849 GC
[1 3] 0 setdash
2 LJ
0.667 LW
N
378.469 374 M
378.469 51 L
S
GR
GS
[0.75 0 0 0.75 0 0] CT
0.849 GC
[1 3] 0 setdash
2 LJ
0.667 LW
N
380.4 374 M
380.4 51 L
S
GR
GS
[0.75 0 0 0.75 0 0] CT
0.849 GC
[1 3] 0 setdash
2 LJ
0.667 LW
N
393.103 374 M
393.103 51 L
S
GR
GS
[0.75 0 0 0.75 0 0] CT
0.849 GC
[1 3] 0 setdash
2 LJ
0.667 LW
N
400.535 374 M
400.535 51 L
S
GR
GS
[0.75 0 0 0.75 0 0] CT
0.849 GC
[1 3] 0 setdash
2 LJ
0.667 LW
N
405.807 374 M
405.807 51 L
S
GR
GS
[0.75 0 0 0.75 0 0] CT
0.849 GC
[1 3] 0 setdash
2 LJ
0.667 LW
N
409.897 374 M
409.897 51 L
S
GR
GS
[0.75 0 0 0.75 0 0] CT
0.849 GC
[1 3] 0 setdash
2 LJ
0.667 LW
N
413.238 374 M
413.238 51 L
S
GR
GS
[0.75 0 0 0.75 0 0] CT
0.849 GC
[1 3] 0 setdash
2 LJ
0.667 LW
N
416.063 374 M
416.063 51 L
S
GR
GS
[0.75 0 0 0.75 0 0] CT
0.849 GC
[1 3] 0 setdash
2 LJ
0.667 LW
N
418.51 374 M
418.51 51 L
S
GR
GS
[0.75 0 0 0.75 0 0] CT
0.849 GC
[1 3] 0 setdash
2 LJ
0.667 LW
N
420.669 374 M
420.669 51 L
S
GR
GS
[0.75 0 0 0.75 0 0] CT
0.849 GC
[1 3] 0 setdash
2 LJ
0.667 LW
N
435.303 374 M
435.303 51 L
S
GR
GS
[0.75 0 0 0.75 0 0] CT
0.849 GC
[1 3] 0 setdash
2 LJ
0.667 LW
N
442.734 374 M
442.734 51 L
S
GR
GS
[0.75 0 0 0.75 0 0] CT
0.849 GC
[1 3] 0 setdash
2 LJ
0.667 LW
N
448.007 374 M
448.007 51 L
S
GR
GS
[0.75 0 0 0.75 0 0] CT
0.849 GC
[1 3] 0 setdash
2 LJ
0.667 LW
N
452.097 374 M
452.097 51 L
S
GR
GS
[0.75 0 0 0.75 0 0] CT
0.849 GC
[1 3] 0 setdash
2 LJ
0.667 LW
N
455.438 374 M
455.438 51 L
S
GR
GS
[0.75 0 0 0.75 0 0] CT
0.849 GC
[1 3] 0 setdash
2 LJ
0.667 LW
N
458.263 374 M
458.263 51 L
S
GR
GS
[0.75 0 0 0.75 0 0] CT
0.849 GC
[1 3] 0 setdash
2 LJ
0.667 LW
N
460.71 374 M
460.71 51 L
S
GR
GS
[0.75 0 0 0.75 0 0] CT
0.849 GC
[1 3] 0 setdash
2 LJ
0.667 LW
N
462.869 374 M
462.869 51 L
S
GR
GS
[0.75 0 0 0.75 0 0] CT
0.849 GC
[1 3] 0 setdash
2 LJ
0.667 LW
N
464.8 374 M
464.8 51 L
S
GR
GS
[0.75 0 0 0.75 0 0] CT
0.849 GC
[1 3] 0 setdash
2 LJ
0.667 LW
N
477.503 374 M
477.503 51 L
S
GR
GS
[0.75 0 0 0.75 0 0] CT
0.849 GC
[1 3] 0 setdash
2 LJ
0.667 LW
N
484.935 374 M
484.935 51 L
S
GR
GS
[0.75 0 0 0.75 0 0] CT
0.849 GC
[1 3] 0 setdash
2 LJ
0.667 LW
N
490.207 374 M
490.207 51 L
S
GR
GS
[0.75 0 0 0.75 0 0] CT
0.849 GC
[1 3] 0 setdash
2 LJ
0.667 LW
N
494.297 374 M
494.297 51 L
S
GR
GS
[0.75 0 0 0.75 0 0] CT
0.849 GC
[1 3] 0 setdash
2 LJ
0.667 LW
N
497.638 374 M
497.638 51 L
S
GR
GS
[0.75 0 0 0.75 0 0] CT
0.849 GC
[1 3] 0 setdash
2 LJ
0.667 LW
N
500.463 374 M
500.463 51 L
S
GR
GS
[0.75 0 0 0.75 0 0] CT
0.849 GC
[1 3] 0 setdash
2 LJ
0.667 LW
N
502.91 374 M
502.91 51 L
S
GR
GS
[0.75 0 0 0.75 0 0] CT
0.849 GC
[1 3] 0 setdash
2 LJ
0.667 LW
N
505.069 374 M
505.069 51 L
S
GR
GS
[0.75 0 0 0.75 0 0] CT
0.873 GC
1 LJ
0.667 LW
N
85 374 M
85 51 L
S
GR
GS
[0.75 0 0 0.75 0 0] CT
0.873 GC
1 LJ
0.667 LW
N
169.4 374 M
169.4 51 L
S
GR
GS
[0.75 0 0 0.75 0 0] CT
0.873 GC
1 LJ
0.667 LW
N
253.8 374 M
253.8 51 L
S
GR
GS
[0.75 0 0 0.75 0 0] CT
0.873 GC
1 LJ
0.667 LW
N
338.2 374 M
338.2 51 L
S
GR
GS
[0.75 0 0 0.75 0 0] CT
0.873 GC
1 LJ
0.667 LW
N
422.6 374 M
422.6 51 L
S
GR
GS
[0.75 0 0 0.75 0 0] CT
0.873 GC
1 LJ
0.667 LW
N
507 374 M
507 51 L
S
GR
GS
[0.75 0 0 0.75 0 0] CT
0.873 GC
1 LJ
0.667 LW
N
507 374 M
85 374 L
S
GR
GS
[0.75 0 0 0.75 0 0] CT
0.873 GC
1 LJ
0.667 LW
N
507 341.7 M
85 341.7 L
S
GR
GS
[0.75 0 0 0.75 0 0] CT
0.873 GC
1 LJ
0.667 LW
N
507 309.4 M
85 309.4 L
S
GR
GS
[0.75 0 0 0.75 0 0] CT
0.873 GC
1 LJ
0.667 LW
N
507 277.1 M
85 277.1 L
S
GR
GS
[0.75 0 0 0.75 0 0] CT
0.873 GC
1 LJ
0.667 LW
N
507 244.8 M
85 244.8 L
S
GR
GS
[0.75 0 0 0.75 0 0] CT
0.873 GC
1 LJ
0.667 LW
N
507 212.5 M
85 212.5 L
S
GR
GS
[0.75 0 0 0.75 0 0] CT
0.873 GC
1 LJ
0.667 LW
N
507 180.2 M
85 180.2 L
S
GR
GS
[0.75 0 0 0.75 0 0] CT
0.873 GC
1 LJ
0.667 LW
N
507 147.9 M
85 147.9 L
S
GR
GS
[0.75 0 0 0.75 0 0] CT
0.873 GC
1 LJ
0.667 LW
N
507 115.6 M
85 115.6 L
S
GR
GS
[0.75 0 0 0.75 0 0] CT
0.873 GC
1 LJ
0.667 LW
N
507 83.3 M
85 83.3 L
S
GR
GS
[0.75 0 0 0.75 0 0] CT
0.873 GC
1 LJ
0.667 LW
N
507 51 M
85 51 L
S
GR
GS
[0.75 0 0 0.75 0 0] CT
0.4 GC
2 setlinecap
1 LJ
0.667 LW
N
85 374 M
507 374 L
S
GR
GS
[0.75 0 0 0.75 0 0] CT
0.4 GC
2 setlinecap
1 LJ
0.667 LW
N
85 51 M
507 51 L
S
GR
GS
[0.75 0 0 0.75 0 0] CT
0.4 GC
2 setlinecap
1 LJ
0.667 LW
N
85 374 M
85 369.78 L
S
GR
GS
[0.75 0 0 0.75 0 0] CT
0.4 GC
2 setlinecap
1 LJ
0.667 LW
N
169.4 374 M
169.4 369.78 L
S
GR
GS
[0.75 0 0 0.75 0 0] CT
0.4 GC
2 setlinecap
1 LJ
0.667 LW
N
253.8 374 M
253.8 369.78 L
S
GR
GS
[0.75 0 0 0.75 0 0] CT
0.4 GC
2 setlinecap
1 LJ
0.667 LW
N
338.2 374 M
338.2 369.78 L
S
GR
GS
[0.75 0 0 0.75 0 0] CT
0.4 GC
2 setlinecap
1 LJ
0.667 LW
N
422.6 374 M
422.6 369.78 L
S
GR
GS
[0.75 0 0 0.75 0 0] CT
0.4 GC
2 setlinecap
1 LJ
0.667 LW
N
507 374 M
507 369.78 L
S
GR
GS
[0.75 0 0 0.75 0 0] CT
0.4 GC
2 setlinecap
1 LJ
0.667 LW
N
85 51 M
85 55.22 L
S
GR
GS
[0.75 0 0 0.75 0 0] CT
0.4 GC
2 setlinecap
1 LJ
0.667 LW
N
169.4 51 M
169.4 55.22 L
S
GR
GS
[0.75 0 0 0.75 0 0] CT
0.4 GC
2 setlinecap
1 LJ
0.667 LW
N
253.8 51 M
253.8 55.22 L
S
GR
GS
[0.75 0 0 0.75 0 0] CT
0.4 GC
2 setlinecap
1 LJ
0.667 LW
N
338.2 51 M
338.2 55.22 L
S
GR
GS
[0.75 0 0 0.75 0 0] CT
0.4 GC
2 setlinecap
1 LJ
0.667 LW
N
422.6 51 M
422.6 55.22 L
S
GR
GS
[0.75 0 0 0.75 0 0] CT
0.4 GC
2 setlinecap
1 LJ
0.667 LW
N
507 51 M
507 55.22 L
S
GR
GS
[0.75 0 0 0.75 0 0] CT
0.4 GC
2 setlinecap
1 LJ
0.667 LW
N
85 374 M
85 371.89 L
S
GR
GS
[0.75 0 0 0.75 0 0] CT
0.4 GC
2 setlinecap
1 LJ
0.667 LW
N
97.703 374 M
97.703 371.89 L
S
GR
GS
[0.75 0 0 0.75 0 0] CT
0.4 GC
2 setlinecap
1 LJ
0.667 LW
N
105.135 374 M
105.135 371.89 L
S
GR
GS
[0.75 0 0 0.75 0 0] CT
0.4 GC
2 setlinecap
1 LJ
0.667 LW
N
110.407 374 M
110.407 371.89 L
S
GR
GS
[0.75 0 0 0.75 0 0] CT
0.4 GC
2 setlinecap
1 LJ
0.667 LW
N
114.497 374 M
114.497 371.89 L
S
GR
GS
[0.75 0 0 0.75 0 0] CT
0.4 GC
2 setlinecap
1 LJ
0.667 LW
N
117.838 374 M
117.838 371.89 L
S
GR
GS
[0.75 0 0 0.75 0 0] CT
0.4 GC
2 setlinecap
1 LJ
0.667 LW
N
120.663 374 M
120.663 371.89 L
S
GR
GS
[0.75 0 0 0.75 0 0] CT
0.4 GC
2 setlinecap
1 LJ
0.667 LW
N
123.11 374 M
123.11 371.89 L
S
GR
GS
[0.75 0 0 0.75 0 0] CT
0.4 GC
2 setlinecap
1 LJ
0.667 LW
N
125.269 374 M
125.269 371.89 L
S
GR
GS
[0.75 0 0 0.75 0 0] CT
0.4 GC
2 setlinecap
1 LJ
0.667 LW
N
127.2 374 M
127.2 371.89 L
S
GR
GS
[0.75 0 0 0.75 0 0] CT
0.4 GC
2 setlinecap
1 LJ
0.667 LW
N
139.903 374 M
139.903 371.89 L
S
GR
GS
[0.75 0 0 0.75 0 0] CT
0.4 GC
2 setlinecap
1 LJ
0.667 LW
N
147.335 374 M
147.335 371.89 L
S
GR
GS
[0.75 0 0 0.75 0 0] CT
0.4 GC
2 setlinecap
1 LJ
0.667 LW
N
152.607 374 M
152.607 371.89 L
S
GR
GS
[0.75 0 0 0.75 0 0] CT
0.4 GC
2 setlinecap
1 LJ
0.667 LW
N
156.697 374 M
156.697 371.89 L
S
GR
GS
[0.75 0 0 0.75 0 0] CT
0.4 GC
2 setlinecap
1 LJ
0.667 LW
N
160.038 374 M
160.038 371.89 L
S
GR
GS
[0.75 0 0 0.75 0 0] CT
0.4 GC
2 setlinecap
1 LJ
0.667 LW
N
162.863 374 M
162.863 371.89 L
S
GR
GS
[0.75 0 0 0.75 0 0] CT
0.4 GC
2 setlinecap
1 LJ
0.667 LW
N
165.31 374 M
165.31 371.89 L
S
GR
GS
[0.75 0 0 0.75 0 0] CT
0.4 GC
2 setlinecap
1 LJ
0.667 LW
N
167.469 374 M
167.469 371.89 L
S
GR
GS
[0.75 0 0 0.75 0 0] CT
0.4 GC
2 setlinecap
1 LJ
0.667 LW
N
169.4 374 M
169.4 371.89 L
S
GR
GS
[0.75 0 0 0.75 0 0] CT
0.4 GC
2 setlinecap
1 LJ
0.667 LW
N
182.103 374 M
182.103 371.89 L
S
GR
GS
[0.75 0 0 0.75 0 0] CT
0.4 GC
2 setlinecap
1 LJ
0.667 LW
N
189.535 374 M
189.535 371.89 L
S
GR
GS
[0.75 0 0 0.75 0 0] CT
0.4 GC
2 setlinecap
1 LJ
0.667 LW
N
194.807 374 M
194.807 371.89 L
S
GR
GS
[0.75 0 0 0.75 0 0] CT
0.4 GC
2 setlinecap
1 LJ
0.667 LW
N
198.897 374 M
198.897 371.89 L
S
GR
GS
[0.75 0 0 0.75 0 0] CT
0.4 GC
2 setlinecap
1 LJ
0.667 LW
N
202.238 374 M
202.238 371.89 L
S
GR
GS
[0.75 0 0 0.75 0 0] CT
0.4 GC
2 setlinecap
1 LJ
0.667 LW
N
205.063 374 M
205.063 371.89 L
S
GR
GS
[0.75 0 0 0.75 0 0] CT
0.4 GC
2 setlinecap
1 LJ
0.667 LW
N
207.51 374 M
207.51 371.89 L
S
GR
GS
[0.75 0 0 0.75 0 0] CT
0.4 GC
2 setlinecap
1 LJ
0.667 LW
N
209.669 374 M
209.669 371.89 L
S
GR
GS
[0.75 0 0 0.75 0 0] CT
0.4 GC
2 setlinecap
1 LJ
0.667 LW
N
211.6 374 M
211.6 371.89 L
S
GR
GS
[0.75 0 0 0.75 0 0] CT
0.4 GC
2 setlinecap
1 LJ
0.667 LW
N
224.303 374 M
224.303 371.89 L
S
GR
GS
[0.75 0 0 0.75 0 0] CT
0.4 GC
2 setlinecap
1 LJ
0.667 LW
N
231.735 374 M
231.735 371.89 L
S
GR
GS
[0.75 0 0 0.75 0 0] CT
0.4 GC
2 setlinecap
1 LJ
0.667 LW
N
237.007 374 M
237.007 371.89 L
S
GR
GS
[0.75 0 0 0.75 0 0] CT
0.4 GC
2 setlinecap
1 LJ
0.667 LW
N
241.097 374 M
241.097 371.89 L
S
GR
GS
[0.75 0 0 0.75 0 0] CT
0.4 GC
2 setlinecap
1 LJ
0.667 LW
N
244.438 374 M
244.438 371.89 L
S
GR
GS
[0.75 0 0 0.75 0 0] CT
0.4 GC
2 setlinecap
1 LJ
0.667 LW
N
247.263 374 M
247.263 371.89 L
S
GR
GS
[0.75 0 0 0.75 0 0] CT
0.4 GC
2 setlinecap
1 LJ
0.667 LW
N
249.71 374 M
249.71 371.89 L
S
GR
GS
[0.75 0 0 0.75 0 0] CT
0.4 GC
2 setlinecap
1 LJ
0.667 LW
N
251.869 374 M
251.869 371.89 L
S
GR
GS
[0.75 0 0 0.75 0 0] CT
0.4 GC
2 setlinecap
1 LJ
0.667 LW
N
253.8 374 M
253.8 371.89 L
S
GR
GS
[0.75 0 0 0.75 0 0] CT
0.4 GC
2 setlinecap
1 LJ
0.667 LW
N
253.8 374 M
253.8 371.89 L
S
GR
GS
[0.75 0 0 0.75 0 0] CT
0.4 GC
2 setlinecap
1 LJ
0.667 LW
N
266.503 374 M
266.503 371.89 L
S
GR
GS
[0.75 0 0 0.75 0 0] CT
0.4 GC
2 setlinecap
1 LJ
0.667 LW
N
273.935 374 M
273.935 371.89 L
S
GR
GS
[0.75 0 0 0.75 0 0] CT
0.4 GC
2 setlinecap
1 LJ
0.667 LW
N
279.207 374 M
279.207 371.89 L
S
GR
GS
[0.75 0 0 0.75 0 0] CT
0.4 GC
2 setlinecap
1 LJ
0.667 LW
N
283.297 374 M
283.297 371.89 L
S
GR
GS
[0.75 0 0 0.75 0 0] CT
0.4 GC
2 setlinecap
1 LJ
0.667 LW
N
286.638 374 M
286.638 371.89 L
S
GR
GS
[0.75 0 0 0.75 0 0] CT
0.4 GC
2 setlinecap
1 LJ
0.667 LW
N
289.463 374 M
289.463 371.89 L
S
GR
GS
[0.75 0 0 0.75 0 0] CT
0.4 GC
2 setlinecap
1 LJ
0.667 LW
N
291.91 374 M
291.91 371.89 L
S
GR
GS
[0.75 0 0 0.75 0 0] CT
0.4 GC
2 setlinecap
1 LJ
0.667 LW
N
294.069 374 M
294.069 371.89 L
S
GR
GS
[0.75 0 0 0.75 0 0] CT
0.4 GC
2 setlinecap
1 LJ
0.667 LW
N
296 374 M
296 371.89 L
S
GR
GS
[0.75 0 0 0.75 0 0] CT
0.4 GC
2 setlinecap
1 LJ
0.667 LW
N
308.703 374 M
308.703 371.89 L
S
GR
GS
[0.75 0 0 0.75 0 0] CT
0.4 GC
2 setlinecap
1 LJ
0.667 LW
N
316.135 374 M
316.135 371.89 L
S
GR
GS
[0.75 0 0 0.75 0 0] CT
0.4 GC
2 setlinecap
1 LJ
0.667 LW
N
321.407 374 M
321.407 371.89 L
S
GR
GS
[0.75 0 0 0.75 0 0] CT
0.4 GC
2 setlinecap
1 LJ
0.667 LW
N
325.497 374 M
325.497 371.89 L
S
GR
GS
[0.75 0 0 0.75 0 0] CT
0.4 GC
2 setlinecap
1 LJ
0.667 LW
N
328.838 374 M
328.838 371.89 L
S
GR
GS
[0.75 0 0 0.75 0 0] CT
0.4 GC
2 setlinecap
1 LJ
0.667 LW
N
331.663 374 M
331.663 371.89 L
S
GR
GS
[0.75 0 0 0.75 0 0] CT
0.4 GC
2 setlinecap
1 LJ
0.667 LW
N
334.11 374 M
334.11 371.89 L
S
GR
GS
[0.75 0 0 0.75 0 0] CT
0.4 GC
2 setlinecap
1 LJ
0.667 LW
N
336.269 374 M
336.269 371.89 L
S
GR
GS
[0.75 0 0 0.75 0 0] CT
0.4 GC
2 setlinecap
1 LJ
0.667 LW
N
338.2 374 M
338.2 371.89 L
S
GR
GS
[0.75 0 0 0.75 0 0] CT
0.4 GC
2 setlinecap
1 LJ
0.667 LW
N
350.903 374 M
350.903 371.89 L
S
GR
GS
[0.75 0 0 0.75 0 0] CT
0.4 GC
2 setlinecap
1 LJ
0.667 LW
N
358.335 374 M
358.335 371.89 L
S
GR
GS
[0.75 0 0 0.75 0 0] CT
0.4 GC
2 setlinecap
1 LJ
0.667 LW
N
363.607 374 M
363.607 371.89 L
S
GR
GS
[0.75 0 0 0.75 0 0] CT
0.4 GC
2 setlinecap
1 LJ
0.667 LW
N
367.697 374 M
367.697 371.89 L
S
GR
GS
[0.75 0 0 0.75 0 0] CT
0.4 GC
2 setlinecap
1 LJ
0.667 LW
N
371.038 374 M
371.038 371.89 L
S
GR
GS
[0.75 0 0 0.75 0 0] CT
0.4 GC
2 setlinecap
1 LJ
0.667 LW
N
373.863 374 M
373.863 371.89 L
S
GR
GS
[0.75 0 0 0.75 0 0] CT
0.4 GC
2 setlinecap
1 LJ
0.667 LW
N
376.31 374 M
376.31 371.89 L
S
GR
GS
[0.75 0 0 0.75 0 0] CT
0.4 GC
2 setlinecap
1 LJ
0.667 LW
N
378.469 374 M
378.469 371.89 L
S
GR
GS
[0.75 0 0 0.75 0 0] CT
0.4 GC
2 setlinecap
1 LJ
0.667 LW
N
380.4 374 M
380.4 371.89 L
S
GR
GS
[0.75 0 0 0.75 0 0] CT
0.4 GC
2 setlinecap
1 LJ
0.667 LW
N
393.103 374 M
393.103 371.89 L
S
GR
GS
[0.75 0 0 0.75 0 0] CT
0.4 GC
2 setlinecap
1 LJ
0.667 LW
N
400.535 374 M
400.535 371.89 L
S
GR
GS
[0.75 0 0 0.75 0 0] CT
0.4 GC
2 setlinecap
1 LJ
0.667 LW
N
405.807 374 M
405.807 371.89 L
S
GR
GS
[0.75 0 0 0.75 0 0] CT
0.4 GC
2 setlinecap
1 LJ
0.667 LW
N
409.897 374 M
409.897 371.89 L
S
GR
GS
[0.75 0 0 0.75 0 0] CT
0.4 GC
2 setlinecap
1 LJ
0.667 LW
N
413.238 374 M
413.238 371.89 L
S
GR
GS
[0.75 0 0 0.75 0 0] CT
0.4 GC
2 setlinecap
1 LJ
0.667 LW
N
416.063 374 M
416.063 371.89 L
S
GR
GS
[0.75 0 0 0.75 0 0] CT
0.4 GC
2 setlinecap
1 LJ
0.667 LW
N
418.51 374 M
418.51 371.89 L
S
GR
GS
[0.75 0 0 0.75 0 0] CT
0.4 GC
2 setlinecap
1 LJ
0.667 LW
N
420.669 374 M
420.669 371.89 L
S
GR
GS
[0.75 0 0 0.75 0 0] CT
0.4 GC
2 setlinecap
1 LJ
0.667 LW
N
422.6 374 M
422.6 371.89 L
S
GR
GS
[0.75 0 0 0.75 0 0] CT
0.4 GC
2 setlinecap
1 LJ
0.667 LW
N
435.303 374 M
435.303 371.89 L
S
GR
GS
[0.75 0 0 0.75 0 0] CT
0.4 GC
2 setlinecap
1 LJ
0.667 LW
N
442.734 374 M
442.734 371.89 L
S
GR
GS
[0.75 0 0 0.75 0 0] CT
0.4 GC
2 setlinecap
1 LJ
0.667 LW
N
448.007 374 M
448.007 371.89 L
S
GR
GS
[0.75 0 0 0.75 0 0] CT
0.4 GC
2 setlinecap
1 LJ
0.667 LW
N
452.097 374 M
452.097 371.89 L
S
GR
GS
[0.75 0 0 0.75 0 0] CT
0.4 GC
2 setlinecap
1 LJ
0.667 LW
N
455.438 374 M
455.438 371.89 L
S
GR
GS
[0.75 0 0 0.75 0 0] CT
0.4 GC
2 setlinecap
1 LJ
0.667 LW
N
458.263 374 M
458.263 371.89 L
S
GR
GS
[0.75 0 0 0.75 0 0] CT
0.4 GC
2 setlinecap
1 LJ
0.667 LW
N
460.71 374 M
460.71 371.89 L
S
GR
GS
[0.75 0 0 0.75 0 0] CT
0.4 GC
2 setlinecap
1 LJ
0.667 LW
N
462.869 374 M
462.869 371.89 L
S
GR
GS
[0.75 0 0 0.75 0 0] CT
0.4 GC
2 setlinecap
1 LJ
0.667 LW
N
464.8 374 M
464.8 371.89 L
S
GR
GS
[0.75 0 0 0.75 0 0] CT
0.4 GC
2 setlinecap
1 LJ
0.667 LW
N
477.503 374 M
477.503 371.89 L
S
GR
GS
[0.75 0 0 0.75 0 0] CT
0.4 GC
2 setlinecap
1 LJ
0.667 LW
N
484.935 374 M
484.935 371.89 L
S
GR
GS
[0.75 0 0 0.75 0 0] CT
0.4 GC
2 setlinecap
1 LJ
0.667 LW
N
490.207 374 M
490.207 371.89 L
S
GR
GS
[0.75 0 0 0.75 0 0] CT
0.4 GC
2 setlinecap
1 LJ
0.667 LW
N
494.297 374 M
494.297 371.89 L
S
GR
GS
[0.75 0 0 0.75 0 0] CT
0.4 GC
2 setlinecap
1 LJ
0.667 LW
N
497.638 374 M
497.638 371.89 L
S
GR
GS
[0.75 0 0 0.75 0 0] CT
0.4 GC
2 setlinecap
1 LJ
0.667 LW
N
500.463 374 M
500.463 371.89 L
S
GR
GS
[0.75 0 0 0.75 0 0] CT
0.4 GC
2 setlinecap
1 LJ
0.667 LW
N
502.91 374 M
502.91 371.89 L
S
GR
GS
[0.75 0 0 0.75 0 0] CT
0.4 GC
2 setlinecap
1 LJ
0.667 LW
N
505.069 374 M
505.069 371.89 L
S
GR
GS
[0.75 0 0 0.75 0 0] CT
0.4 GC
2 setlinecap
1 LJ
0.667 LW
N
507 374 M
507 371.89 L
S
GR
GS
[0.75 0 0 0.75 0 0] CT
0.4 GC
2 setlinecap
1 LJ
0.667 LW
N
85 51 M
85 53.11 L
S
GR
GS
[0.75 0 0 0.75 0 0] CT
0.4 GC
2 setlinecap
1 LJ
0.667 LW
N
97.703 51 M
97.703 53.11 L
S
GR
GS
[0.75 0 0 0.75 0 0] CT
0.4 GC
2 setlinecap
1 LJ
0.667 LW
N
105.135 51 M
105.135 53.11 L
S
GR
GS
[0.75 0 0 0.75 0 0] CT
0.4 GC
2 setlinecap
1 LJ
0.667 LW
N
110.407 51 M
110.407 53.11 L
S
GR
GS
[0.75 0 0 0.75 0 0] CT
0.4 GC
2 setlinecap
1 LJ
0.667 LW
N
114.497 51 M
114.497 53.11 L
S
GR
GS
[0.75 0 0 0.75 0 0] CT
0.4 GC
2 setlinecap
1 LJ
0.667 LW
N
117.838 51 M
117.838 53.11 L
S
GR
GS
[0.75 0 0 0.75 0 0] CT
0.4 GC
2 setlinecap
1 LJ
0.667 LW
N
120.663 51 M
120.663 53.11 L
S
GR
GS
[0.75 0 0 0.75 0 0] CT
0.4 GC
2 setlinecap
1 LJ
0.667 LW
N
123.11 51 M
123.11 53.11 L
S
GR
GS
[0.75 0 0 0.75 0 0] CT
0.4 GC
2 setlinecap
1 LJ
0.667 LW
N
125.269 51 M
125.269 53.11 L
S
GR
GS
[0.75 0 0 0.75 0 0] CT
0.4 GC
2 setlinecap
1 LJ
0.667 LW
N
127.2 51 M
127.2 53.11 L
S
GR
GS
[0.75 0 0 0.75 0 0] CT
0.4 GC
2 setlinecap
1 LJ
0.667 LW
N
139.903 51 M
139.903 53.11 L
S
GR
GS
[0.75 0 0 0.75 0 0] CT
0.4 GC
2 setlinecap
1 LJ
0.667 LW
N
147.335 51 M
147.335 53.11 L
S
GR
GS
[0.75 0 0 0.75 0 0] CT
0.4 GC
2 setlinecap
1 LJ
0.667 LW
N
152.607 51 M
152.607 53.11 L
S
GR
GS
[0.75 0 0 0.75 0 0] CT
0.4 GC
2 setlinecap
1 LJ
0.667 LW
N
156.697 51 M
156.697 53.11 L
S
GR
GS
[0.75 0 0 0.75 0 0] CT
0.4 GC
2 setlinecap
1 LJ
0.667 LW
N
160.038 51 M
160.038 53.11 L
S
GR
GS
[0.75 0 0 0.75 0 0] CT
0.4 GC
2 setlinecap
1 LJ
0.667 LW
N
162.863 51 M
162.863 53.11 L
S
GR
GS
[0.75 0 0 0.75 0 0] CT
0.4 GC
2 setlinecap
1 LJ
0.667 LW
N
165.31 51 M
165.31 53.11 L
S
GR
GS
[0.75 0 0 0.75 0 0] CT
0.4 GC
2 setlinecap
1 LJ
0.667 LW
N
167.469 51 M
167.469 53.11 L
S
GR
GS
[0.75 0 0 0.75 0 0] CT
0.4 GC
2 setlinecap
1 LJ
0.667 LW
N
169.4 51 M
169.4 53.11 L
S
GR
GS
[0.75 0 0 0.75 0 0] CT
0.4 GC
2 setlinecap
1 LJ
0.667 LW
N
182.103 51 M
182.103 53.11 L
S
GR
GS
[0.75 0 0 0.75 0 0] CT
0.4 GC
2 setlinecap
1 LJ
0.667 LW
N
189.535 51 M
189.535 53.11 L
S
GR
GS
[0.75 0 0 0.75 0 0] CT
0.4 GC
2 setlinecap
1 LJ
0.667 LW
N
194.807 51 M
194.807 53.11 L
S
GR
GS
[0.75 0 0 0.75 0 0] CT
0.4 GC
2 setlinecap
1 LJ
0.667 LW
N
198.897 51 M
198.897 53.11 L
S
GR
GS
[0.75 0 0 0.75 0 0] CT
0.4 GC
2 setlinecap
1 LJ
0.667 LW
N
202.238 51 M
202.238 53.11 L
S
GR
GS
[0.75 0 0 0.75 0 0] CT
0.4 GC
2 setlinecap
1 LJ
0.667 LW
N
205.063 51 M
205.063 53.11 L
S
GR
GS
[0.75 0 0 0.75 0 0] CT
0.4 GC
2 setlinecap
1 LJ
0.667 LW
N
207.51 51 M
207.51 53.11 L
S
GR
GS
[0.75 0 0 0.75 0 0] CT
0.4 GC
2 setlinecap
1 LJ
0.667 LW
N
209.669 51 M
209.669 53.11 L
S
GR
GS
[0.75 0 0 0.75 0 0] CT
0.4 GC
2 setlinecap
1 LJ
0.667 LW
N
211.6 51 M
211.6 53.11 L
S
GR
GS
[0.75 0 0 0.75 0 0] CT
0.4 GC
2 setlinecap
1 LJ
0.667 LW
N
224.303 51 M
224.303 53.11 L
S
GR
GS
[0.75 0 0 0.75 0 0] CT
0.4 GC
2 setlinecap
1 LJ
0.667 LW
N
231.735 51 M
231.735 53.11 L
S
GR
GS
[0.75 0 0 0.75 0 0] CT
0.4 GC
2 setlinecap
1 LJ
0.667 LW
N
237.007 51 M
237.007 53.11 L
S
GR
GS
[0.75 0 0 0.75 0 0] CT
0.4 GC
2 setlinecap
1 LJ
0.667 LW
N
241.097 51 M
241.097 53.11 L
S
GR
GS
[0.75 0 0 0.75 0 0] CT
0.4 GC
2 setlinecap
1 LJ
0.667 LW
N
244.438 51 M
244.438 53.11 L
S
GR
GS
[0.75 0 0 0.75 0 0] CT
0.4 GC
2 setlinecap
1 LJ
0.667 LW
N
247.263 51 M
247.263 53.11 L
S
GR
GS
[0.75 0 0 0.75 0 0] CT
0.4 GC
2 setlinecap
1 LJ
0.667 LW
N
249.71 51 M
249.71 53.11 L
S
GR
GS
[0.75 0 0 0.75 0 0] CT
0.4 GC
2 setlinecap
1 LJ
0.667 LW
N
251.869 51 M
251.869 53.11 L
S
GR
GS
[0.75 0 0 0.75 0 0] CT
0.4 GC
2 setlinecap
1 LJ
0.667 LW
N
253.8 51 M
253.8 53.11 L
S
GR
GS
[0.75 0 0 0.75 0 0] CT
0.4 GC
2 setlinecap
1 LJ
0.667 LW
N
253.8 51 M
253.8 53.11 L
S
GR
GS
[0.75 0 0 0.75 0 0] CT
0.4 GC
2 setlinecap
1 LJ
0.667 LW
N
266.503 51 M
266.503 53.11 L
S
GR
GS
[0.75 0 0 0.75 0 0] CT
0.4 GC
2 setlinecap
1 LJ
0.667 LW
N
273.935 51 M
273.935 53.11 L
S
GR
GS
[0.75 0 0 0.75 0 0] CT
0.4 GC
2 setlinecap
1 LJ
0.667 LW
N
279.207 51 M
279.207 53.11 L
S
GR
GS
[0.75 0 0 0.75 0 0] CT
0.4 GC
2 setlinecap
1 LJ
0.667 LW
N
283.297 51 M
283.297 53.11 L
S
GR
GS
[0.75 0 0 0.75 0 0] CT
0.4 GC
2 setlinecap
1 LJ
0.667 LW
N
286.638 51 M
286.638 53.11 L
S
GR
GS
[0.75 0 0 0.75 0 0] CT
0.4 GC
2 setlinecap
1 LJ
0.667 LW
N
289.463 51 M
289.463 53.11 L
S
GR
GS
[0.75 0 0 0.75 0 0] CT
0.4 GC
2 setlinecap
1 LJ
0.667 LW
N
291.91 51 M
291.91 53.11 L
S
GR
GS
[0.75 0 0 0.75 0 0] CT
0.4 GC
2 setlinecap
1 LJ
0.667 LW
N
294.069 51 M
294.069 53.11 L
S
GR
GS
[0.75 0 0 0.75 0 0] CT
0.4 GC
2 setlinecap
1 LJ
0.667 LW
N
296 51 M
296 53.11 L
S
GR
GS
[0.75 0 0 0.75 0 0] CT
0.4 GC
2 setlinecap
1 LJ
0.667 LW
N
308.703 51 M
308.703 53.11 L
S
GR
GS
[0.75 0 0 0.75 0 0] CT
0.4 GC
2 setlinecap
1 LJ
0.667 LW
N
316.135 51 M
316.135 53.11 L
S
GR
GS
[0.75 0 0 0.75 0 0] CT
0.4 GC
2 setlinecap
1 LJ
0.667 LW
N
321.407 51 M
321.407 53.11 L
S
GR
GS
[0.75 0 0 0.75 0 0] CT
0.4 GC
2 setlinecap
1 LJ
0.667 LW
N
325.497 51 M
325.497 53.11 L
S
GR
GS
[0.75 0 0 0.75 0 0] CT
0.4 GC
2 setlinecap
1 LJ
0.667 LW
N
328.838 51 M
328.838 53.11 L
S
GR
GS
[0.75 0 0 0.75 0 0] CT
0.4 GC
2 setlinecap
1 LJ
0.667 LW
N
331.663 51 M
331.663 53.11 L
S
GR
GS
[0.75 0 0 0.75 0 0] CT
0.4 GC
2 setlinecap
1 LJ
0.667 LW
N
334.11 51 M
334.11 53.11 L
S
GR
GS
[0.75 0 0 0.75 0 0] CT
0.4 GC
2 setlinecap
1 LJ
0.667 LW
N
336.269 51 M
336.269 53.11 L
S
GR
GS
[0.75 0 0 0.75 0 0] CT
0.4 GC
2 setlinecap
1 LJ
0.667 LW
N
338.2 51 M
338.2 53.11 L
S
GR
GS
[0.75 0 0 0.75 0 0] CT
0.4 GC
2 setlinecap
1 LJ
0.667 LW
N
350.903 51 M
350.903 53.11 L
S
GR
GS
[0.75 0 0 0.75 0 0] CT
0.4 GC
2 setlinecap
1 LJ
0.667 LW
N
358.335 51 M
358.335 53.11 L
S
GR
GS
[0.75 0 0 0.75 0 0] CT
0.4 GC
2 setlinecap
1 LJ
0.667 LW
N
363.607 51 M
363.607 53.11 L
S
GR
GS
[0.75 0 0 0.75 0 0] CT
0.4 GC
2 setlinecap
1 LJ
0.667 LW
N
367.697 51 M
367.697 53.11 L
S
GR
GS
[0.75 0 0 0.75 0 0] CT
0.4 GC
2 setlinecap
1 LJ
0.667 LW
N
371.038 51 M
371.038 53.11 L
S
GR
GS
[0.75 0 0 0.75 0 0] CT
0.4 GC
2 setlinecap
1 LJ
0.667 LW
N
373.863 51 M
373.863 53.11 L
S
GR
GS
[0.75 0 0 0.75 0 0] CT
0.4 GC
2 setlinecap
1 LJ
0.667 LW
N
376.31 51 M
376.31 53.11 L
S
GR
GS
[0.75 0 0 0.75 0 0] CT
0.4 GC
2 setlinecap
1 LJ
0.667 LW
N
378.469 51 M
378.469 53.11 L
S
GR
GS
[0.75 0 0 0.75 0 0] CT
0.4 GC
2 setlinecap
1 LJ
0.667 LW
N
380.4 51 M
380.4 53.11 L
S
GR
GS
[0.75 0 0 0.75 0 0] CT
0.4 GC
2 setlinecap
1 LJ
0.667 LW
N
393.103 51 M
393.103 53.11 L
S
GR
GS
[0.75 0 0 0.75 0 0] CT
0.4 GC
2 setlinecap
1 LJ
0.667 LW
N
400.535 51 M
400.535 53.11 L
S
GR
GS
[0.75 0 0 0.75 0 0] CT
0.4 GC
2 setlinecap
1 LJ
0.667 LW
N
405.807 51 M
405.807 53.11 L
S
GR
GS
[0.75 0 0 0.75 0 0] CT
0.4 GC
2 setlinecap
1 LJ
0.667 LW
N
409.897 51 M
409.897 53.11 L
S
GR
GS
[0.75 0 0 0.75 0 0] CT
0.4 GC
2 setlinecap
1 LJ
0.667 LW
N
413.238 51 M
413.238 53.11 L
S
GR
GS
[0.75 0 0 0.75 0 0] CT
0.4 GC
2 setlinecap
1 LJ
0.667 LW
N
416.063 51 M
416.063 53.11 L
S
GR
GS
[0.75 0 0 0.75 0 0] CT
0.4 GC
2 setlinecap
1 LJ
0.667 LW
N
418.51 51 M
418.51 53.11 L
S
GR
GS
[0.75 0 0 0.75 0 0] CT
0.4 GC
2 setlinecap
1 LJ
0.667 LW
N
420.669 51 M
420.669 53.11 L
S
GR
GS
[0.75 0 0 0.75 0 0] CT
0.4 GC
2 setlinecap
1 LJ
0.667 LW
N
422.6 51 M
422.6 53.11 L
S
GR
GS
[0.75 0 0 0.75 0 0] CT
0.4 GC
2 setlinecap
1 LJ
0.667 LW
N
435.303 51 M
435.303 53.11 L
S
GR
GS
[0.75 0 0 0.75 0 0] CT
0.4 GC
2 setlinecap
1 LJ
0.667 LW
N
442.734 51 M
442.734 53.11 L
S
GR
GS
[0.75 0 0 0.75 0 0] CT
0.4 GC
2 setlinecap
1 LJ
0.667 LW
N
448.007 51 M
448.007 53.11 L
S
GR
GS
[0.75 0 0 0.75 0 0] CT
0.4 GC
2 setlinecap
1 LJ
0.667 LW
N
452.097 51 M
452.097 53.11 L
S
GR
GS
[0.75 0 0 0.75 0 0] CT
0.4 GC
2 setlinecap
1 LJ
0.667 LW
N
455.438 51 M
455.438 53.11 L
S
GR
GS
[0.75 0 0 0.75 0 0] CT
0.4 GC
2 setlinecap
1 LJ
0.667 LW
N
458.263 51 M
458.263 53.11 L
S
GR
GS
[0.75 0 0 0.75 0 0] CT
0.4 GC
2 setlinecap
1 LJ
0.667 LW
N
460.71 51 M
460.71 53.11 L
S
GR
GS
[0.75 0 0 0.75 0 0] CT
0.4 GC
2 setlinecap
1 LJ
0.667 LW
N
462.869 51 M
462.869 53.11 L
S
GR
GS
[0.75 0 0 0.75 0 0] CT
0.4 GC
2 setlinecap
1 LJ
0.667 LW
N
464.8 51 M
464.8 53.11 L
S
GR
GS
[0.75 0 0 0.75 0 0] CT
0.4 GC
2 setlinecap
1 LJ
0.667 LW
N
477.503 51 M
477.503 53.11 L
S
GR
GS
[0.75 0 0 0.75 0 0] CT
0.4 GC
2 setlinecap
1 LJ
0.667 LW
N
484.935 51 M
484.935 53.11 L
S
GR
GS
[0.75 0 0 0.75 0 0] CT
0.4 GC
2 setlinecap
1 LJ
0.667 LW
N
490.207 51 M
490.207 53.11 L
S
GR
GS
[0.75 0 0 0.75 0 0] CT
0.4 GC
2 setlinecap
1 LJ
0.667 LW
N
494.297 51 M
494.297 53.11 L
S
GR
GS
[0.75 0 0 0.75 0 0] CT
0.4 GC
2 setlinecap
1 LJ
0.667 LW
N
497.638 51 M
497.638 53.11 L
S
GR
GS
[0.75 0 0 0.75 0 0] CT
0.4 GC
2 setlinecap
1 LJ
0.667 LW
N
500.463 51 M
500.463 53.11 L
S
GR
GS
[0.75 0 0 0.75 0 0] CT
0.4 GC
2 setlinecap
1 LJ
0.667 LW
N
502.91 51 M
502.91 53.11 L
S
GR
GS
[0.75 0 0 0.75 0 0] CT
0.4 GC
2 setlinecap
1 LJ
0.667 LW
N
505.069 51 M
505.069 53.11 L
S
GR
GS
[0.75 0 0 0.75 0 0] CT
0.4 GC
2 setlinecap
1 LJ
0.667 LW
N
507 51 M
507 53.11 L
S
GR
GS
[0.75 0 0 0.75 54 297.75] CT
0.4 GC
/Helvetica 13.333 F
GS
[1 0 0 1 0 0] CT
0 0 moveto 
1 -1 scale
(10) t 
GR
GR
GS
[0.75 0 0 0.75 65.25 293.25] CT
0.4 GC
/Helvetica 10.667 F
GS
[1 0 0 1 0 0] CT
0 0 moveto 
1 -1 scale
(-8) t 
GR
GR
GS
[0.75 0 0 0.75 117 297.75] CT
0.4 GC
/Helvetica 13.333 F
GS
[1 0 0 1 0 0] CT
0 0 moveto 
1 -1 scale
(10) t 
GR
GR
GS
[0.75 0 0 0.75 128.25 293.25] CT
0.4 GC
/Helvetica 10.667 F
GS
[1 0 0 1 0 0] CT
0 0 moveto 
1 -1 scale
(-6) t 
GR
GR
GS
[0.75 0 0 0.75 180.75 297.75] CT
0.4 GC
/Helvetica 13.333 F
GS
[1 0 0 1 0 0] CT
0 0 moveto 
1 -1 scale
(10) t 
GR
GR
GS
[0.75 0 0 0.75 192 293.25] CT
0.4 GC
/Helvetica 10.667 F
GS
[1 0 0 1 0 0] CT
0 0 moveto 
1 -1 scale
(-4) t 
GR
GR
GS
[0.75 0 0 0.75 243.75 297.75] CT
0.4 GC
/Helvetica 13.333 F
GS
[1 0 0 1 0 0] CT
0 0 moveto 
1 -1 scale
(10) t 
GR
GR
GS
[0.75 0 0 0.75 255 293.25] CT
0.4 GC
/Helvetica 10.667 F
GS
[1 0 0 1 0 0] CT
0 0 moveto 
1 -1 scale
(-2) t 
GR
GR
GS
[0.75 0 0 0.75 309 297.75] CT
0.4 GC
/Helvetica 13.333 F
GS
[1 0 0 1 0 0] CT
0 0 moveto 
1 -1 scale
(10) t 
GR
GR
GS
[0.75 0 0 0.75 320.25 293.25] CT
0.4 GC
/Helvetica 10.667 F
GS
[1 0 0 1 0 0] CT
0 0 moveto 
1 -1 scale
(0) t 
GR
GR
GS
[0.75 0 0 0.75 372 297.75] CT
0.4 GC
/Helvetica 13.333 F
GS
[1 0 0 1 0 0] CT
0 0 moveto 
1 -1 scale
(10) t 
GR
GR
GS
[0.75 0 0 0.75 383.25 293.25] CT
0.4 GC
/Helvetica 10.667 F
GS
[1 0 0 1 0 0] CT
0 0 moveto 
1 -1 scale
(2) t 
GR
GR
GS
[0.75 0 0 0.75 0 0] CT
0.4 GC
2 setlinecap
1 LJ
0.667 LW
N
85 374 M
85 51 L
S
GR
GS
[0.75 0 0 0.75 0 0] CT
0.4 GC
2 setlinecap
1 LJ
0.667 LW
N
507 374 M
507 51 L
S
GR
GS
[0.75 0 0 0.75 0 0] CT
0.4 GC
2 setlinecap
1 LJ
0.667 LW
N
85 374 M
89.22 374 L
S
GR
GS
[0.75 0 0 0.75 0 0] CT
0.4 GC
2 setlinecap
1 LJ
0.667 LW
N
85 341.7 M
89.22 341.7 L
S
GR
GS
[0.75 0 0 0.75 0 0] CT
0.4 GC
2 setlinecap
1 LJ
0.667 LW
N
85 309.4 M
89.22 309.4 L
S
GR
GS
[0.75 0 0 0.75 0 0] CT
0.4 GC
2 setlinecap
1 LJ
0.667 LW
N
85 277.1 M
89.22 277.1 L
S
GR
GS
[0.75 0 0 0.75 0 0] CT
0.4 GC
2 setlinecap
1 LJ
0.667 LW
N
85 244.8 M
89.22 244.8 L
S
GR
GS
[0.75 0 0 0.75 0 0] CT
0.4 GC
2 setlinecap
1 LJ
0.667 LW
N
85 212.5 M
89.22 212.5 L
S
GR
GS
[0.75 0 0 0.75 0 0] CT
0.4 GC
2 setlinecap
1 LJ
0.667 LW
N
85 180.2 M
89.22 180.2 L
S
GR
GS
[0.75 0 0 0.75 0 0] CT
0.4 GC
2 setlinecap
1 LJ
0.667 LW
N
85 147.9 M
89.22 147.9 L
S
GR
GS
[0.75 0 0 0.75 0 0] CT
0.4 GC
2 setlinecap
1 LJ
0.667 LW
N
85 115.6 M
89.22 115.6 L
S
GR
GS
[0.75 0 0 0.75 0 0] CT
0.4 GC
2 setlinecap
1 LJ
0.667 LW
N
85 83.3 M
89.22 83.3 L
S
GR
GS
[0.75 0 0 0.75 0 0] CT
0.4 GC
2 setlinecap
1 LJ
0.667 LW
N
85 51 M
89.22 51 L
S
GR
GS
[0.75 0 0 0.75 0 0] CT
0.4 GC
2 setlinecap
1 LJ
0.667 LW
N
507 374 M
502.78 374 L
S
GR
GS
[0.75 0 0 0.75 0 0] CT
0.4 GC
2 setlinecap
1 LJ
0.667 LW
N
507 341.7 M
502.78 341.7 L
S
GR
GS
[0.75 0 0 0.75 0 0] CT
0.4 GC
2 setlinecap
1 LJ
0.667 LW
N
507 309.4 M
502.78 309.4 L
S
GR
GS
[0.75 0 0 0.75 0 0] CT
0.4 GC
2 setlinecap
1 LJ
0.667 LW
N
507 277.1 M
502.78 277.1 L
S
GR
GS
[0.75 0 0 0.75 0 0] CT
0.4 GC
2 setlinecap
1 LJ
0.667 LW
N
507 244.8 M
502.78 244.8 L
S
GR
GS
[0.75 0 0 0.75 0 0] CT
0.4 GC
2 setlinecap
1 LJ
0.667 LW
N
507 212.5 M
502.78 212.5 L
S
GR
GS
[0.75 0 0 0.75 0 0] CT
0.4 GC
2 setlinecap
1 LJ
0.667 LW
N
507 180.2 M
502.78 180.2 L
S
GR
GS
[0.75 0 0 0.75 0 0] CT
0.4 GC
2 setlinecap
1 LJ
0.667 LW
N
507 147.9 M
502.78 147.9 L
S
GR
GS
[0.75 0 0 0.75 0 0] CT
0.4 GC
2 setlinecap
1 LJ
0.667 LW
N
507 115.6 M
502.78 115.6 L
S
GR
GS
[0.75 0 0 0.75 0 0] CT
0.4 GC
2 setlinecap
1 LJ
0.667 LW
N
507 83.3 M
502.78 83.3 L
S
GR
GS
[0.75 0 0 0.75 0 0] CT
0.4 GC
2 setlinecap
1 LJ
0.667 LW
N
507 51 M
502.78 51 L
S
GR
GS
[0.75 0 0 0.75 59.75 280.5] CT
0.4 GC
/Helvetica 13.333 F
GS
[1 0 0 1 0 0] CT
-19 5.5 moveto 
1 -1 scale
(-50) t 
GR
GR
GS
[0.75 0 0 0.75 59.75 256.27501] CT
0.4 GC
/Helvetica 13.333 F
GS
[1 0 0 1 0 0] CT
-19 5.5 moveto 
1 -1 scale
(-45) t 
GR
GR
GS
[0.75 0 0 0.75 59.75 232.05] CT
0.4 GC
/Helvetica 13.333 F
GS
[1 0 0 1 0 0] CT
-19 5.5 moveto 
1 -1 scale
(-40) t 
GR
GR
GS
[0.75 0 0 0.75 59.75 207.825] CT
0.4 GC
/Helvetica 13.333 F
GS
[1 0 0 1 0 0] CT
-19 5.5 moveto 
1 -1 scale
(-35) t 
GR
GR
GS
[0.75 0 0 0.75 59.75 183.6] CT
0.4 GC
/Helvetica 13.333 F
GS
[1 0 0 1 0 0] CT
-19 5.5 moveto 
1 -1 scale
(-30) t 
GR
GR
GS
[0.75 0 0 0.75 59.75 159.375] CT
0.4 GC
/Helvetica 13.333 F
GS
[1 0 0 1 0 0] CT
-19 5.5 moveto 
1 -1 scale
(-25) t 
GR
GR
GS
[0.75 0 0 0.75 59.75 135.15] CT
0.4 GC
/Helvetica 13.333 F
GS
[1 0 0 1 0 0] CT
-19 5.5 moveto 
1 -1 scale
(-20) t 
GR
GR
GS
[0.75 0 0 0.75 59.75 110.92501] CT
0.4 GC
/Helvetica 13.333 F
GS
[1 0 0 1 0 0] CT
-19 5.5 moveto 
1 -1 scale
(-15) t 
GR
GR
GS
[0.75 0 0 0.75 59.75 86.7] CT
0.4 GC
/Helvetica 13.333 F
GS
[1 0 0 1 0 0] CT
-19 5.5 moveto 
1 -1 scale
(-10) t 
GR
GR
GS
[0.75 0 0 0.75 59.75 62.47501] CT
0.4 GC
/Helvetica 13.333 F
GS
[1 0 0 1 0 0] CT
-12 5.5 moveto 
1 -1 scale
(-5) t 
GR
GR
GS
[0.75 0 0 0.75 59.75 38.25] CT
0.4 GC
/Helvetica 13.333 F
GS
[1 0 0 1 0 0] CT
-8 5.5 moveto 
1 -1 scale
(0) t 
GR
GR
GS
[0.75 0 0 0.75 0 0] CT
0 0.447 0.741 RC
1 LJ
0.667 LW
N
84.95 332.185 M
90.975 313.739 L
96.575 296.599 L
99.393 287.975 L
102.211 279.352 L
105.029 270.731 L
107.847 262.112 L
110.665 253.497 L
113.483 244.886 L
116.301 236.28 L
119.119 227.683 L
121.937 219.097 L
124.755 210.526 L
127.573 201.975 L
130.391 193.451 L
133.209 184.964 L
136.027 176.527 L
138.845 168.156 L
141.663 159.874 L
144.481 151.709 L
147.299 143.699 L
150.117 135.891 L
152.935 128.34 L
155.753 121.114 L
158.571 114.286 L
161.389 107.935 L
164.207 102.133 L
167.025 96.943 L
169.843 92.403 L
172.661 88.523 L
175.48 85.283 L
178.298 82.637 L
181.116 80.519 L
183.934 78.853 L
186.752 77.561 L
189.57 76.572 L
192.388 75.822 L
195.206 75.257 L
198.024 74.835 L
200.842 74.52 L
203.66 74.286 L
206.478 74.113 L
209.296 73.985 L
212.114 73.891 L
214.932 73.821 L
217.75 73.77 L
220.568 73.732 L
223.386 73.704 L
226.204 73.684 L
232.7 73.655 L
253.8 73.629 L
274.9 73.623 L
279.746 73.62 L
282.564 73.617 L
285.382 73.613 L
288.2 73.608 L
291.018 73.601 L
293.836 73.592 L
296.654 73.58 L
299.472 73.563 L
302.29 73.54 L
305.109 73.508 L
307.927 73.466 L
310.745 73.408 L
313.563 73.33 L
316.381 73.224 L
319.199 73.08 L
322.017 72.886 L
324.835 72.626 L
327.653 72.28 L
330.471 71.822 L
333.289 71.228 L
336.107 70.469 L
338.925 69.525 L
341.743 68.391 L
344.561 67.092 L
347.379 65.703 L
350.197 64.366 L
353.015 63.311 L
355.833 62.839 L
358.651 63.275 L
361.469 64.859 L
364.287 67.612 L
367.105 71.259 L
369.923 75.283 L
372.741 79.085 L
375.559 82.086 L
378.377 83.848 L
381.195 84.993 L
384.013 85.917 L
386.831 86.683 L
389.649 87.317 L
392.467 87.836 L
395.285 88.261 L
398.103 88.606 L
400.921 88.887 L
403.739 89.113 L
406.557 89.294 L
409.375 89.438 L
412.193 89.552 L
415.011 89.64 L
417.829 89.708 L
420.647 89.76 L
423.465 89.799 L
426.283 89.828 L
429.101 89.849 L
431.919 89.864 L
434.738 89.874 L
437.556 89.881 L
440.374 89.886 L
443.192 89.888 L
446.01 89.89 L
448.828 89.891 L
451.646 89.892 L
454.464 89.892 L
457.282 89.893 L
460.1 89.893 L
462.918 89.893 L
465.736 89.893 L
468.554 89.893 L
471.372 89.893 L
474.19 89.893 L
477.008 89.893 L
479.826 89.893 L
482.644 89.893 L
485.462 89.893 L
488.28 89.893 L
491.098 89.893 L
493.916 89.893 L
496.734 89.893 L
499.552 89.893 L
502.37 89.893 L
507.05 89.893 L
S
GR
GS
[0.75 0 0 0.75 0 0] CT
0 0.447 0.741 RC
1 LJ
0.667 LW
N
84.95 334.435 M
90.975 315.989 L
96.575 298.849 L
99.393 290.225 L
102.211 281.602 L
105.029 272.981 L
107.847 264.362 L
110.665 255.747 L
113.483 247.136 L
116.301 238.53 L
119.119 229.933 L
121.937 221.347 L
124.755 212.776 L
127.573 204.225 L
130.391 195.701 L
133.209 187.214 L
136.027 178.777 L
138.845 170.406 L
141.663 162.124 L
144.481 153.959 L
147.299 145.949 L
150.117 138.141 L
152.935 130.59 L
155.753 123.364 L
158.571 116.536 L
161.389 110.185 L
164.207 104.383 L
167.025 99.193 L
169.843 94.653 L
172.661 90.773 L
175.48 87.533 L
178.298 84.887 L
181.116 82.769 L
183.934 81.103 L
186.752 79.811 L
189.57 78.822 L
192.388 78.072 L
195.206 77.507 L
198.024 77.085 L
200.842 76.77 L
203.66 76.536 L
206.478 76.363 L
209.296 76.235 L
212.114 76.141 L
214.932 76.071 L
217.75 76.02 L
220.568 75.982 L
223.386 75.954 L
226.204 75.934 L
232.7 75.905 L
253.8 75.88 L
274.9 75.876 L
279.746 75.876 L
282.564 75.875 L
285.382 75.875 L
288.2 75.874 L
291.018 75.873 L
293.836 75.871 L
296.654 75.869 L
299.472 75.866 L
302.29 75.863 L
305.109 75.858 L
307.927 75.851 L
310.745 75.843 L
313.563 75.832 L
316.381 75.817 L
319.199 75.799 L
322.017 75.776 L
324.835 75.748 L
327.653 75.714 L
330.471 75.677 L
333.289 75.636 L
336.107 75.595 L
338.925 75.559 L
341.743 75.539 L
344.561 75.549 L
347.379 75.609 L
350.197 75.747 L
353.015 75.992 L
355.833 76.377 L
358.651 76.927 L
361.469 77.655 L
364.287 78.56 L
367.105 79.619 L
369.923 80.797 L
372.741 82.068 L
375.559 83.524 L
378.377 85.366 L
381.195 86.969 L
384.013 88.067 L
386.831 88.766 L
389.649 89.197 L
392.467 89.458 L
395.285 89.616 L
398.103 89.713 L
400.921 89.773 L
403.739 89.811 L
406.557 89.836 L
409.375 89.852 L
412.193 89.864 L
415.011 89.871 L
417.829 89.877 L
420.647 89.881 L
423.465 89.884 L
426.283 89.886 L
429.101 89.888 L
431.919 89.889 L
434.738 89.89 L
437.556 89.891 L
440.374 89.892 L
443.192 89.892 L
446.01 89.892 L
448.828 89.892 L
451.646 89.893 L
454.464 89.893 L
457.282 89.893 L
460.1 89.893 L
462.918 89.893 L
465.736 89.893 L
468.554 89.893 L
471.372 89.893 L
474.19 89.893 L
477.008 89.893 L
479.826 89.893 L
482.644 89.893 L
485.462 89.893 L
488.28 89.893 L
491.098 89.893 L
493.916 89.893 L
496.734 89.893 L
499.552 89.893 L
502.37 89.893 L
507.05 89.893 L
S
GR
GS
[0.75 0 0 0.75 0 0] CT
1 GC
N
426 84 M
426 64 L
494 64 L
494 84 L
cp
f
GR
GS
[0.75 0 0 0.75 347.25 55.5] CT
/Helvetica 12 F
GS
[1 0 0 1 0 0] CT
0 5 moveto 
1 -1 scale
(W1S) t 
GR
GR
GS
[0.75 0 0 0.75 0 0] CT
0 0.447 0.741 RC
1 LJ
0.667 LW
N
430 74 M
460 74 L
S
GR
GS
[0.75 0 0 0.75 0 0] CT
0.149 GC
10.0 ML
0.667 LW
N
426 84 M
426 64 L
494 64 L
494 84 L
cp
S
GR
GS
[0.75 0 0 0.75 221.25 33.52501] CT
/Helvetica-Bold 14.667 F
GS
[1 0 0 1 0 0] CT
-56.5 -4 moveto 
1 -1 scale
(Singular Values) t 
GR
GR
GS
[0.75 0 0 0.75 221.25 299.74999] CT
/Helvetica 14.667 F
GS
[1 0 0 1 0 0] CT
-59.5 16 moveto 
1 -1 scale
(Frequency \(rad/s\)) t 
GR
GR
GS
[0 -0.75 0.75 0 42.5 160.3875] CT
/Helvetica 14.667 F
GS
[1 0 0 1 0 0] CT
-69 -4 moveto 
1 -1 scale
(Singular Values \(dB\)) t 
GR
GR
%%Trailer
%%Pages: 1
%%EOF
