%!PS-Adobe-3.0 EPSF-3.0
%%Creator: (MATLAB, The Mathworks, Inc. Version 9.1.0.441655 \(R2016b\). Operating System: Linux)
%%Title: /home/frdm/Documents/RLS/rls-2017/sp5/figures/porucha1_akcni.eps
%%CreationDate: 2018-02-09T17:32:01
%%Pages: (atend)
%%BoundingBox: 0 0 737 460
%%LanguageLevel: 3
%%EndComments
%%BeginProlog
%%BeginResource: procset (Apache XML Graphics Std ProcSet) 1.2 0
%%Version: 1.2 0
%%Copyright: (Copyright 2001-2003,2010 The Apache Software Foundation. License terms: http://www.apache.org/licenses/LICENSE-2.0)
/bd{bind def}bind def
/ld{load def}bd
/GR/grestore ld
/M/moveto ld
/LJ/setlinejoin ld
/C/curveto ld
/f/fill ld
/LW/setlinewidth ld
/GC/setgray ld
/t/show ld
/N/newpath ld
/CT/concat ld
/cp/closepath ld
/S/stroke ld
/L/lineto ld
/CC/setcmykcolor ld
/A/ashow ld
/GS/gsave ld
/RC/setrgbcolor ld
/RM/rmoveto ld
/ML/setmiterlimit ld
/re {4 2 roll M
1 index 0 rlineto
0 exch rlineto
neg 0 rlineto
cp } bd
/_ctm matrix def
/_tm matrix def
/BT { _ctm currentmatrix pop matrix _tm copy pop 0 0 moveto } bd
/ET { _ctm setmatrix } bd
/iTm { _ctm setmatrix _tm concat } bd
/Tm { _tm astore pop iTm 0 0 moveto } bd
/ux 0.0 def
/uy 0.0 def
/F {
  /Tp exch def
  /Tf exch def
  Tf findfont Tp scalefont setfont
  /cf Tf def  /cs Tp def
} bd
/ULS {currentpoint /uy exch def /ux exch def} bd
/ULE {
  /Tcx currentpoint pop def
  gsave
  newpath
  cf findfont cs scalefont dup
  /FontMatrix get 0 get /Ts exch def /FontInfo get dup
  /UnderlinePosition get Ts mul /To exch def
  /UnderlineThickness get Ts mul /Tt exch def
  ux uy To add moveto  Tcx uy To add lineto
  Tt setlinewidth stroke
  grestore
} bd
/OLE {
  /Tcx currentpoint pop def
  gsave
  newpath
  cf findfont cs scalefont dup
  /FontMatrix get 0 get /Ts exch def /FontInfo get dup
  /UnderlinePosition get Ts mul /To exch def
  /UnderlineThickness get Ts mul /Tt exch def
  ux uy To add cs add moveto Tcx uy To add cs add lineto
  Tt setlinewidth stroke
  grestore
} bd
/SOE {
  /Tcx currentpoint pop def
  gsave
  newpath
  cf findfont cs scalefont dup
  /FontMatrix get 0 get /Ts exch def /FontInfo get dup
  /UnderlinePosition get Ts mul /To exch def
  /UnderlineThickness get Ts mul /Tt exch def
  ux uy To add cs 10 mul 26 idiv add moveto Tcx uy To add cs 10 mul 26 idiv add lineto
  Tt setlinewidth stroke
  grestore
} bd
/QT {
/Y22 exch store
/X22 exch store
/Y21 exch store
/X21 exch store
currentpoint
/Y21 load 2 mul add 3 div exch
/X21 load 2 mul add 3 div exch
/X21 load 2 mul /X22 load add 3 div
/Y21 load 2 mul /Y22 load add 3 div
/X22 load /Y22 load curveto
} bd
/SSPD {
dup length /d exch dict def
{
/v exch def
/k exch def
currentpagedevice k known {
/cpdv currentpagedevice k get def
v cpdv ne {
/upd false def
/nullv v type /nulltype eq def
/nullcpdv cpdv type /nulltype eq def
nullv nullcpdv or
{
/upd true def
} {
/sametype v type cpdv type eq def
sametype {
v type /arraytype eq {
/vlen v length def
/cpdvlen cpdv length def
vlen cpdvlen eq {
0 1 vlen 1 sub {
/i exch def
/obj v i get def
/cpdobj cpdv i get def
obj cpdobj ne {
/upd true def
exit
} if
} for
} {
/upd true def
} ifelse
} {
v type /dicttype eq {
v {
/dv exch def
/dk exch def
/cpddv cpdv dk get def
dv cpddv ne {
/upd true def
exit
} if
} forall
} {
/upd true def
} ifelse
} ifelse
} if
} ifelse
upd true eq {
d k v put
} if
} if
} if
} forall
d length 0 gt {
d setpagedevice
} if
} bd
/RE { % /NewFontName [NewEncodingArray] /FontName RE -
  findfont dup length dict begin
  {
    1 index /FID ne
    {def} {pop pop} ifelse
  } forall
  /Encoding exch def
  /FontName 1 index def
  currentdict definefont pop
  end
} bind def
%%EndResource
%%BeginResource: procset (Apache XML Graphics EPS ProcSet) 1.0 0
%%Version: 1.0 0
%%Copyright: (Copyright 2002-2003 The Apache Software Foundation. License terms: http://www.apache.org/licenses/LICENSE-2.0)
/BeginEPSF { %def
/b4_Inc_state save def         % Save state for cleanup
/dict_count countdictstack def % Count objects on dict stack
/op_count count 1 sub def      % Count objects on operand stack
userdict begin                 % Push userdict on dict stack
/showpage { } def              % Redefine showpage, { } = null proc
0 setgray 0 setlinecap         % Prepare graphics state
1 setlinewidth 0 setlinejoin
10 setmiterlimit [ ] 0 setdash newpath
/languagelevel where           % If level not equal to 1 then
{pop languagelevel             % set strokeadjust and
1 ne                           % overprint to their defaults.
{false setstrokeadjust false setoverprint
} if
} if
} bd
/EndEPSF { %def
count op_count sub {pop} repeat            % Clean up stacks
countdictstack dict_count sub {end} repeat
b4_Inc_state restore
} bd
%%EndResource
%FOPBeginFontDict
%%IncludeResource: font Courier-Bold
%%IncludeResource: font Helvetica
%%IncludeResource: font Courier-BoldOblique
%%IncludeResource: font Courier-Oblique
%%IncludeResource: font Times-Roman
%%IncludeResource: font Helvetica-BoldOblique
%%IncludeResource: font Helvetica-Bold
%%IncludeResource: font Helvetica-Oblique
%%IncludeResource: font Times-BoldItalic
%%IncludeResource: font Courier
%%IncludeResource: font Times-Italic
%%IncludeResource: font Times-Bold
%%IncludeResource: font Symbol
%%IncludeResource: font ZapfDingbats
%FOPEndFontDict
%%BeginResource: encoding WinAnsiEncoding
/WinAnsiEncoding [
/.notdef /.notdef /.notdef /.notdef /.notdef
/.notdef /.notdef /.notdef /.notdef /.notdef
/.notdef /.notdef /.notdef /.notdef /.notdef
/.notdef /.notdef /.notdef /.notdef /.notdef
/.notdef /.notdef /.notdef /.notdef /.notdef
/.notdef /.notdef /.notdef /.notdef /.notdef
/.notdef /.notdef /space /exclam /quotedbl
/numbersign /dollar /percent /ampersand /quotesingle
/parenleft /parenright /asterisk /plus /comma
/hyphen /period /slash /zero /one
/two /three /four /five /six
/seven /eight /nine /colon /semicolon
/less /equal /greater /question /at
/A /B /C /D /E
/F /G /H /I /J
/K /L /M /N /O
/P /Q /R /S /T
/U /V /W /X /Y
/Z /bracketleft /backslash /bracketright /asciicircum
/underscore /quoteleft /a /b /c
/d /e /f /g /h
/i /j /k /l /m
/n /o /p /q /r
/s /t /u /v /w
/x /y /z /braceleft /bar
/braceright /asciitilde /bullet /Euro /bullet
/quotesinglbase /florin /quotedblbase /ellipsis /dagger
/daggerdbl /circumflex /perthousand /Scaron /guilsinglleft
/OE /bullet /Zcaron /bullet /bullet
/quoteleft /quoteright /quotedblleft /quotedblright /bullet
/endash /emdash /asciitilde /trademark /scaron
/guilsinglright /oe /bullet /zcaron /Ydieresis
/space /exclamdown /cent /sterling /currency
/yen /brokenbar /section /dieresis /copyright
/ordfeminine /guillemotleft /logicalnot /sfthyphen /registered
/macron /degree /plusminus /twosuperior /threesuperior
/acute /mu /paragraph /middot /cedilla
/onesuperior /ordmasculine /guillemotright /onequarter /onehalf
/threequarters /questiondown /Agrave /Aacute /Acircumflex
/Atilde /Adieresis /Aring /AE /Ccedilla
/Egrave /Eacute /Ecircumflex /Edieresis /Igrave
/Iacute /Icircumflex /Idieresis /Eth /Ntilde
/Ograve /Oacute /Ocircumflex /Otilde /Odieresis
/multiply /Oslash /Ugrave /Uacute /Ucircumflex
/Udieresis /Yacute /Thorn /germandbls /agrave
/aacute /acircumflex /atilde /adieresis /aring
/ae /ccedilla /egrave /eacute /ecircumflex
/edieresis /igrave /iacute /icircumflex /idieresis
/eth /ntilde /ograve /oacute /ocircumflex
/otilde /odieresis /divide /oslash /ugrave
/uacute /ucircumflex /udieresis /yacute /thorn
/ydieresis
] def
%%EndResource
%FOPBeginFontReencode
/Courier-Bold findfont
dup length dict begin
  {1 index /FID ne {def} {pop pop} ifelse} forall
  /Encoding WinAnsiEncoding def
  currentdict
end
/Courier-Bold exch definefont pop
/Helvetica findfont
dup length dict begin
  {1 index /FID ne {def} {pop pop} ifelse} forall
  /Encoding WinAnsiEncoding def
  currentdict
end
/Helvetica exch definefont pop
/Courier-BoldOblique findfont
dup length dict begin
  {1 index /FID ne {def} {pop pop} ifelse} forall
  /Encoding WinAnsiEncoding def
  currentdict
end
/Courier-BoldOblique exch definefont pop
/Courier-Oblique findfont
dup length dict begin
  {1 index /FID ne {def} {pop pop} ifelse} forall
  /Encoding WinAnsiEncoding def
  currentdict
end
/Courier-Oblique exch definefont pop
/Times-Roman findfont
dup length dict begin
  {1 index /FID ne {def} {pop pop} ifelse} forall
  /Encoding WinAnsiEncoding def
  currentdict
end
/Times-Roman exch definefont pop
/Helvetica-BoldOblique findfont
dup length dict begin
  {1 index /FID ne {def} {pop pop} ifelse} forall
  /Encoding WinAnsiEncoding def
  currentdict
end
/Helvetica-BoldOblique exch definefont pop
/Helvetica-Bold findfont
dup length dict begin
  {1 index /FID ne {def} {pop pop} ifelse} forall
  /Encoding WinAnsiEncoding def
  currentdict
end
/Helvetica-Bold exch definefont pop
/Helvetica-Oblique findfont
dup length dict begin
  {1 index /FID ne {def} {pop pop} ifelse} forall
  /Encoding WinAnsiEncoding def
  currentdict
end
/Helvetica-Oblique exch definefont pop
/Times-BoldItalic findfont
dup length dict begin
  {1 index /FID ne {def} {pop pop} ifelse} forall
  /Encoding WinAnsiEncoding def
  currentdict
end
/Times-BoldItalic exch definefont pop
/Courier findfont
dup length dict begin
  {1 index /FID ne {def} {pop pop} ifelse} forall
  /Encoding WinAnsiEncoding def
  currentdict
end
/Courier exch definefont pop
/Times-Italic findfont
dup length dict begin
  {1 index /FID ne {def} {pop pop} ifelse} forall
  /Encoding WinAnsiEncoding def
  currentdict
end
/Times-Italic exch definefont pop
/Times-Bold findfont
dup length dict begin
  {1 index /FID ne {def} {pop pop} ifelse} forall
  /Encoding WinAnsiEncoding def
  currentdict
end
/Times-Bold exch definefont pop
%FOPEndFontReencode
%%EndProlog
%%Page: 1 1
%%PageBoundingBox: 0 0 737 460
%%BeginPageSetup
[1 0 0 -1 0 460] CT
%%EndPageSetup
GS
[0.75 0 0 0.75 0 0.25] CT
N
0 0 M
983 0 L
983 613 L
0 613 L
0 0 L
cp
clip
1 GC
N
0 0 983 613 re
f
GR
GS
[0.75 0 0 0.75 0 0.25] CT
1 GC
N
0 0 983 613 re
f
GR
GS
[0.75 0 0 0.75 0 0.25] CT
1 GC
N
128 546 M
890 546 L
890 46 L
128 46 L
cp
f
GR
GS
[0.75 0 0 0.75 0 0.25] CT
0.149 GC
2 setlinecap
1 LJ
0.667 LW
N
128 546 M
890 546 L
S
GR
GS
[0.75 0 0 0.75 0 0.25] CT
0.149 GC
2 setlinecap
1 LJ
0.667 LW
N
128 546 M
128 538.38 L
S
GR
GS
[0.75 0 0 0.75 0 0.25] CT
0.149 GC
2 setlinecap
1 LJ
0.667 LW
N
204.2 546 M
204.2 538.38 L
S
GR
GS
[0.75 0 0 0.75 0 0.25] CT
0.149 GC
2 setlinecap
1 LJ
0.667 LW
N
280.4 546 M
280.4 538.38 L
S
GR
GS
[0.75 0 0 0.75 0 0.25] CT
0.149 GC
2 setlinecap
1 LJ
0.667 LW
N
356.6 546 M
356.6 538.38 L
S
GR
GS
[0.75 0 0 0.75 0 0.25] CT
0.149 GC
2 setlinecap
1 LJ
0.667 LW
N
432.8 546 M
432.8 538.38 L
S
GR
GS
[0.75 0 0 0.75 0 0.25] CT
0.149 GC
2 setlinecap
1 LJ
0.667 LW
N
509 546 M
509 538.38 L
S
GR
GS
[0.75 0 0 0.75 0 0.25] CT
0.149 GC
2 setlinecap
1 LJ
0.667 LW
N
585.2 546 M
585.2 538.38 L
S
GR
GS
[0.75 0 0 0.75 0 0.25] CT
0.149 GC
2 setlinecap
1 LJ
0.667 LW
N
661.4 546 M
661.4 538.38 L
S
GR
GS
[0.75 0 0 0.75 0 0.25] CT
0.149 GC
2 setlinecap
1 LJ
0.667 LW
N
737.6 546 M
737.6 538.38 L
S
GR
GS
[0.75 0 0 0.75 0 0.25] CT
0.149 GC
2 setlinecap
1 LJ
0.667 LW
N
813.8 546 M
813.8 538.38 L
S
GR
GS
[0.75 0 0 0.75 0 0.25] CT
0.149 GC
2 setlinecap
1 LJ
0.667 LW
N
890 546 M
890 538.38 L
S
GR
GS
[0.75 0 0 0.75 96 413.74998] CT
0.149 GC
/Helvetica 13.333 F
GS
[1 0 0 1 0 0] CT
-4.5 13 moveto 
1 -1 scale
(0) t 
GR
GR
GS
[0.75 0 0 0.75 153.15 413.74998] CT
0.149 GC
/Helvetica 13.333 F
GS
[1 0 0 1 0 0] CT
-8.5 13 moveto 
1 -1 scale
(50) t 
GR
GR
GS
[0.75 0 0 0.75 210.3 413.74998] CT
0.149 GC
/Helvetica 13.333 F
GS
[1 0 0 1 0 0] CT
-12.5 13 moveto 
1 -1 scale
(100) t 
GR
GR
GS
[0.75 0 0 0.75 267.45 413.74998] CT
0.149 GC
/Helvetica 13.333 F
GS
[1 0 0 1 0 0] CT
-12.5 13 moveto 
1 -1 scale
(150) t 
GR
GR
GS
[0.75 0 0 0.75 324.59999 413.74998] CT
0.149 GC
/Helvetica 13.333 F
GS
[1 0 0 1 0 0] CT
-12.5 13 moveto 
1 -1 scale
(200) t 
GR
GR
GS
[0.75 0 0 0.75 381.75 413.74998] CT
0.149 GC
/Helvetica 13.333 F
GS
[1 0 0 1 0 0] CT
-12.5 13 moveto 
1 -1 scale
(250) t 
GR
GR
GS
[0.75 0 0 0.75 438.90001 413.74998] CT
0.149 GC
/Helvetica 13.333 F
GS
[1 0 0 1 0 0] CT
-12.5 13 moveto 
1 -1 scale
(300) t 
GR
GR
GS
[0.75 0 0 0.75 496.05002 413.74998] CT
0.149 GC
/Helvetica 13.333 F
GS
[1 0 0 1 0 0] CT
-12.5 13 moveto 
1 -1 scale
(350) t 
GR
GR
GS
[0.75 0 0 0.75 553.19998 413.74998] CT
0.149 GC
/Helvetica 13.333 F
GS
[1 0 0 1 0 0] CT
-12.5 13 moveto 
1 -1 scale
(400) t 
GR
GR
GS
[0.75 0 0 0.75 610.34999 413.74998] CT
0.149 GC
/Helvetica 13.333 F
GS
[1 0 0 1 0 0] CT
-12.5 13 moveto 
1 -1 scale
(450) t 
GR
GR
GS
[0.75 0 0 0.75 667.5 413.74998] CT
0.149 GC
/Helvetica 13.333 F
GS
[1 0 0 1 0 0] CT
-12.5 13 moveto 
1 -1 scale
(500) t 
GR
GR
GS
[0.75 0 0 0.75 381.75027 427.50002] CT
0.149 GC
/Helvetica 14.667 F
GS
[1 0 0 1 0 0] CT
-57.5 14 moveto 
1 -1 scale
(Time \(seconds\)) t 
GR
GR
GS
[0.75 0 0 0.75 0 0.25] CT
0.149 GC
2 setlinecap
1 LJ
0.667 LW
N
128 546 M
128 46 L
S
GR
GS
[0.75 0 0 0.75 0 0.25] CT
0.149 GC
2 setlinecap
1 LJ
0.667 LW
N
128 546 M
135.62 546 L
S
GR
GS
[0.75 0 0 0.75 0 0.25] CT
0.149 GC
2 setlinecap
1 LJ
0.667 LW
N
128 483.5 M
135.62 483.5 L
S
GR
GS
[0.75 0 0 0.75 0 0.25] CT
0.149 GC
2 setlinecap
1 LJ
0.667 LW
N
128 421 M
135.62 421 L
S
GR
GS
[0.75 0 0 0.75 0 0.25] CT
0.149 GC
2 setlinecap
1 LJ
0.667 LW
N
128 358.5 M
135.62 358.5 L
S
GR
GS
[0.75 0 0 0.75 0 0.25] CT
0.149 GC
2 setlinecap
1 LJ
0.667 LW
N
128 296 M
135.62 296 L
S
GR
GS
[0.75 0 0 0.75 0 0.25] CT
0.149 GC
2 setlinecap
1 LJ
0.667 LW
N
128 233.5 M
135.62 233.5 L
S
GR
GS
[0.75 0 0 0.75 0 0.25] CT
0.149 GC
2 setlinecap
1 LJ
0.667 LW
N
128 171 M
135.62 171 L
S
GR
GS
[0.75 0 0 0.75 0 0.25] CT
0.149 GC
2 setlinecap
1 LJ
0.667 LW
N
128 108.5 M
135.62 108.5 L
S
GR
GS
[0.75 0 0 0.75 0 0.25] CT
0.149 GC
2 setlinecap
1 LJ
0.667 LW
N
128 46 M
135.62 46 L
S
GR
GS
[0.75 0 0 0.75 92 409.75] CT
0.149 GC
/Helvetica 13.333 F
GS
[1 0 0 1 0 0] CT
-13 4.5 moveto 
1 -1 scale
(-1) t 
GR
GR
GS
[0.75 0 0 0.75 92 362.875] CT
0.149 GC
/Helvetica 13.333 F
GS
[1 0 0 1 0 0] CT
-9 4.5 moveto 
1 -1 scale
(0) t 
GR
GR
GS
[0.75 0 0 0.75 92 316] CT
0.149 GC
/Helvetica 13.333 F
GS
[1 0 0 1 0 0] CT
-9 4.5 moveto 
1 -1 scale
(1) t 
GR
GR
GS
[0.75 0 0 0.75 92 269.125] CT
0.149 GC
/Helvetica 13.333 F
GS
[1 0 0 1 0 0] CT
-9 4.5 moveto 
1 -1 scale
(2) t 
GR
GR
GS
[0.75 0 0 0.75 92 222.25] CT
0.149 GC
/Helvetica 13.333 F
GS
[1 0 0 1 0 0] CT
-9 4.5 moveto 
1 -1 scale
(3) t 
GR
GR
GS
[0.75 0 0 0.75 92 175.375] CT
0.149 GC
/Helvetica 13.333 F
GS
[1 0 0 1 0 0] CT
-9 4.5 moveto 
1 -1 scale
(4) t 
GR
GR
GS
[0.75 0 0 0.75 92 128.5] CT
0.149 GC
/Helvetica 13.333 F
GS
[1 0 0 1 0 0] CT
-9 4.5 moveto 
1 -1 scale
(5) t 
GR
GR
GS
[0.75 0 0 0.75 92 81.625] CT
0.149 GC
/Helvetica 13.333 F
GS
[1 0 0 1 0 0] CT
-9 4.5 moveto 
1 -1 scale
(6) t 
GR
GR
GS
[0.75 0 0 0.75 92 34.75] CT
0.149 GC
/Helvetica 13.333 F
GS
[1 0 0 1 0 0] CT
-9 4.5 moveto 
1 -1 scale
(7) t 
GR
GR
GS
[0 -0.75 0.75 0 79.25 222.24982] CT
0.149 GC
/Helvetica 14.667 F
GS
[1 0 0 1 0 0] CT
-17 -4 moveto 
1 -1 scale
(data) t 
GR
GR
GS
[0.75 0 0 0.75 381.75037 32.68749] CT
N
-46.984 -6 M
-51.391 -6 L
-52.094 -4 L
-54.922 -4 L
-50.875 -14.938 L
-47.516 -14.938 L
-43.469 -4 L
-46.297 -4 L
-46.984 -6 L
cp
-50.688 -8.016 M
-47.703 -8.016 L
-49.188 -12.375 L
-50.688 -8.016 L
cp
-42.392 -15.391 M
-39.782 -15.391 L
-39.782 -9.188 L
-36.751 -12.203 L
-33.704 -12.203 L
-37.72 -8.438 L
-33.392 -4 L
-36.579 -4 L
-39.782 -7.422 L
-39.782 -4 L
-42.392 -4 L
-42.392 -15.391 L
cp
-26.02 -11.953 M
-26.02 -9.813 L
-26.551 -10.172 -27.09 -10.352 QT
-27.629 -10.531 -28.207 -10.531 QT
-29.316 -10.531 -29.926 -9.891 QT
-30.535 -9.25 -30.535 -8.094 QT
-30.535 -6.938 -29.926 -6.297 QT
-29.316 -5.656 -28.207 -5.656 QT
-27.598 -5.656 -27.043 -5.844 QT
-26.488 -6.031 -26.02 -6.391 QT
-26.02 -4.234 L
-26.645 -4.016 -27.277 -3.898 QT
-27.91 -3.781 -28.535 -3.781 QT
-30.754 -3.781 -32.012 -4.922 QT
-33.27 -6.063 -33.27 -8.094 QT
-33.27 -10.125 -32.012 -11.266 QT
-30.754 -12.406 -28.535 -12.406 QT
-27.895 -12.406 -27.27 -12.289 QT
-26.645 -12.172 -26.02 -11.953 QT
cp
-29.051 -13.25 M
-30.926 -16 L
-29.613 -16 L
-28.16 -14.328 L
-26.707 -16 L
-25.395 -16 L
-27.27 -13.25 L
-29.051 -13.25 L
cp
-15.722 -9 M
-15.722 -4 L
-18.347 -4 L
-18.347 -4.813 L
-18.347 -7.828 L
-18.347 -8.891 -18.394 -9.289 QT
-18.441 -9.688 -18.566 -9.875 QT
-18.722 -10.141 -18.98 -10.281 QT
-19.238 -10.422 -19.582 -10.422 QT
-20.41 -10.422 -20.879 -9.789 QT
-21.347 -9.156 -21.347 -8.031 QT
-21.347 -4 L
-23.957 -4 L
-23.957 -12.203 L
-21.347 -12.203 L
-21.347 -11 L
-20.754 -11.719 -20.082 -12.063 QT
-19.41 -12.406 -18.613 -12.406 QT
-17.191 -12.406 -16.457 -11.531 QT
-15.722 -10.656 -15.722 -9 QT
cp
-13.523 -12.203 M
-10.913 -12.203 L
-10.913 -4 L
-13.523 -4 L
-13.523 -12.203 L
cp
-11.054 -16 M
-8.976 -16 L
-11.679 -13.25 L
-13.116 -13.25 L
-11.054 -16 L
cp
-3.803 -12.203 M
3.354 -12.203 L
3.354 -10.375 L
-0.975 -5.875 L
3.354 -5.875 L
3.354 -4 L
-3.99 -4 L
-3.99 -5.828 L
0.338 -10.328 L
-3.803 -10.328 L
-3.803 -12.203 L
cp
8.806 -7.688 M
7.978 -7.688 7.564 -7.414 QT
7.15 -7.141 7.15 -6.594 QT
7.15 -6.094 7.486 -5.813 QT
7.821 -5.531 8.415 -5.531 QT
9.15 -5.531 9.657 -6.063 QT
10.165 -6.594 10.165 -7.391 QT
10.165 -7.688 L
8.806 -7.688 L
cp
12.806 -8.688 M
12.806 -4 L
10.165 -4 L
10.165 -5.219 L
9.634 -4.469 8.978 -4.125 QT
8.321 -3.781 7.384 -3.781 QT
6.103 -3.781 5.306 -4.531 QT
4.509 -5.281 4.509 -6.469 QT
4.509 -7.906 5.501 -8.578 QT
6.493 -9.25 8.618 -9.25 QT
10.165 -9.25 L
10.165 -9.453 L
10.165 -10.078 9.673 -10.367 QT
9.181 -10.656 8.15 -10.656 QT
7.306 -10.656 6.579 -10.492 QT
5.853 -10.328 5.228 -9.984 QT
5.228 -11.984 L
6.071 -12.188 6.923 -12.297 QT
7.775 -12.406 8.618 -12.406 QT
10.837 -12.406 11.821 -11.531 QT
12.806 -10.656 12.806 -8.688 QT
cp
9.603 -16 M
11.681 -16 L
8.978 -13.25 L
7.54 -13.25 L
9.603 -16 L
cp
21.43 -11.953 M
21.43 -9.953 L
20.587 -10.313 19.805 -10.484 QT
19.024 -10.656 18.321 -10.656 QT
17.571 -10.656 17.212 -10.469 QT
16.852 -10.281 16.852 -9.891 QT
16.852 -9.578 17.126 -9.414 QT
17.399 -9.25 18.102 -9.156 QT
18.571 -9.094 L
20.587 -8.844 21.282 -8.258 QT
21.977 -7.672 21.977 -6.422 QT
21.977 -5.109 21.008 -4.445 QT
20.04 -3.781 18.118 -3.781 QT
17.305 -3.781 16.438 -3.914 QT
15.571 -4.047 14.665 -4.297 QT
14.665 -6.297 L
15.446 -5.906 16.266 -5.719 QT
17.087 -5.531 17.946 -5.531 QT
18.712 -5.531 19.102 -5.742 QT
19.493 -5.953 19.493 -6.375 QT
19.493 -6.719 19.219 -6.891 QT
18.946 -7.063 18.149 -7.172 QT
17.696 -7.219 L
15.946 -7.438 15.243 -8.031 QT
14.54 -8.625 14.54 -9.844 QT
14.54 -11.141 15.43 -11.773 QT
16.321 -12.406 18.165 -12.406 QT
18.899 -12.406 19.696 -12.297 QT
20.493 -12.188 21.43 -11.953 QT
cp
27.42 -7.688 M
26.591 -7.688 26.177 -7.414 QT
25.763 -7.141 25.763 -6.594 QT
25.763 -6.094 26.099 -5.813 QT
26.435 -5.531 27.029 -5.531 QT
27.763 -5.531 28.271 -6.063 QT
28.779 -6.594 28.779 -7.391 QT
28.779 -7.688 L
27.42 -7.688 L
cp
31.42 -8.688 M
31.42 -4 L
28.779 -4 L
28.779 -5.219 L
28.248 -4.469 27.591 -4.125 QT
26.935 -3.781 25.998 -3.781 QT
24.716 -3.781 23.92 -4.531 QT
23.123 -5.281 23.123 -6.469 QT
23.123 -7.906 24.115 -8.578 QT
25.107 -9.25 27.232 -9.25 QT
28.779 -9.25 L
28.779 -9.453 L
28.779 -10.078 28.287 -10.367 QT
27.795 -10.656 26.763 -10.656 QT
25.92 -10.656 25.193 -10.492 QT
24.466 -10.328 23.841 -9.984 QT
23.841 -11.984 L
24.685 -12.188 25.537 -12.297 QT
26.388 -12.406 27.232 -12.406 QT
29.451 -12.406 30.435 -11.531 QT
31.42 -10.656 31.42 -8.688 QT
cp
41.872 -9 M
41.872 -4 L
39.247 -4 L
39.247 -4.813 L
39.247 -7.813 L
39.247 -8.891 39.2 -9.289 QT
39.153 -9.688 39.028 -9.875 QT
38.872 -10.141 38.614 -10.281 QT
38.357 -10.422 38.013 -10.422 QT
37.185 -10.422 36.716 -9.789 QT
36.247 -9.156 36.247 -8.031 QT
36.247 -4 L
33.638 -4 L
33.638 -15.391 L
36.247 -15.391 L
36.247 -11 L
36.841 -11.719 37.513 -12.063 QT
38.185 -12.406 38.982 -12.406 QT
40.403 -12.406 41.138 -11.531 QT
41.872 -10.656 41.872 -9 QT
cp
42.994 -12.203 M
45.619 -12.203 L
47.822 -6.641 L
49.697 -12.203 L
52.306 -12.203 L
48.869 -3.219 L
48.337 -1.859 47.65 -1.313 QT
46.962 -0.766 45.822 -0.766 QT
44.306 -0.766 L
44.306 -2.484 L
45.134 -2.484 L
45.791 -2.484 46.095 -2.695 QT
46.4 -2.906 46.572 -3.453 QT
46.65 -3.688 L
42.994 -12.203 L
cp
f
GR
GS
[0.75 0 0 0.75 0 0.25] CT
0 0.447 0.741 RC
1 LJ
0.667 LW
N
128 483.5 M
128.001 483.5 L
128.005 483.5 L
128.028 483.5 L
128.143 483.5 L
128.664 483.5 L
129.606 483.5 L
130.803 483.5 L
132.136 483.5 L
133.641 483.5 L
135.546 483.5 L
137.734 483.5 L
140.788 483.5 L
144.884 483.5 L
149.978 483.5 L
154.924 483.5 L
160.393 483.5 L
167.423 483.5 L
177.466 483.5 L
189.809 483.5 L
202.376 483.5 L
204.2 483.5 L
204.2 483.5 L
205.076 483.271 L
205.953 482.659 L
207.074 481.451 L
208.347 479.642 L
209.742 477.258 L
211.557 473.681 L
213.593 469.186 L
215.955 463.49 L
218.758 456.25 L
223.033 444.58 L
229.493 426.455 L
237.965 403.567 L
248.883 377.919 L
258.7 359.672 L
266.435 348.597 L
274.171 340.184 L
282.276 333.84 L
290.343 329.606 L
298.626 326.949 L
306.531 325.637 L
313.903 325.212 L
321.208 325.309 L
328.998 325.778 L
337.292 326.521 L
345.471 327.377 L
353.036 328.222 L
360.233 329.018 L
367.728 329.786 L
371.84 330.235 L
371.84 330.235 L
371.84 330.235 L
374.327 325.511 L
376.814 315.739 L
380.447 298.945 L
384.926 277.862 L
391.246 249.528 L
400.007 214.095 L
407.43 187.94 L
414.854 165.328 L
423.149 144.037 L
431.717 126.072 L
432.8 124.118 L
432.8 99.118 L
432.8 99.118 L
435.417 98.173 L
438.033 100.686 L
441.841 105.292 L
446.561 110.136 L
453.504 115.128 L
463.759 119.806 L
469.852 121.815 L
475.946 123.829 L
478.52 124.702 L
478.52 124.702 L
478.52 124.702 L
483.301 126.445 L
488.082 128.265 L
494.332 130.848 L
501.977 134.372 L
511.849 139.445 L
524.921 146.728 L
532.372 150.887 L
539.823 154.951 L
548.702 159.603 L
557.765 164.058 L
565.413 167.373 L
571.917 169.848 L
578.72 172.261 L
586.963 174.901 L
596.269 177.536 L
604.732 179.592 L
611.604 180.864 L
618.006 181.923 L
625.469 183.059 L
634.491 184.272 L
643.651 185.385 L
651.231 186.042 L
657.614 186.428 L
664.37 186.859 L
672.691 187.363 L
682.127 187.924 L
688.903 188.137 L
695.679 188.355 L
703.912 188.631 L
713.24 188.971 L
721.732 189.26 L
728.605 189.289 L
734.985 189.332 L
742.424 189.442 L
751.447 189.608 L
760.637 189.846 L
768.237 189.897 L
774.61 189.836 L
781.341 189.856 L
789.644 189.926 L
799.096 190.076 L
805.88 190.038 L
812.664 190.036 L
820.899 190.08 L
830.221 190.196 L
838.704 190.311 L
845.577 190.218 L
851.964 190.162 L
859.409 190.168 L
868.433 190.226 L
877.613 190.369 L
885.208 190.352 L
890 190.213 L
S
GR
GS
[0.75 0 0 0.75 0 0.25] CT
0.851 0.325 0.098 RC
1 LJ
0.667 LW
N
128 483.5 M
128.001 483.5 L
128.005 483.5 L
128.028 483.5 L
128.143 483.5 L
128.664 483.5 L
129.606 483.5 L
130.803 483.5 L
132.136 483.5 L
133.641 483.5 L
135.546 483.5 L
137.734 483.5 L
140.788 483.5 L
144.884 483.5 L
149.978 483.5 L
154.924 483.5 L
160.393 483.5 L
167.423 483.5 L
177.466 483.5 L
189.809 483.5 L
202.376 483.5 L
204.2 483.5 L
204.2 483.5 L
205.076 483.541 L
205.953 483.613 L
207.074 483.657 L
208.347 483.563 L
209.742 483.223 L
211.557 482.371 L
213.593 480.873 L
215.955 478.481 L
218.758 474.876 L
223.033 468.172 L
229.493 456.404 L
237.965 440.21 L
248.883 421.229 L
258.7 407.686 L
266.435 399.659 L
274.171 393.859 L
282.276 389.882 L
290.343 387.671 L
298.626 386.807 L
306.531 386.932 L
313.903 387.606 L
321.208 388.621 L
328.998 389.921 L
337.292 391.397 L
345.471 392.823 L
353.036 394.029 L
360.233 395.056 L
367.728 396.005 L
371.84 396.42 L
371.84 396.42 L
371.84 396.42 L
374.327 400.497 L
376.814 408.032 L
380.447 419.822 L
384.926 432.932 L
391.246 448.121 L
400.007 464.237 L
407.43 474.83 L
414.854 483.632 L
423.149 492.104 L
431.717 499.86 L
432.8 500.741 L
432.8 500.741 L
432.8 500.741 L
435.417 498.934 L
438.033 492.926 L
441.841 481.746 L
446.561 466.82 L
453.504 444.894 L
463.759 414.818 L
469.852 399.113 L
475.946 385.107 L
478.52 379.738 L
478.52 354.738 L
478.52 354.738 L
483.301 345.587 L
488.082 337.597 L
494.332 328.796 L
501.977 320.327 L
511.849 312.589 L
524.921 306.616 L
532.372 304.86 L
539.823 303.935 L
548.702 303.576 L
557.765 303.737 L
565.413 304.257 L
571.917 304.9 L
578.72 305.572 L
586.963 306.373 L
596.269 307.206 L
604.732 307.912 L
611.604 308.604 L
618.006 309.185 L
625.469 309.754 L
634.491 310.338 L
643.651 310.795 L
651.231 311.25 L
657.614 311.687 L
664.37 312.049 L
672.691 312.419 L
682.127 312.734 L
688.903 313.064 L
695.679 313.344 L
703.912 313.619 L
713.24 313.843 L
721.732 314.014 L
728.605 314.301 L
734.985 314.53 L
742.424 314.719 L
751.447 314.886 L
760.637 314.962 L
768.237 315.128 L
774.61 315.344 L
781.341 315.485 L
789.644 315.601 L
799.096 315.649 L
805.88 315.799 L
812.664 315.908 L
820.899 315.987 L
830.221 316.004 L
838.704 315.999 L
845.577 316.151 L
851.964 316.261 L
859.409 316.319 L
868.433 316.338 L
877.613 316.275 L
885.208 316.336 L
890 316.486 L
S
GR
GS
[0.75 0 0 0.75 0 0.25] CT
1 GC
N
817 106 M
817 59 L
877 59 L
877 106 L
cp
f
GR
GS
[0.75 0 0 0.75 640.5 55.75] CT
/Helvetica 12 F
GS
[1 0 0 1 0 0] CT
0 0 moveto 
1 -1 scale
(u) t 
GR
GR
GS
[0.75 0 0 0.75 646.5 60.25] CT
/Helvetica 9.6 F
GS
[1 0 0 1 0 0] CT
0 0 moveto 
1 -1 scale
(r1) t 
GR
GR
GS
[0.75 0 0 0.75 0 0.25] CT
0 0.447 0.741 RC
1 LJ
0.667 LW
N
821 71.634 M
851 71.634 L
S
GR
GS
[0.75 0 0 0.75 640.5 71.5] CT
/Helvetica 12 F
GS
[1 0 0 1 0 0] CT
0 0 moveto 
1 -1 scale
(u) t 
GR
GR
GS
[0.75 0 0 0.75 646.5 76] CT
/Helvetica 9.6 F
GS
[1 0 0 1 0 0] CT
0 0 moveto 
1 -1 scale
(r2) t 
GR
GR
GS
[0.75 0 0 0.75 0 0.25] CT
0.851 0.325 0.098 RC
1 LJ
0.667 LW
N
821 93.366 M
851 93.366 L
S
GR
GS
[0.75 0 0 0.75 0 0.25] CT
0.149 GC
10.0 ML
0.667 LW
N
817 106 M
817 59 L
877 59 L
877 106 L
cp
S
GR
%%Trailer
%%Pages: 1
%%EOF
