%!PS-Adobe-3.0 EPSF-3.0
%%Creator: (MATLAB, The Mathworks, Inc. Version 9.1.0.441655 \(R2016b\). Operating System: Windows 7)
%%Title: C:/Users/June/Documents/GitKraken/rls-2017/sp6/figures/rs_ukol5.eps
%%CreationDate: 2018-03-04T21:35:01
%%Pages: (atend)
%%BoundingBox: 0 0 420 315
%%LanguageLevel: 3
%%EndComments
%%BeginProlog
%%BeginResource: procset (Apache XML Graphics Std ProcSet) 1.2 0
%%Version: 1.2 0
%%Copyright: (Copyright 2001-2003,2010 The Apache Software Foundation. License terms: http://www.apache.org/licenses/LICENSE-2.0)
/bd{bind def}bind def
/ld{load def}bd
/GR/grestore ld
/M/moveto ld
/LJ/setlinejoin ld
/C/curveto ld
/f/fill ld
/LW/setlinewidth ld
/GC/setgray ld
/t/show ld
/N/newpath ld
/CT/concat ld
/cp/closepath ld
/S/stroke ld
/L/lineto ld
/CC/setcmykcolor ld
/A/ashow ld
/GS/gsave ld
/RC/setrgbcolor ld
/RM/rmoveto ld
/ML/setmiterlimit ld
/re {4 2 roll M
1 index 0 rlineto
0 exch rlineto
neg 0 rlineto
cp } bd
/_ctm matrix def
/_tm matrix def
/BT { _ctm currentmatrix pop matrix _tm copy pop 0 0 moveto } bd
/ET { _ctm setmatrix } bd
/iTm { _ctm setmatrix _tm concat } bd
/Tm { _tm astore pop iTm 0 0 moveto } bd
/ux 0.0 def
/uy 0.0 def
/F {
  /Tp exch def
  /Tf exch def
  Tf findfont Tp scalefont setfont
  /cf Tf def  /cs Tp def
} bd
/ULS {currentpoint /uy exch def /ux exch def} bd
/ULE {
  /Tcx currentpoint pop def
  gsave
  newpath
  cf findfont cs scalefont dup
  /FontMatrix get 0 get /Ts exch def /FontInfo get dup
  /UnderlinePosition get Ts mul /To exch def
  /UnderlineThickness get Ts mul /Tt exch def
  ux uy To add moveto  Tcx uy To add lineto
  Tt setlinewidth stroke
  grestore
} bd
/OLE {
  /Tcx currentpoint pop def
  gsave
  newpath
  cf findfont cs scalefont dup
  /FontMatrix get 0 get /Ts exch def /FontInfo get dup
  /UnderlinePosition get Ts mul /To exch def
  /UnderlineThickness get Ts mul /Tt exch def
  ux uy To add cs add moveto Tcx uy To add cs add lineto
  Tt setlinewidth stroke
  grestore
} bd
/SOE {
  /Tcx currentpoint pop def
  gsave
  newpath
  cf findfont cs scalefont dup
  /FontMatrix get 0 get /Ts exch def /FontInfo get dup
  /UnderlinePosition get Ts mul /To exch def
  /UnderlineThickness get Ts mul /Tt exch def
  ux uy To add cs 10 mul 26 idiv add moveto Tcx uy To add cs 10 mul 26 idiv add lineto
  Tt setlinewidth stroke
  grestore
} bd
/QT {
/Y22 exch store
/X22 exch store
/Y21 exch store
/X21 exch store
currentpoint
/Y21 load 2 mul add 3 div exch
/X21 load 2 mul add 3 div exch
/X21 load 2 mul /X22 load add 3 div
/Y21 load 2 mul /Y22 load add 3 div
/X22 load /Y22 load curveto
} bd
/SSPD {
dup length /d exch dict def
{
/v exch def
/k exch def
currentpagedevice k known {
/cpdv currentpagedevice k get def
v cpdv ne {
/upd false def
/nullv v type /nulltype eq def
/nullcpdv cpdv type /nulltype eq def
nullv nullcpdv or
{
/upd true def
} {
/sametype v type cpdv type eq def
sametype {
v type /arraytype eq {
/vlen v length def
/cpdvlen cpdv length def
vlen cpdvlen eq {
0 1 vlen 1 sub {
/i exch def
/obj v i get def
/cpdobj cpdv i get def
obj cpdobj ne {
/upd true def
exit
} if
} for
} {
/upd true def
} ifelse
} {
v type /dicttype eq {
v {
/dv exch def
/dk exch def
/cpddv cpdv dk get def
dv cpddv ne {
/upd true def
exit
} if
} forall
} {
/upd true def
} ifelse
} ifelse
} if
} ifelse
upd true eq {
d k v put
} if
} if
} if
} forall
d length 0 gt {
d setpagedevice
} if
} bd
/RE { % /NewFontName [NewEncodingArray] /FontName RE -
  findfont dup length dict begin
  {
    1 index /FID ne
    {def} {pop pop} ifelse
  } forall
  /Encoding exch def
  /FontName 1 index def
  currentdict definefont pop
  end
} bind def
%%EndResource
%%BeginResource: procset (Apache XML Graphics EPS ProcSet) 1.0 0
%%Version: 1.0 0
%%Copyright: (Copyright 2002-2003 The Apache Software Foundation. License terms: http://www.apache.org/licenses/LICENSE-2.0)
/BeginEPSF { %def
/b4_Inc_state save def         % Save state for cleanup
/dict_count countdictstack def % Count objects on dict stack
/op_count count 1 sub def      % Count objects on operand stack
userdict begin                 % Push userdict on dict stack
/showpage { } def              % Redefine showpage, { } = null proc
0 setgray 0 setlinecap         % Prepare graphics state
1 setlinewidth 0 setlinejoin
10 setmiterlimit [ ] 0 setdash newpath
/languagelevel where           % If level not equal to 1 then
{pop languagelevel             % set strokeadjust and
1 ne                           % overprint to their defaults.
{false setstrokeadjust false setoverprint
} if
} if
} bd
/EndEPSF { %def
count op_count sub {pop} repeat            % Clean up stacks
countdictstack dict_count sub {end} repeat
b4_Inc_state restore
} bd
%%EndResource
%FOPBeginFontDict
%%IncludeResource: font Courier-Bold
%%IncludeResource: font Helvetica
%%IncludeResource: font Courier-BoldOblique
%%IncludeResource: font Courier-Oblique
%%IncludeResource: font Times-Roman
%%IncludeResource: font Helvetica-BoldOblique
%%IncludeResource: font Helvetica-Bold
%%IncludeResource: font Helvetica-Oblique
%%IncludeResource: font Times-BoldItalic
%%IncludeResource: font Courier
%%IncludeResource: font Times-Italic
%%IncludeResource: font Times-Bold
%%IncludeResource: font Symbol
%%IncludeResource: font ZapfDingbats
%FOPEndFontDict
%%BeginResource: encoding WinAnsiEncoding
/WinAnsiEncoding [
/.notdef /.notdef /.notdef /.notdef /.notdef
/.notdef /.notdef /.notdef /.notdef /.notdef
/.notdef /.notdef /.notdef /.notdef /.notdef
/.notdef /.notdef /.notdef /.notdef /.notdef
/.notdef /.notdef /.notdef /.notdef /.notdef
/.notdef /.notdef /.notdef /.notdef /.notdef
/.notdef /.notdef /space /exclam /quotedbl
/numbersign /dollar /percent /ampersand /quotesingle
/parenleft /parenright /asterisk /plus /comma
/hyphen /period /slash /zero /one
/two /three /four /five /six
/seven /eight /nine /colon /semicolon
/less /equal /greater /question /at
/A /B /C /D /E
/F /G /H /I /J
/K /L /M /N /O
/P /Q /R /S /T
/U /V /W /X /Y
/Z /bracketleft /backslash /bracketright /asciicircum
/underscore /quoteleft /a /b /c
/d /e /f /g /h
/i /j /k /l /m
/n /o /p /q /r
/s /t /u /v /w
/x /y /z /braceleft /bar
/braceright /asciitilde /bullet /Euro /bullet
/quotesinglbase /florin /quotedblbase /ellipsis /dagger
/daggerdbl /circumflex /perthousand /Scaron /guilsinglleft
/OE /bullet /Zcaron /bullet /bullet
/quoteleft /quoteright /quotedblleft /quotedblright /bullet
/endash /emdash /asciitilde /trademark /scaron
/guilsinglright /oe /bullet /zcaron /Ydieresis
/space /exclamdown /cent /sterling /currency
/yen /brokenbar /section /dieresis /copyright
/ordfeminine /guillemotleft /logicalnot /sfthyphen /registered
/macron /degree /plusminus /twosuperior /threesuperior
/acute /mu /paragraph /middot /cedilla
/onesuperior /ordmasculine /guillemotright /onequarter /onehalf
/threequarters /questiondown /Agrave /Aacute /Acircumflex
/Atilde /Adieresis /Aring /AE /Ccedilla
/Egrave /Eacute /Ecircumflex /Edieresis /Igrave
/Iacute /Icircumflex /Idieresis /Eth /Ntilde
/Ograve /Oacute /Ocircumflex /Otilde /Odieresis
/multiply /Oslash /Ugrave /Uacute /Ucircumflex
/Udieresis /Yacute /Thorn /germandbls /agrave
/aacute /acircumflex /atilde /adieresis /aring
/ae /ccedilla /egrave /eacute /ecircumflex
/edieresis /igrave /iacute /icircumflex /idieresis
/eth /ntilde /ograve /oacute /ocircumflex
/otilde /odieresis /divide /oslash /ugrave
/uacute /ucircumflex /udieresis /yacute /thorn
/ydieresis
] def
%%EndResource
%FOPBeginFontReencode
/Courier-Bold findfont
dup length dict begin
  {1 index /FID ne {def} {pop pop} ifelse} forall
  /Encoding WinAnsiEncoding def
  currentdict
end
/Courier-Bold exch definefont pop
/Helvetica findfont
dup length dict begin
  {1 index /FID ne {def} {pop pop} ifelse} forall
  /Encoding WinAnsiEncoding def
  currentdict
end
/Helvetica exch definefont pop
/Courier-BoldOblique findfont
dup length dict begin
  {1 index /FID ne {def} {pop pop} ifelse} forall
  /Encoding WinAnsiEncoding def
  currentdict
end
/Courier-BoldOblique exch definefont pop
/Courier-Oblique findfont
dup length dict begin
  {1 index /FID ne {def} {pop pop} ifelse} forall
  /Encoding WinAnsiEncoding def
  currentdict
end
/Courier-Oblique exch definefont pop
/Times-Roman findfont
dup length dict begin
  {1 index /FID ne {def} {pop pop} ifelse} forall
  /Encoding WinAnsiEncoding def
  currentdict
end
/Times-Roman exch definefont pop
/Helvetica-BoldOblique findfont
dup length dict begin
  {1 index /FID ne {def} {pop pop} ifelse} forall
  /Encoding WinAnsiEncoding def
  currentdict
end
/Helvetica-BoldOblique exch definefont pop
/Helvetica-Bold findfont
dup length dict begin
  {1 index /FID ne {def} {pop pop} ifelse} forall
  /Encoding WinAnsiEncoding def
  currentdict
end
/Helvetica-Bold exch definefont pop
/Helvetica-Oblique findfont
dup length dict begin
  {1 index /FID ne {def} {pop pop} ifelse} forall
  /Encoding WinAnsiEncoding def
  currentdict
end
/Helvetica-Oblique exch definefont pop
/Times-BoldItalic findfont
dup length dict begin
  {1 index /FID ne {def} {pop pop} ifelse} forall
  /Encoding WinAnsiEncoding def
  currentdict
end
/Times-BoldItalic exch definefont pop
/Courier findfont
dup length dict begin
  {1 index /FID ne {def} {pop pop} ifelse} forall
  /Encoding WinAnsiEncoding def
  currentdict
end
/Courier exch definefont pop
/Times-Italic findfont
dup length dict begin
  {1 index /FID ne {def} {pop pop} ifelse} forall
  /Encoding WinAnsiEncoding def
  currentdict
end
/Times-Italic exch definefont pop
/Times-Bold findfont
dup length dict begin
  {1 index /FID ne {def} {pop pop} ifelse} forall
  /Encoding WinAnsiEncoding def
  currentdict
end
/Times-Bold exch definefont pop
%FOPEndFontReencode
%%EndProlog
%%Page: 1 1
%%PageBoundingBox: 0 0 420 315
%%BeginPageSetup
[1 0 0 -1 0 315] CT
%%EndPageSetup
GS
[0.75 0 0 0.75 0 0] CT
1 GC
N
0 0 560 420 re
f
GR
GS
[0.75 0 0 0.75 0 0] CT
1 GC
N
0 0 560 420 re
f
GR
GS
[0.75 0 0 0.75 0 0] CT
1 GC
N
73 374 M
507 374 L
507 31 L
73 31 L
cp
f
GR
GS
[0.75 0 0 0.75 0 0] CT
0.873 GC
1 LJ
0.667 LW
N
73 374 M
73 31 L
S
GR
GS
[0.75 0 0 0.75 0 0] CT
0.873 GC
1 LJ
0.667 LW
N
116.4 374 M
116.4 31 L
S
GR
GS
[0.75 0 0 0.75 0 0] CT
0.873 GC
1 LJ
0.667 LW
N
159.8 374 M
159.8 31 L
S
GR
GS
[0.75 0 0 0.75 0 0] CT
0.873 GC
1 LJ
0.667 LW
N
203.2 374 M
203.2 31 L
S
GR
GS
[0.75 0 0 0.75 0 0] CT
0.873 GC
1 LJ
0.667 LW
N
246.6 374 M
246.6 31 L
S
GR
GS
[0.75 0 0 0.75 0 0] CT
0.873 GC
1 LJ
0.667 LW
N
290 374 M
290 31 L
S
GR
GS
[0.75 0 0 0.75 0 0] CT
0.873 GC
1 LJ
0.667 LW
N
333.4 374 M
333.4 31 L
S
GR
GS
[0.75 0 0 0.75 0 0] CT
0.873 GC
1 LJ
0.667 LW
N
376.8 374 M
376.8 31 L
S
GR
GS
[0.75 0 0 0.75 0 0] CT
0.873 GC
1 LJ
0.667 LW
N
420.2 374 M
420.2 31 L
S
GR
GS
[0.75 0 0 0.75 0 0] CT
0.873 GC
1 LJ
0.667 LW
N
463.6 374 M
463.6 31 L
S
GR
GS
[0.75 0 0 0.75 0 0] CT
0.873 GC
1 LJ
0.667 LW
N
507 374 M
507 31 L
S
GR
GS
[0.75 0 0 0.75 0 0] CT
0.873 GC
1 LJ
0.667 LW
N
507 374 M
73 374 L
S
GR
GS
[0.75 0 0 0.75 0 0] CT
0.873 GC
1 LJ
0.667 LW
N
507 325 M
73 325 L
S
GR
GS
[0.75 0 0 0.75 0 0] CT
0.873 GC
1 LJ
0.667 LW
N
507 276 M
73 276 L
S
GR
GS
[0.75 0 0 0.75 0 0] CT
0.873 GC
1 LJ
0.667 LW
N
507 227 M
73 227 L
S
GR
GS
[0.75 0 0 0.75 0 0] CT
0.873 GC
1 LJ
0.667 LW
N
507 178 M
73 178 L
S
GR
GS
[0.75 0 0 0.75 0 0] CT
0.873 GC
1 LJ
0.667 LW
N
507 129 M
73 129 L
S
GR
GS
[0.75 0 0 0.75 0 0] CT
0.873 GC
1 LJ
0.667 LW
N
507 80 M
73 80 L
S
GR
GS
[0.75 0 0 0.75 0 0] CT
0.873 GC
1 LJ
0.667 LW
N
507 31 M
73 31 L
S
GR
GS
[0.75 0 0 0.75 0 0] CT
0.149 GC
2 setlinecap
1 LJ
0.667 LW
N
73 374 M
507 374 L
S
GR
GS
[0.75 0 0 0.75 0 0] CT
0.149 GC
2 setlinecap
1 LJ
0.667 LW
N
73 31 M
507 31 L
S
GR
GS
[0.75 0 0 0.75 0 0] CT
0.149 GC
2 setlinecap
1 LJ
0.667 LW
N
73 374 M
73 369.66 L
S
GR
GS
[0.75 0 0 0.75 0 0] CT
0.149 GC
2 setlinecap
1 LJ
0.667 LW
N
116.4 374 M
116.4 369.66 L
S
GR
GS
[0.75 0 0 0.75 0 0] CT
0.149 GC
2 setlinecap
1 LJ
0.667 LW
N
159.8 374 M
159.8 369.66 L
S
GR
GS
[0.75 0 0 0.75 0 0] CT
0.149 GC
2 setlinecap
1 LJ
0.667 LW
N
203.2 374 M
203.2 369.66 L
S
GR
GS
[0.75 0 0 0.75 0 0] CT
0.149 GC
2 setlinecap
1 LJ
0.667 LW
N
246.6 374 M
246.6 369.66 L
S
GR
GS
[0.75 0 0 0.75 0 0] CT
0.149 GC
2 setlinecap
1 LJ
0.667 LW
N
290 374 M
290 369.66 L
S
GR
GS
[0.75 0 0 0.75 0 0] CT
0.149 GC
2 setlinecap
1 LJ
0.667 LW
N
333.4 374 M
333.4 369.66 L
S
GR
GS
[0.75 0 0 0.75 0 0] CT
0.149 GC
2 setlinecap
1 LJ
0.667 LW
N
376.8 374 M
376.8 369.66 L
S
GR
GS
[0.75 0 0 0.75 0 0] CT
0.149 GC
2 setlinecap
1 LJ
0.667 LW
N
420.2 374 M
420.2 369.66 L
S
GR
GS
[0.75 0 0 0.75 0 0] CT
0.149 GC
2 setlinecap
1 LJ
0.667 LW
N
463.6 374 M
463.6 369.66 L
S
GR
GS
[0.75 0 0 0.75 0 0] CT
0.149 GC
2 setlinecap
1 LJ
0.667 LW
N
507 374 M
507 369.66 L
S
GR
GS
[0.75 0 0 0.75 0 0] CT
0.149 GC
2 setlinecap
1 LJ
0.667 LW
N
73 31 M
73 35.34 L
S
GR
GS
[0.75 0 0 0.75 0 0] CT
0.149 GC
2 setlinecap
1 LJ
0.667 LW
N
116.4 31 M
116.4 35.34 L
S
GR
GS
[0.75 0 0 0.75 0 0] CT
0.149 GC
2 setlinecap
1 LJ
0.667 LW
N
159.8 31 M
159.8 35.34 L
S
GR
GS
[0.75 0 0 0.75 0 0] CT
0.149 GC
2 setlinecap
1 LJ
0.667 LW
N
203.2 31 M
203.2 35.34 L
S
GR
GS
[0.75 0 0 0.75 0 0] CT
0.149 GC
2 setlinecap
1 LJ
0.667 LW
N
246.6 31 M
246.6 35.34 L
S
GR
GS
[0.75 0 0 0.75 0 0] CT
0.149 GC
2 setlinecap
1 LJ
0.667 LW
N
290 31 M
290 35.34 L
S
GR
GS
[0.75 0 0 0.75 0 0] CT
0.149 GC
2 setlinecap
1 LJ
0.667 LW
N
333.4 31 M
333.4 35.34 L
S
GR
GS
[0.75 0 0 0.75 0 0] CT
0.149 GC
2 setlinecap
1 LJ
0.667 LW
N
376.8 31 M
376.8 35.34 L
S
GR
GS
[0.75 0 0 0.75 0 0] CT
0.149 GC
2 setlinecap
1 LJ
0.667 LW
N
420.2 31 M
420.2 35.34 L
S
GR
GS
[0.75 0 0 0.75 0 0] CT
0.149 GC
2 setlinecap
1 LJ
0.667 LW
N
463.6 31 M
463.6 35.34 L
S
GR
GS
[0.75 0 0 0.75 0 0] CT
0.149 GC
2 setlinecap
1 LJ
0.667 LW
N
507 31 M
507 35.34 L
S
GR
GS
[0.75 0 0 0.75 54.75 284.50001] CT
0.149 GC
/Helvetica 13.333 F
GS
[1 0 0 1 0 0] CT
-4 14 moveto 
1 -1 scale
(0) t 
GR
GR
GS
[0.75 0 0 0.75 87.3 284.50001] CT
0.149 GC
/Helvetica 13.333 F
GS
[1 0 0 1 0 0] CT
-11 14 moveto 
1 -1 scale
(200) t 
GR
GR
GS
[0.75 0 0 0.75 119.85 284.50001] CT
0.149 GC
/Helvetica 13.333 F
GS
[1 0 0 1 0 0] CT
-11 14 moveto 
1 -1 scale
(400) t 
GR
GR
GS
[0.75 0 0 0.75 152.4 284.50001] CT
0.149 GC
/Helvetica 13.333 F
GS
[1 0 0 1 0 0] CT
-11 14 moveto 
1 -1 scale
(600) t 
GR
GR
GS
[0.75 0 0 0.75 184.95 284.50001] CT
0.149 GC
/Helvetica 13.333 F
GS
[1 0 0 1 0 0] CT
-11 14 moveto 
1 -1 scale
(800) t 
GR
GR
GS
[0.75 0 0 0.75 217.5 284.50001] CT
0.149 GC
/Helvetica 13.333 F
GS
[1 0 0 1 0 0] CT
-14.5 14 moveto 
1 -1 scale
(1000) t 
GR
GR
GS
[0.75 0 0 0.75 250.05 284.50001] CT
0.149 GC
/Helvetica 13.333 F
GS
[1 0 0 1 0 0] CT
-14.5 14 moveto 
1 -1 scale
(1200) t 
GR
GR
GS
[0.75 0 0 0.75 282.59999 284.50001] CT
0.149 GC
/Helvetica 13.333 F
GS
[1 0 0 1 0 0] CT
-14.5 14 moveto 
1 -1 scale
(1400) t 
GR
GR
GS
[0.75 0 0 0.75 315.15001 284.50001] CT
0.149 GC
/Helvetica 13.333 F
GS
[1 0 0 1 0 0] CT
-14.5 14 moveto 
1 -1 scale
(1600) t 
GR
GR
GS
[0.75 0 0 0.75 347.7 284.50001] CT
0.149 GC
/Helvetica 13.333 F
GS
[1 0 0 1 0 0] CT
-14.5 14 moveto 
1 -1 scale
(1800) t 
GR
GR
GS
[0.75 0 0 0.75 380.25 284.50001] CT
0.149 GC
/Helvetica 13.333 F
GS
[1 0 0 1 0 0] CT
-14.5 14 moveto 
1 -1 scale
(2000) t 
GR
GR
GS
[0.75 0 0 0.75 0 0] CT
0.149 GC
2 setlinecap
1 LJ
0.667 LW
N
73 374 M
73 31 L
S
GR
GS
[0.75 0 0 0.75 0 0] CT
0.149 GC
2 setlinecap
1 LJ
0.667 LW
N
507 374 M
507 31 L
S
GR
GS
[0.75 0 0 0.75 0 0] CT
0.149 GC
2 setlinecap
1 LJ
0.667 LW
N
73 374 M
77.34 374 L
S
GR
GS
[0.75 0 0 0.75 0 0] CT
0.149 GC
2 setlinecap
1 LJ
0.667 LW
N
73 325 M
77.34 325 L
S
GR
GS
[0.75 0 0 0.75 0 0] CT
0.149 GC
2 setlinecap
1 LJ
0.667 LW
N
73 276 M
77.34 276 L
S
GR
GS
[0.75 0 0 0.75 0 0] CT
0.149 GC
2 setlinecap
1 LJ
0.667 LW
N
73 227 M
77.34 227 L
S
GR
GS
[0.75 0 0 0.75 0 0] CT
0.149 GC
2 setlinecap
1 LJ
0.667 LW
N
73 178 M
77.34 178 L
S
GR
GS
[0.75 0 0 0.75 0 0] CT
0.149 GC
2 setlinecap
1 LJ
0.667 LW
N
73 129 M
77.34 129 L
S
GR
GS
[0.75 0 0 0.75 0 0] CT
0.149 GC
2 setlinecap
1 LJ
0.667 LW
N
73 80 M
77.34 80 L
S
GR
GS
[0.75 0 0 0.75 0 0] CT
0.149 GC
2 setlinecap
1 LJ
0.667 LW
N
73 31 M
77.34 31 L
S
GR
GS
[0.75 0 0 0.75 0 0] CT
0.149 GC
2 setlinecap
1 LJ
0.667 LW
N
507 374 M
502.66 374 L
S
GR
GS
[0.75 0 0 0.75 0 0] CT
0.149 GC
2 setlinecap
1 LJ
0.667 LW
N
507 325 M
502.66 325 L
S
GR
GS
[0.75 0 0 0.75 0 0] CT
0.149 GC
2 setlinecap
1 LJ
0.667 LW
N
507 276 M
502.66 276 L
S
GR
GS
[0.75 0 0 0.75 0 0] CT
0.149 GC
2 setlinecap
1 LJ
0.667 LW
N
507 227 M
502.66 227 L
S
GR
GS
[0.75 0 0 0.75 0 0] CT
0.149 GC
2 setlinecap
1 LJ
0.667 LW
N
507 178 M
502.66 178 L
S
GR
GS
[0.75 0 0 0.75 0 0] CT
0.149 GC
2 setlinecap
1 LJ
0.667 LW
N
507 129 M
502.66 129 L
S
GR
GS
[0.75 0 0 0.75 0 0] CT
0.149 GC
2 setlinecap
1 LJ
0.667 LW
N
507 80 M
502.66 80 L
S
GR
GS
[0.75 0 0 0.75 0 0] CT
0.149 GC
2 setlinecap
1 LJ
0.667 LW
N
507 31 M
502.66 31 L
S
GR
GS
[0.75 0 0 0.75 50.75 280.5] CT
0.149 GC
/Helvetica 13.333 F
GS
[1 0 0 1 0 0] CT
-8 5.5 moveto 
1 -1 scale
(0) t 
GR
GR
GS
[0.75 0 0 0.75 50.75 243.75] CT
0.149 GC
/Helvetica 13.333 F
GS
[1 0 0 1 0 0] CT
-19 5.5 moveto 
1 -1 scale
(0.1) t 
GR
GR
GS
[0.75 0 0 0.75 50.75 207] CT
0.149 GC
/Helvetica 13.333 F
GS
[1 0 0 1 0 0] CT
-19 5.5 moveto 
1 -1 scale
(0.2) t 
GR
GR
GS
[0.75 0 0 0.75 50.75 170.25] CT
0.149 GC
/Helvetica 13.333 F
GS
[1 0 0 1 0 0] CT
-19 5.5 moveto 
1 -1 scale
(0.3) t 
GR
GR
GS
[0.75 0 0 0.75 50.75 133.5] CT
0.149 GC
/Helvetica 13.333 F
GS
[1 0 0 1 0 0] CT
-19 5.5 moveto 
1 -1 scale
(0.4) t 
GR
GR
GS
[0.75 0 0 0.75 50.75 96.75] CT
0.149 GC
/Helvetica 13.333 F
GS
[1 0 0 1 0 0] CT
-19 5.5 moveto 
1 -1 scale
(0.5) t 
GR
GR
GS
[0.75 0 0 0.75 50.75 59.99999] CT
0.149 GC
/Helvetica 13.333 F
GS
[1 0 0 1 0 0] CT
-19 5.5 moveto 
1 -1 scale
(0.6) t 
GR
GR
GS
[0.75 0 0 0.75 50.75 23.25] CT
0.149 GC
/Helvetica 13.333 F
GS
[1 0 0 1 0 0] CT
-19 5.5 moveto 
1 -1 scale
(0.7) t 
GR
GR
GS
[0.75 0 0 0.75 217.50021 21.1875] CT
/Helvetica-Bold 14.667 F
GS
[1 0 0 1 0 0] CT
-48.5 -4 moveto 
1 -1 scale
(Podminka RS) t 
GR
GR
GS
[0.75 0 0 0.75 0 0] CT
0 0.447 0.741 RC
1 LJ
0.667 LW
N
73.217 31.021 M
73.434 31.021 L
73.651 31.021 L
73.868 31.022 L
74.085 31.022 L
74.302 31.022 L
74.519 31.022 L
74.736 31.023 L
74.953 31.023 L
75.17 31.023 L
75.387 31.024 L
75.604 31.024 L
75.821 31.024 L
76.038 31.024 L
76.255 31.025 L
76.472 31.025 L
76.689 31.025 L
76.906 31.026 L
77.123 31.026 L
77.34 31.026 L
77.557 31.027 L
77.774 31.027 L
77.991 31.027 L
78.208 31.028 L
78.425 31.028 L
78.642 31.028 L
78.859 31.029 L
79.076 31.029 L
79.293 31.029 L
79.51 31.03 L
79.727 31.03 L
79.944 31.03 L
80.161 31.031 L
80.378 31.031 L
80.595 31.032 L
80.812 31.032 L
81.029 31.032 L
81.246 31.033 L
81.463 31.033 L
81.68 31.034 L
81.897 31.034 L
82.114 31.034 L
82.331 31.035 L
82.548 31.035 L
82.765 31.036 L
82.982 31.036 L
83.199 31.037 L
83.416 31.037 L
83.633 31.038 L
83.85 31.038 L
84.067 31.039 L
84.284 31.039 L
84.501 31.04 L
84.718 31.04 L
84.935 31.041 L
85.152 31.041 L
85.369 31.042 L
85.586 31.042 L
85.803 31.043 L
86.02 31.043 L
86.237 31.044 L
86.454 31.044 L
86.671 31.045 L
86.888 31.046 L
87.105 31.046 L
87.322 31.047 L
87.539 31.047 L
87.756 31.048 L
87.973 31.049 L
88.19 31.049 L
88.407 31.05 L
88.624 31.05 L
88.841 31.051 L
89.058 31.052 L
89.275 31.052 L
89.492 31.053 L
89.709 31.054 L
89.926 31.055 L
90.143 31.055 L
90.36 31.056 L
90.577 31.057 L
90.794 31.057 L
91.011 31.058 L
91.228 31.059 L
91.445 31.06 L
91.662 31.061 L
91.879 31.061 L
92.096 31.062 L
92.313 31.063 L
92.53 31.064 L
92.747 31.065 L
92.964 31.065 L
93.181 31.066 L
93.398 31.067 L
93.615 31.068 L
93.832 31.069 L
94.049 31.07 L
94.266 31.071 L
94.483 31.072 L
94.7 31.073 L
94.917 31.074 L
95.134 31.075 L
95.351 31.076 L
95.568 31.077 L
95.785 31.078 L
96.002 31.079 L
96.219 31.08 L
96.436 31.081 L
96.653 31.082 L
96.87 31.083 L
97.087 31.084 L
97.304 31.085 L
97.521 31.086 L
97.738 31.087 L
97.955 31.089 L
98.172 31.09 L
98.389 31.091 L
98.606 31.092 L
98.823 31.093 L
99.04 31.095 L
99.257 31.096 L
99.474 31.097 L
99.691 31.099 L
99.908 31.1 L
100.125 31.101 L
100.342 31.103 L
100.559 31.104 L
100.776 31.105 L
100.993 31.107 L
101.21 31.108 L
101.427 31.11 L
101.644 31.111 L
101.861 31.113 L
102.078 31.114 L
102.295 31.116 L
102.512 31.117 L
102.729 31.119 L
102.946 31.12 L
103.163 31.122 L
103.38 31.124 L
103.597 31.125 L
103.814 31.127 L
104.031 31.129 L
104.248 31.13 L
104.465 31.132 L
104.682 31.134 L
104.899 31.136 L
105.116 31.137 L
105.333 31.139 L
105.55 31.141 L
105.767 31.143 L
105.984 31.145 L
106.201 31.147 L
106.418 31.149 L
106.635 31.151 L
106.852 31.153 L
107.069 31.155 L
107.286 31.157 L
107.503 31.159 L
107.72 31.161 L
107.937 31.163 L
108.154 31.166 L
108.371 31.168 L
108.588 31.17 L
108.805 31.172 L
109.022 31.175 L
109.239 31.177 L
109.456 31.179 L
109.673 31.182 L
109.89 31.184 L
110.107 31.187 L
110.324 31.189 L
110.541 31.192 L
110.758 31.194 L
110.975 31.197 L
111.192 31.2 L
111.409 31.202 L
111.626 31.205 L
111.843 31.208 L
112.06 31.211 L
112.277 31.214 L
112.494 31.216 L
112.711 31.219 L
112.928 31.222 L
113.145 31.225 L
113.362 31.228 L
113.579 31.231 L
113.796 31.234 L
114.013 31.238 L
114.23 31.241 L
114.447 31.244 L
114.664 31.247 L
114.881 31.251 L
115.098 31.254 L
115.315 31.257 L
115.532 31.261 L
115.749 31.264 L
115.966 31.268 L
116.183 31.272 L
116.4 31.275 L
116.617 31.279 L
116.834 31.283 L
117.051 31.286 L
117.268 31.29 L
117.485 31.294 L
117.702 31.298 L
117.919 31.302 L
118.136 31.306 L
118.353 31.31 L
118.57 31.314 L
118.787 31.319 L
119.004 31.323 L
119.221 31.327 L
119.438 31.332 L
119.655 31.336 L
119.872 31.34 L
120.089 31.345 L
120.306 31.35 L
120.523 31.354 L
120.74 31.359 L
120.957 31.364 L
121.174 31.369 L
121.391 31.374 L
121.608 31.379 L
121.825 31.384 L
122.042 31.389 L
122.259 31.394 L
122.476 31.399 L
122.693 31.404 L
122.91 31.41 L
123.127 31.415 L
123.344 31.421 L
123.561 31.426 L
123.778 31.432 L
123.995 31.438 L
124.212 31.444 L
124.429 31.45 L
124.646 31.456 L
124.863 31.462 L
125.08 31.468 L
125.297 31.474 L
125.514 31.48 L
125.731 31.487 L
125.948 31.493 L
126.165 31.5 L
126.382 31.506 L
126.599 31.513 L
126.816 31.52 L
127.033 31.526 L
127.25 31.533 L
127.467 31.54 L
127.684 31.548 L
127.901 31.555 L
128.118 31.562 L
128.335 31.569 L
128.552 31.577 L
128.769 31.585 L
128.986 31.592 L
129.203 31.6 L
129.42 31.608 L
129.637 31.616 L
129.854 31.624 L
130.071 31.632 L
130.288 31.64 L
130.505 31.649 L
130.722 31.657 L
130.939 31.666 L
131.156 31.675 L
131.373 31.683 L
131.59 31.692 L
131.807 31.701 L
132.024 31.711 L
132.241 31.72 L
132.458 31.729 L
132.675 31.739 L
132.892 31.748 L
133.109 31.758 L
133.326 31.768 L
133.543 31.778 L
133.76 31.788 L
133.977 31.798 L
134.194 31.809 L
134.411 31.819 L
134.628 31.83 L
134.845 31.84 L
135.062 31.851 L
135.279 31.862 L
135.496 31.873 L
135.713 31.885 L
135.93 31.896 L
136.147 31.908 L
136.364 31.919 L
136.581 31.931 L
136.798 31.943 L
137.015 31.955 L
137.232 31.967 L
137.449 31.98 L
137.666 31.992 L
137.883 32.005 L
138.1 32.018 L
138.317 32.031 L
138.534 32.044 L
138.751 32.057 L
138.968 32.071 L
139.185 32.084 L
139.402 32.098 L
139.619 32.112 L
139.836 32.126 L
140.053 32.14 L
140.27 32.155 L
140.487 32.17 L
140.704 32.184 L
140.921 32.199 L
141.138 32.214 L
141.355 32.23 L
141.572 32.245 L
141.789 32.261 L
142.006 32.277 L
142.223 32.293 L
142.44 32.309 L
142.657 32.326 L
142.874 32.342 L
143.091 32.359 L
143.308 32.376 L
143.525 32.393 L
143.742 32.411 L
143.959 32.428 L
144.176 32.446 L
144.393 32.464 L
144.61 32.482 L
144.827 32.501 L
145.044 32.519 L
145.261 32.538 L
145.478 32.557 L
145.695 32.577 L
145.912 32.596 L
146.129 32.616 L
146.346 32.636 L
146.563 32.656 L
146.78 32.676 L
146.997 32.697 L
147.214 32.718 L
147.431 32.739 L
147.648 32.76 L
147.865 32.782 L
148.082 32.804 L
148.299 32.826 L
148.516 32.848 L
148.733 32.871 L
148.95 32.894 L
149.167 32.917 L
149.384 32.94 L
149.601 32.964 L
149.818 32.988 L
150.035 33.012 L
150.252 33.036 L
150.469 33.061 L
150.686 33.086 L
150.903 33.111 L
151.12 33.137 L
151.337 33.162 L
151.554 33.188 L
151.771 33.215 L
151.988 33.241 L
152.205 33.268 L
152.422 33.296 L
152.639 33.323 L
152.856 33.351 L
153.073 33.379 L
153.29 33.408 L
153.507 33.437 L
153.724 33.466 L
153.941 33.495 L
154.158 33.525 L
154.375 33.555 L
154.592 33.586 L
154.809 33.616 L
155.026 33.647 L
155.243 33.679 L
155.46 33.711 L
155.677 33.743 L
155.894 33.775 L
156.111 33.808 L
156.328 33.841 L
156.545 33.875 L
156.762 33.909 L
156.979 33.943 L
157.196 33.978 L
157.413 34.013 L
157.63 34.049 L
157.847 34.085 L
158.064 34.121 L
158.281 34.157 L
158.498 34.195 L
158.715 34.232 L
158.932 34.27 L
159.149 34.308 L
159.366 34.347 L
159.583 34.386 L
159.8 34.426 L
160.017 34.466 L
160.234 34.506 L
160.451 34.547 L
160.668 34.589 L
160.885 34.63 L
161.102 34.673 L
161.319 34.716 L
161.536 34.759 L
161.753 34.803 L
161.97 34.847 L
162.187 34.891 L
162.404 34.937 L
162.621 34.982 L
162.838 35.029 L
163.055 35.075 L
163.272 35.123 L
163.489 35.17 L
163.706 35.219 L
163.923 35.268 L
164.14 35.317 L
164.357 35.367 L
164.574 35.417 L
164.791 35.469 L
165.008 35.52 L
165.225 35.572 L
165.442 35.625 L
165.659 35.679 L
165.876 35.733 L
166.093 35.787 L
166.31 35.843 L
166.527 35.899 L
166.744 35.955 L
166.961 36.012 L
167.178 36.07 L
167.395 36.129 L
167.612 36.188 L
167.829 36.248 L
168.046 36.308 L
168.263 36.369 L
168.48 36.431 L
168.697 36.494 L
168.914 36.557 L
169.131 36.621 L
169.348 36.686 L
169.565 36.751 L
169.782 36.818 L
169.999 36.885 L
170.216 36.953 L
170.433 37.021 L
170.65 37.091 L
170.867 37.161 L
171.084 37.232 L
171.301 37.304 L
171.518 37.376 L
171.735 37.45 L
171.952 37.524 L
172.169 37.6 L
172.386 37.676 L
172.603 37.753 L
172.82 37.831 L
173.037 37.91 L
173.254 37.989 L
173.471 38.07 L
173.688 38.152 L
173.905 38.234 L
174.122 38.318 L
174.339 38.402 L
174.556 38.488 L
174.773 38.575 L
174.99 38.662 L
175.207 38.751 L
175.424 38.841 L
175.641 38.931 L
175.858 39.023 L
176.075 39.116 L
176.292 39.21 L
176.509 39.305 L
176.726 39.402 L
176.943 39.499 L
177.16 39.598 L
177.377 39.698 L
177.594 39.799 L
177.811 39.901 L
178.028 40.004 L
178.245 40.109 L
178.462 40.215 L
178.679 40.322 L
178.896 40.43 L
179.113 40.54 L
179.33 40.651 L
179.547 40.764 L
179.764 40.877 L
179.981 40.992 L
180.198 41.109 L
180.415 41.227 L
180.632 41.346 L
180.849 41.467 L
181.066 41.589 L
181.283 41.713 L
181.5 41.838 L
181.717 41.964 L
181.934 42.093 L
182.151 42.222 L
182.368 42.354 L
182.585 42.486 L
182.802 42.621 L
183.019 42.757 L
183.236 42.895 L
183.453 43.034 L
183.67 43.175 L
183.887 43.318 L
184.104 43.462 L
184.321 43.608 L
184.538 43.756 L
184.755 43.906 L
184.972 44.057 L
185.189 44.21 L
185.406 44.365 L
185.623 44.522 L
185.84 44.681 L
186.057 44.842 L
186.274 45.004 L
186.491 45.169 L
186.708 45.335 L
186.925 45.504 L
187.142 45.674 L
187.359 45.847 L
187.576 46.021 L
187.793 46.198 L
188.01 46.376 L
188.227 46.557 L
188.444 46.74 L
188.661 46.925 L
188.878 47.112 L
189.095 47.301 L
189.312 47.493 L
189.529 47.686 L
189.746 47.882 L
189.963 48.081 L
190.18 48.281 L
190.397 48.484 L
190.614 48.689 L
190.831 48.897 L
191.048 49.107 L
191.265 49.319 L
191.482 49.534 L
191.699 49.752 L
191.916 49.971 L
192.133 50.193 L
192.35 50.418 L
192.567 50.646 L
192.784 50.875 L
193.001 51.108 L
193.218 51.343 L
193.435 51.58 L
193.652 51.821 L
193.869 52.064 L
194.086 52.309 L
194.303 52.558 L
194.52 52.809 L
194.737 53.063 L
194.954 53.319 L
195.171 53.579 L
195.388 53.841 L
195.605 54.106 L
195.822 54.374 L
196.039 54.644 L
196.256 54.918 L
196.473 55.195 L
196.69 55.474 L
196.907 55.756 L
197.124 56.042 L
197.341 56.33 L
197.558 56.622 L
197.775 56.916 L
197.992 57.213 L
198.209 57.514 L
198.426 57.818 L
198.643 58.124 L
198.86 58.434 L
199.077 58.747 L
199.294 59.063 L
199.511 59.382 L
199.728 59.705 L
199.945 60.03 L
200.162 60.359 L
200.379 60.691 L
200.596 61.026 L
200.813 61.365 L
201.03 61.706 L
201.247 62.051 L
201.464 62.4 L
201.681 62.751 L
201.898 63.106 L
202.115 63.464 L
202.332 63.826 L
202.549 64.191 L
202.766 64.559 L
202.983 64.931 L
203.2 65.306 L
203.417 65.684 L
203.634 66.066 L
203.851 66.451 L
204.068 66.84 L
204.285 67.232 L
204.502 67.627 L
204.719 68.026 L
204.936 68.428 L
205.153 68.834 L
205.37 69.243 L
205.587 69.656 L
205.804 70.072 L
206.021 70.492 L
206.238 70.915 L
206.455 71.341 L
206.672 71.772 L
206.889 72.205 L
207.106 72.642 L
207.323 73.083 L
207.54 73.527 L
207.757 73.974 L
207.974 74.425 L
208.191 74.88 L
208.408 75.338 L
208.625 75.799 L
208.842 76.264 L
209.059 76.733 L
209.276 77.205 L
209.493 77.68 L
209.71 78.159 L
209.927 78.642 L
210.144 79.128 L
210.361 79.618 L
210.578 80.111 L
210.795 80.607 L
211.012 81.107 L
211.229 81.611 L
211.446 82.118 L
211.663 82.629 L
211.88 83.143 L
212.097 83.66 L
212.314 84.182 L
212.531 84.706 L
212.748 85.234 L
212.965 85.766 L
213.182 86.301 L
213.399 86.84 L
213.616 87.382 L
213.833 87.928 L
214.05 88.477 L
214.267 89.029 L
214.484 89.585 L
214.701 90.145 L
214.918 90.708 L
215.135 91.274 L
215.352 91.844 L
215.569 92.418 L
215.786 92.995 L
216.003 93.575 L
216.22 94.159 L
216.437 94.747 L
216.654 95.337 L
216.871 95.932 L
217.088 96.53 L
217.305 97.131 L
217.522 97.736 L
217.739 98.344 L
217.956 98.955 L
218.173 99.571 L
218.39 100.189 L
218.607 100.811 L
218.824 101.437 L
219.041 102.066 L
219.258 102.698 L
219.475 103.334 L
219.692 103.973 L
219.909 104.616 L
220.126 105.262 L
220.343 105.912 L
220.56 106.565 L
220.777 107.221 L
220.994 107.881 L
221.211 108.544 L
221.428 109.211 L
221.645 109.881 L
221.862 110.555 L
222.079 111.232 L
222.296 111.912 L
222.513 112.596 L
222.73 113.283 L
222.947 113.974 L
223.164 114.668 L
223.381 115.366 L
223.598 116.066 L
223.815 116.771 L
224.032 117.478 L
224.249 118.189 L
224.466 118.904 L
224.683 119.621 L
224.9 120.342 L
225.117 121.067 L
225.334 121.794 L
225.551 122.525 L
225.768 123.26 L
225.985 123.997 L
226.202 124.738 L
226.419 125.482 L
226.636 126.23 L
226.853 126.98 L
227.07 127.734 L
227.287 128.492 L
227.504 129.252 L
227.721 130.016 L
227.938 130.782 L
228.155 131.552 L
228.372 132.326 L
228.589 133.102 L
228.806 133.881 L
229.023 134.664 L
229.24 135.45 L
229.457 136.238 L
229.674 137.03 L
229.891 137.825 L
230.108 138.623 L
230.325 139.424 L
230.542 140.227 L
230.759 141.034 L
230.976 141.844 L
231.193 142.657 L
231.41 143.472 L
231.627 144.291 L
231.844 145.112 L
232.061 145.936 L
232.278 146.763 L
232.495 147.592 L
232.712 148.425 L
232.929 149.26 L
233.146 150.097 L
233.363 150.938 L
233.58 151.78 L
233.797 152.626 L
234.014 153.474 L
234.231 154.325 L
234.448 155.178 L
234.665 156.033 L
234.882 156.891 L
235.099 157.751 L
235.316 158.614 L
235.533 159.479 L
235.75 160.346 L
235.967 161.215 L
236.184 162.087 L
236.401 162.961 L
236.618 163.836 L
236.835 164.714 L
237.052 165.594 L
237.269 166.476 L
237.486 167.36 L
237.703 168.246 L
237.92 169.133 L
238.137 170.022 L
238.354 170.914 L
238.571 171.806 L
238.788 172.701 L
239.005 173.597 L
239.222 174.495 L
239.439 175.394 L
239.656 176.295 L
239.873 177.197 L
240.09 178.1 L
240.307 179.005 L
240.524 179.911 L
240.741 180.818 L
240.958 181.727 L
241.175 182.636 L
241.392 183.547 L
241.609 184.459 L
241.826 185.371 L
242.043 186.285 L
242.26 187.199 L
242.477 188.114 L
242.694 189.03 L
242.911 189.947 L
243.128 190.864 L
243.345 191.782 L
243.562 192.7 L
243.779 193.619 L
243.996 194.538 L
244.213 195.457 L
244.43 196.377 L
244.647 197.297 L
244.864 198.217 L
245.081 199.138 L
245.298 200.058 L
245.515 200.978 L
245.732 201.899 L
245.949 202.819 L
246.166 203.739 L
246.383 204.659 L
246.6 205.578 L
246.817 206.497 L
247.034 207.416 L
247.251 208.334 L
247.468 209.252 L
247.685 210.169 L
247.902 211.085 L
248.119 212.001 L
248.336 212.916 L
248.553 213.83 L
248.77 214.743 L
248.987 215.655 L
249.204 216.567 L
249.421 217.477 L
249.638 218.386 L
249.855 219.294 L
250.072 220.2 L
250.289 221.106 L
250.506 222.01 L
250.723 222.912 L
250.94 223.813 L
251.157 224.713 L
251.374 225.611 L
251.591 226.507 L
251.808 227.402 L
252.025 228.295 L
252.242 229.186 L
252.459 230.075 L
252.676 230.962 L
252.893 231.848 L
253.11 232.731 L
253.327 233.612 L
253.544 234.491 L
253.761 235.368 L
253.978 236.243 L
254.195 237.115 L
254.412 237.985 L
254.629 238.852 L
254.846 239.718 L
255.063 240.58 L
255.28 241.44 L
255.497 242.298 L
255.714 243.153 L
255.931 244.005 L
256.148 244.854 L
256.365 245.701 L
256.582 246.544 L
256.799 247.385 L
257.016 248.223 L
257.233 249.058 L
257.45 249.89 L
257.667 250.719 L
257.884 251.545 L
258.101 252.367 L
258.318 253.187 L
258.535 254.003 L
258.752 254.816 L
258.969 255.625 L
259.186 256.431 L
259.403 257.234 L
259.62 258.034 L
259.837 258.83 L
260.054 259.622 L
260.271 260.411 L
260.488 261.196 L
260.705 261.978 L
260.922 262.756 L
261.139 263.53 L
261.356 264.3 L
261.573 265.067 L
261.79 265.83 L
262.007 266.589 L
262.224 267.345 L
262.441 268.096 L
262.658 268.844 L
262.875 269.587 L
263.092 270.327 L
263.309 271.063 L
263.526 271.794 L
263.743 272.522 L
263.96 273.245 L
264.177 273.965 L
264.394 274.68 L
264.611 275.391 L
264.828 276.098 L
265.045 276.801 L
265.262 277.5 L
265.479 278.194 L
265.696 278.884 L
265.913 279.57 L
266.13 280.251 L
266.347 280.928 L
266.564 281.601 L
266.781 282.27 L
266.998 282.934 L
267.215 283.594 L
267.432 284.249 L
267.649 284.9 L
267.866 285.547 L
268.083 286.189 L
268.3 286.827 L
268.517 287.46 L
268.734 288.089 L
268.951 288.713 L
269.168 289.333 L
269.385 289.949 L
269.602 290.56 L
269.819 291.166 L
270.036 291.768 L
270.253 292.365 L
270.47 292.958 L
270.687 293.547 L
270.904 294.131 L
271.121 294.71 L
271.338 295.285 L
271.555 295.855 L
271.772 296.421 L
271.989 296.982 L
272.206 297.539 L
272.423 298.091 L
272.64 298.639 L
272.857 299.182 L
273.074 299.721 L
273.291 300.256 L
273.508 300.785 L
273.725 301.311 L
273.942 301.832 L
274.159 302.348 L
274.376 302.86 L
274.593 303.368 L
274.81 303.871 L
275.027 304.37 L
275.244 304.864 L
275.461 305.355 L
275.678 305.84 L
275.895 306.322 L
276.112 306.799 L
276.329 307.272 L
276.546 307.741 L
276.763 308.205 L
276.98 308.665 L
277.197 309.121 L
277.414 309.573 L
277.631 310.021 L
277.848 310.465 L
278.065 310.905 L
278.282 311.34 L
278.499 311.772 L
278.716 312.2 L
278.933 312.623 L
279.15 313.043 L
279.367 313.459 L
279.584 313.872 L
279.801 314.28 L
280.018 314.685 L
280.235 315.086 L
280.452 315.483 L
280.669 315.877 L
280.886 316.267 L
281.103 316.654 L
281.32 317.037 L
281.537 317.417 L
281.754 317.793 L
281.971 318.166 L
282.188 318.536 L
282.405 318.902 L
282.622 319.265 L
282.839 319.625 L
283.056 319.982 L
283.273 320.336 L
283.49 320.687 L
283.707 321.035 L
283.924 321.38 L
284.141 321.722 L
284.358 322.061 L
284.575 322.398 L
284.792 322.731 L
285.009 323.062 L
285.226 323.391 L
285.443 323.716 L
285.66 324.04 L
285.877 324.36 L
286.094 324.678 L
286.311 324.994 L
286.528 325.307 L
286.745 325.618 L
286.962 325.927 L
287.179 326.233 L
287.396 326.538 L
287.613 326.84 L
287.83 327.139 L
288.047 327.437 L
288.264 327.733 L
288.481 328.027 L
288.698 328.318 L
288.915 328.608 L
289.132 328.896 L
289.349 329.181 L
289.566 329.465 L
289.783 329.748 L
290 330.028 L
290.217 330.306 L
290.434 330.583 L
290.651 330.858 L
290.868 331.132 L
291.085 331.404 L
291.302 331.674 L
291.519 331.942 L
291.736 332.209 L
291.953 332.475 L
292.17 332.738 L
292.387 333.001 L
292.604 333.262 L
292.821 333.521 L
293.038 333.779 L
293.255 334.035 L
293.472 334.29 L
293.689 334.544 L
293.906 334.796 L
294.123 335.047 L
294.34 335.297 L
294.557 335.545 L
294.774 335.792 L
294.991 336.037 L
295.208 336.282 L
295.425 336.525 L
295.642 336.766 L
295.859 337.007 L
296.076 337.246 L
296.293 337.484 L
296.51 337.721 L
296.727 337.957 L
296.944 338.191 L
297.161 338.424 L
297.378 338.656 L
297.595 338.887 L
297.812 339.117 L
298.029 339.345 L
298.246 339.573 L
298.463 339.799 L
298.68 340.024 L
298.897 340.248 L
299.114 340.471 L
299.331 340.693 L
299.548 340.913 L
299.765 341.133 L
299.982 341.351 L
300.199 341.569 L
300.416 341.785 L
300.633 342 L
300.85 342.214 L
301.067 342.427 L
301.284 342.639 L
301.501 342.849 L
301.718 343.059 L
301.935 343.268 L
302.152 343.475 L
302.369 343.682 L
302.586 343.887 L
302.803 344.092 L
303.02 344.295 L
303.237 344.497 L
303.454 344.698 L
303.671 344.899 L
303.888 345.098 L
304.105 345.296 L
304.322 345.493 L
304.539 345.689 L
304.756 345.884 L
304.973 346.078 L
305.19 346.27 L
305.407 346.462 L
305.624 346.653 L
305.841 346.843 L
306.058 347.031 L
306.275 347.219 L
306.492 347.406 L
306.709 347.591 L
306.926 347.776 L
307.143 347.959 L
307.36 348.142 L
307.577 348.323 L
307.794 348.504 L
308.011 348.683 L
308.228 348.862 L
308.445 349.039 L
308.662 349.216 L
308.879 349.391 L
309.096 349.565 L
309.313 349.739 L
309.53 349.911 L
309.747 350.082 L
309.964 350.253 L
310.181 350.422 L
310.398 350.59 L
310.615 350.758 L
310.832 350.924 L
311.049 351.089 L
311.266 351.254 L
311.483 351.417 L
311.7 351.579 L
311.917 351.741 L
312.134 351.901 L
312.351 352.06 L
312.568 352.219 L
312.785 352.376 L
313.002 352.532 L
313.219 352.688 L
313.436 352.842 L
313.653 352.996 L
313.87 353.148 L
314.087 353.3 L
314.304 353.45 L
314.521 353.6 L
314.738 353.749 L
314.955 353.896 L
315.172 354.043 L
315.389 354.189 L
315.606 354.334 L
315.823 354.478 L
316.04 354.621 L
316.257 354.763 L
316.474 354.904 L
316.691 355.044 L
316.908 355.183 L
317.125 355.321 L
317.342 355.459 L
317.559 355.595 L
317.776 355.731 L
317.993 355.865 L
318.21 355.999 L
318.427 356.132 L
318.644 356.264 L
318.861 356.395 L
319.078 356.525 L
319.295 356.654 L
319.512 356.782 L
319.729 356.91 L
319.946 357.036 L
320.163 357.162 L
320.38 357.287 L
320.597 357.411 L
320.814 357.534 L
321.031 357.656 L
321.248 357.778 L
321.465 357.898 L
321.682 358.018 L
321.899 358.137 L
322.116 358.255 L
322.333 358.372 L
322.55 358.488 L
322.767 358.604 L
322.984 358.718 L
323.201 358.832 L
323.418 358.945 L
323.635 359.058 L
323.852 359.169 L
324.069 359.28 L
324.286 359.39 L
324.503 359.499 L
324.72 359.607 L
324.937 359.714 L
325.154 359.821 L
325.371 359.927 L
325.588 360.032 L
325.805 360.137 L
326.022 360.24 L
326.239 360.343 L
326.456 360.445 L
326.673 360.547 L
326.89 360.648 L
327.107 360.747 L
327.324 360.847 L
327.541 360.945 L
327.758 361.043 L
327.975 361.14 L
328.192 361.236 L
328.409 361.332 L
328.626 361.427 L
328.843 361.521 L
329.06 361.614 L
329.277 361.707 L
329.494 361.799 L
329.711 361.891 L
329.928 361.982 L
330.145 362.072 L
330.362 362.161 L
330.579 362.25 L
330.796 362.338 L
331.013 362.426 L
331.23 362.512 L
331.447 362.598 L
331.664 362.684 L
331.881 362.769 L
332.098 362.853 L
332.315 362.937 L
332.532 363.02 L
332.749 363.102 L
332.966 363.184 L
333.183 363.265 L
333.4 363.345 L
333.617 363.425 L
333.834 363.505 L
334.051 363.583 L
334.268 363.662 L
334.485 363.739 L
334.702 363.816 L
334.919 363.893 L
335.136 363.968 L
335.353 364.044 L
335.57 364.118 L
335.787 364.192 L
336.004 364.266 L
336.221 364.339 L
336.438 364.412 L
336.655 364.484 L
336.872 364.555 L
337.089 364.626 L
337.306 364.696 L
337.523 364.766 L
337.74 364.835 L
337.957 364.904 L
338.174 364.972 L
338.391 365.04 L
338.608 365.107 L
338.825 365.174 L
339.042 365.24 L
339.259 365.306 L
339.476 365.371 L
339.693 365.436 L
339.91 365.5 L
340.127 365.564 L
340.344 365.627 L
340.561 365.69 L
340.778 365.752 L
340.995 365.814 L
341.212 365.876 L
341.429 365.936 L
341.646 365.997 L
341.863 366.057 L
342.08 366.117 L
342.297 366.176 L
342.514 366.234 L
342.731 366.293 L
342.948 366.351 L
343.165 366.408 L
343.382 366.465 L
343.599 366.521 L
343.816 366.578 L
344.033 366.633 L
344.25 366.689 L
344.467 366.743 L
344.684 366.798 L
344.901 366.852 L
345.118 366.906 L
345.335 366.959 L
345.552 367.012 L
345.769 367.064 L
345.986 367.116 L
346.203 367.168 L
346.42 367.219 L
346.637 367.27 L
346.854 367.321 L
347.071 367.371 L
347.288 367.421 L
347.505 367.47 L
347.722 367.519 L
347.939 367.568 L
348.156 367.616 L
348.373 367.664 L
348.59 367.712 L
348.807 367.759 L
349.024 367.806 L
349.241 367.853 L
349.458 367.899 L
349.675 367.945 L
349.892 367.991 L
350.109 368.036 L
350.326 368.081 L
350.543 368.125 L
350.76 368.169 L
350.977 368.213 L
351.194 368.257 L
351.411 368.3 L
351.628 368.343 L
351.845 368.386 L
352.062 368.428 L
352.279 368.47 L
352.496 368.512 L
352.713 368.553 L
352.93 368.594 L
353.147 368.635 L
353.364 368.676 L
353.581 368.716 L
353.798 368.756 L
354.015 368.796 L
354.232 368.835 L
354.449 368.874 L
354.666 368.913 L
354.883 368.951 L
355.1 368.989 L
355.317 369.027 L
355.534 369.065 L
355.751 369.102 L
355.968 369.139 L
356.185 369.176 L
356.402 369.213 L
356.619 369.249 L
356.836 369.285 L
357.053 369.321 L
357.27 369.357 L
357.487 369.392 L
357.704 369.427 L
357.921 369.462 L
358.138 369.496 L
358.355 369.531 L
358.572 369.565 L
358.789 369.598 L
359.006 369.632 L
359.223 369.665 L
359.44 369.698 L
359.657 369.731 L
359.874 369.764 L
360.091 369.796 L
360.308 369.828 L
360.525 369.86 L
360.742 369.892 L
360.959 369.923 L
361.176 369.955 L
361.393 369.986 L
361.61 370.016 L
361.827 370.047 L
362.044 370.077 L
362.261 370.107 L
362.478 370.137 L
362.695 370.167 L
362.912 370.197 L
363.129 370.226 L
363.346 370.255 L
363.563 370.284 L
363.78 370.313 L
363.997 370.341 L
364.214 370.369 L
364.431 370.397 L
364.648 370.425 L
364.865 370.453 L
365.082 370.48 L
365.299 370.508 L
365.516 370.535 L
365.733 370.562 L
365.95 370.588 L
366.167 370.615 L
366.384 370.641 L
366.601 370.668 L
366.818 370.694 L
367.035 370.719 L
367.252 370.745 L
367.469 370.77 L
367.686 370.796 L
367.903 370.821 L
368.12 370.846 L
368.337 370.87 L
368.554 370.895 L
368.771 370.919 L
368.988 370.944 L
369.205 370.968 L
369.422 370.992 L
369.639 371.015 L
369.856 371.039 L
370.073 371.062 L
370.29 371.085 L
370.507 371.108 L
370.724 371.131 L
370.941 371.154 L
371.158 371.177 L
371.375 371.199 L
371.592 371.221 L
371.809 371.244 L
372.026 371.266 L
372.243 371.287 L
372.46 371.309 L
372.677 371.331 L
372.894 371.352 L
373.111 371.373 L
373.328 371.394 L
373.545 371.415 L
373.762 371.436 L
373.979 371.456 L
374.196 371.477 L
374.413 371.497 L
374.63 371.518 L
374.847 371.538 L
375.064 371.557 L
375.281 371.577 L
375.498 371.597 L
375.715 371.616 L
375.932 371.636 L
376.149 371.655 L
376.366 371.674 L
376.583 371.693 L
376.8 371.712 L
377.017 371.731 L
377.234 371.749 L
377.451 371.768 L
377.668 371.786 L
377.885 371.804 L
378.102 371.822 L
378.319 371.84 L
378.536 371.858 L
378.753 371.876 L
378.97 371.893 L
379.187 371.911 L
379.404 371.928 L
379.621 371.945 L
379.838 371.962 L
380.055 371.979 L
380.272 371.996 L
380.489 372.013 L
380.706 372.03 L
380.923 372.046 L
381.14 372.063 L
381.357 372.079 L
381.574 372.095 L
381.791 372.111 L
382.008 372.127 L
382.225 372.143 L
382.442 372.159 L
382.659 372.174 L
382.876 372.19 L
383.093 372.205 L
383.31 372.22 L
383.527 372.236 L
383.744 372.251 L
383.961 372.266 L
384.178 372.28 L
384.395 372.295 L
384.612 372.31 L
384.829 372.324 L
385.046 372.339 L
385.263 372.353 L
385.48 372.367 L
385.697 372.382 L
385.914 372.396 L
386.131 372.41 L
386.348 372.424 L
386.565 372.437 L
386.782 372.451 L
386.999 372.465 L
387.216 372.478 L
387.433 372.491 L
387.65 372.505 L
387.867 372.518 L
388.084 372.531 L
388.301 372.544 L
388.518 372.557 L
388.735 372.57 L
388.952 372.582 L
389.169 372.595 L
389.386 372.608 L
389.603 372.62 L
389.82 372.633 L
390.037 372.645 L
390.254 372.657 L
390.471 372.669 L
390.688 372.681 L
390.905 372.693 L
391.122 372.705 L
391.339 372.717 L
391.556 372.729 L
391.773 372.74 L
391.99 372.752 L
392.207 372.763 L
392.424 372.775 L
392.641 372.786 L
392.858 372.797 L
393.075 372.808 L
393.292 372.819 L
393.509 372.83 L
393.726 372.841 L
393.943 372.852 L
394.16 372.863 L
394.377 372.873 L
394.594 372.884 L
394.811 372.894 L
395.028 372.905 L
395.245 372.915 L
395.462 372.925 L
395.679 372.936 L
395.896 372.946 L
396.113 372.956 L
396.33 372.966 L
396.547 372.976 L
396.764 372.986 L
396.981 372.995 L
397.198 373.005 L
397.415 373.015 L
397.632 373.024 L
397.849 373.034 L
398.066 373.043 L
398.283 373.052 L
398.5 373.062 L
398.717 373.071 L
398.934 373.08 L
399.151 373.089 L
399.368 373.098 L
399.585 373.107 L
399.802 373.116 L
400.019 373.125 L
400.236 373.133 L
400.453 373.142 L
400.67 373.15 L
400.887 373.159 L
401.104 373.167 L
401.321 373.176 L
401.538 373.184 L
401.755 373.192 L
401.972 373.201 L
402.189 373.209 L
402.406 373.217 L
402.623 373.225 L
402.84 373.233 L
403.057 373.241 L
403.274 373.248 L
403.491 373.256 L
403.708 373.264 L
403.925 373.271 L
404.142 373.279 L
404.359 373.286 L
404.576 373.294 L
404.793 373.301 L
405.01 373.309 L
405.227 373.316 L
405.444 373.323 L
405.661 373.33 L
405.878 373.337 L
406.095 373.344 L
406.312 373.351 L
406.529 373.358 L
406.746 373.365 L
406.963 373.372 L
407.18 373.378 L
407.397 373.385 L
407.614 373.392 L
407.831 373.398 L
408.048 373.405 L
408.265 373.411 L
408.482 373.417 L
408.699 373.424 L
408.916 373.43 L
409.133 373.436 L
409.35 373.442 L
409.567 373.448 L
409.784 373.454 L
410.001 373.461 L
410.218 373.466 L
410.435 373.472 L
410.652 373.478 L
410.869 373.484 L
411.086 373.49 L
411.303 373.495 L
411.52 373.501 L
411.737 373.507 L
411.954 373.512 L
412.171 373.518 L
412.388 373.523 L
412.605 373.528 L
412.822 373.534 L
413.039 373.539 L
413.256 373.544 L
413.473 373.549 L
413.69 373.554 L
413.907 373.559 L
414.124 373.564 L
414.341 373.569 L
414.558 373.574 L
414.775 373.579 L
414.992 373.584 L
415.209 373.589 L
415.426 373.594 L
415.643 373.598 L
415.86 373.603 L
416.077 373.608 L
416.294 373.612 L
416.511 373.617 L
416.728 373.621 L
416.945 373.626 L
417.162 373.63 L
417.379 373.634 L
417.596 373.639 L
417.813 373.643 L
418.03 373.647 L
418.247 373.651 L
418.464 373.655 L
418.681 373.659 L
418.898 373.663 L
419.115 373.667 L
419.332 373.671 L
419.549 373.675 L
419.766 373.679 L
419.983 373.683 L
420.2 373.687 L
420.417 373.69 L
420.634 373.694 L
420.851 373.698 L
421.068 373.701 L
421.285 373.705 L
421.502 373.709 L
421.719 373.712 L
421.936 373.716 L
422.153 373.719 L
422.37 373.722 L
422.587 373.726 L
422.804 373.729 L
423.021 373.732 L
423.238 373.736 L
423.455 373.739 L
423.672 373.742 L
423.889 373.745 L
424.106 373.748 L
424.323 373.751 L
424.54 373.755 L
424.757 373.758 L
424.974 373.761 L
425.191 373.764 L
425.408 373.766 L
425.625 373.769 L
425.842 373.772 L
426.059 373.775 L
426.276 373.778 L
426.493 373.781 L
426.71 373.783 L
426.927 373.786 L
427.144 373.789 L
427.361 373.791 L
427.578 373.794 L
427.795 373.796 L
428.012 373.799 L
428.229 373.802 L
428.446 373.804 L
428.663 373.807 L
428.88 373.809 L
429.097 373.811 L
429.314 373.814 L
429.531 373.816 L
429.748 373.818 L
429.965 373.821 L
430.182 373.823 L
430.399 373.825 L
430.616 373.827 L
430.833 373.83 L
431.05 373.832 L
431.267 373.834 L
431.484 373.836 L
431.701 373.838 L
431.918 373.84 L
432.135 373.842 L
432.352 373.844 L
432.569 373.846 L
432.786 373.848 L
433.003 373.85 L
433.22 373.852 L
433.437 373.854 L
433.654 373.856 L
433.871 373.858 L
434.088 373.86 L
434.305 373.861 L
434.522 373.863 L
434.739 373.865 L
434.956 373.867 L
435.173 373.868 L
435.39 373.87 L
435.607 373.872 L
435.824 373.873 L
436.041 373.875 L
436.258 373.877 L
436.475 373.878 L
436.692 373.88 L
436.909 373.881 L
437.126 373.883 L
437.343 373.884 L
437.56 373.886 L
437.777 373.887 L
437.994 373.889 L
438.211 373.89 L
438.428 373.892 L
438.645 373.893 L
438.862 373.895 L
439.079 373.896 L
439.296 373.897 L
439.513 373.899 L
439.73 373.9 L
439.947 373.901 L
440.164 373.903 L
440.381 373.904 L
440.598 373.905 L
440.815 373.906 L
441.032 373.908 L
441.249 373.909 L
441.466 373.91 L
441.683 373.911 L
441.9 373.912 L
442.117 373.914 L
442.334 373.915 L
442.551 373.916 L
442.768 373.917 L
442.985 373.918 L
443.202 373.919 L
443.419 373.92 L
443.636 373.921 L
443.853 373.922 L
444.07 373.923 L
444.287 373.924 L
444.504 373.925 L
444.721 373.926 L
444.938 373.927 L
445.155 373.928 L
445.372 373.929 L
445.589 373.93 L
445.806 373.931 L
446.023 373.932 L
446.24 373.933 L
446.457 373.934 L
446.674 373.935 L
446.891 373.936 L
447.108 373.936 L
447.325 373.937 L
447.542 373.938 L
447.759 373.939 L
447.976 373.94 L
448.193 373.941 L
448.41 373.941 L
448.627 373.942 L
448.844 373.943 L
449.061 373.944 L
449.278 373.944 L
449.495 373.945 L
449.712 373.946 L
449.929 373.947 L
450.146 373.947 L
450.363 373.948 L
450.58 373.949 L
450.797 373.949 L
451.014 373.95 L
451.231 373.951 L
451.448 373.951 L
451.665 373.952 L
451.882 373.953 L
452.099 373.953 L
452.316 373.954 L
452.533 373.955 L
452.75 373.955 L
452.967 373.956 L
453.184 373.956 L
453.401 373.957 L
453.618 373.958 L
453.835 373.958 L
454.052 373.959 L
454.269 373.959 L
454.486 373.96 L
454.703 373.96 L
454.92 373.961 L
455.137 373.961 L
455.354 373.962 L
455.571 373.962 L
455.788 373.963 L
456.005 373.963 L
456.222 373.964 L
456.439 373.964 L
456.656 373.965 L
456.873 373.965 L
457.09 373.966 L
457.307 373.966 L
457.524 373.967 L
457.741 373.967 L
457.958 373.968 L
458.175 373.968 L
458.392 373.969 L
458.609 373.969 L
458.826 373.969 L
459.043 373.97 L
459.26 373.97 L
459.477 373.971 L
459.694 373.971 L
459.911 373.971 L
460.128 373.972 L
460.345 373.972 L
460.562 373.973 L
460.779 373.973 L
460.996 373.973 L
461.213 373.974 L
461.43 373.974 L
461.647 373.974 L
461.864 373.975 L
462.081 373.975 L
462.298 373.975 L
462.515 373.976 L
462.732 373.976 L
462.949 373.976 L
463.166 373.977 L
463.383 373.977 L
463.6 373.977 L
463.817 373.978 L
464.034 373.978 L
464.251 373.978 L
464.468 373.979 L
464.685 373.979 L
464.902 373.979 L
465.119 373.979 L
465.336 373.98 L
465.553 373.98 L
465.77 373.98 L
465.987 373.98 L
466.204 373.981 L
466.421 373.981 L
466.638 373.981 L
466.855 373.982 L
467.072 373.982 L
467.289 373.982 L
467.506 373.982 L
467.723 373.983 L
467.94 373.983 L
468.157 373.983 L
468.374 373.983 L
468.591 373.983 L
468.808 373.984 L
469.025 373.984 L
469.242 373.984 L
469.459 373.984 L
469.676 373.985 L
469.893 373.985 L
470.11 373.985 L
470.327 373.985 L
470.544 373.985 L
470.761 373.986 L
470.978 373.986 L
471.195 373.986 L
471.412 373.986 L
471.629 373.986 L
471.846 373.987 L
472.063 373.987 L
472.28 373.987 L
472.497 373.987 L
472.714 373.987 L
472.931 373.987 L
473.148 373.988 L
473.365 373.988 L
473.582 373.988 L
473.799 373.988 L
474.016 373.988 L
474.233 373.988 L
474.45 373.989 L
474.667 373.989 L
474.884 373.989 L
475.101 373.989 L
475.318 373.989 L
475.535 373.989 L
475.752 373.989 L
475.969 373.99 L
476.186 373.99 L
476.403 373.99 L
476.62 373.99 L
476.837 373.99 L
477.054 373.99 L
477.271 373.99 L
477.488 373.991 L
477.705 373.991 L
477.922 373.991 L
478.139 373.991 L
478.356 373.991 L
478.573 373.991 L
478.79 373.991 L
479.007 373.991 L
479.224 373.992 L
479.441 373.992 L
479.658 373.992 L
479.875 373.992 L
480.092 373.992 L
480.309 373.992 L
480.526 373.992 L
480.743 373.992 L
480.96 373.992 L
481.177 373.993 L
481.394 373.993 L
481.611 373.993 L
481.828 373.993 L
482.045 373.993 L
482.262 373.993 L
482.479 373.993 L
482.696 373.993 L
482.913 373.993 L
483.13 373.993 L
483.347 373.993 L
483.564 373.994 L
483.781 373.994 L
483.998 373.994 L
484.215 373.994 L
484.432 373.994 L
484.649 373.994 L
484.866 373.994 L
485.083 373.994 L
485.3 373.994 L
485.517 373.994 L
485.734 373.994 L
485.951 373.994 L
486.168 373.995 L
486.385 373.995 L
486.602 373.995 L
486.819 373.995 L
487.036 373.995 L
487.253 373.995 L
487.47 373.995 L
487.687 373.995 L
487.904 373.995 L
488.121 373.995 L
488.338 373.995 L
488.555 373.995 L
488.772 373.995 L
488.989 373.995 L
489.206 373.996 L
489.423 373.996 L
489.64 373.996 L
489.857 373.996 L
490.074 373.996 L
490.291 373.996 L
490.508 373.996 L
490.725 373.996 L
490.942 373.996 L
491.159 373.996 L
491.376 373.996 L
491.593 373.996 L
491.81 373.996 L
492.027 373.996 L
492.244 373.996 L
492.461 373.996 L
492.678 373.996 L
492.895 373.996 L
493.112 373.996 L
493.329 373.997 L
493.546 373.997 L
493.763 373.997 L
493.98 373.997 L
494.197 373.997 L
494.414 373.997 L
494.631 373.997 L
494.848 373.997 L
495.065 373.997 L
495.282 373.997 L
495.499 373.997 L
495.716 373.997 L
495.933 373.997 L
496.15 373.997 L
496.367 373.997 L
496.584 373.997 L
496.801 373.997 L
497.018 373.997 L
497.235 373.997 L
497.452 373.997 L
497.669 373.997 L
497.886 373.997 L
498.103 373.997 L
498.32 373.997 L
498.537 373.998 L
498.754 373.998 L
498.971 373.998 L
499.188 373.998 L
499.405 373.998 L
499.622 373.998 L
499.839 373.998 L
500.056 373.998 L
500.273 373.998 L
500.49 373.998 L
500.707 373.998 L
500.924 373.998 L
501.141 373.998 L
501.358 373.998 L
501.575 373.998 L
501.792 373.998 L
502.009 373.998 L
502.226 373.998 L
502.443 373.998 L
502.66 373.998 L
502.877 373.998 L
503.094 373.998 L
503.311 373.998 L
503.528 373.998 L
503.745 373.998 L
503.962 373.998 L
504.179 373.998 L
504.396 373.998 L
504.613 373.998 L
504.83 373.998 L
505.047 373.998 L
505.264 373.998 L
505.481 373.998 L
505.698 373.998 L
505.915 373.998 L
506.132 373.998 L
506.349 373.999 L
506.566 373.999 L
506.783 373.999 L
507 373.999 L
S
GR
%%Trailer
%%Pages: 1
%%EOF
