%!PS-Adobe-3.0 EPSF-3.0
%%Creator: (MATLAB, The Mathworks, Inc. Version 9.1.0.441655 \(R2016b\). Operating System: Linux)
%%Title: /home/frdm/Documents/RLS/rls-2017/sp2/figures/f4.eps
%%CreationDate: 2017-11-14T02:34:08
%%Pages: (atend)
%%BoundingBox: 0 0 731 458
%%LanguageLevel: 3
%%EndComments
%%BeginProlog
%%BeginResource: procset (Apache XML Graphics Std ProcSet) 1.2 0
%%Version: 1.2 0
%%Copyright: (Copyright 2001-2003,2010 The Apache Software Foundation. License terms: http://www.apache.org/licenses/LICENSE-2.0)
/bd{bind def}bind def
/ld{load def}bd
/GR/grestore ld
/M/moveto ld
/LJ/setlinejoin ld
/C/curveto ld
/f/fill ld
/LW/setlinewidth ld
/GC/setgray ld
/t/show ld
/N/newpath ld
/CT/concat ld
/cp/closepath ld
/S/stroke ld
/L/lineto ld
/CC/setcmykcolor ld
/A/ashow ld
/GS/gsave ld
/RC/setrgbcolor ld
/RM/rmoveto ld
/ML/setmiterlimit ld
/re {4 2 roll M
1 index 0 rlineto
0 exch rlineto
neg 0 rlineto
cp } bd
/_ctm matrix def
/_tm matrix def
/BT { _ctm currentmatrix pop matrix _tm copy pop 0 0 moveto } bd
/ET { _ctm setmatrix } bd
/iTm { _ctm setmatrix _tm concat } bd
/Tm { _tm astore pop iTm 0 0 moveto } bd
/ux 0.0 def
/uy 0.0 def
/F {
  /Tp exch def
  /Tf exch def
  Tf findfont Tp scalefont setfont
  /cf Tf def  /cs Tp def
} bd
/ULS {currentpoint /uy exch def /ux exch def} bd
/ULE {
  /Tcx currentpoint pop def
  gsave
  newpath
  cf findfont cs scalefont dup
  /FontMatrix get 0 get /Ts exch def /FontInfo get dup
  /UnderlinePosition get Ts mul /To exch def
  /UnderlineThickness get Ts mul /Tt exch def
  ux uy To add moveto  Tcx uy To add lineto
  Tt setlinewidth stroke
  grestore
} bd
/OLE {
  /Tcx currentpoint pop def
  gsave
  newpath
  cf findfont cs scalefont dup
  /FontMatrix get 0 get /Ts exch def /FontInfo get dup
  /UnderlinePosition get Ts mul /To exch def
  /UnderlineThickness get Ts mul /Tt exch def
  ux uy To add cs add moveto Tcx uy To add cs add lineto
  Tt setlinewidth stroke
  grestore
} bd
/SOE {
  /Tcx currentpoint pop def
  gsave
  newpath
  cf findfont cs scalefont dup
  /FontMatrix get 0 get /Ts exch def /FontInfo get dup
  /UnderlinePosition get Ts mul /To exch def
  /UnderlineThickness get Ts mul /Tt exch def
  ux uy To add cs 10 mul 26 idiv add moveto Tcx uy To add cs 10 mul 26 idiv add lineto
  Tt setlinewidth stroke
  grestore
} bd
/QT {
/Y22 exch store
/X22 exch store
/Y21 exch store
/X21 exch store
currentpoint
/Y21 load 2 mul add 3 div exch
/X21 load 2 mul add 3 div exch
/X21 load 2 mul /X22 load add 3 div
/Y21 load 2 mul /Y22 load add 3 div
/X22 load /Y22 load curveto
} bd
/SSPD {
dup length /d exch dict def
{
/v exch def
/k exch def
currentpagedevice k known {
/cpdv currentpagedevice k get def
v cpdv ne {
/upd false def
/nullv v type /nulltype eq def
/nullcpdv cpdv type /nulltype eq def
nullv nullcpdv or
{
/upd true def
} {
/sametype v type cpdv type eq def
sametype {
v type /arraytype eq {
/vlen v length def
/cpdvlen cpdv length def
vlen cpdvlen eq {
0 1 vlen 1 sub {
/i exch def
/obj v i get def
/cpdobj cpdv i get def
obj cpdobj ne {
/upd true def
exit
} if
} for
} {
/upd true def
} ifelse
} {
v type /dicttype eq {
v {
/dv exch def
/dk exch def
/cpddv cpdv dk get def
dv cpddv ne {
/upd true def
exit
} if
} forall
} {
/upd true def
} ifelse
} ifelse
} if
} ifelse
upd true eq {
d k v put
} if
} if
} if
} forall
d length 0 gt {
d setpagedevice
} if
} bd
/RE { % /NewFontName [NewEncodingArray] /FontName RE -
  findfont dup length dict begin
  {
    1 index /FID ne
    {def} {pop pop} ifelse
  } forall
  /Encoding exch def
  /FontName 1 index def
  currentdict definefont pop
  end
} bind def
%%EndResource
%%BeginResource: procset (Apache XML Graphics EPS ProcSet) 1.0 0
%%Version: 1.0 0
%%Copyright: (Copyright 2002-2003 The Apache Software Foundation. License terms: http://www.apache.org/licenses/LICENSE-2.0)
/BeginEPSF { %def
/b4_Inc_state save def         % Save state for cleanup
/dict_count countdictstack def % Count objects on dict stack
/op_count count 1 sub def      % Count objects on operand stack
userdict begin                 % Push userdict on dict stack
/showpage { } def              % Redefine showpage, { } = null proc
0 setgray 0 setlinecap         % Prepare graphics state
1 setlinewidth 0 setlinejoin
10 setmiterlimit [ ] 0 setdash newpath
/languagelevel where           % If level not equal to 1 then
{pop languagelevel             % set strokeadjust and
1 ne                           % overprint to their defaults.
{false setstrokeadjust false setoverprint
} if
} if
} bd
/EndEPSF { %def
count op_count sub {pop} repeat            % Clean up stacks
countdictstack dict_count sub {end} repeat
b4_Inc_state restore
} bd
%%EndResource
%FOPBeginFontDict
%%IncludeResource: font Courier-Bold
%%IncludeResource: font Helvetica
%%IncludeResource: font Courier-BoldOblique
%%IncludeResource: font Courier-Oblique
%%IncludeResource: font Times-Roman
%%IncludeResource: font Helvetica-BoldOblique
%%IncludeResource: font Helvetica-Bold
%%IncludeResource: font Helvetica-Oblique
%%IncludeResource: font Times-BoldItalic
%%IncludeResource: font Courier
%%IncludeResource: font Times-Italic
%%IncludeResource: font Times-Bold
%%IncludeResource: font Symbol
%%IncludeResource: font ZapfDingbats
%FOPEndFontDict
%%BeginResource: encoding WinAnsiEncoding
/WinAnsiEncoding [
/.notdef /.notdef /.notdef /.notdef /.notdef
/.notdef /.notdef /.notdef /.notdef /.notdef
/.notdef /.notdef /.notdef /.notdef /.notdef
/.notdef /.notdef /.notdef /.notdef /.notdef
/.notdef /.notdef /.notdef /.notdef /.notdef
/.notdef /.notdef /.notdef /.notdef /.notdef
/.notdef /.notdef /space /exclam /quotedbl
/numbersign /dollar /percent /ampersand /quotesingle
/parenleft /parenright /asterisk /plus /comma
/hyphen /period /slash /zero /one
/two /three /four /five /six
/seven /eight /nine /colon /semicolon
/less /equal /greater /question /at
/A /B /C /D /E
/F /G /H /I /J
/K /L /M /N /O
/P /Q /R /S /T
/U /V /W /X /Y
/Z /bracketleft /backslash /bracketright /asciicircum
/underscore /quoteleft /a /b /c
/d /e /f /g /h
/i /j /k /l /m
/n /o /p /q /r
/s /t /u /v /w
/x /y /z /braceleft /bar
/braceright /asciitilde /bullet /Euro /bullet
/quotesinglbase /florin /quotedblbase /ellipsis /dagger
/daggerdbl /circumflex /perthousand /Scaron /guilsinglleft
/OE /bullet /Zcaron /bullet /bullet
/quoteleft /quoteright /quotedblleft /quotedblright /bullet
/endash /emdash /asciitilde /trademark /scaron
/guilsinglright /oe /bullet /zcaron /Ydieresis
/space /exclamdown /cent /sterling /currency
/yen /brokenbar /section /dieresis /copyright
/ordfeminine /guillemotleft /logicalnot /sfthyphen /registered
/macron /degree /plusminus /twosuperior /threesuperior
/acute /mu /paragraph /middot /cedilla
/onesuperior /ordmasculine /guillemotright /onequarter /onehalf
/threequarters /questiondown /Agrave /Aacute /Acircumflex
/Atilde /Adieresis /Aring /AE /Ccedilla
/Egrave /Eacute /Ecircumflex /Edieresis /Igrave
/Iacute /Icircumflex /Idieresis /Eth /Ntilde
/Ograve /Oacute /Ocircumflex /Otilde /Odieresis
/multiply /Oslash /Ugrave /Uacute /Ucircumflex
/Udieresis /Yacute /Thorn /germandbls /agrave
/aacute /acircumflex /atilde /adieresis /aring
/ae /ccedilla /egrave /eacute /ecircumflex
/edieresis /igrave /iacute /icircumflex /idieresis
/eth /ntilde /ograve /oacute /ocircumflex
/otilde /odieresis /divide /oslash /ugrave
/uacute /ucircumflex /udieresis /yacute /thorn
/ydieresis
] def
%%EndResource
%FOPBeginFontReencode
/Courier-Bold findfont
dup length dict begin
  {1 index /FID ne {def} {pop pop} ifelse} forall
  /Encoding WinAnsiEncoding def
  currentdict
end
/Courier-Bold exch definefont pop
/Helvetica findfont
dup length dict begin
  {1 index /FID ne {def} {pop pop} ifelse} forall
  /Encoding WinAnsiEncoding def
  currentdict
end
/Helvetica exch definefont pop
/Courier-BoldOblique findfont
dup length dict begin
  {1 index /FID ne {def} {pop pop} ifelse} forall
  /Encoding WinAnsiEncoding def
  currentdict
end
/Courier-BoldOblique exch definefont pop
/Courier-Oblique findfont
dup length dict begin
  {1 index /FID ne {def} {pop pop} ifelse} forall
  /Encoding WinAnsiEncoding def
  currentdict
end
/Courier-Oblique exch definefont pop
/Times-Roman findfont
dup length dict begin
  {1 index /FID ne {def} {pop pop} ifelse} forall
  /Encoding WinAnsiEncoding def
  currentdict
end
/Times-Roman exch definefont pop
/Helvetica-BoldOblique findfont
dup length dict begin
  {1 index /FID ne {def} {pop pop} ifelse} forall
  /Encoding WinAnsiEncoding def
  currentdict
end
/Helvetica-BoldOblique exch definefont pop
/Helvetica-Bold findfont
dup length dict begin
  {1 index /FID ne {def} {pop pop} ifelse} forall
  /Encoding WinAnsiEncoding def
  currentdict
end
/Helvetica-Bold exch definefont pop
/Helvetica-Oblique findfont
dup length dict begin
  {1 index /FID ne {def} {pop pop} ifelse} forall
  /Encoding WinAnsiEncoding def
  currentdict
end
/Helvetica-Oblique exch definefont pop
/Times-BoldItalic findfont
dup length dict begin
  {1 index /FID ne {def} {pop pop} ifelse} forall
  /Encoding WinAnsiEncoding def
  currentdict
end
/Times-BoldItalic exch definefont pop
/Courier findfont
dup length dict begin
  {1 index /FID ne {def} {pop pop} ifelse} forall
  /Encoding WinAnsiEncoding def
  currentdict
end
/Courier exch definefont pop
/Times-Italic findfont
dup length dict begin
  {1 index /FID ne {def} {pop pop} ifelse} forall
  /Encoding WinAnsiEncoding def
  currentdict
end
/Times-Italic exch definefont pop
/Times-Bold findfont
dup length dict begin
  {1 index /FID ne {def} {pop pop} ifelse} forall
  /Encoding WinAnsiEncoding def
  currentdict
end
/Times-Bold exch definefont pop
%FOPEndFontReencode
%%EndProlog
%%Page: 1 1
%%PageBoundingBox: 0 0 731 458
%%BeginPageSetup
[1 0 0 -1 0 458] CT
%%EndPageSetup
GS
[0.75 0 0 0.75 0 -0.25] CT
1 GC
N
0 0 975 611 re
f
GR
GS
[0.75 0 0 0.75 0 -0.25] CT
1 GC
N
0 0 975 611 re
f
GR
GS
[0.75 0 0 0.75 0 -0.25] CT
1 GC
N
127 544 M
882 544 L
882 46 L
127 46 L
cp
f
GR
GS
[0.75 0 0 0.75 0 -0.25] CT
0.149 GC
2 setlinecap
1 LJ
0.667 LW
N
127 544 M
882 544 L
S
GR
GS
[0.75 0 0 0.75 0 -0.25] CT
0.149 GC
2 setlinecap
1 LJ
0.667 LW
N
127 46 M
882 46 L
S
GR
GS
[0.75 0 0 0.75 0 -0.25] CT
0.149 GC
2 setlinecap
1 LJ
0.667 LW
N
127 544 M
127 536.45 L
S
GR
GS
[0.75 0 0 0.75 0 -0.25] CT
0.149 GC
2 setlinecap
1 LJ
0.667 LW
N
212.795 544 M
212.795 536.45 L
S
GR
GS
[0.75 0 0 0.75 0 -0.25] CT
0.149 GC
2 setlinecap
1 LJ
0.667 LW
N
298.591 544 M
298.591 536.45 L
S
GR
GS
[0.75 0 0 0.75 0 -0.25] CT
0.149 GC
2 setlinecap
1 LJ
0.667 LW
N
384.386 544 M
384.386 536.45 L
S
GR
GS
[0.75 0 0 0.75 0 -0.25] CT
0.149 GC
2 setlinecap
1 LJ
0.667 LW
N
470.182 544 M
470.182 536.45 L
S
GR
GS
[0.75 0 0 0.75 0 -0.25] CT
0.149 GC
2 setlinecap
1 LJ
0.667 LW
N
555.977 544 M
555.977 536.45 L
S
GR
GS
[0.75 0 0 0.75 0 -0.25] CT
0.149 GC
2 setlinecap
1 LJ
0.667 LW
N
641.773 544 M
641.773 536.45 L
S
GR
GS
[0.75 0 0 0.75 0 -0.25] CT
0.149 GC
2 setlinecap
1 LJ
0.667 LW
N
727.568 544 M
727.568 536.45 L
S
GR
GS
[0.75 0 0 0.75 0 -0.25] CT
0.149 GC
2 setlinecap
1 LJ
0.667 LW
N
813.364 544 M
813.364 536.45 L
S
GR
GS
[0.75 0 0 0.75 0 -0.25] CT
0.149 GC
2 setlinecap
1 LJ
0.667 LW
N
127 46 M
127 53.55 L
S
GR
GS
[0.75 0 0 0.75 0 -0.25] CT
0.149 GC
2 setlinecap
1 LJ
0.667 LW
N
212.795 46 M
212.795 53.55 L
S
GR
GS
[0.75 0 0 0.75 0 -0.25] CT
0.149 GC
2 setlinecap
1 LJ
0.667 LW
N
298.591 46 M
298.591 53.55 L
S
GR
GS
[0.75 0 0 0.75 0 -0.25] CT
0.149 GC
2 setlinecap
1 LJ
0.667 LW
N
384.386 46 M
384.386 53.55 L
S
GR
GS
[0.75 0 0 0.75 0 -0.25] CT
0.149 GC
2 setlinecap
1 LJ
0.667 LW
N
470.182 46 M
470.182 53.55 L
S
GR
GS
[0.75 0 0 0.75 0 -0.25] CT
0.149 GC
2 setlinecap
1 LJ
0.667 LW
N
555.977 46 M
555.977 53.55 L
S
GR
GS
[0.75 0 0 0.75 0 -0.25] CT
0.149 GC
2 setlinecap
1 LJ
0.667 LW
N
641.773 46 M
641.773 53.55 L
S
GR
GS
[0.75 0 0 0.75 0 -0.25] CT
0.149 GC
2 setlinecap
1 LJ
0.667 LW
N
727.568 46 M
727.568 53.55 L
S
GR
GS
[0.75 0 0 0.75 0 -0.25] CT
0.149 GC
2 setlinecap
1 LJ
0.667 LW
N
813.364 46 M
813.364 53.55 L
S
GR
GS
[0.75 0 0 0.75 95.25 411.74998] CT
0.149 GC
/Helvetica 13.333 F
GS
[1 0 0 1 0 0] CT
-4.5 13 moveto 
1 -1 scale
(0) t 
GR
GR
GS
[0.75 0 0 0.75 159.59659 411.74998] CT
0.149 GC
/Helvetica 13.333 F
GS
[1 0 0 1 0 0] CT
-8.5 13 moveto 
1 -1 scale
(50) t 
GR
GR
GS
[0.75 0 0 0.75 223.94318 411.74998] CT
0.149 GC
/Helvetica 13.333 F
GS
[1 0 0 1 0 0] CT
-12.5 13 moveto 
1 -1 scale
(100) t 
GR
GR
GS
[0.75 0 0 0.75 288.28976 411.74998] CT
0.149 GC
/Helvetica 13.333 F
GS
[1 0 0 1 0 0] CT
-12.5 13 moveto 
1 -1 scale
(150) t 
GR
GR
GS
[0.75 0 0 0.75 352.63637 411.74998] CT
0.149 GC
/Helvetica 13.333 F
GS
[1 0 0 1 0 0] CT
-12.5 13 moveto 
1 -1 scale
(200) t 
GR
GR
GS
[0.75 0 0 0.75 416.98297 411.74998] CT
0.149 GC
/Helvetica 13.333 F
GS
[1 0 0 1 0 0] CT
-12.5 13 moveto 
1 -1 scale
(250) t 
GR
GR
GS
[0.75 0 0 0.75 481.32953 411.74998] CT
0.149 GC
/Helvetica 13.333 F
GS
[1 0 0 1 0 0] CT
-12.5 13 moveto 
1 -1 scale
(300) t 
GR
GR
GS
[0.75 0 0 0.75 545.67613 411.74998] CT
0.149 GC
/Helvetica 13.333 F
GS
[1 0 0 1 0 0] CT
-12.5 13 moveto 
1 -1 scale
(350) t 
GR
GR
GS
[0.75 0 0 0.75 610.02274 411.74998] CT
0.149 GC
/Helvetica 13.333 F
GS
[1 0 0 1 0 0] CT
-12.5 13 moveto 
1 -1 scale
(400) t 
GR
GR
GS
[0.75 0 0 0.75 378.37527 425.50002] CT
0.149 GC
/Helvetica 14.667 F
GS
[1 0 0 1 0 0] CT
-57.5 14 moveto 
1 -1 scale
(Time \(seconds\)) t 
GR
GR
GS
[0.75 0 0 0.75 0 -0.25] CT
0.149 GC
2 setlinecap
1 LJ
0.667 LW
N
127 544 M
127 46 L
S
GR
GS
[0.75 0 0 0.75 0 -0.25] CT
0.149 GC
2 setlinecap
1 LJ
0.667 LW
N
882 544 M
882 46 L
S
GR
GS
[0.75 0 0 0.75 0 -0.25] CT
0.149 GC
2 setlinecap
1 LJ
0.667 LW
N
127 544 M
134.55 544 L
S
GR
GS
[0.75 0 0 0.75 0 -0.25] CT
0.149 GC
2 setlinecap
1 LJ
0.667 LW
N
127 485.412 M
134.55 485.412 L
S
GR
GS
[0.75 0 0 0.75 0 -0.25] CT
0.149 GC
2 setlinecap
1 LJ
0.667 LW
N
127 426.824 M
134.55 426.824 L
S
GR
GS
[0.75 0 0 0.75 0 -0.25] CT
0.149 GC
2 setlinecap
1 LJ
0.667 LW
N
127 368.235 M
134.55 368.235 L
S
GR
GS
[0.75 0 0 0.75 0 -0.25] CT
0.149 GC
2 setlinecap
1 LJ
0.667 LW
N
127 309.647 M
134.55 309.647 L
S
GR
GS
[0.75 0 0 0.75 0 -0.25] CT
0.149 GC
2 setlinecap
1 LJ
0.667 LW
N
127 251.059 M
134.55 251.059 L
S
GR
GS
[0.75 0 0 0.75 0 -0.25] CT
0.149 GC
2 setlinecap
1 LJ
0.667 LW
N
127 192.471 M
134.55 192.471 L
S
GR
GS
[0.75 0 0 0.75 0 -0.25] CT
0.149 GC
2 setlinecap
1 LJ
0.667 LW
N
127 133.882 M
134.55 133.882 L
S
GR
GS
[0.75 0 0 0.75 0 -0.25] CT
0.149 GC
2 setlinecap
1 LJ
0.667 LW
N
127 75.294 M
134.55 75.294 L
S
GR
GS
[0.75 0 0 0.75 0 -0.25] CT
0.149 GC
2 setlinecap
1 LJ
0.667 LW
N
882 544 M
874.45 544 L
S
GR
GS
[0.75 0 0 0.75 0 -0.25] CT
0.149 GC
2 setlinecap
1 LJ
0.667 LW
N
882 485.412 M
874.45 485.412 L
S
GR
GS
[0.75 0 0 0.75 0 -0.25] CT
0.149 GC
2 setlinecap
1 LJ
0.667 LW
N
882 426.824 M
874.45 426.824 L
S
GR
GS
[0.75 0 0 0.75 0 -0.25] CT
0.149 GC
2 setlinecap
1 LJ
0.667 LW
N
882 368.235 M
874.45 368.235 L
S
GR
GS
[0.75 0 0 0.75 0 -0.25] CT
0.149 GC
2 setlinecap
1 LJ
0.667 LW
N
882 309.647 M
874.45 309.647 L
S
GR
GS
[0.75 0 0 0.75 0 -0.25] CT
0.149 GC
2 setlinecap
1 LJ
0.667 LW
N
882 251.059 M
874.45 251.059 L
S
GR
GS
[0.75 0 0 0.75 0 -0.25] CT
0.149 GC
2 setlinecap
1 LJ
0.667 LW
N
882 192.471 M
874.45 192.471 L
S
GR
GS
[0.75 0 0 0.75 0 -0.25] CT
0.149 GC
2 setlinecap
1 LJ
0.667 LW
N
882 133.882 M
874.45 133.882 L
S
GR
GS
[0.75 0 0 0.75 0 -0.25] CT
0.149 GC
2 setlinecap
1 LJ
0.667 LW
N
882 75.294 M
874.45 75.294 L
S
GR
GS
[0.75 0 0 0.75 91.25 407.75] CT
0.149 GC
/Helvetica 13.333 F
GS
[1 0 0 1 0 0] CT
-26 4.5 moveto 
1 -1 scale
(-0.2) t 
GR
GR
GS
[0.75 0 0 0.75 91.25 363.80883] CT
0.149 GC
/Helvetica 13.333 F
GS
[1 0 0 1 0 0] CT
-9 4.5 moveto 
1 -1 scale
(0) t 
GR
GR
GS
[0.75 0 0 0.75 91.25 319.86764] CT
0.149 GC
/Helvetica 13.333 F
GS
[1 0 0 1 0 0] CT
-21 4.5 moveto 
1 -1 scale
(0.2) t 
GR
GR
GS
[0.75 0 0 0.75 91.25 275.92647] CT
0.149 GC
/Helvetica 13.333 F
GS
[1 0 0 1 0 0] CT
-21 4.5 moveto 
1 -1 scale
(0.4) t 
GR
GR
GS
[0.75 0 0 0.75 91.25 231.9853] CT
0.149 GC
/Helvetica 13.333 F
GS
[1 0 0 1 0 0] CT
-21 4.5 moveto 
1 -1 scale
(0.6) t 
GR
GR
GS
[0.75 0 0 0.75 91.25 188.04412] CT
0.149 GC
/Helvetica 13.333 F
GS
[1 0 0 1 0 0] CT
-21 4.5 moveto 
1 -1 scale
(0.8) t 
GR
GR
GS
[0.75 0 0 0.75 91.25 144.10294] CT
0.149 GC
/Helvetica 13.333 F
GS
[1 0 0 1 0 0] CT
-9 4.5 moveto 
1 -1 scale
(1) t 
GR
GR
GS
[0.75 0 0 0.75 91.25 100.16175] CT
0.149 GC
/Helvetica 13.333 F
GS
[1 0 0 1 0 0] CT
-21 4.5 moveto 
1 -1 scale
(1.2) t 
GR
GR
GS
[0.75 0 0 0.75 91.25 56.2206] CT
0.149 GC
/Helvetica 13.333 F
GS
[1 0 0 1 0 0] CT
-21 4.5 moveto 
1 -1 scale
(1.4) t 
GR
GR
GS
[0.75 0 0 0.75 378.37534 32.18751] CT
N
-297.109 -10.094 M
-296.234 -10.094 -295.852 -10.422 QT
-295.469 -10.75 -295.469 -11.5 QT
-295.469 -12.25 -295.852 -12.57 QT
-296.234 -12.891 -297.109 -12.891 QT
-298.297 -12.891 L
-298.297 -10.094 L
-297.109 -10.094 L
cp
-298.297 -8.141 M
-298.297 -4 L
-301.125 -4 L
-301.125 -14.938 L
-296.813 -14.938 L
-294.656 -14.938 -293.648 -14.211 QT
-292.641 -13.484 -292.641 -11.922 QT
-292.641 -10.828 -293.164 -10.133 QT
-293.688 -9.438 -294.75 -9.109 QT
-294.172 -8.984 -293.711 -8.516 QT
-293.25 -8.047 -292.781 -7.109 QT
-291.25 -4 L
-294.25 -4 L
-295.578 -6.719 L
-295.984 -7.531 -296.398 -7.836 QT
-296.813 -8.141 -297.5 -8.141 QT
-298.297 -8.141 L
cp
-281.761 -8.125 M
-281.761 -7.375 L
-287.902 -7.375 L
-287.808 -6.453 -287.23 -5.992 QT
-286.652 -5.531 -285.636 -5.531 QT
-284.808 -5.531 -283.941 -5.773 QT
-283.074 -6.016 -282.152 -6.516 QT
-282.152 -4.5 L
-283.089 -4.141 -284.019 -3.961 QT
-284.949 -3.781 -285.871 -3.781 QT
-288.105 -3.781 -289.339 -4.914 QT
-290.574 -6.047 -290.574 -8.094 QT
-290.574 -10.094 -289.363 -11.25 QT
-288.152 -12.406 -286.027 -12.406 QT
-284.089 -12.406 -282.925 -11.242 QT
-281.761 -10.078 -281.761 -8.125 QT
cp
-284.464 -9 M
-284.464 -9.75 -284.902 -10.203 QT
-285.339 -10.656 -286.043 -10.656 QT
-286.793 -10.656 -287.269 -10.227 QT
-287.746 -9.797 -287.871 -9 QT
-284.464 -9 L
cp
-280.009 -15.391 M
-277.399 -15.391 L
-277.399 -9.188 L
-274.368 -12.203 L
-271.321 -12.203 L
-275.337 -8.438 L
-271.009 -4 L
-274.196 -4 L
-277.399 -7.422 L
-277.399 -4 L
-280.009 -4 L
-280.009 -15.391 L
cp
-266.371 -10.531 M
-267.23 -10.531 -267.691 -9.906 QT
-268.152 -9.281 -268.152 -8.094 QT
-268.152 -6.922 -267.691 -6.289 QT
-267.23 -5.656 -266.371 -5.656 QT
-265.512 -5.656 -265.058 -6.289 QT
-264.605 -6.922 -264.605 -8.094 QT
-264.605 -9.281 -265.058 -9.906 QT
-265.512 -10.531 -266.371 -10.531 QT
cp
-266.371 -12.406 M
-264.246 -12.406 -263.058 -11.258 QT
-261.871 -10.109 -261.871 -8.094 QT
-261.871 -6.078 -263.058 -4.93 QT
-264.246 -3.781 -266.371 -3.781 QT
-268.48 -3.781 -269.683 -4.93 QT
-270.887 -6.078 -270.887 -8.094 QT
-270.887 -10.109 -269.683 -11.258 QT
-268.48 -12.406 -266.371 -12.406 QT
cp
-251.958 -9 M
-251.958 -4 L
-254.583 -4 L
-254.583 -4.813 L
-254.583 -7.828 L
-254.583 -8.891 -254.63 -9.289 QT
-254.677 -9.688 -254.802 -9.875 QT
-254.958 -10.141 -255.216 -10.281 QT
-255.474 -10.422 -255.818 -10.422 QT
-256.646 -10.422 -257.114 -9.789 QT
-257.583 -9.156 -257.583 -8.031 QT
-257.583 -4 L
-260.193 -4 L
-260.193 -12.203 L
-257.583 -12.203 L
-257.583 -11 L
-256.989 -11.719 -256.318 -12.063 QT
-255.646 -12.406 -254.849 -12.406 QT
-253.427 -12.406 -252.693 -11.531 QT
-251.958 -10.656 -251.958 -9 QT
cp
-243.352 -11.953 M
-243.352 -9.953 L
-244.196 -10.313 -244.977 -10.484 QT
-245.759 -10.656 -246.462 -10.656 QT
-247.212 -10.656 -247.571 -10.469 QT
-247.93 -10.281 -247.93 -9.891 QT
-247.93 -9.578 -247.657 -9.414 QT
-247.384 -9.25 -246.68 -9.156 QT
-246.212 -9.094 L
-244.196 -8.844 -243.501 -8.258 QT
-242.805 -7.672 -242.805 -6.422 QT
-242.805 -5.109 -243.774 -4.445 QT
-244.743 -3.781 -246.665 -3.781 QT
-247.477 -3.781 -248.345 -3.914 QT
-249.212 -4.047 -250.118 -4.297 QT
-250.118 -6.297 L
-249.337 -5.906 -248.516 -5.719 QT
-247.696 -5.531 -246.837 -5.531 QT
-246.071 -5.531 -245.68 -5.742 QT
-245.29 -5.953 -245.29 -6.375 QT
-245.29 -6.719 -245.563 -6.891 QT
-245.837 -7.063 -246.634 -7.172 QT
-247.087 -7.219 L
-248.837 -7.438 -249.54 -8.031 QT
-250.243 -8.625 -250.243 -9.844 QT
-250.243 -11.141 -249.352 -11.773 QT
-248.462 -12.406 -246.618 -12.406 QT
-245.884 -12.406 -245.087 -12.297 QT
-244.29 -12.188 -243.352 -11.953 QT
cp
-238.176 -14.531 M
-238.176 -12.203 L
-235.472 -12.203 L
-235.472 -10.328 L
-238.176 -10.328 L
-238.176 -6.844 L
-238.176 -6.281 -237.949 -6.078 QT
-237.722 -5.875 -237.051 -5.875 QT
-235.707 -5.875 L
-235.707 -4 L
-237.957 -4 L
-239.504 -4 -240.152 -4.648 QT
-240.801 -5.297 -240.801 -6.844 QT
-240.801 -10.328 L
-242.097 -10.328 L
-242.097 -12.203 L
-240.801 -12.203 L
-240.801 -14.531 L
-238.176 -14.531 L
cp
-227.935 -9.969 M
-228.279 -10.125 -228.623 -10.203 QT
-228.966 -10.281 -229.31 -10.281 QT
-230.326 -10.281 -230.873 -9.633 QT
-231.42 -8.984 -231.42 -7.781 QT
-231.42 -4 L
-234.029 -4 L
-234.029 -12.203 L
-231.42 -12.203 L
-231.42 -10.859 L
-230.904 -11.656 -230.248 -12.031 QT
-229.591 -12.406 -228.685 -12.406 QT
-228.545 -12.406 -228.396 -12.391 QT
-228.248 -12.375 -227.951 -12.344 QT
-227.935 -9.969 L
cp
-226.895 -7.188 M
-226.895 -12.203 L
-224.254 -12.203 L
-224.254 -11.391 L
-224.254 -10.719 -224.262 -9.711 QT
-224.27 -8.703 -224.27 -8.359 QT
-224.27 -7.375 -224.223 -6.938 QT
-224.176 -6.5 -224.051 -6.313 QT
-223.879 -6.047 -223.621 -5.906 QT
-223.363 -5.766 -223.02 -5.766 QT
-222.207 -5.766 -221.738 -6.398 QT
-221.27 -7.031 -221.27 -8.156 QT
-221.27 -12.203 L
-218.645 -12.203 L
-218.645 -4 L
-221.27 -4 L
-221.27 -5.188 L
-221.863 -4.469 -222.528 -4.125 QT
-223.192 -3.781 -223.988 -3.781 QT
-225.41 -3.781 -226.153 -4.656 QT
-226.895 -5.531 -226.895 -7.188 QT
cp
-216.367 -15.391 M
-213.758 -15.391 L
-213.758 -9.188 L
-210.726 -12.203 L
-207.679 -12.203 L
-211.695 -8.438 L
-207.367 -4 L
-210.554 -4 L
-213.758 -7.422 L
-213.758 -4 L
-216.367 -4 L
-216.367 -15.391 L
cp
-203.761 -14.531 M
-203.761 -12.203 L
-201.057 -12.203 L
-201.057 -10.328 L
-203.761 -10.328 L
-203.761 -6.844 L
-203.761 -6.281 -203.534 -6.078 QT
-203.307 -5.875 -202.636 -5.875 QT
-201.292 -5.875 L
-201.292 -4 L
-203.542 -4 L
-205.089 -4 -205.737 -4.648 QT
-206.386 -5.297 -206.386 -6.844 QT
-206.386 -10.328 L
-207.682 -10.328 L
-207.682 -12.203 L
-206.386 -12.203 L
-206.386 -14.531 L
-203.761 -14.531 L
cp
-195.723 -10.531 M
-196.583 -10.531 -197.044 -9.906 QT
-197.505 -9.281 -197.505 -8.094 QT
-197.505 -6.922 -197.044 -6.289 QT
-196.583 -5.656 -195.723 -5.656 QT
-194.864 -5.656 -194.411 -6.289 QT
-193.958 -6.922 -193.958 -8.094 QT
-193.958 -9.281 -194.411 -9.906 QT
-194.864 -10.531 -195.723 -10.531 QT
cp
-195.723 -12.406 M
-193.598 -12.406 -192.411 -11.258 QT
-191.223 -10.109 -191.223 -8.094 QT
-191.223 -6.078 -192.411 -4.93 QT
-193.598 -3.781 -195.723 -3.781 QT
-197.833 -3.781 -199.036 -4.93 QT
-200.239 -6.078 -200.239 -8.094 QT
-200.239 -10.109 -199.036 -11.258 QT
-197.833 -12.406 -195.723 -12.406 QT
cp
-183.451 -9.969 M
-183.795 -10.125 -184.139 -10.203 QT
-184.482 -10.281 -184.826 -10.281 QT
-185.842 -10.281 -186.389 -9.633 QT
-186.936 -8.984 -186.936 -7.781 QT
-186.936 -4 L
-189.545 -4 L
-189.545 -12.203 L
-186.936 -12.203 L
-186.936 -10.859 L
-186.42 -11.656 -185.764 -12.031 QT
-185.107 -12.406 -184.201 -12.406 QT
-184.061 -12.406 -183.912 -12.391 QT
-183.764 -12.375 -183.467 -12.344 QT
-183.451 -9.969 L
cp
-170.808 -11.953 M
-170.808 -9.953 L
-171.652 -10.313 -172.433 -10.484 QT
-173.214 -10.656 -173.918 -10.656 QT
-174.668 -10.656 -175.027 -10.469 QT
-175.386 -10.281 -175.386 -9.891 QT
-175.386 -9.578 -175.113 -9.414 QT
-174.839 -9.25 -174.136 -9.156 QT
-173.668 -9.094 L
-171.652 -8.844 -170.957 -8.258 QT
-170.261 -7.672 -170.261 -6.422 QT
-170.261 -5.109 -171.23 -4.445 QT
-172.199 -3.781 -174.121 -3.781 QT
-174.933 -3.781 -175.8 -3.914 QT
-176.668 -4.047 -177.574 -4.297 QT
-177.574 -6.297 L
-176.793 -5.906 -175.972 -5.719 QT
-175.152 -5.531 -174.293 -5.531 QT
-173.527 -5.531 -173.136 -5.742 QT
-172.746 -5.953 -172.746 -6.375 QT
-172.746 -6.719 -173.019 -6.891 QT
-173.293 -7.063 -174.089 -7.172 QT
-174.543 -7.219 L
-176.293 -7.438 -176.996 -8.031 QT
-177.699 -8.625 -177.699 -9.844 QT
-177.699 -11.141 -176.808 -11.773 QT
-175.918 -12.406 -174.074 -12.406 QT
-173.339 -12.406 -172.543 -12.297 QT
-171.746 -12.188 -170.808 -11.953 QT
cp
-165.631 -14.531 M
-165.631 -12.203 L
-162.928 -12.203 L
-162.928 -10.328 L
-165.631 -10.328 L
-165.631 -6.844 L
-165.631 -6.281 -165.405 -6.078 QT
-165.178 -5.875 -164.506 -5.875 QT
-163.163 -5.875 L
-163.163 -4 L
-165.413 -4 L
-166.96 -4 -167.608 -4.648 QT
-168.256 -5.297 -168.256 -6.844 QT
-168.256 -10.328 L
-169.553 -10.328 L
-169.553 -12.203 L
-168.256 -12.203 L
-168.256 -14.531 L
-165.631 -14.531 L
cp
-157.813 -7.688 M
-158.641 -7.688 -159.055 -7.414 QT
-159.469 -7.141 -159.469 -6.594 QT
-159.469 -6.094 -159.133 -5.813 QT
-158.797 -5.531 -158.203 -5.531 QT
-157.469 -5.531 -156.961 -6.063 QT
-156.453 -6.594 -156.453 -7.391 QT
-156.453 -7.688 L
-157.813 -7.688 L
cp
-153.813 -8.688 M
-153.813 -4 L
-156.453 -4 L
-156.453 -5.219 L
-156.985 -4.469 -157.641 -4.125 QT
-158.297 -3.781 -159.235 -3.781 QT
-160.516 -3.781 -161.313 -4.531 QT
-162.11 -5.281 -162.11 -6.469 QT
-162.11 -7.906 -161.118 -8.578 QT
-160.125 -9.25 -158 -9.25 QT
-156.453 -9.25 L
-156.453 -9.453 L
-156.453 -10.078 -156.946 -10.367 QT
-157.438 -10.656 -158.469 -10.656 QT
-159.313 -10.656 -160.039 -10.492 QT
-160.766 -10.328 -161.391 -9.984 QT
-161.391 -11.984 L
-160.547 -12.188 -159.696 -12.297 QT
-158.844 -12.406 -158 -12.406 QT
-155.782 -12.406 -154.797 -11.531 QT
-153.813 -10.656 -153.813 -8.688 QT
cp
-152.626 -12.203 M
-150.017 -12.203 L
-147.97 -6.531 L
-145.938 -12.203 L
-143.298 -12.203 L
-146.532 -4 L
-149.407 -4 L
-152.626 -12.203 L
cp
-142.135 -7.188 M
-142.135 -12.203 L
-139.494 -12.203 L
-139.494 -11.391 L
-139.494 -10.719 -139.502 -9.711 QT
-139.51 -8.703 -139.51 -8.359 QT
-139.51 -7.375 -139.463 -6.938 QT
-139.416 -6.5 -139.291 -6.313 QT
-139.119 -6.047 -138.861 -5.906 QT
-138.603 -5.766 -138.26 -5.766 QT
-137.447 -5.766 -136.978 -6.398 QT
-136.51 -7.031 -136.51 -8.156 QT
-136.51 -12.203 L
-133.885 -12.203 L
-133.885 -4 L
-136.51 -4 L
-136.51 -5.188 L
-137.103 -4.469 -137.767 -4.125 QT
-138.432 -3.781 -139.228 -3.781 QT
-140.65 -3.781 -141.392 -4.656 QT
-142.135 -5.531 -142.135 -7.188 QT
cp
-120.098 -11.953 M
-120.098 -9.953 L
-120.942 -10.313 -121.723 -10.484 QT
-122.504 -10.656 -123.208 -10.656 QT
-123.958 -10.656 -124.317 -10.469 QT
-124.676 -10.281 -124.676 -9.891 QT
-124.676 -9.578 -124.403 -9.414 QT
-124.129 -9.25 -123.426 -9.156 QT
-122.958 -9.094 L
-120.942 -8.844 -120.247 -8.258 QT
-119.551 -7.672 -119.551 -6.422 QT
-119.551 -5.109 -120.52 -4.445 QT
-121.489 -3.781 -123.411 -3.781 QT
-124.223 -3.781 -125.09 -3.914 QT
-125.958 -4.047 -126.864 -4.297 QT
-126.864 -6.297 L
-126.083 -5.906 -125.262 -5.719 QT
-124.442 -5.531 -123.583 -5.531 QT
-122.817 -5.531 -122.426 -5.742 QT
-122.036 -5.953 -122.036 -6.375 QT
-122.036 -6.719 -122.309 -6.891 QT
-122.583 -7.063 -123.379 -7.172 QT
-123.833 -7.219 L
-125.583 -7.438 -126.286 -8.031 QT
-126.989 -8.625 -126.989 -9.844 QT
-126.989 -11.141 -126.098 -11.773 QT
-125.208 -12.406 -123.364 -12.406 QT
-122.629 -12.406 -121.833 -12.297 QT
-121.036 -12.188 -120.098 -11.953 QT
cp
-106.585 -9.969 M
-106.928 -10.125 -107.272 -10.203 QT
-107.616 -10.281 -107.96 -10.281 QT
-108.975 -10.281 -109.522 -9.633 QT
-110.069 -8.984 -110.069 -7.781 QT
-110.069 -4 L
-112.678 -4 L
-112.678 -12.203 L
-110.069 -12.203 L
-110.069 -10.859 L
-109.553 -11.656 -108.897 -12.031 QT
-108.241 -12.406 -107.335 -12.406 QT
-107.194 -12.406 -107.045 -12.391 QT
-106.897 -12.375 -106.6 -12.344 QT
-106.585 -9.969 L
cp
-101.56 -10.531 M
-102.419 -10.531 -102.88 -9.906 QT
-103.341 -9.281 -103.341 -8.094 QT
-103.341 -6.922 -102.88 -6.289 QT
-102.419 -5.656 -101.56 -5.656 QT
-100.7 -5.656 -100.247 -6.289 QT
-99.794 -6.922 -99.794 -8.094 QT
-99.794 -9.281 -100.247 -9.906 QT
-100.7 -10.531 -101.56 -10.531 QT
cp
-101.56 -12.406 M
-99.435 -12.406 -98.247 -11.258 QT
-97.06 -10.109 -97.06 -8.094 QT
-97.06 -6.078 -98.247 -4.93 QT
-99.435 -3.781 -101.56 -3.781 QT
-103.669 -3.781 -104.872 -4.93 QT
-106.075 -6.078 -106.075 -8.094 QT
-106.075 -10.109 -104.872 -11.258 QT
-103.669 -12.406 -101.56 -12.406 QT
cp
-95.788 -12.203 M
-88.631 -12.203 L
-88.631 -10.375 L
-92.959 -5.875 L
-88.631 -5.875 L
-88.631 -4 L
-95.975 -4 L
-95.975 -5.828 L
-91.647 -10.328 L
-95.788 -10.328 L
-95.788 -12.203 L
cp
-84.257 -13.25 M
-86.132 -16 L
-84.82 -16 L
-83.367 -14.328 L
-81.913 -16 L
-80.601 -16 L
-82.476 -13.25 L
-84.257 -13.25 L
cp
-80.445 -11.953 M
-80.445 -9.953 L
-81.288 -10.313 -82.07 -10.484 QT
-82.851 -10.656 -83.554 -10.656 QT
-84.304 -10.656 -84.663 -10.469 QT
-85.023 -10.281 -85.023 -9.891 QT
-85.023 -9.578 -84.749 -9.414 QT
-84.476 -9.25 -83.773 -9.156 QT
-83.304 -9.094 L
-81.288 -8.844 -80.593 -8.258 QT
-79.898 -7.672 -79.898 -6.422 QT
-79.898 -5.109 -80.867 -4.445 QT
-81.835 -3.781 -83.757 -3.781 QT
-84.57 -3.781 -85.437 -3.914 QT
-86.304 -4.047 -87.21 -4.297 QT
-87.21 -6.297 L
-86.429 -5.906 -85.609 -5.719 QT
-84.788 -5.531 -83.929 -5.531 QT
-83.163 -5.531 -82.773 -5.742 QT
-82.382 -5.953 -82.382 -6.375 QT
-82.382 -6.719 -82.656 -6.891 QT
-82.929 -7.063 -83.726 -7.172 QT
-84.179 -7.219 L
-85.929 -7.438 -86.632 -8.031 QT
-87.335 -8.625 -87.335 -9.844 QT
-87.335 -11.141 -86.445 -11.773 QT
-85.554 -12.406 -83.71 -12.406 QT
-82.976 -12.406 -82.179 -12.297 QT
-81.382 -12.188 -80.445 -11.953 QT
cp
-78.127 -12.203 M
-75.518 -12.203 L
-75.518 -4 L
-78.127 -4 L
-78.127 -12.203 L
cp
-75.659 -16 M
-73.58 -16 L
-76.284 -13.25 L
-77.721 -13.25 L
-75.659 -16 L
cp
-67.01 -9.969 M
-67.354 -10.125 -67.697 -10.203 QT
-68.041 -10.281 -68.385 -10.281 QT
-69.4 -10.281 -69.947 -9.633 QT
-70.494 -8.984 -70.494 -7.781 QT
-70.494 -4 L
-73.104 -4 L
-73.104 -12.203 L
-70.494 -12.203 L
-70.494 -10.859 L
-69.979 -11.656 -69.322 -12.031 QT
-68.666 -12.406 -67.76 -12.406 QT
-67.619 -12.406 -67.471 -12.391 QT
-67.322 -12.375 -67.025 -12.344 QT
-67.01 -9.969 L
cp
-70.51 -13.25 M
-72.385 -16 L
-71.072 -16 L
-69.619 -14.328 L
-68.166 -16 L
-66.854 -16 L
-68.729 -13.25 L
-70.51 -13.25 L
cp
-57.688 -8.125 M
-57.688 -7.375 L
-63.829 -7.375 L
-63.735 -6.453 -63.157 -5.992 QT
-62.579 -5.531 -61.563 -5.531 QT
-60.735 -5.531 -59.868 -5.773 QT
-59.001 -6.016 -58.079 -6.516 QT
-58.079 -4.5 L
-59.016 -4.141 -59.946 -3.961 QT
-60.876 -3.781 -61.797 -3.781 QT
-64.032 -3.781 -65.266 -4.914 QT
-66.501 -6.047 -66.501 -8.094 QT
-66.501 -10.094 -65.29 -11.25 QT
-64.079 -12.406 -61.954 -12.406 QT
-60.016 -12.406 -58.852 -11.242 QT
-57.688 -10.078 -57.688 -8.125 QT
cp
-60.391 -9 M
-60.391 -9.75 -60.829 -10.203 QT
-61.266 -10.656 -61.969 -10.656 QT
-62.719 -10.656 -63.196 -10.227 QT
-63.672 -9.797 -63.797 -9 QT
-60.391 -9 L
cp
-47.701 -9 M
-47.701 -4 L
-50.326 -4 L
-50.326 -4.813 L
-50.326 -7.828 L
-50.326 -8.891 -50.373 -9.289 QT
-50.42 -9.688 -50.545 -9.875 QT
-50.701 -10.141 -50.959 -10.281 QT
-51.217 -10.422 -51.56 -10.422 QT
-52.389 -10.422 -52.857 -9.789 QT
-53.326 -9.156 -53.326 -8.031 QT
-53.326 -4 L
-55.935 -4 L
-55.935 -12.203 L
-53.326 -12.203 L
-53.326 -11 L
-52.732 -11.719 -52.06 -12.063 QT
-51.389 -12.406 -50.592 -12.406 QT
-49.17 -12.406 -48.435 -11.531 QT
-47.701 -10.656 -47.701 -9 QT
cp
-41.611 -10.531 M
-42.47 -10.531 -42.931 -9.906 QT
-43.392 -9.281 -43.392 -8.094 QT
-43.392 -6.922 -42.931 -6.289 QT
-42.47 -5.656 -41.611 -5.656 QT
-40.751 -5.656 -40.298 -6.289 QT
-39.845 -6.922 -39.845 -8.094 QT
-39.845 -9.281 -40.298 -9.906 QT
-40.751 -10.531 -41.611 -10.531 QT
cp
-41.611 -12.406 M
-39.486 -12.406 -38.298 -11.258 QT
-37.111 -10.109 -37.111 -8.094 QT
-37.111 -6.078 -38.298 -4.93 QT
-39.486 -3.781 -41.611 -3.781 QT
-43.72 -3.781 -44.923 -4.93 QT
-46.126 -6.078 -46.126 -8.094 QT
-46.126 -10.109 -44.923 -11.258 QT
-43.72 -12.406 -41.611 -12.406 QT
cp
-35.526 -7.188 M
-35.526 -12.203 L
-32.886 -12.203 L
-32.886 -11.391 L
-32.886 -10.719 -32.893 -9.711 QT
-32.901 -8.703 -32.901 -8.359 QT
-32.901 -7.375 -32.854 -6.938 QT
-32.807 -6.5 -32.682 -6.313 QT
-32.511 -6.047 -32.253 -5.906 QT
-31.995 -5.766 -31.651 -5.766 QT
-30.839 -5.766 -30.37 -6.398 QT
-29.901 -7.031 -29.901 -8.156 QT
-29.901 -12.203 L
-27.276 -12.203 L
-27.276 -4 L
-29.901 -4 L
-29.901 -5.188 L
-30.495 -4.469 -31.159 -4.125 QT
-31.823 -3.781 -32.62 -3.781 QT
-34.042 -3.781 -34.784 -4.656 QT
-35.526 -5.531 -35.526 -7.188 QT
cp
-13.49 -11.953 M
-13.49 -9.953 L
-14.333 -10.313 -15.115 -10.484 QT
-15.896 -10.656 -16.599 -10.656 QT
-17.349 -10.656 -17.708 -10.469 QT
-18.068 -10.281 -18.068 -9.891 QT
-18.068 -9.578 -17.794 -9.414 QT
-17.521 -9.25 -16.818 -9.156 QT
-16.349 -9.094 L
-14.333 -8.844 -13.638 -8.258 QT
-12.943 -7.672 -12.943 -6.422 QT
-12.943 -5.109 -13.912 -4.445 QT
-14.88 -3.781 -16.802 -3.781 QT
-17.615 -3.781 -18.482 -3.914 QT
-19.349 -4.047 -20.255 -4.297 QT
-20.255 -6.297 L
-19.474 -5.906 -18.654 -5.719 QT
-17.833 -5.531 -16.974 -5.531 QT
-16.208 -5.531 -15.818 -5.742 QT
-15.427 -5.953 -15.427 -6.375 QT
-15.427 -6.719 -15.701 -6.891 QT
-15.974 -7.063 -16.771 -7.172 QT
-17.224 -7.219 L
-18.974 -7.438 -19.677 -8.031 QT
-20.38 -8.625 -20.38 -9.844 QT
-20.38 -11.141 -19.49 -11.773 QT
-18.599 -12.406 -16.755 -12.406 QT
-16.021 -12.406 -15.224 -12.297 QT
-14.427 -12.188 -13.49 -11.953 QT
cp
-8.313 -14.531 M
-8.313 -12.203 L
-5.61 -12.203 L
-5.61 -10.328 L
-8.313 -10.328 L
-8.313 -6.844 L
-8.313 -6.281 -8.086 -6.078 QT
-7.86 -5.875 -7.188 -5.875 QT
-5.844 -5.875 L
-5.844 -4 L
-8.094 -4 L
-9.641 -4 -10.289 -4.648 QT
-10.938 -5.297 -10.938 -6.844 QT
-10.938 -10.328 L
-12.235 -10.328 L
-12.235 -12.203 L
-10.938 -12.203 L
-10.938 -14.531 L
-8.313 -14.531 L
cp
-0.494 -7.688 M
-1.322 -7.688 -1.737 -7.414 QT
-2.151 -7.141 -2.151 -6.594 QT
-2.151 -6.094 -1.815 -5.813 QT
-1.479 -5.531 -0.885 -5.531 QT
-0.151 -5.531 0.357 -6.063 QT
0.865 -6.594 0.865 -7.391 QT
0.865 -7.688 L
-0.494 -7.688 L
cp
3.506 -8.688 M
3.506 -4 L
0.865 -4 L
0.865 -5.219 L
0.334 -4.469 -0.322 -4.125 QT
-0.979 -3.781 -1.916 -3.781 QT
-3.197 -3.781 -3.994 -4.531 QT
-4.791 -5.281 -4.791 -6.469 QT
-4.791 -7.906 -3.799 -8.578 QT
-2.807 -9.25 -0.682 -9.25 QT
0.865 -9.25 L
0.865 -9.453 L
0.865 -10.078 0.373 -10.367 QT
-0.119 -10.656 -1.151 -10.656 QT
-1.994 -10.656 -2.721 -10.492 QT
-3.447 -10.328 -4.072 -9.984 QT
-4.072 -11.984 L
-3.229 -12.188 -2.377 -12.297 QT
-1.526 -12.406 -0.682 -12.406 QT
1.537 -12.406 2.521 -11.531 QT
3.506 -10.656 3.506 -8.688 QT
cp
4.693 -12.203 M
7.302 -12.203 L
9.349 -6.531 L
11.38 -12.203 L
14.021 -12.203 L
10.786 -4 L
7.911 -4 L
4.693 -12.203 L
cp
19.168 -10.531 M
18.309 -10.531 17.848 -9.906 QT
17.387 -9.281 17.387 -8.094 QT
17.387 -6.922 17.848 -6.289 QT
18.309 -5.656 19.168 -5.656 QT
20.028 -5.656 20.481 -6.289 QT
20.934 -6.922 20.934 -8.094 QT
20.934 -9.281 20.481 -9.906 QT
20.028 -10.531 19.168 -10.531 QT
cp
19.168 -12.406 M
21.293 -12.406 22.481 -11.258 QT
23.668 -10.109 23.668 -8.094 QT
23.668 -6.078 22.481 -4.93 QT
21.293 -3.781 19.168 -3.781 QT
17.059 -3.781 15.856 -4.93 QT
14.653 -6.078 14.653 -8.094 QT
14.653 -10.109 15.856 -11.258 QT
17.059 -12.406 19.168 -12.406 QT
cp
24.315 -12.203 M
26.925 -12.203 L
28.972 -6.531 L
31.003 -12.203 L
33.644 -12.203 L
30.409 -4 L
27.534 -4 L
24.315 -12.203 L
cp
38.791 -10.531 M
37.932 -10.531 37.471 -9.906 QT
37.01 -9.281 37.01 -8.094 QT
37.01 -6.922 37.471 -6.289 QT
37.932 -5.656 38.791 -5.656 QT
39.65 -5.656 40.104 -6.289 QT
40.557 -6.922 40.557 -8.094 QT
40.557 -9.281 40.104 -9.906 QT
39.65 -10.531 38.791 -10.531 QT
cp
38.791 -12.406 M
40.916 -12.406 42.104 -11.258 QT
43.291 -10.109 43.291 -8.094 QT
43.291 -6.078 42.104 -4.93 QT
40.916 -3.781 38.791 -3.781 QT
36.682 -3.781 35.479 -4.93 QT
34.275 -6.078 34.275 -8.094 QT
34.275 -10.109 35.479 -11.258 QT
36.682 -12.406 38.791 -12.406 QT
cp
44.876 -7.188 M
44.876 -12.203 L
47.516 -12.203 L
47.516 -11.391 L
47.516 -10.719 47.509 -9.711 QT
47.501 -8.703 47.501 -8.359 QT
47.501 -7.375 47.548 -6.938 QT
47.594 -6.5 47.719 -6.313 QT
47.891 -6.047 48.149 -5.906 QT
48.407 -5.766 48.751 -5.766 QT
49.563 -5.766 50.032 -6.398 QT
50.501 -7.031 50.501 -8.156 QT
50.501 -12.203 L
53.126 -12.203 L
53.126 -4 L
50.501 -4 L
50.501 -5.188 L
49.907 -4.469 49.243 -4.125 QT
48.579 -3.781 47.782 -3.781 QT
46.36 -3.781 45.618 -4.656 QT
44.876 -5.531 44.876 -7.188 QT
cp
60.1 -12.203 M
67.256 -12.203 L
67.256 -10.375 L
62.928 -5.875 L
67.256 -5.875 L
67.256 -4 L
59.912 -4 L
59.912 -5.828 L
64.24 -10.328 L
60.1 -10.328 L
60.1 -12.203 L
cp
71.646 -5.188 M
71.646 -0.875 L
69.036 -0.875 L
69.036 -12.203 L
71.646 -12.203 L
71.646 -11 L
72.193 -11.719 72.857 -12.063 QT
73.521 -12.406 74.365 -12.406 QT
75.88 -12.406 76.857 -11.195 QT
77.833 -9.984 77.833 -8.094 QT
77.833 -6.203 76.857 -4.992 QT
75.88 -3.781 74.365 -3.781 QT
73.521 -3.781 72.857 -4.125 QT
72.193 -4.469 71.646 -5.188 QT
cp
73.396 -10.5 M
72.552 -10.5 72.099 -9.883 QT
71.646 -9.266 71.646 -8.094 QT
71.646 -6.938 72.099 -6.313 QT
72.552 -5.688 73.396 -5.688 QT
74.24 -5.688 74.685 -6.305 QT
75.13 -6.922 75.13 -8.094 QT
75.13 -9.266 74.685 -9.883 QT
74.24 -10.5 73.396 -10.5 QT
cp
87.715 -8.125 M
87.715 -7.375 L
81.574 -7.375 L
81.668 -6.453 82.246 -5.992 QT
82.824 -5.531 83.84 -5.531 QT
84.668 -5.531 85.535 -5.773 QT
86.403 -6.016 87.324 -6.516 QT
87.324 -4.5 L
86.387 -4.141 85.457 -3.961 QT
84.528 -3.781 83.606 -3.781 QT
81.371 -3.781 80.137 -4.914 QT
78.903 -6.047 78.903 -8.094 QT
78.903 -10.094 80.114 -11.25 QT
81.324 -12.406 83.449 -12.406 QT
85.387 -12.406 86.551 -11.242 QT
87.715 -10.078 87.715 -8.125 QT
cp
85.012 -9 M
85.012 -9.75 84.574 -10.203 QT
84.137 -10.656 83.434 -10.656 QT
82.684 -10.656 82.207 -10.227 QT
81.731 -9.797 81.606 -9 QT
85.012 -9 L
cp
83.121 -13.25 M
81.246 -16 L
82.559 -16 L
84.012 -14.328 L
85.465 -16 L
86.778 -16 L
84.903 -13.25 L
83.121 -13.25 L
cp
92.327 -14.531 M
92.327 -12.203 L
95.03 -12.203 L
95.03 -10.328 L
92.327 -10.328 L
92.327 -6.844 L
92.327 -6.281 92.554 -6.078 QT
92.78 -5.875 93.452 -5.875 QT
94.796 -5.875 L
94.796 -4 L
92.546 -4 L
90.999 -4 90.351 -4.648 QT
89.702 -5.297 89.702 -6.844 QT
89.702 -10.328 L
88.405 -10.328 L
88.405 -12.203 L
89.702 -12.203 L
89.702 -14.531 L
92.327 -14.531 L
cp
104.708 -9 M
104.708 -4 L
102.083 -4 L
102.083 -4.813 L
102.083 -7.828 L
102.083 -8.891 102.036 -9.289 QT
101.99 -9.688 101.865 -9.875 QT
101.708 -10.141 101.451 -10.281 QT
101.193 -10.422 100.849 -10.422 QT
100.021 -10.422 99.552 -9.789 QT
99.083 -9.156 99.083 -8.031 QT
99.083 -4 L
96.474 -4 L
96.474 -12.203 L
99.083 -12.203 L
99.083 -11 L
99.677 -11.719 100.349 -12.063 QT
101.021 -12.406 101.818 -12.406 QT
103.24 -12.406 103.974 -11.531 QT
104.708 -10.656 104.708 -9 QT
cp
110.799 -10.531 M
109.939 -10.531 109.478 -9.906 QT
109.017 -9.281 109.017 -8.094 QT
109.017 -6.922 109.478 -6.289 QT
109.939 -5.656 110.799 -5.656 QT
111.658 -5.656 112.111 -6.289 QT
112.564 -6.922 112.564 -8.094 QT
112.564 -9.281 112.111 -9.906 QT
111.658 -10.531 110.799 -10.531 QT
cp
110.799 -12.406 M
112.924 -12.406 114.111 -11.258 QT
115.299 -10.109 115.299 -8.094 QT
115.299 -6.078 114.111 -4.93 QT
112.924 -3.781 110.799 -3.781 QT
108.689 -3.781 107.486 -4.93 QT
106.283 -6.078 106.283 -8.094 QT
106.283 -10.109 107.486 -11.258 QT
108.689 -12.406 110.799 -12.406 QT
cp
116.883 -7.188 M
116.883 -12.203 L
119.524 -12.203 L
119.524 -11.391 L
119.524 -10.719 119.516 -9.711 QT
119.508 -8.703 119.508 -8.359 QT
119.508 -7.375 119.555 -6.938 QT
119.602 -6.5 119.727 -6.313 QT
119.899 -6.047 120.157 -5.906 QT
120.414 -5.766 120.758 -5.766 QT
121.571 -5.766 122.039 -6.398 QT
122.508 -7.031 122.508 -8.156 QT
122.508 -12.203 L
125.133 -12.203 L
125.133 -4 L
122.508 -4 L
122.508 -5.188 L
121.914 -4.469 121.25 -4.125 QT
120.586 -3.781 119.789 -3.781 QT
118.368 -3.781 117.625 -4.656 QT
116.883 -5.531 116.883 -7.188 QT
cp
131.482 -12.203 M
134.092 -12.203 L
136.138 -6.531 L
138.17 -12.203 L
140.81 -12.203 L
137.576 -4 L
134.701 -4 L
131.482 -12.203 L
cp
145.739 -7.688 M
144.911 -7.688 144.497 -7.414 QT
144.083 -7.141 144.083 -6.594 QT
144.083 -6.094 144.419 -5.813 QT
144.755 -5.531 145.348 -5.531 QT
146.083 -5.531 146.591 -6.063 QT
147.098 -6.594 147.098 -7.391 QT
147.098 -7.688 L
145.739 -7.688 L
cp
149.739 -8.688 M
149.739 -4 L
147.098 -4 L
147.098 -5.219 L
146.567 -4.469 145.911 -4.125 QT
145.255 -3.781 144.317 -3.781 QT
143.036 -3.781 142.239 -4.531 QT
141.442 -5.281 141.442 -6.469 QT
141.442 -7.906 142.434 -8.578 QT
143.427 -9.25 145.552 -9.25 QT
147.098 -9.25 L
147.098 -9.453 L
147.098 -10.078 146.606 -10.367 QT
146.114 -10.656 145.083 -10.656 QT
144.239 -10.656 143.513 -10.492 QT
142.786 -10.328 142.161 -9.984 QT
142.161 -11.984 L
143.005 -12.188 143.856 -12.297 QT
144.708 -12.406 145.552 -12.406 QT
147.77 -12.406 148.755 -11.531 QT
149.739 -10.656 149.739 -8.688 QT
cp
151.551 -12.203 M
158.707 -12.203 L
158.707 -10.375 L
154.379 -5.875 L
158.707 -5.875 L
158.707 -4 L
151.364 -4 L
151.364 -5.828 L
155.692 -10.328 L
151.551 -10.328 L
151.551 -12.203 L
cp
164.847 -5.688 M
165.691 -5.688 166.136 -6.305 QT
166.581 -6.922 166.581 -8.094 QT
166.581 -9.266 166.136 -9.883 QT
165.691 -10.5 164.847 -10.5 QT
164.003 -10.5 163.55 -9.883 QT
163.097 -9.266 163.097 -8.094 QT
163.097 -6.938 163.55 -6.313 QT
164.003 -5.688 164.847 -5.688 QT
cp
163.097 -11 M
163.644 -11.719 164.308 -12.063 QT
164.972 -12.406 165.816 -12.406 QT
167.331 -12.406 168.308 -11.195 QT
169.285 -9.984 169.285 -8.094 QT
169.285 -6.203 168.308 -4.992 QT
167.331 -3.781 165.816 -3.781 QT
164.972 -3.781 164.308 -4.125 QT
163.644 -4.469 163.097 -5.188 QT
163.097 -4 L
160.488 -4 L
160.488 -15.391 L
163.097 -15.391 L
163.097 -11 L
cp
174.87 -10.531 M
174.01 -10.531 173.549 -9.906 QT
173.088 -9.281 173.088 -8.094 QT
173.088 -6.922 173.549 -6.289 QT
174.01 -5.656 174.87 -5.656 QT
175.729 -5.656 176.182 -6.289 QT
176.635 -6.922 176.635 -8.094 QT
176.635 -9.281 176.182 -9.906 QT
175.729 -10.531 174.87 -10.531 QT
cp
174.87 -12.406 M
176.995 -12.406 178.182 -11.258 QT
179.37 -10.109 179.37 -8.094 QT
179.37 -6.078 178.182 -4.93 QT
176.995 -3.781 174.87 -3.781 QT
172.76 -3.781 171.557 -4.93 QT
170.354 -6.078 170.354 -8.094 QT
170.354 -10.109 171.557 -11.258 QT
172.76 -12.406 174.87 -12.406 QT
cp
180.954 -7.188 M
180.954 -12.203 L
183.595 -12.203 L
183.595 -11.391 L
183.595 -10.719 183.587 -9.711 QT
183.579 -8.703 183.579 -8.359 QT
183.579 -7.375 183.626 -6.938 QT
183.673 -6.5 183.798 -6.313 QT
183.97 -6.047 184.228 -5.906 QT
184.485 -5.766 184.829 -5.766 QT
185.642 -5.766 186.11 -6.398 QT
186.579 -7.031 186.579 -8.156 QT
186.579 -12.203 L
189.204 -12.203 L
189.204 -4 L
186.579 -4 L
186.579 -5.188 L
185.985 -4.469 185.321 -4.125 QT
184.657 -3.781 183.86 -3.781 QT
182.439 -3.781 181.696 -4.656 QT
180.954 -5.531 180.954 -7.188 QT
cp
202.991 -11.953 M
202.991 -9.953 L
202.147 -10.313 201.366 -10.484 QT
200.584 -10.656 199.881 -10.656 QT
199.131 -10.656 198.772 -10.469 QT
198.413 -10.281 198.413 -9.891 QT
198.413 -9.578 198.686 -9.414 QT
198.959 -9.25 199.663 -9.156 QT
200.131 -9.094 L
202.147 -8.844 202.842 -8.258 QT
203.538 -7.672 203.538 -6.422 QT
203.538 -5.109 202.569 -4.445 QT
201.6 -3.781 199.678 -3.781 QT
198.866 -3.781 197.999 -3.914 QT
197.131 -4.047 196.225 -4.297 QT
196.225 -6.297 L
197.006 -5.906 197.827 -5.719 QT
198.647 -5.531 199.506 -5.531 QT
200.272 -5.531 200.663 -5.742 QT
201.053 -5.953 201.053 -6.375 QT
201.053 -6.719 200.78 -6.891 QT
200.506 -7.063 199.709 -7.172 QT
199.256 -7.219 L
197.506 -7.438 196.803 -8.031 QT
196.1 -8.625 196.1 -9.844 QT
196.1 -11.141 196.991 -11.773 QT
197.881 -12.406 199.725 -12.406 QT
200.459 -12.406 201.256 -12.297 QT
202.053 -12.188 202.991 -11.953 QT
cp
210.411 -12.203 M
213.02 -12.203 L
213.02 -4 L
210.411 -4 L
210.411 -12.203 L
cp
210.411 -15.391 M
213.02 -15.391 L
213.02 -13.266 L
210.411 -13.266 L
210.411 -15.391 L
cp
223.669 -9 M
223.669 -4 L
221.044 -4 L
221.044 -4.813 L
221.044 -7.828 L
221.044 -8.891 220.997 -9.289 QT
220.95 -9.688 220.825 -9.875 QT
220.669 -10.141 220.411 -10.281 QT
220.153 -10.422 219.809 -10.422 QT
218.981 -10.422 218.512 -9.789 QT
218.044 -9.156 218.044 -8.031 QT
218.044 -4 L
215.434 -4 L
215.434 -12.203 L
218.044 -12.203 L
218.044 -11 L
218.637 -11.719 219.309 -12.063 QT
219.981 -12.406 220.778 -12.406 QT
222.2 -12.406 222.934 -11.531 QT
223.669 -10.656 223.669 -9 QT
cp
228.728 -14.531 M
228.728 -12.203 L
231.431 -12.203 L
231.431 -10.328 L
228.728 -10.328 L
228.728 -6.844 L
228.728 -6.281 228.954 -6.078 QT
229.181 -5.875 229.853 -5.875 QT
231.196 -5.875 L
231.196 -4 L
228.946 -4 L
227.4 -4 226.751 -4.648 QT
226.103 -5.297 226.103 -6.844 QT
226.103 -10.328 L
224.806 -10.328 L
224.806 -12.203 L
226.103 -12.203 L
226.103 -14.531 L
228.728 -14.531 L
cp
241.062 -8.125 M
241.062 -7.375 L
234.921 -7.375 L
235.015 -6.453 235.593 -5.992 QT
236.171 -5.531 237.187 -5.531 QT
238.015 -5.531 238.882 -5.773 QT
239.749 -6.016 240.671 -6.516 QT
240.671 -4.5 L
239.734 -4.141 238.804 -3.961 QT
237.874 -3.781 236.953 -3.781 QT
234.718 -3.781 233.484 -4.914 QT
232.249 -6.047 232.249 -8.094 QT
232.249 -10.094 233.46 -11.25 QT
234.671 -12.406 236.796 -12.406 QT
238.734 -12.406 239.898 -11.242 QT
241.062 -10.078 241.062 -8.125 QT
cp
238.359 -9 M
238.359 -9.75 237.921 -10.203 QT
237.484 -10.656 236.781 -10.656 QT
236.031 -10.656 235.554 -10.227 QT
235.078 -9.797 234.953 -9 QT
238.359 -9 L
cp
248.393 -5.391 M
247.846 -4.672 247.197 -4.336 QT
246.549 -4 245.69 -4 QT
244.19 -4 243.205 -5.18 QT
242.221 -6.359 242.221 -8.203 QT
242.221 -10.031 243.205 -11.211 QT
244.19 -12.391 245.69 -12.391 QT
246.549 -12.391 247.197 -12.055 QT
247.846 -11.719 248.393 -10.984 QT
248.393 -12.203 L
251.033 -12.203 L
251.033 -4.828 L
251.033 -2.844 249.783 -1.805 QT
248.533 -0.766 246.158 -0.766 QT
245.393 -0.766 244.674 -0.883 QT
243.955 -1 243.221 -1.234 QT
243.221 -3.281 L
243.908 -2.891 244.572 -2.695 QT
245.236 -2.5 245.893 -2.5 QT
247.19 -2.5 247.791 -3.063 QT
248.393 -3.625 248.393 -4.828 QT
248.393 -5.391 L
cp
246.658 -10.5 M
245.846 -10.5 245.393 -9.898 QT
244.94 -9.297 244.94 -8.203 QT
244.94 -7.063 245.377 -6.484 QT
245.815 -5.906 246.658 -5.906 QT
247.486 -5.906 247.94 -6.508 QT
248.393 -7.109 248.393 -8.203 QT
248.393 -9.297 247.94 -9.898 QT
247.486 -10.5 246.658 -10.5 QT
cp
259.4 -9.969 M
259.056 -10.125 258.712 -10.203 QT
258.368 -10.281 258.025 -10.281 QT
257.009 -10.281 256.462 -9.633 QT
255.915 -8.984 255.915 -7.781 QT
255.915 -4 L
253.306 -4 L
253.306 -12.203 L
255.915 -12.203 L
255.915 -10.859 L
256.431 -11.656 257.087 -12.031 QT
257.743 -12.406 258.65 -12.406 QT
258.79 -12.406 258.939 -12.391 QT
259.087 -12.375 259.384 -12.344 QT
259.4 -9.969 L
cp
264.206 -7.688 M
263.377 -7.688 262.963 -7.414 QT
262.549 -7.141 262.549 -6.594 QT
262.549 -6.094 262.885 -5.813 QT
263.221 -5.531 263.815 -5.531 QT
264.549 -5.531 265.057 -6.063 QT
265.565 -6.594 265.565 -7.391 QT
265.565 -7.688 L
264.206 -7.688 L
cp
268.206 -8.688 M
268.206 -4 L
265.565 -4 L
265.565 -5.219 L
265.034 -4.469 264.377 -4.125 QT
263.721 -3.781 262.784 -3.781 QT
261.502 -3.781 260.706 -4.531 QT
259.909 -5.281 259.909 -6.469 QT
259.909 -7.906 260.901 -8.578 QT
261.893 -9.25 264.018 -9.25 QT
265.565 -9.25 L
265.565 -9.453 L
265.565 -10.078 265.073 -10.367 QT
264.581 -10.656 263.549 -10.656 QT
262.706 -10.656 261.979 -10.492 QT
261.252 -10.328 260.627 -9.984 QT
260.627 -11.984 L
261.471 -12.188 262.323 -12.297 QT
263.174 -12.406 264.018 -12.406 QT
266.237 -12.406 267.221 -11.531 QT
268.206 -10.656 268.206 -8.688 QT
cp
277.049 -11.953 M
277.049 -9.813 L
276.518 -10.172 275.979 -10.352 QT
275.439 -10.531 274.861 -10.531 QT
273.752 -10.531 273.143 -9.891 QT
272.533 -9.25 272.533 -8.094 QT
272.533 -6.938 273.143 -6.297 QT
273.752 -5.656 274.861 -5.656 QT
275.471 -5.656 276.025 -5.844 QT
276.58 -6.031 277.049 -6.391 QT
277.049 -4.234 L
276.424 -4.016 275.791 -3.898 QT
275.158 -3.781 274.533 -3.781 QT
272.314 -3.781 271.057 -4.922 QT
269.799 -6.063 269.799 -8.094 QT
269.799 -10.125 271.057 -11.266 QT
272.314 -12.406 274.533 -12.406 QT
275.174 -12.406 275.799 -12.289 QT
276.424 -12.172 277.049 -11.953 QT
cp
279.112 -12.203 M
281.721 -12.203 L
281.721 -4 L
279.112 -4 L
279.112 -12.203 L
cp
281.58 -16 M
283.659 -16 L
280.955 -13.25 L
279.518 -13.25 L
281.58 -16 L
cp
f
GR
GS
[0.75 0 0 0.75 0 -0.25] CT
0 0.447 0.741 RC
1 LJ
0.667 LW
N
127 485.412 M
127.003 485.412 L
127.021 485.412 L
127.107 485.412 L
127.538 485.412 L
129.693 485.412 L
133.221 485.412 L
137.58 485.412 L
142.628 485.412 L
148.601 485.412 L
149.307 485.412 L
149.307 163.176 L
149.307 163.176 L
152.312 163.176 L
155.317 163.176 L
158.91 163.176 L
162.997 163.176 L
166.466 163.176 L
166.466 163.176 L
166.466 163.176 L
169.511 163.176 L
172.556 163.176 L
176.048 163.176 L
180.177 163.176 L
184.952 163.176 L
190.708 163.176 L
197.961 163.176 L
207.376 163.176 L
212.795 163.176 L
212.795 163.176 L
217.785 163.176 L
222.774 163.176 L
228.959 163.176 L
235.956 163.176 L
244.182 163.176 L
254.086 163.176 L
266.504 163.176 L
281.604 163.176 L
296.704 163.176 L
298.591 163.176 L
298.591 163.176 L
298.591 163.176 L
303.579 163.176 L
308.567 163.176 L
315.468 163.176 L
323.757 163.176 L
334.724 163.176 L
349.824 163.176 L
364.924 163.176 L
380.024 163.176 L
395.124 163.176 L
410.224 163.176 L
425.324 163.176 L
440.424 163.176 L
455.524 163.176 L
470.624 163.176 L
485.724 163.176 L
500.824 163.176 L
515.924 163.176 L
531.024 163.176 L
546.124 163.176 L
561.224 163.176 L
576.324 163.176 L
591.424 163.176 L
606.524 163.176 L
621.624 163.176 L
636.724 163.176 L
651.824 163.176 L
666.924 163.176 L
682.024 163.176 L
697.124 163.176 L
712.224 163.176 L
727.324 163.176 L
742.424 163.176 L
757.524 163.176 L
772.624 163.176 L
787.724 163.176 L
802.824 163.176 L
817.924 163.176 L
833.024 163.176 L
848.124 163.176 L
863.224 163.176 L
878.324 163.176 L
882 163.176 L
S
GR
GS
[0.75 0 0 0.75 0 -0.25] CT
0.851 0.325 0.098 RC
1 LJ
0.667 LW
N
127 485.412 M
127.003 485.412 L
127.021 485.412 L
127.107 485.412 L
127.538 485.412 L
129.693 485.412 L
133.221 485.412 L
137.58 485.412 L
142.628 485.412 L
148.601 485.412 L
149.307 485.412 L
149.307 485.412 L
149.307 485.412 L
152.312 485.412 L
155.317 485.412 L
158.91 485.412 L
162.997 485.412 L
166.466 485.412 L
166.466 75.294 L
166.466 75.294 L
169.511 75.294 L
172.556 75.294 L
176.048 75.294 L
180.177 75.294 L
184.952 75.294 L
190.708 75.294 L
197.961 75.294 L
207.376 75.294 L
212.795 75.294 L
212.795 75.294 L
217.785 75.294 L
222.774 75.294 L
228.959 75.294 L
235.956 75.294 L
244.182 75.294 L
254.086 75.294 L
266.504 75.294 L
281.604 75.294 L
296.704 75.294 L
298.591 75.294 L
298.591 75.294 L
298.591 75.294 L
303.579 75.294 L
308.567 75.294 L
315.468 75.294 L
323.757 75.294 L
334.724 75.294 L
349.824 75.294 L
364.924 75.294 L
380.024 75.294 L
395.124 75.294 L
410.224 75.294 L
425.324 75.294 L
440.424 75.294 L
455.524 75.294 L
470.624 75.294 L
485.724 75.294 L
500.824 75.294 L
515.924 75.294 L
531.024 75.294 L
546.124 75.294 L
561.224 75.294 L
576.324 75.294 L
591.424 75.294 L
606.524 75.294 L
621.624 75.294 L
636.724 75.294 L
651.824 75.294 L
666.924 75.294 L
682.024 75.294 L
697.124 75.294 L
712.224 75.294 L
727.324 75.294 L
742.424 75.294 L
757.524 75.294 L
772.624 75.294 L
787.724 75.294 L
802.824 75.294 L
817.924 75.294 L
833.024 75.294 L
848.124 75.294 L
863.224 75.294 L
878.324 75.294 L
882 75.294 L
S
GR
GS
[0.75 0 0 0.75 0 -0.25] CT
0.929 0.694 0.125 RC
1 LJ
0.667 LW
N
127 456.118 M
127.003 456.111 L
127.021 456.077 L
127.107 455.91 L
127.538 455.129 L
129.693 452.405 L
133.221 450.88 L
137.58 451.737 L
142.628 454.449 L
148.601 458.54 L
149.307 459.045 L
149.307 459.045 L
149.307 459.045 L
152.312 461.396 L
155.317 462.874 L
158.91 461.957 L
162.997 457.224 L
166.466 450.715 L
166.466 450.715 L
166.466 450.715 L
169.511 440.816 L
172.556 427.335 L
176.048 410.969 L
180.177 392.662 L
184.952 373.99 L
190.708 354.942 L
197.961 335.083 L
207.376 313.892 L
212.795 303.297 L
212.795 215.415 L
217.785 206.558 L
222.774 199.591 L
228.959 193.96 L
235.956 190.671 L
244.182 189.232 L
254.086 188.947 L
266.504 188.966 L
281.604 188.468 L
296.704 187.268 L
298.591 187.078 L
298.591 187.078 L
298.591 187.078 L
303.579 185.906 L
308.567 184.423 L
315.468 182.797 L
323.757 181.482 L
334.724 180.23 L
349.824 178.7 L
364.924 177.163 L
380.024 175.636 L
395.124 174.167 L
410.224 172.793 L
425.324 171.533 L
440.424 170.396 L
455.524 169.382 L
470.624 168.487 L
485.724 167.703 L
500.824 167.022 L
515.924 166.433 L
531.024 165.927 L
546.124 165.494 L
561.224 165.125 L
576.324 164.811 L
591.424 164.545 L
606.524 164.32 L
621.624 164.131 L
636.724 163.972 L
651.824 163.838 L
666.924 163.727 L
682.024 163.633 L
697.124 163.555 L
712.224 163.49 L
727.324 163.436 L
742.424 163.391 L
757.524 163.354 L
772.624 163.323 L
787.724 163.297 L
802.824 163.276 L
817.924 163.258 L
833.024 163.244 L
848.124 163.232 L
863.224 163.222 L
878.324 163.214 L
882 163.212 L
S
GR
GS
[0.75 0 0 0.75 0 -0.25] CT
0.494 0.184 0.557 RC
1 LJ
0.667 LW
N
127 456.118 M
127.003 456.113 L
127.021 456.093 L
127.107 455.99 L
127.538 455.499 L
129.693 453.558 L
133.221 452.012 L
137.58 452.253 L
142.628 454.445 L
148.601 458.381 L
149.307 458.892 L
149.307 458.892 L
149.307 458.892 L
152.312 459.899 L
155.317 459.569 L
158.91 458.767 L
162.997 458.217 L
166.466 458.314 L
166.466 458.314 L
166.466 458.314 L
169.511 459.129 L
172.556 459.517 L
176.048 457.539 L
180.177 451.257 L
184.952 439.416 L
190.708 420.764 L
197.961 394.016 L
207.376 358.618 L
212.795 339.151 L
212.795 339.151 L
217.785 322.856 L
222.774 308.269 L
228.959 291.461 L
235.956 273.454 L
244.182 253.464 L
254.086 231.307 L
266.504 206.808 L
281.604 181.833 L
296.704 161.508 L
298.591 159.255 L
298.591 188.549 L
298.591 188.549 L
303.579 182.933 L
308.567 177.201 L
315.468 168.78 L
323.757 158.524 L
334.724 145.855 L
349.824 131.053 L
364.924 119.238 L
380.024 109.898 L
395.124 102.531 L
410.224 96.724 L
425.324 92.148 L
440.424 88.543 L
455.524 85.705 L
470.624 83.471 L
485.724 81.714 L
500.824 80.332 L
515.924 79.245 L
531.024 78.391 L
546.124 77.72 L
561.224 77.194 L
576.324 76.78 L
591.424 76.456 L
606.524 76.202 L
621.624 76.003 L
636.724 75.847 L
651.824 75.725 L
666.924 75.63 L
682.024 75.556 L
697.124 75.497 L
712.224 75.452 L
727.324 75.417 L
742.424 75.389 L
757.524 75.368 L
772.624 75.351 L
787.724 75.338 L
802.824 75.328 L
817.924 75.32 L
833.024 75.314 L
848.124 75.309 L
863.224 75.306 L
878.324 75.303 L
882 75.302 L
S
GR
GS
[0.75 0 0 0.75 0 -0.25] CT
0.467 0.675 0.188 RC
1 LJ
0.667 LW
N
127 485.412 M
127.003 485.412 L
127.021 485.412 L
127.107 485.412 L
127.538 485.412 L
129.693 485.412 L
133.221 485.412 L
137.58 485.412 L
142.628 485.412 L
148.601 485.412 L
149.307 485.412 L
149.307 485.412 L
149.307 485.412 L
152.312 485.412 L
155.317 485.412 L
158.91 485.412 L
162.997 485.412 L
166.466 485.412 L
166.466 485.412 L
166.466 485.412 L
169.511 485.412 L
172.556 485.412 L
176.048 485.412 L
180.177 485.412 L
184.952 485.412 L
190.708 485.412 L
197.961 485.412 L
207.376 485.412 L
212.795 485.412 L
212.795 397.529 L
217.785 397.529 L
222.774 397.529 L
228.959 397.529 L
235.956 397.529 L
244.182 397.529 L
254.086 397.529 L
266.504 397.529 L
281.604 397.529 L
296.704 397.529 L
298.591 397.529 L
298.591 397.529 L
298.591 397.529 L
303.579 397.529 L
308.567 397.529 L
315.468 397.529 L
323.757 397.529 L
334.724 397.529 L
349.824 397.529 L
364.924 397.529 L
380.024 397.529 L
395.124 397.529 L
410.224 397.529 L
425.324 397.529 L
440.424 397.529 L
455.524 397.529 L
470.624 397.529 L
485.724 397.529 L
500.824 397.529 L
515.924 397.529 L
531.024 397.529 L
546.124 397.529 L
561.224 397.529 L
576.324 397.529 L
591.424 397.529 L
606.524 397.529 L
621.624 397.529 L
636.724 397.529 L
651.824 397.529 L
666.924 397.529 L
682.024 397.529 L
697.124 397.529 L
712.224 397.529 L
727.324 397.529 L
742.424 397.529 L
757.524 397.529 L
772.624 397.529 L
787.724 397.529 L
802.824 397.529 L
817.924 397.529 L
833.024 397.529 L
848.124 397.529 L
863.224 397.529 L
878.324 397.529 L
882 397.529 L
S
GR
GS
[0.75 0 0 0.75 0 -0.25] CT
0.302 0.745 0.933 RC
1 LJ
0.667 LW
N
127 485.412 M
127.003 485.412 L
127.021 485.412 L
127.107 485.412 L
127.538 485.412 L
129.693 485.412 L
133.221 485.412 L
137.58 485.412 L
142.628 485.412 L
148.601 485.412 L
149.307 485.412 L
149.307 485.412 L
149.307 485.412 L
152.312 485.412 L
155.317 485.412 L
158.91 485.412 L
162.997 485.412 L
166.466 485.412 L
166.466 485.412 L
166.466 485.412 L
169.511 485.412 L
172.556 485.412 L
176.048 485.412 L
180.177 485.412 L
184.952 485.412 L
190.708 485.412 L
197.961 485.412 L
207.376 485.412 L
212.795 485.412 L
212.795 485.412 L
217.785 485.412 L
222.774 485.412 L
228.959 485.412 L
235.956 485.412 L
244.182 485.412 L
254.086 485.412 L
266.504 485.412 L
281.604 485.412 L
296.704 485.412 L
298.591 485.412 L
298.591 514.706 L
298.591 514.706 L
303.579 514.706 L
308.567 514.706 L
315.468 514.706 L
323.757 514.706 L
334.724 514.706 L
349.824 514.706 L
364.924 514.706 L
380.024 514.706 L
395.124 514.706 L
410.224 514.706 L
425.324 514.706 L
440.424 514.706 L
455.524 514.706 L
470.624 514.706 L
485.724 514.706 L
500.824 514.706 L
515.924 514.706 L
531.024 514.706 L
546.124 514.706 L
561.224 514.706 L
576.324 514.706 L
591.424 514.706 L
606.524 514.706 L
621.624 514.706 L
636.724 514.706 L
651.824 514.706 L
666.924 514.706 L
682.024 514.706 L
697.124 514.706 L
712.224 514.706 L
727.324 514.706 L
742.424 514.706 L
757.524 514.706 L
772.624 514.706 L
787.724 514.706 L
802.824 514.706 L
817.924 514.706 L
833.024 514.706 L
848.124 514.706 L
863.224 514.706 L
878.324 514.706 L
882 514.706 L
S
GR
GS
[0.75 0 0 0.75 0 -0.25] CT
0.635 0.078 0.184 RC
1 LJ
0.667 LW
N
127 485.412 M
127.003 485.412 L
127.021 485.412 L
127.107 485.412 L
127.538 485.412 L
129.693 485.412 L
133.221 485.412 L
137.58 485.412 L
142.628 485.412 L
148.601 485.412 L
149.307 485.412 L
149.307 485.412 L
149.307 485.412 L
152.312 485.412 L
155.317 485.412 L
158.91 485.412 L
162.997 485.412 L
166.466 485.412 L
166.466 368.235 L
166.466 368.235 L
169.511 368.235 L
172.556 368.235 L
176.048 368.235 L
180.177 368.235 L
184.952 368.235 L
190.708 368.235 L
197.961 368.235 L
207.376 368.235 L
212.795 368.235 L
212.795 368.235 L
217.785 368.235 L
222.774 368.235 L
228.959 368.235 L
235.956 368.235 L
244.182 368.235 L
254.086 368.235 L
266.504 368.235 L
281.604 368.235 L
296.704 368.235 L
298.591 368.235 L
298.591 368.235 L
298.591 368.235 L
303.579 368.235 L
308.567 368.235 L
315.468 368.235 L
323.757 368.235 L
334.724 368.235 L
349.824 368.235 L
364.924 368.235 L
380.024 368.235 L
395.124 368.235 L
410.224 368.235 L
425.324 368.235 L
440.424 368.235 L
455.524 368.235 L
470.624 368.235 L
485.724 368.235 L
500.824 368.235 L
515.924 368.235 L
531.024 368.235 L
546.124 368.235 L
561.224 368.235 L
576.324 368.235 L
591.424 368.235 L
606.524 368.235 L
621.624 368.235 L
636.724 368.235 L
651.824 368.235 L
666.924 368.235 L
682.024 368.235 L
697.124 368.235 L
712.224 368.235 L
727.324 368.235 L
742.424 368.235 L
757.524 368.235 L
772.624 368.235 L
787.724 368.235 L
802.824 368.235 L
817.924 368.235 L
833.024 368.235 L
848.124 368.235 L
863.224 368.235 L
878.324 368.235 L
882 368.235 L
S
GR
GS
[0.75 0 0 0.75 0 -0.25] CT
1 GC
N
665 335 M
665 181 L
846 181 L
846 335 L
cp
f
GR
GS
[0.75 0 0 0.75 526.5 146.75] CT
/Helvetica 12 F
GS
[1 0 0 1 0 0] CT
0 0 moveto 
1 -1 scale
(u) t 
GR
GR
GS
[0.75 0 0 0.75 532.5 151.25] CT
/Helvetica 9.6 F
GS
[1 0 0 1 0 0] CT
0 0 moveto 
1 -1 scale
(1) t 
GR
GR
GS
[0.75 0 0 0.75 0 -0.25] CT
0 0.447 0.741 RC
1 LJ
0.667 LW
N
669 193.5 M
699 193.5 L
S
GR
GS
[0.75 0 0 0.75 526.5 162.5] CT
/Helvetica 12 F
GS
[1 0 0 1 0 0] CT
0 0 moveto 
1 -1 scale
(u) t 
GR
GR
GS
[0.75 0 0 0.75 532.5 167] CT
/Helvetica 9.6 F
GS
[1 0 0 1 0 0] CT
0 0 moveto 
1 -1 scale
(2) t 
GR
GR
GS
[0.75 0 0 0.75 0 -0.25] CT
0.851 0.325 0.098 RC
1 LJ
0.667 LW
N
669 215 M
699 215 L
S
GR
GS
[0.75 0 0 0.75 526.5 179] CT
/Helvetica 12 F
GS
[1 0 0 1 0 0] CT
0 0 moveto 
1 -1 scale
(h) t 
GR
GR
GS
[0.75 0 0 0.75 532.5 183.5] CT
/Helvetica 9.6 F
GS
[1 0 0 1 0 0] CT
0 0 moveto 
1 -1 scale
(1) t 
GR
GR
GS
[0.75 0 0 0.75 0 -0.25] CT
0.929 0.694 0.125 RC
1 LJ
0.667 LW
N
669 236.5 M
699 236.5 L
S
GR
GS
[0.75 0 0 0.75 526.5 194.75] CT
/Helvetica 12 F
GS
[1 0 0 1 0 0] CT
0 0 moveto 
1 -1 scale
(h) t 
GR
GR
GS
[0.75 0 0 0.75 532.5 199.25] CT
/Helvetica 9.6 F
GS
[1 0 0 1 0 0] CT
0 0 moveto 
1 -1 scale
(2) t 
GR
GR
GS
[0.75 0 0 0.75 0 -0.25] CT
0.494 0.184 0.557 RC
1 LJ
0.667 LW
N
669 258 M
699 258 L
S
GR
GS
[0.75 0 0 0.75 526.5 211.25] CT
/Helvetica 12 F
GS
[1 0 0 1 0 0] CT
0 0 moveto 
1 -1 scale
(Chyba na v\375stupu y) t 
GR
GR
GS
[0.75 0 0 0.75 616.5 215.75] CT
/Helvetica 9.6 F
GS
[1 0 0 1 0 0] CT
0 0 moveto 
1 -1 scale
(1) t 
GR
GR
GS
[0.75 0 0 0.75 0 -0.25] CT
0.467 0.675 0.188 RC
1 LJ
0.667 LW
N
669 279.5 M
699 279.5 L
S
GR
GS
[0.75 0 0 0.75 526.5 227] CT
/Helvetica 12 F
GS
[1 0 0 1 0 0] CT
0 0 moveto 
1 -1 scale
(Chyba na v\375stupu y) t 
GR
GR
GS
[0.75 0 0 0.75 616.5 231.5] CT
/Helvetica 9.6 F
GS
[1 0 0 1 0 0] CT
0 0 moveto 
1 -1 scale
(2) t 
GR
GR
GS
[0.75 0 0 0.75 0 -0.25] CT
0.302 0.745 0.933 RC
1 LJ
0.667 LW
N
669 301 M
699 301 L
S
GR
GS
[0.75 0 0 0.75 526.5 243.5] CT
N
2.359 -7.781 M
2.359 -4.484 L
3.844 -4.484 L
4.672 -4.484 5.125 -4.914 QT
5.578 -5.344 5.578 -6.141 QT
5.578 -6.922 5.125 -7.352 QT
4.672 -7.781 3.844 -7.781 QT
2.359 -7.781 L
cp
1.172 -8.75 M
3.844 -8.75 L
5.328 -8.75 6.078 -8.086 QT
6.828 -7.422 6.828 -6.141 QT
6.828 -4.844 6.078 -4.18 QT
5.328 -3.516 3.844 -3.516 QT
2.359 -3.516 L
2.359 0 L
1.172 0 L
1.172 -8.75 L
cp
11.346 -3.297 M
10.049 -3.297 9.541 -3 QT
9.033 -2.703 9.033 -1.984 QT
9.033 -1.406 9.416 -1.07 QT
9.799 -0.734 10.439 -0.734 QT
11.346 -0.734 11.885 -1.367 QT
12.424 -2 12.424 -3.063 QT
12.424 -3.297 L
11.346 -3.297 L
cp
13.502 -3.75 M
13.502 0 L
12.424 0 L
12.424 -1 L
12.049 -0.406 11.502 -0.117 QT
10.955 0.172 10.158 0.172 QT
9.143 0.172 8.549 -0.398 QT
7.955 -0.969 7.955 -1.906 QT
7.955 -3.016 8.697 -3.578 QT
9.439 -4.141 10.908 -4.141 QT
12.424 -4.141 L
12.424 -4.25 L
12.424 -5 11.932 -5.406 QT
11.439 -5.813 10.564 -5.813 QT
10.002 -5.813 9.463 -5.672 QT
8.924 -5.531 8.439 -5.266 QT
8.439 -6.266 L
9.033 -6.5 9.588 -6.609 QT
10.143 -6.719 10.674 -6.719 QT
12.096 -6.719 12.799 -5.984 QT
13.502 -5.25 13.502 -3.75 QT
cp
19.527 -5.563 M
19.34 -5.656 19.129 -5.711 QT
18.918 -5.766 18.652 -5.766 QT
17.746 -5.766 17.254 -5.172 QT
16.762 -4.578 16.762 -3.453 QT
16.762 0 L
15.684 0 L
15.684 -6.563 L
16.762 -6.563 L
16.762 -5.547 L
17.105 -6.141 17.652 -6.43 QT
18.199 -6.719 18.98 -6.719 QT
19.09 -6.719 19.223 -6.703 QT
19.355 -6.688 19.512 -6.656 QT
19.527 -5.563 L
cp
23.633 -3.297 M
22.336 -3.297 21.828 -3 QT
21.32 -2.703 21.32 -1.984 QT
21.32 -1.406 21.703 -1.07 QT
22.086 -0.734 22.727 -0.734 QT
23.633 -0.734 24.172 -1.367 QT
24.711 -2 24.711 -3.063 QT
24.711 -3.297 L
23.633 -3.297 L
cp
25.789 -3.75 M
25.789 0 L
24.711 0 L
24.711 -1 L
24.336 -0.406 23.789 -0.117 QT
23.242 0.172 22.445 0.172 QT
21.43 0.172 20.836 -0.398 QT
20.242 -0.969 20.242 -1.906 QT
20.242 -3.016 20.984 -3.578 QT
21.727 -4.141 23.195 -4.141 QT
24.711 -4.141 L
24.711 -4.25 L
24.711 -5 24.219 -5.406 QT
23.727 -5.813 22.852 -5.813 QT
22.289 -5.813 21.75 -5.672 QT
21.211 -5.531 20.727 -5.266 QT
20.727 -6.266 L
21.32 -6.5 21.875 -6.609 QT
22.43 -6.719 22.961 -6.719 QT
24.383 -6.719 25.086 -5.984 QT
25.789 -5.25 25.789 -3.75 QT
cp
27.533 -6.563 M
32.658 -6.563 L
32.658 -5.578 L
28.611 -0.859 L
32.658 -0.859 L
32.658 0 L
27.393 0 L
27.393 -0.984 L
31.455 -5.703 L
27.533 -5.703 L
27.533 -6.563 L
cp
34.301 -6.563 M
35.379 -6.563 L
35.379 0 L
34.301 0 L
34.301 -6.563 L
cp
34.301 -9.125 M
35.379 -9.125 L
35.379 -7.75 L
34.301 -7.75 L
34.301 -9.125 L
cp
38.713 -8.422 M
38.713 -6.563 L
40.932 -6.563 L
40.932 -5.719 L
38.713 -5.719 L
38.713 -2.156 L
38.713 -1.359 38.932 -1.133 QT
39.15 -0.906 39.822 -0.906 QT
40.932 -0.906 L
40.932 0 L
39.822 0 L
38.572 0 38.096 -0.469 QT
37.619 -0.938 37.619 -2.156 QT
37.619 -5.719 L
36.838 -5.719 L
36.838 -6.563 L
37.619 -6.563 L
37.619 -8.422 L
38.713 -8.422 L
cp
47.809 -3.969 M
47.809 0 L
46.73 0 L
46.73 -3.922 L
46.73 -4.859 46.363 -5.32 QT
45.996 -5.781 45.277 -5.781 QT
44.402 -5.781 43.895 -5.227 QT
43.387 -4.672 43.387 -3.703 QT
43.387 0 L
42.309 0 L
42.309 -6.563 L
43.387 -6.563 L
43.387 -5.547 L
43.777 -6.141 44.301 -6.43 QT
44.824 -6.719 45.512 -6.719 QT
46.637 -6.719 47.223 -6.023 QT
47.809 -5.328 47.809 -3.969 QT
cp
51.633 -9.594 M
52.805 -9.594 L
50.898 -7.391 L
49.992 -7.391 L
51.633 -9.594 L
cp
49.945 -6.563 M
51.023 -6.563 L
51.023 0 L
49.945 0 L
49.945 -6.563 L
cp
58.141 -0.984 M
58.141 2.5 L
57.063 2.5 L
57.063 -6.563 L
58.141 -6.563 L
58.141 -5.563 L
58.484 -6.156 59 -6.438 QT
59.516 -6.719 60.234 -6.719 QT
61.438 -6.719 62.188 -5.773 QT
62.938 -4.828 62.938 -3.281 QT
62.938 -1.734 62.188 -0.781 QT
61.438 0.172 60.234 0.172 QT
59.516 0.172 59 -0.117 QT
58.484 -0.406 58.141 -0.984 QT
cp
61.813 -3.281 M
61.813 -4.469 61.32 -5.141 QT
60.828 -5.813 59.984 -5.813 QT
59.125 -5.813 58.633 -5.141 QT
58.141 -4.469 58.141 -3.281 QT
58.141 -2.094 58.633 -1.414 QT
59.125 -0.734 59.984 -0.734 QT
60.828 -0.734 61.32 -1.414 QT
61.813 -2.094 61.813 -3.281 QT
cp
68.523 -5.563 M
68.336 -5.656 68.125 -5.711 QT
67.914 -5.766 67.648 -5.766 QT
66.742 -5.766 66.25 -5.172 QT
65.758 -4.578 65.758 -3.453 QT
65.758 0 L
64.68 0 L
64.68 -6.563 L
65.758 -6.563 L
65.758 -5.547 L
66.102 -6.141 66.648 -6.43 QT
67.195 -6.719 67.977 -6.719 QT
68.086 -6.719 68.219 -6.703 QT
68.352 -6.688 68.508 -6.656 QT
68.523 -5.563 L
cp
66.148 -7.391 M
64.68 -9.594 L
65.508 -9.594 L
66.602 -8.156 L
67.68 -9.594 L
68.508 -9.594 L
67.039 -7.391 L
66.148 -7.391 L
cp
71.332 -9.594 M
72.504 -9.594 L
70.598 -7.391 L
69.691 -7.391 L
71.332 -9.594 L
cp
69.645 -6.563 M
70.723 -6.563 L
70.723 0 L
69.645 0 L
69.645 -6.563 L
cp
74.057 -8.422 M
74.057 -6.563 L
76.275 -6.563 L
76.275 -5.719 L
74.057 -5.719 L
74.057 -2.156 L
74.057 -1.359 74.275 -1.133 QT
74.494 -0.906 75.166 -0.906 QT
76.275 -0.906 L
76.275 0 L
75.166 0 L
73.916 0 73.439 -0.469 QT
72.963 -0.938 72.963 -2.156 QT
72.963 -5.719 L
72.182 -5.719 L
72.182 -6.563 L
72.963 -6.563 L
72.963 -8.422 L
74.057 -8.422 L
cp
80.23 -5.813 M
79.371 -5.813 78.863 -5.133 QT
78.355 -4.453 78.355 -3.281 QT
78.355 -2.094 78.855 -1.422 QT
79.355 -0.75 80.23 -0.75 QT
81.09 -0.75 81.598 -1.43 QT
82.105 -2.109 82.105 -3.281 QT
82.105 -4.438 81.598 -5.125 QT
81.09 -5.813 80.23 -5.813 QT
cp
80.23 -6.719 M
81.637 -6.719 82.441 -5.805 QT
83.246 -4.891 83.246 -3.281 QT
83.246 -1.672 82.441 -0.75 QT
81.637 0.172 80.23 0.172 QT
78.824 0.172 78.02 -0.75 QT
77.215 -1.672 77.215 -3.281 QT
77.215 -4.891 78.02 -5.805 QT
78.824 -6.719 80.23 -6.719 QT
cp
84.994 -9.125 M
86.072 -9.125 L
86.072 -3.734 L
89.291 -6.563 L
90.666 -6.563 L
87.182 -3.5 L
90.822 0 L
89.416 0 L
86.072 -3.203 L
86.072 0 L
84.994 0 L
84.994 -9.125 L
cp
95.68 -2.594 M
95.68 -6.563 L
96.758 -6.563 L
96.758 -2.625 L
96.758 -1.703 97.125 -1.234 QT
97.492 -0.766 98.211 -0.766 QT
99.086 -0.766 99.594 -1.32 QT
100.102 -1.875 100.102 -2.844 QT
100.102 -6.563 L
101.18 -6.563 L
101.18 0 L
100.102 0 L
100.102 -1.016 L
99.711 -0.406 99.195 -0.117 QT
98.68 0.172 97.992 0.172 QT
96.852 0.172 96.266 -0.531 QT
95.68 -1.234 95.68 -2.594 QT
cp
f
GR
GS
[0.75 0 0 0.75 603.75 248] CT
/Helvetica 9.6 F
GS
[1 0 0 1 0 0] CT
0 0 moveto 
1 -1 scale
(1) t 
GR
GR
GS
[0.75 0 0 0.75 609 243.5] CT
/Helvetica 12 F
GS
[1 0 0 1 0 0] CT
0 0 moveto 
1 -1 scale
( a u) t 
GR
GR
GS
[0.75 0 0 0.75 626.25 248] CT
/Helvetica 9.6 F
GS
[1 0 0 1 0 0] CT
0 0 moveto 
1 -1 scale
(2) t 
GR
GR
GS
[0.75 0 0 0.75 0 -0.25] CT
0.635 0.078 0.184 RC
1 LJ
0.667 LW
N
669 322.5 M
699 322.5 L
S
GR
GS
[0.75 0 0 0.75 0 -0.25] CT
0.149 GC
10.0 ML
0.667 LW
N
665 335 M
665 181 L
846 181 L
846 335 L
cp
S
GR
%%Trailer
%%Pages: 1
%%EOF
