%!PS-Adobe-3.0 EPSF-3.0
%%Creator: (MATLAB, The Mathworks, Inc. Version 9.1.0.441655 \(R2016b\). Operating System: Linux)
%%Title: /home/frdm/Documents/RLS/rls-2017/sp2/figures/f4_1.eps
%%CreationDate: 2017-11-14T03:11:11
%%Pages: (atend)
%%BoundingBox: 0 0 731 458
%%LanguageLevel: 3
%%EndComments
%%BeginProlog
%%BeginResource: procset (Apache XML Graphics Std ProcSet) 1.2 0
%%Version: 1.2 0
%%Copyright: (Copyright 2001-2003,2010 The Apache Software Foundation. License terms: http://www.apache.org/licenses/LICENSE-2.0)
/bd{bind def}bind def
/ld{load def}bd
/GR/grestore ld
/M/moveto ld
/LJ/setlinejoin ld
/C/curveto ld
/f/fill ld
/LW/setlinewidth ld
/GC/setgray ld
/t/show ld
/N/newpath ld
/CT/concat ld
/cp/closepath ld
/S/stroke ld
/L/lineto ld
/CC/setcmykcolor ld
/A/ashow ld
/GS/gsave ld
/RC/setrgbcolor ld
/RM/rmoveto ld
/ML/setmiterlimit ld
/re {4 2 roll M
1 index 0 rlineto
0 exch rlineto
neg 0 rlineto
cp } bd
/_ctm matrix def
/_tm matrix def
/BT { _ctm currentmatrix pop matrix _tm copy pop 0 0 moveto } bd
/ET { _ctm setmatrix } bd
/iTm { _ctm setmatrix _tm concat } bd
/Tm { _tm astore pop iTm 0 0 moveto } bd
/ux 0.0 def
/uy 0.0 def
/F {
  /Tp exch def
  /Tf exch def
  Tf findfont Tp scalefont setfont
  /cf Tf def  /cs Tp def
} bd
/ULS {currentpoint /uy exch def /ux exch def} bd
/ULE {
  /Tcx currentpoint pop def
  gsave
  newpath
  cf findfont cs scalefont dup
  /FontMatrix get 0 get /Ts exch def /FontInfo get dup
  /UnderlinePosition get Ts mul /To exch def
  /UnderlineThickness get Ts mul /Tt exch def
  ux uy To add moveto  Tcx uy To add lineto
  Tt setlinewidth stroke
  grestore
} bd
/OLE {
  /Tcx currentpoint pop def
  gsave
  newpath
  cf findfont cs scalefont dup
  /FontMatrix get 0 get /Ts exch def /FontInfo get dup
  /UnderlinePosition get Ts mul /To exch def
  /UnderlineThickness get Ts mul /Tt exch def
  ux uy To add cs add moveto Tcx uy To add cs add lineto
  Tt setlinewidth stroke
  grestore
} bd
/SOE {
  /Tcx currentpoint pop def
  gsave
  newpath
  cf findfont cs scalefont dup
  /FontMatrix get 0 get /Ts exch def /FontInfo get dup
  /UnderlinePosition get Ts mul /To exch def
  /UnderlineThickness get Ts mul /Tt exch def
  ux uy To add cs 10 mul 26 idiv add moveto Tcx uy To add cs 10 mul 26 idiv add lineto
  Tt setlinewidth stroke
  grestore
} bd
/QT {
/Y22 exch store
/X22 exch store
/Y21 exch store
/X21 exch store
currentpoint
/Y21 load 2 mul add 3 div exch
/X21 load 2 mul add 3 div exch
/X21 load 2 mul /X22 load add 3 div
/Y21 load 2 mul /Y22 load add 3 div
/X22 load /Y22 load curveto
} bd
/SSPD {
dup length /d exch dict def
{
/v exch def
/k exch def
currentpagedevice k known {
/cpdv currentpagedevice k get def
v cpdv ne {
/upd false def
/nullv v type /nulltype eq def
/nullcpdv cpdv type /nulltype eq def
nullv nullcpdv or
{
/upd true def
} {
/sametype v type cpdv type eq def
sametype {
v type /arraytype eq {
/vlen v length def
/cpdvlen cpdv length def
vlen cpdvlen eq {
0 1 vlen 1 sub {
/i exch def
/obj v i get def
/cpdobj cpdv i get def
obj cpdobj ne {
/upd true def
exit
} if
} for
} {
/upd true def
} ifelse
} {
v type /dicttype eq {
v {
/dv exch def
/dk exch def
/cpddv cpdv dk get def
dv cpddv ne {
/upd true def
exit
} if
} forall
} {
/upd true def
} ifelse
} ifelse
} if
} ifelse
upd true eq {
d k v put
} if
} if
} if
} forall
d length 0 gt {
d setpagedevice
} if
} bd
/RE { % /NewFontName [NewEncodingArray] /FontName RE -
  findfont dup length dict begin
  {
    1 index /FID ne
    {def} {pop pop} ifelse
  } forall
  /Encoding exch def
  /FontName 1 index def
  currentdict definefont pop
  end
} bind def
%%EndResource
%%BeginResource: procset (Apache XML Graphics EPS ProcSet) 1.0 0
%%Version: 1.0 0
%%Copyright: (Copyright 2002-2003 The Apache Software Foundation. License terms: http://www.apache.org/licenses/LICENSE-2.0)
/BeginEPSF { %def
/b4_Inc_state save def         % Save state for cleanup
/dict_count countdictstack def % Count objects on dict stack
/op_count count 1 sub def      % Count objects on operand stack
userdict begin                 % Push userdict on dict stack
/showpage { } def              % Redefine showpage, { } = null proc
0 setgray 0 setlinecap         % Prepare graphics state
1 setlinewidth 0 setlinejoin
10 setmiterlimit [ ] 0 setdash newpath
/languagelevel where           % If level not equal to 1 then
{pop languagelevel             % set strokeadjust and
1 ne                           % overprint to their defaults.
{false setstrokeadjust false setoverprint
} if
} if
} bd
/EndEPSF { %def
count op_count sub {pop} repeat            % Clean up stacks
countdictstack dict_count sub {end} repeat
b4_Inc_state restore
} bd
%%EndResource
%FOPBeginFontDict
%%IncludeResource: font Courier-Bold
%%IncludeResource: font Helvetica
%%IncludeResource: font Courier-BoldOblique
%%IncludeResource: font Courier-Oblique
%%IncludeResource: font Times-Roman
%%IncludeResource: font Helvetica-BoldOblique
%%IncludeResource: font Helvetica-Bold
%%IncludeResource: font Helvetica-Oblique
%%IncludeResource: font Times-BoldItalic
%%IncludeResource: font Courier
%%IncludeResource: font Times-Italic
%%IncludeResource: font Times-Bold
%%IncludeResource: font Symbol
%%IncludeResource: font ZapfDingbats
%FOPEndFontDict
%%BeginResource: encoding WinAnsiEncoding
/WinAnsiEncoding [
/.notdef /.notdef /.notdef /.notdef /.notdef
/.notdef /.notdef /.notdef /.notdef /.notdef
/.notdef /.notdef /.notdef /.notdef /.notdef
/.notdef /.notdef /.notdef /.notdef /.notdef
/.notdef /.notdef /.notdef /.notdef /.notdef
/.notdef /.notdef /.notdef /.notdef /.notdef
/.notdef /.notdef /space /exclam /quotedbl
/numbersign /dollar /percent /ampersand /quotesingle
/parenleft /parenright /asterisk /plus /comma
/hyphen /period /slash /zero /one
/two /three /four /five /six
/seven /eight /nine /colon /semicolon
/less /equal /greater /question /at
/A /B /C /D /E
/F /G /H /I /J
/K /L /M /N /O
/P /Q /R /S /T
/U /V /W /X /Y
/Z /bracketleft /backslash /bracketright /asciicircum
/underscore /quoteleft /a /b /c
/d /e /f /g /h
/i /j /k /l /m
/n /o /p /q /r
/s /t /u /v /w
/x /y /z /braceleft /bar
/braceright /asciitilde /bullet /Euro /bullet
/quotesinglbase /florin /quotedblbase /ellipsis /dagger
/daggerdbl /circumflex /perthousand /Scaron /guilsinglleft
/OE /bullet /Zcaron /bullet /bullet
/quoteleft /quoteright /quotedblleft /quotedblright /bullet
/endash /emdash /asciitilde /trademark /scaron
/guilsinglright /oe /bullet /zcaron /Ydieresis
/space /exclamdown /cent /sterling /currency
/yen /brokenbar /section /dieresis /copyright
/ordfeminine /guillemotleft /logicalnot /sfthyphen /registered
/macron /degree /plusminus /twosuperior /threesuperior
/acute /mu /paragraph /middot /cedilla
/onesuperior /ordmasculine /guillemotright /onequarter /onehalf
/threequarters /questiondown /Agrave /Aacute /Acircumflex
/Atilde /Adieresis /Aring /AE /Ccedilla
/Egrave /Eacute /Ecircumflex /Edieresis /Igrave
/Iacute /Icircumflex /Idieresis /Eth /Ntilde
/Ograve /Oacute /Ocircumflex /Otilde /Odieresis
/multiply /Oslash /Ugrave /Uacute /Ucircumflex
/Udieresis /Yacute /Thorn /germandbls /agrave
/aacute /acircumflex /atilde /adieresis /aring
/ae /ccedilla /egrave /eacute /ecircumflex
/edieresis /igrave /iacute /icircumflex /idieresis
/eth /ntilde /ograve /oacute /ocircumflex
/otilde /odieresis /divide /oslash /ugrave
/uacute /ucircumflex /udieresis /yacute /thorn
/ydieresis
] def
%%EndResource
%FOPBeginFontReencode
/Courier-Bold findfont
dup length dict begin
  {1 index /FID ne {def} {pop pop} ifelse} forall
  /Encoding WinAnsiEncoding def
  currentdict
end
/Courier-Bold exch definefont pop
/Helvetica findfont
dup length dict begin
  {1 index /FID ne {def} {pop pop} ifelse} forall
  /Encoding WinAnsiEncoding def
  currentdict
end
/Helvetica exch definefont pop
/Courier-BoldOblique findfont
dup length dict begin
  {1 index /FID ne {def} {pop pop} ifelse} forall
  /Encoding WinAnsiEncoding def
  currentdict
end
/Courier-BoldOblique exch definefont pop
/Courier-Oblique findfont
dup length dict begin
  {1 index /FID ne {def} {pop pop} ifelse} forall
  /Encoding WinAnsiEncoding def
  currentdict
end
/Courier-Oblique exch definefont pop
/Times-Roman findfont
dup length dict begin
  {1 index /FID ne {def} {pop pop} ifelse} forall
  /Encoding WinAnsiEncoding def
  currentdict
end
/Times-Roman exch definefont pop
/Helvetica-BoldOblique findfont
dup length dict begin
  {1 index /FID ne {def} {pop pop} ifelse} forall
  /Encoding WinAnsiEncoding def
  currentdict
end
/Helvetica-BoldOblique exch definefont pop
/Helvetica-Bold findfont
dup length dict begin
  {1 index /FID ne {def} {pop pop} ifelse} forall
  /Encoding WinAnsiEncoding def
  currentdict
end
/Helvetica-Bold exch definefont pop
/Helvetica-Oblique findfont
dup length dict begin
  {1 index /FID ne {def} {pop pop} ifelse} forall
  /Encoding WinAnsiEncoding def
  currentdict
end
/Helvetica-Oblique exch definefont pop
/Times-BoldItalic findfont
dup length dict begin
  {1 index /FID ne {def} {pop pop} ifelse} forall
  /Encoding WinAnsiEncoding def
  currentdict
end
/Times-BoldItalic exch definefont pop
/Courier findfont
dup length dict begin
  {1 index /FID ne {def} {pop pop} ifelse} forall
  /Encoding WinAnsiEncoding def
  currentdict
end
/Courier exch definefont pop
/Times-Italic findfont
dup length dict begin
  {1 index /FID ne {def} {pop pop} ifelse} forall
  /Encoding WinAnsiEncoding def
  currentdict
end
/Times-Italic exch definefont pop
/Times-Bold findfont
dup length dict begin
  {1 index /FID ne {def} {pop pop} ifelse} forall
  /Encoding WinAnsiEncoding def
  currentdict
end
/Times-Bold exch definefont pop
%FOPEndFontReencode
%%EndProlog
%%Page: 1 1
%%PageBoundingBox: 0 0 731 458
%%BeginPageSetup
[1 0 0 -1 0 458] CT
%%EndPageSetup
GS
[0.75 0 0 0.75 0 -0.25] CT
1 GC
N
0 0 975 611 re
f
GR
GS
[0.75 0 0 0.75 0 -0.25] CT
1 GC
N
0 0 975 611 re
f
GR
GS
[0.75 0 0 0.75 0 -0.25] CT
1 GC
N
127 544 M
882 544 L
882 46 L
127 46 L
cp
f
GR
GS
[0.75 0 0 0.75 0 -0.25] CT
0.149 GC
2 setlinecap
1 LJ
0.667 LW
N
127 544 M
882 544 L
S
GR
GS
[0.75 0 0 0.75 0 -0.25] CT
0.149 GC
2 setlinecap
1 LJ
0.667 LW
N
127 46 M
882 46 L
S
GR
GS
[0.75 0 0 0.75 0 -0.25] CT
0.149 GC
2 setlinecap
1 LJ
0.667 LW
N
127 544 M
127 536.45 L
S
GR
GS
[0.75 0 0 0.75 0 -0.25] CT
0.149 GC
2 setlinecap
1 LJ
0.667 LW
N
210.889 544 M
210.889 536.45 L
S
GR
GS
[0.75 0 0 0.75 0 -0.25] CT
0.149 GC
2 setlinecap
1 LJ
0.667 LW
N
294.778 544 M
294.778 536.45 L
S
GR
GS
[0.75 0 0 0.75 0 -0.25] CT
0.149 GC
2 setlinecap
1 LJ
0.667 LW
N
378.667 544 M
378.667 536.45 L
S
GR
GS
[0.75 0 0 0.75 0 -0.25] CT
0.149 GC
2 setlinecap
1 LJ
0.667 LW
N
462.556 544 M
462.556 536.45 L
S
GR
GS
[0.75 0 0 0.75 0 -0.25] CT
0.149 GC
2 setlinecap
1 LJ
0.667 LW
N
546.444 544 M
546.444 536.45 L
S
GR
GS
[0.75 0 0 0.75 0 -0.25] CT
0.149 GC
2 setlinecap
1 LJ
0.667 LW
N
630.333 544 M
630.333 536.45 L
S
GR
GS
[0.75 0 0 0.75 0 -0.25] CT
0.149 GC
2 setlinecap
1 LJ
0.667 LW
N
714.222 544 M
714.222 536.45 L
S
GR
GS
[0.75 0 0 0.75 0 -0.25] CT
0.149 GC
2 setlinecap
1 LJ
0.667 LW
N
798.111 544 M
798.111 536.45 L
S
GR
GS
[0.75 0 0 0.75 0 -0.25] CT
0.149 GC
2 setlinecap
1 LJ
0.667 LW
N
882 544 M
882 536.45 L
S
GR
GS
[0.75 0 0 0.75 0 -0.25] CT
0.149 GC
2 setlinecap
1 LJ
0.667 LW
N
127 46 M
127 53.55 L
S
GR
GS
[0.75 0 0 0.75 0 -0.25] CT
0.149 GC
2 setlinecap
1 LJ
0.667 LW
N
210.889 46 M
210.889 53.55 L
S
GR
GS
[0.75 0 0 0.75 0 -0.25] CT
0.149 GC
2 setlinecap
1 LJ
0.667 LW
N
294.778 46 M
294.778 53.55 L
S
GR
GS
[0.75 0 0 0.75 0 -0.25] CT
0.149 GC
2 setlinecap
1 LJ
0.667 LW
N
378.667 46 M
378.667 53.55 L
S
GR
GS
[0.75 0 0 0.75 0 -0.25] CT
0.149 GC
2 setlinecap
1 LJ
0.667 LW
N
462.556 46 M
462.556 53.55 L
S
GR
GS
[0.75 0 0 0.75 0 -0.25] CT
0.149 GC
2 setlinecap
1 LJ
0.667 LW
N
546.444 46 M
546.444 53.55 L
S
GR
GS
[0.75 0 0 0.75 0 -0.25] CT
0.149 GC
2 setlinecap
1 LJ
0.667 LW
N
630.333 46 M
630.333 53.55 L
S
GR
GS
[0.75 0 0 0.75 0 -0.25] CT
0.149 GC
2 setlinecap
1 LJ
0.667 LW
N
714.222 46 M
714.222 53.55 L
S
GR
GS
[0.75 0 0 0.75 0 -0.25] CT
0.149 GC
2 setlinecap
1 LJ
0.667 LW
N
798.111 46 M
798.111 53.55 L
S
GR
GS
[0.75 0 0 0.75 0 -0.25] CT
0.149 GC
2 setlinecap
1 LJ
0.667 LW
N
882 46 M
882 53.55 L
S
GR
GS
[0.75 0 0 0.75 95.25 411.74998] CT
0.149 GC
/Helvetica 13.333 F
GS
[1 0 0 1 0 0] CT
-4.5 13 moveto 
1 -1 scale
(0) t 
GR
GR
GS
[0.75 0 0 0.75 158.16666 411.74998] CT
0.149 GC
/Helvetica 13.333 F
GS
[1 0 0 1 0 0] CT
-8.5 13 moveto 
1 -1 scale
(50) t 
GR
GR
GS
[0.75 0 0 0.75 221.08333 411.74998] CT
0.149 GC
/Helvetica 13.333 F
GS
[1 0 0 1 0 0] CT
-12.5 13 moveto 
1 -1 scale
(100) t 
GR
GR
GS
[0.75 0 0 0.75 283.99999 411.74998] CT
0.149 GC
/Helvetica 13.333 F
GS
[1 0 0 1 0 0] CT
-12.5 13 moveto 
1 -1 scale
(150) t 
GR
GR
GS
[0.75 0 0 0.75 346.91666 411.74998] CT
0.149 GC
/Helvetica 13.333 F
GS
[1 0 0 1 0 0] CT
-12.5 13 moveto 
1 -1 scale
(200) t 
GR
GR
GS
[0.75 0 0 0.75 409.83334 411.74998] CT
0.149 GC
/Helvetica 13.333 F
GS
[1 0 0 1 0 0] CT
-12.5 13 moveto 
1 -1 scale
(250) t 
GR
GR
GS
[0.75 0 0 0.75 472.74998 411.74998] CT
0.149 GC
/Helvetica 13.333 F
GS
[1 0 0 1 0 0] CT
-12.5 13 moveto 
1 -1 scale
(300) t 
GR
GR
GS
[0.75 0 0 0.75 535.66667 411.74998] CT
0.149 GC
/Helvetica 13.333 F
GS
[1 0 0 1 0 0] CT
-12.5 13 moveto 
1 -1 scale
(350) t 
GR
GR
GS
[0.75 0 0 0.75 598.58331 411.74998] CT
0.149 GC
/Helvetica 13.333 F
GS
[1 0 0 1 0 0] CT
-12.5 13 moveto 
1 -1 scale
(400) t 
GR
GR
GS
[0.75 0 0 0.75 661.5 411.74998] CT
0.149 GC
/Helvetica 13.333 F
GS
[1 0 0 1 0 0] CT
-12.5 13 moveto 
1 -1 scale
(450) t 
GR
GR
GS
[0.75 0 0 0.75 378.37527 425.50002] CT
0.149 GC
/Helvetica 14.667 F
GS
[1 0 0 1 0 0] CT
-57.5 14 moveto 
1 -1 scale
(Time \(seconds\)) t 
GR
GR
GS
[0.75 0 0 0.75 0 -0.25] CT
0.149 GC
2 setlinecap
1 LJ
0.667 LW
N
127 544 M
127 46 L
S
GR
GS
[0.75 0 0 0.75 0 -0.25] CT
0.149 GC
2 setlinecap
1 LJ
0.667 LW
N
882 544 M
882 46 L
S
GR
GS
[0.75 0 0 0.75 0 -0.25] CT
0.149 GC
2 setlinecap
1 LJ
0.667 LW
N
127 544 M
134.55 544 L
S
GR
GS
[0.75 0 0 0.75 0 -0.25] CT
0.149 GC
2 setlinecap
1 LJ
0.667 LW
N
127 481.75 M
134.55 481.75 L
S
GR
GS
[0.75 0 0 0.75 0 -0.25] CT
0.149 GC
2 setlinecap
1 LJ
0.667 LW
N
127 419.5 M
134.55 419.5 L
S
GR
GS
[0.75 0 0 0.75 0 -0.25] CT
0.149 GC
2 setlinecap
1 LJ
0.667 LW
N
127 357.25 M
134.55 357.25 L
S
GR
GS
[0.75 0 0 0.75 0 -0.25] CT
0.149 GC
2 setlinecap
1 LJ
0.667 LW
N
127 295 M
134.55 295 L
S
GR
GS
[0.75 0 0 0.75 0 -0.25] CT
0.149 GC
2 setlinecap
1 LJ
0.667 LW
N
127 232.75 M
134.55 232.75 L
S
GR
GS
[0.75 0 0 0.75 0 -0.25] CT
0.149 GC
2 setlinecap
1 LJ
0.667 LW
N
127 170.5 M
134.55 170.5 L
S
GR
GS
[0.75 0 0 0.75 0 -0.25] CT
0.149 GC
2 setlinecap
1 LJ
0.667 LW
N
127 108.25 M
134.55 108.25 L
S
GR
GS
[0.75 0 0 0.75 0 -0.25] CT
0.149 GC
2 setlinecap
1 LJ
0.667 LW
N
127 46 M
134.55 46 L
S
GR
GS
[0.75 0 0 0.75 0 -0.25] CT
0.149 GC
2 setlinecap
1 LJ
0.667 LW
N
882 544 M
874.45 544 L
S
GR
GS
[0.75 0 0 0.75 0 -0.25] CT
0.149 GC
2 setlinecap
1 LJ
0.667 LW
N
882 481.75 M
874.45 481.75 L
S
GR
GS
[0.75 0 0 0.75 0 -0.25] CT
0.149 GC
2 setlinecap
1 LJ
0.667 LW
N
882 419.5 M
874.45 419.5 L
S
GR
GS
[0.75 0 0 0.75 0 -0.25] CT
0.149 GC
2 setlinecap
1 LJ
0.667 LW
N
882 357.25 M
874.45 357.25 L
S
GR
GS
[0.75 0 0 0.75 0 -0.25] CT
0.149 GC
2 setlinecap
1 LJ
0.667 LW
N
882 295 M
874.45 295 L
S
GR
GS
[0.75 0 0 0.75 0 -0.25] CT
0.149 GC
2 setlinecap
1 LJ
0.667 LW
N
882 232.75 M
874.45 232.75 L
S
GR
GS
[0.75 0 0 0.75 0 -0.25] CT
0.149 GC
2 setlinecap
1 LJ
0.667 LW
N
882 170.5 M
874.45 170.5 L
S
GR
GS
[0.75 0 0 0.75 0 -0.25] CT
0.149 GC
2 setlinecap
1 LJ
0.667 LW
N
882 108.25 M
874.45 108.25 L
S
GR
GS
[0.75 0 0 0.75 0 -0.25] CT
0.149 GC
2 setlinecap
1 LJ
0.667 LW
N
882 46 M
874.45 46 L
S
GR
GS
[0.75 0 0 0.75 91.25 407.75] CT
0.149 GC
/Helvetica 13.333 F
GS
[1 0 0 1 0 0] CT
-26 4.5 moveto 
1 -1 scale
(-0.2) t 
GR
GR
GS
[0.75 0 0 0.75 91.25 361.0625] CT
0.149 GC
/Helvetica 13.333 F
GS
[1 0 0 1 0 0] CT
-9 4.5 moveto 
1 -1 scale
(0) t 
GR
GR
GS
[0.75 0 0 0.75 91.25 314.375] CT
0.149 GC
/Helvetica 13.333 F
GS
[1 0 0 1 0 0] CT
-21 4.5 moveto 
1 -1 scale
(0.2) t 
GR
GR
GS
[0.75 0 0 0.75 91.25 267.6875] CT
0.149 GC
/Helvetica 13.333 F
GS
[1 0 0 1 0 0] CT
-21 4.5 moveto 
1 -1 scale
(0.4) t 
GR
GR
GS
[0.75 0 0 0.75 91.25 221] CT
0.149 GC
/Helvetica 13.333 F
GS
[1 0 0 1 0 0] CT
-21 4.5 moveto 
1 -1 scale
(0.6) t 
GR
GR
GS
[0.75 0 0 0.75 91.25 174.3125] CT
0.149 GC
/Helvetica 13.333 F
GS
[1 0 0 1 0 0] CT
-21 4.5 moveto 
1 -1 scale
(0.8) t 
GR
GR
GS
[0.75 0 0 0.75 91.25 127.625] CT
0.149 GC
/Helvetica 13.333 F
GS
[1 0 0 1 0 0] CT
-9 4.5 moveto 
1 -1 scale
(1) t 
GR
GR
GS
[0.75 0 0 0.75 91.25 80.93749] CT
0.149 GC
/Helvetica 13.333 F
GS
[1 0 0 1 0 0] CT
-21 4.5 moveto 
1 -1 scale
(1.2) t 
GR
GR
GS
[0.75 0 0 0.75 91.25 34.25001] CT
0.149 GC
/Helvetica 13.333 F
GS
[1 0 0 1 0 0] CT
-21 4.5 moveto 
1 -1 scale
(1.4) t 
GR
GR
GS
[0.75 0 0 0.75 378.37537 32.18751] CT
/Helvetica-Bold 14.667 F
GS
[1 0 0 1 0 0] CT
-173 -4 moveto 
1 -1 scale
(Rekonstrukce stavu be v\375stupn\355 poruchy) t 
GR
GR
GS
[0.75 0 0 0.75 0 -0.25] CT
0 0.447 0.741 RC
1 LJ
0.667 LW
N
127 450.625 M
127.003 450.618 L
127.02 450.582 L
127.105 450.404 L
127.526 449.575 L
129.633 446.681 L
133.083 445.06 L
137.345 445.971 L
142.281 448.852 L
148.121 453.198 L
148.811 453.736 L
148.811 453.736 L
148.811 453.736 L
151.749 456.233 L
154.688 457.804 L
158.201 456.829 L
162.197 451.801 L
165.589 444.884 L
165.589 444.884 L
165.589 444.884 L
168.566 434.367 L
171.544 420.044 L
174.958 402.654 L
178.996 383.204 L
183.664 363.364 L
189.292 343.125 L
196.384 322.026 L
205.59 299.511 L
210.889 288.253 L
210.889 288.253 L
225.234 262.113 L
239.575 240.742 L
254.34 222.619 L
269.104 207.708 L
283.869 195.442 L
294.778 187.802 L
294.778 187.802 L
294.778 187.802 L
309.542 179.076 L
324.307 171.909 L
339.071 166.023 L
353.836 161.194 L
368.6 157.233 L
383.364 153.985 L
398.129 151.324 L
412.893 149.144 L
427.658 147.359 L
442.422 145.898 L
457.187 144.702 L
471.951 143.725 L
486.716 142.926 L
501.48 142.272 L
516.244 141.739 L
531.009 141.303 L
545.773 140.947 L
560.538 140.656 L
575.302 140.419 L
590.067 140.226 L
604.831 140.068 L
619.596 139.94 L
634.36 139.835 L
649.124 139.749 L
663.889 139.68 L
678.653 139.623 L
693.418 139.577 L
708.182 139.539 L
722.947 139.508 L
737.711 139.483 L
752.476 139.463 L
767.24 139.447 L
782.004 139.433 L
796.769 139.422 L
811.533 139.413 L
826.298 139.406 L
841.062 139.4 L
855.827 139.396 L
865.222 139.393 L
S
GR
GS
[0.75 0 0 0.75 0 -0.25] CT
0.851 0.325 0.098 RC
1 LJ
0.667 LW
N
127 450.625 M
127.003 450.621 L
127.02 450.599 L
127.105 450.49 L
127.526 449.968 L
129.633 447.905 L
133.083 446.263 L
137.345 446.519 L
142.281 448.848 L
148.121 453.03 L
148.811 453.573 L
148.811 453.573 L
148.811 453.573 L
151.749 454.642 L
154.688 454.292 L
158.201 453.44 L
162.197 452.855 L
165.589 452.958 L
165.589 452.958 L
165.589 452.958 L
168.566 453.824 L
171.544 454.236 L
174.958 452.135 L
178.996 445.46 L
183.664 432.88 L
189.292 413.062 L
196.384 384.642 L
205.59 347.032 L
210.889 326.348 L
210.889 326.348 L
225.234 275.931 L
239.575 234.073 L
254.34 198.809 L
269.104 170.122 L
283.869 146.802 L
294.778 132.428 L
294.778 132.428 L
294.778 132.428 L
309.542 116.173 L
324.307 102.967 L
339.071 92.241 L
353.836 83.529 L
368.6 76.455 L
383.364 70.711 L
398.129 66.048 L
412.893 62.263 L
427.658 59.191 L
442.422 56.699 L
457.187 54.676 L
471.951 53.035 L
486.716 51.704 L
501.48 50.624 L
516.244 49.748 L
531.009 49.038 L
545.773 48.462 L
560.538 47.995 L
575.302 47.617 L
590.067 47.31 L
604.831 47.061 L
619.596 46.86 L
634.36 46.696 L
649.124 46.564 L
663.889 46.457 L
678.653 46.37 L
693.418 46.299 L
708.182 46.242 L
722.947 46.196 L
737.711 46.159 L
752.476 46.129 L
767.24 46.104 L
782.004 46.084 L
796.769 46.068 L
811.533 46.055 L
826.298 46.045 L
841.062 46.036 L
855.827 46.029 L
865.222 46.026 L
S
GR
GS
[0.75 0 0 0.75 0 -0.25] CT
0.929 0.694 0.125 RC
1 LJ
0.667 LW
N
127 450.625 M
127.003 450.645 L
127.02 450.746 L
127.105 451.244 L
127.526 453.616 L
129.633 462.967 L
133.083 472.186 L
137.345 478.099 L
142.281 481.547 L
148.121 483.591 L
148.811 483.751 L
148.811 483.751 L
148.811 483.751 L
151.749 477.595 L
154.688 464.628 L
158.201 448.176 L
162.197 432.596 L
165.589 422.835 L
165.589 422.835 L
165.589 422.835 L
168.566 421.148 L
171.544 427.54 L
174.958 437.775 L
178.996 449.271 L
183.664 459.508 L
189.292 467.476 L
196.384 472.747 L
205.59 475.403 L
210.889 475.936 L
210.889 475.936 L
225.234 476.093 L
239.575 475.794 L
254.34 475.478 L
269.104 475.224 L
283.869 475.029 L
294.778 474.917 L
294.778 474.917 L
294.778 474.917 L
309.542 474.797 L
324.307 474.708 L
339.071 474.642 L
353.836 474.593 L
368.6 474.557 L
383.364 474.531 L
398.129 474.512 L
412.893 474.499 L
427.658 474.49 L
442.422 474.483 L
457.187 474.479 L
471.951 474.477 L
486.716 474.475 L
501.48 474.474 L
516.244 474.474 L
531.009 474.474 L
545.773 474.474 L
560.538 474.475 L
575.302 474.475 L
590.067 474.476 L
604.831 474.477 L
619.596 474.477 L
634.36 474.478 L
649.124 474.478 L
663.889 474.478 L
678.653 474.479 L
693.418 474.479 L
708.182 474.479 L
722.947 474.479 L
737.711 474.48 L
752.476 474.48 L
767.24 474.48 L
782.004 474.48 L
796.769 474.48 L
811.533 474.48 L
826.298 474.48 L
841.062 474.48 L
855.827 474.48 L
865.222 474.481 L
S
GR
GS
[0.75 0 0 0.75 0 -0.25] CT
0.494 0.184 0.557 RC
1 LJ
0.667 LW
N
127 450.625 M
127.003 450.638 L
127.02 450.705 L
127.105 451.038 L
127.526 452.682 L
129.633 460.328 L
133.083 470.584 L
137.345 479.512 L
142.281 485.697 L
148.121 489.169 L
148.811 489.394 L
148.811 489.394 L
148.811 489.394 L
151.749 492.542 L
154.688 499.274 L
158.201 508.538 L
162.197 518.142 L
165.589 524.659 L
165.589 524.659 L
165.589 524.659 L
168.566 518.189 L
171.544 499.065 L
174.958 473.165 L
178.996 445.102 L
183.664 420.175 L
189.292 400.7 L
196.384 388.026 L
205.59 382.42 L
210.889 381.864 L
210.889 381.864 L
225.234 383.768 L
239.575 386.726 L
254.34 389.478 L
269.104 391.761 L
283.869 393.622 L
294.778 394.768 L
294.778 394.768 L
294.778 394.768 L
309.542 396.063 L
324.307 397.112 L
339.071 397.963 L
353.836 398.653 L
368.6 399.212 L
383.364 399.665 L
398.129 400.033 L
412.893 400.33 L
427.658 400.571 L
442.422 400.767 L
457.187 400.925 L
471.951 401.053 L
486.716 401.157 L
501.48 401.241 L
516.244 401.309 L
531.009 401.364 L
545.773 401.409 L
560.538 401.445 L
575.302 401.475 L
590.067 401.498 L
604.831 401.517 L
619.596 401.533 L
634.36 401.546 L
649.124 401.556 L
663.889 401.564 L
678.653 401.571 L
693.418 401.576 L
708.182 401.58 L
722.947 401.584 L
737.711 401.587 L
752.476 401.589 L
767.24 401.591 L
782.004 401.592 L
796.769 401.594 L
811.533 401.595 L
826.298 401.595 L
841.062 401.596 L
855.827 401.597 L
865.222 401.597 L
S
GR
GS
[0.75 0 0 0.75 0 -0.25] CT
0.467 0.675 0.188 RC
1 LJ
0.667 LW
N
127 481.75 M
127.003 481.757 L
127.02 481.789 L
127.105 481.951 L
127.526 482.757 L
129.633 486.576 L
133.083 491.849 L
137.345 496.642 L
142.281 500.325 L
148.121 503.026 L
148.811 503.265 L
148.811 503.265 L
148.811 503.265 L
151.749 504.352 L
154.688 504.353 L
158.201 501.396 L
162.197 494.07 L
165.589 485.219 L
165.589 485.219 L
165.589 485.219 L
168.566 473.04 L
171.544 457.099 L
174.958 437.918 L
178.996 416.443 L
183.664 394.392 L
189.292 371.672 L
196.384 347.719 L
205.59 321.913 L
210.889 308.956 L
210.889 308.956 L
225.234 278.833 L
239.575 254.244 L
254.34 233.455 L
269.104 216.405 L
283.869 202.421 L
294.778 193.734 L
294.778 193.734 L
294.778 193.734 L
309.542 183.837 L
324.307 175.729 L
339.071 169.089 L
353.836 163.654 L
368.6 159.207 L
383.364 155.57 L
398.129 152.595 L
412.893 150.164 L
427.658 148.178 L
442.422 146.555 L
457.187 145.23 L
471.951 144.148 L
486.716 143.265 L
501.48 142.545 L
516.244 141.958 L
531.009 141.478 L
545.773 141.088 L
560.538 140.77 L
575.302 140.51 L
590.067 140.299 L
604.831 140.127 L
619.596 139.986 L
634.36 139.872 L
649.124 139.779 L
663.889 139.704 L
678.653 139.642 L
693.418 139.592 L
708.182 139.552 L
722.947 139.518 L
737.711 139.492 L
752.476 139.47 L
767.24 139.452 L
782.004 139.437 L
796.769 139.426 L
811.533 139.416 L
826.298 139.408 L
841.062 139.402 L
855.827 139.397 L
865.222 139.394 L
S
GR
GS
[0.75 0 0 0.75 0 -0.25] CT
0.302 0.745 0.933 RC
1 LJ
0.667 LW
N
127 481.75 M
127.003 481.747 L
127.02 481.733 L
127.105 481.664 L
127.526 481.327 L
129.633 479.85 L
133.083 478.283 L
137.345 477.732 L
142.281 478.527 L
148.121 480.596 L
148.811 480.883 L
148.811 480.883 L
148.811 480.883 L
151.749 480.868 L
154.688 479.45 L
158.201 477.354 L
162.197 475.414 L
165.589 474.419 L
165.589 474.419 L
165.589 474.419 L
168.566 474.36 L
171.544 473.885 L
174.958 470.813 L
178.996 463.05 L
183.664 449.288 L
189.292 428.151 L
196.384 398.219 L
205.59 358.869 L
210.889 337.285 L
210.889 337.285 L
225.234 284.764 L
239.575 241.206 L
254.34 204.534 L
269.104 174.716 L
283.869 150.489 L
294.778 135.561 L
294.778 135.561 L
294.778 135.561 L
309.542 118.687 L
324.307 104.985 L
339.071 93.86 L
353.836 84.829 L
368.6 77.498 L
383.364 71.548 L
398.129 66.72 L
412.893 62.802 L
427.658 59.624 L
442.422 57.046 L
457.187 54.955 L
471.951 53.258 L
486.716 51.883 L
501.48 50.768 L
516.244 49.864 L
531.009 49.131 L
545.773 48.536 L
560.538 48.055 L
575.302 47.665 L
590.067 47.348 L
604.831 47.092 L
619.596 46.884 L
634.36 46.716 L
649.124 46.58 L
663.889 46.469 L
678.653 46.38 L
693.418 46.308 L
708.182 46.249 L
722.947 46.202 L
737.711 46.163 L
752.476 46.132 L
767.24 46.107 L
782.004 46.086 L
796.769 46.07 L
811.533 46.057 L
826.298 46.046 L
841.062 46.037 L
855.827 46.03 L
865.222 46.026 L
S
GR
GS
[0.75 0 0 0.75 0 -0.25] CT
0.635 0.078 0.184 RC
1 LJ
0.667 LW
N
127 481.75 M
127.003 481.734 L
127.02 481.655 L
127.105 481.259 L
127.526 479.311 L
129.633 470.416 L
133.083 459.21 L
137.345 450.675 L
142.281 446.158 L
148.121 445.188 L
148.811 445.262 L
148.811 445.262 L
148.811 445.262 L
151.749 439.152 L
154.688 426.723 L
158.201 411.32 L
162.197 397.243 L
165.589 388.888 L
165.589 388.888 L
165.589 388.888 L
168.566 388.476 L
171.544 396.149 L
174.958 407.837 L
178.996 421.003 L
183.664 433.087 L
189.292 443.148 L
196.384 450.841 L
205.59 456.296 L
210.889 458.277 L
210.889 458.277 L
225.234 461.831 L
239.575 464.276 L
254.34 466.234 L
269.104 467.806 L
283.869 469.076 L
294.778 469.857 L
294.778 469.857 L
294.778 469.857 L
309.542 470.737 L
324.307 471.449 L
339.071 472.027 L
353.836 472.494 L
368.6 472.873 L
383.364 473.179 L
398.129 473.427 L
412.893 473.628 L
427.658 473.791 L
442.422 473.923 L
457.187 474.029 L
471.951 474.115 L
486.716 474.185 L
501.48 474.242 L
516.244 474.287 L
531.009 474.324 L
545.773 474.354 L
560.538 474.378 L
575.302 474.398 L
590.067 474.414 L
604.831 474.427 L
619.596 474.437 L
634.36 474.445 L
649.124 474.452 L
663.889 474.458 L
678.653 474.462 L
693.418 474.466 L
708.182 474.469 L
722.947 474.471 L
737.711 474.473 L
752.476 474.474 L
767.24 474.476 L
782.004 474.477 L
796.769 474.477 L
811.533 474.478 L
826.298 474.479 L
841.062 474.479 L
855.827 474.479 L
865.222 474.48 L
S
GR
GS
[0.75 0 0 0.75 0 -0.25] CT
0 0.447 0.741 RC
1 LJ
0.667 LW
N
127 481.75 M
127.003 481.755 L
127.02 481.78 L
127.105 481.903 L
127.526 482.536 L
129.633 485.901 L
133.083 491.259 L
137.345 496.403 L
142.281 499.924 L
148.121 501.434 L
148.811 501.475 L
148.811 501.475 L
148.811 501.475 L
151.749 503.922 L
154.688 510.048 L
158.201 518.674 L
162.197 527.635 L
165.589 533.657 L
165.589 533.657 L
165.589 533.657 L
168.566 526.781 L
171.544 507.274 L
174.958 480.96 L
178.996 452.438 L
183.664 427.015 L
189.292 406.987 L
196.384 393.683 L
205.59 387.351 L
210.889 386.421 L
210.889 386.421 L
225.234 387.447 L
239.575 389.698 L
254.34 391.863 L
269.104 393.675 L
283.869 395.158 L
294.778 396.074 L
294.778 396.074 L
294.778 396.074 L
309.542 397.11 L
324.307 397.953 L
339.071 398.638 L
353.836 399.194 L
368.6 399.647 L
383.364 400.014 L
398.129 400.312 L
412.893 400.555 L
427.658 400.752 L
442.422 400.911 L
457.187 401.041 L
471.951 401.146 L
486.716 401.232 L
501.48 401.301 L
516.244 401.357 L
531.009 401.403 L
545.773 401.44 L
560.538 401.47 L
575.302 401.495 L
590.067 401.514 L
604.831 401.53 L
619.596 401.543 L
634.36 401.554 L
649.124 401.562 L
663.889 401.569 L
678.653 401.575 L
693.418 401.579 L
708.182 401.583 L
722.947 401.586 L
737.711 401.589 L
752.476 401.59 L
767.24 401.592 L
782.004 401.593 L
796.769 401.594 L
811.533 401.595 L
826.298 401.596 L
841.062 401.596 L
855.827 401.597 L
865.222 401.597 L
S
GR
%%Trailer
%%Pages: 1
%%EOF
