%!PS-Adobe-3.0 EPSF-3.0
%%Creator: (MATLAB, The Mathworks, Inc. Version 9.1.0.441655 \(R2016b\). Operating System: Linux)
%%Title: /home/frdm/Documents/RLS/rls-2017/sp5/figures/porucha1.eps
%%CreationDate: 2018-02-09T17:32:47
%%Pages: (atend)
%%BoundingBox: 0 0 737 460
%%LanguageLevel: 3
%%EndComments
%%BeginProlog
%%BeginResource: procset (Apache XML Graphics Std ProcSet) 1.2 0
%%Version: 1.2 0
%%Copyright: (Copyright 2001-2003,2010 The Apache Software Foundation. License terms: http://www.apache.org/licenses/LICENSE-2.0)
/bd{bind def}bind def
/ld{load def}bd
/GR/grestore ld
/M/moveto ld
/LJ/setlinejoin ld
/C/curveto ld
/f/fill ld
/LW/setlinewidth ld
/GC/setgray ld
/t/show ld
/N/newpath ld
/CT/concat ld
/cp/closepath ld
/S/stroke ld
/L/lineto ld
/CC/setcmykcolor ld
/A/ashow ld
/GS/gsave ld
/RC/setrgbcolor ld
/RM/rmoveto ld
/ML/setmiterlimit ld
/re {4 2 roll M
1 index 0 rlineto
0 exch rlineto
neg 0 rlineto
cp } bd
/_ctm matrix def
/_tm matrix def
/BT { _ctm currentmatrix pop matrix _tm copy pop 0 0 moveto } bd
/ET { _ctm setmatrix } bd
/iTm { _ctm setmatrix _tm concat } bd
/Tm { _tm astore pop iTm 0 0 moveto } bd
/ux 0.0 def
/uy 0.0 def
/F {
  /Tp exch def
  /Tf exch def
  Tf findfont Tp scalefont setfont
  /cf Tf def  /cs Tp def
} bd
/ULS {currentpoint /uy exch def /ux exch def} bd
/ULE {
  /Tcx currentpoint pop def
  gsave
  newpath
  cf findfont cs scalefont dup
  /FontMatrix get 0 get /Ts exch def /FontInfo get dup
  /UnderlinePosition get Ts mul /To exch def
  /UnderlineThickness get Ts mul /Tt exch def
  ux uy To add moveto  Tcx uy To add lineto
  Tt setlinewidth stroke
  grestore
} bd
/OLE {
  /Tcx currentpoint pop def
  gsave
  newpath
  cf findfont cs scalefont dup
  /FontMatrix get 0 get /Ts exch def /FontInfo get dup
  /UnderlinePosition get Ts mul /To exch def
  /UnderlineThickness get Ts mul /Tt exch def
  ux uy To add cs add moveto Tcx uy To add cs add lineto
  Tt setlinewidth stroke
  grestore
} bd
/SOE {
  /Tcx currentpoint pop def
  gsave
  newpath
  cf findfont cs scalefont dup
  /FontMatrix get 0 get /Ts exch def /FontInfo get dup
  /UnderlinePosition get Ts mul /To exch def
  /UnderlineThickness get Ts mul /Tt exch def
  ux uy To add cs 10 mul 26 idiv add moveto Tcx uy To add cs 10 mul 26 idiv add lineto
  Tt setlinewidth stroke
  grestore
} bd
/QT {
/Y22 exch store
/X22 exch store
/Y21 exch store
/X21 exch store
currentpoint
/Y21 load 2 mul add 3 div exch
/X21 load 2 mul add 3 div exch
/X21 load 2 mul /X22 load add 3 div
/Y21 load 2 mul /Y22 load add 3 div
/X22 load /Y22 load curveto
} bd
/SSPD {
dup length /d exch dict def
{
/v exch def
/k exch def
currentpagedevice k known {
/cpdv currentpagedevice k get def
v cpdv ne {
/upd false def
/nullv v type /nulltype eq def
/nullcpdv cpdv type /nulltype eq def
nullv nullcpdv or
{
/upd true def
} {
/sametype v type cpdv type eq def
sametype {
v type /arraytype eq {
/vlen v length def
/cpdvlen cpdv length def
vlen cpdvlen eq {
0 1 vlen 1 sub {
/i exch def
/obj v i get def
/cpdobj cpdv i get def
obj cpdobj ne {
/upd true def
exit
} if
} for
} {
/upd true def
} ifelse
} {
v type /dicttype eq {
v {
/dv exch def
/dk exch def
/cpddv cpdv dk get def
dv cpddv ne {
/upd true def
exit
} if
} forall
} {
/upd true def
} ifelse
} ifelse
} if
} ifelse
upd true eq {
d k v put
} if
} if
} if
} forall
d length 0 gt {
d setpagedevice
} if
} bd
/RE { % /NewFontName [NewEncodingArray] /FontName RE -
  findfont dup length dict begin
  {
    1 index /FID ne
    {def} {pop pop} ifelse
  } forall
  /Encoding exch def
  /FontName 1 index def
  currentdict definefont pop
  end
} bind def
%%EndResource
%%BeginResource: procset (Apache XML Graphics EPS ProcSet) 1.0 0
%%Version: 1.0 0
%%Copyright: (Copyright 2002-2003 The Apache Software Foundation. License terms: http://www.apache.org/licenses/LICENSE-2.0)
/BeginEPSF { %def
/b4_Inc_state save def         % Save state for cleanup
/dict_count countdictstack def % Count objects on dict stack
/op_count count 1 sub def      % Count objects on operand stack
userdict begin                 % Push userdict on dict stack
/showpage { } def              % Redefine showpage, { } = null proc
0 setgray 0 setlinecap         % Prepare graphics state
1 setlinewidth 0 setlinejoin
10 setmiterlimit [ ] 0 setdash newpath
/languagelevel where           % If level not equal to 1 then
{pop languagelevel             % set strokeadjust and
1 ne                           % overprint to their defaults.
{false setstrokeadjust false setoverprint
} if
} if
} bd
/EndEPSF { %def
count op_count sub {pop} repeat            % Clean up stacks
countdictstack dict_count sub {end} repeat
b4_Inc_state restore
} bd
%%EndResource
%FOPBeginFontDict
%%IncludeResource: font Courier-Bold
%%IncludeResource: font Helvetica
%%IncludeResource: font Courier-BoldOblique
%%IncludeResource: font Courier-Oblique
%%IncludeResource: font Times-Roman
%%IncludeResource: font Helvetica-BoldOblique
%%IncludeResource: font Helvetica-Bold
%%IncludeResource: font Helvetica-Oblique
%%IncludeResource: font Times-BoldItalic
%%IncludeResource: font Courier
%%IncludeResource: font Times-Italic
%%IncludeResource: font Times-Bold
%%IncludeResource: font Symbol
%%IncludeResource: font ZapfDingbats
%FOPEndFontDict
%%BeginResource: encoding WinAnsiEncoding
/WinAnsiEncoding [
/.notdef /.notdef /.notdef /.notdef /.notdef
/.notdef /.notdef /.notdef /.notdef /.notdef
/.notdef /.notdef /.notdef /.notdef /.notdef
/.notdef /.notdef /.notdef /.notdef /.notdef
/.notdef /.notdef /.notdef /.notdef /.notdef
/.notdef /.notdef /.notdef /.notdef /.notdef
/.notdef /.notdef /space /exclam /quotedbl
/numbersign /dollar /percent /ampersand /quotesingle
/parenleft /parenright /asterisk /plus /comma
/hyphen /period /slash /zero /one
/two /three /four /five /six
/seven /eight /nine /colon /semicolon
/less /equal /greater /question /at
/A /B /C /D /E
/F /G /H /I /J
/K /L /M /N /O
/P /Q /R /S /T
/U /V /W /X /Y
/Z /bracketleft /backslash /bracketright /asciicircum
/underscore /quoteleft /a /b /c
/d /e /f /g /h
/i /j /k /l /m
/n /o /p /q /r
/s /t /u /v /w
/x /y /z /braceleft /bar
/braceright /asciitilde /bullet /Euro /bullet
/quotesinglbase /florin /quotedblbase /ellipsis /dagger
/daggerdbl /circumflex /perthousand /Scaron /guilsinglleft
/OE /bullet /Zcaron /bullet /bullet
/quoteleft /quoteright /quotedblleft /quotedblright /bullet
/endash /emdash /asciitilde /trademark /scaron
/guilsinglright /oe /bullet /zcaron /Ydieresis
/space /exclamdown /cent /sterling /currency
/yen /brokenbar /section /dieresis /copyright
/ordfeminine /guillemotleft /logicalnot /sfthyphen /registered
/macron /degree /plusminus /twosuperior /threesuperior
/acute /mu /paragraph /middot /cedilla
/onesuperior /ordmasculine /guillemotright /onequarter /onehalf
/threequarters /questiondown /Agrave /Aacute /Acircumflex
/Atilde /Adieresis /Aring /AE /Ccedilla
/Egrave /Eacute /Ecircumflex /Edieresis /Igrave
/Iacute /Icircumflex /Idieresis /Eth /Ntilde
/Ograve /Oacute /Ocircumflex /Otilde /Odieresis
/multiply /Oslash /Ugrave /Uacute /Ucircumflex
/Udieresis /Yacute /Thorn /germandbls /agrave
/aacute /acircumflex /atilde /adieresis /aring
/ae /ccedilla /egrave /eacute /ecircumflex
/edieresis /igrave /iacute /icircumflex /idieresis
/eth /ntilde /ograve /oacute /ocircumflex
/otilde /odieresis /divide /oslash /ugrave
/uacute /ucircumflex /udieresis /yacute /thorn
/ydieresis
] def
%%EndResource
%FOPBeginFontReencode
/Courier-Bold findfont
dup length dict begin
  {1 index /FID ne {def} {pop pop} ifelse} forall
  /Encoding WinAnsiEncoding def
  currentdict
end
/Courier-Bold exch definefont pop
/Helvetica findfont
dup length dict begin
  {1 index /FID ne {def} {pop pop} ifelse} forall
  /Encoding WinAnsiEncoding def
  currentdict
end
/Helvetica exch definefont pop
/Courier-BoldOblique findfont
dup length dict begin
  {1 index /FID ne {def} {pop pop} ifelse} forall
  /Encoding WinAnsiEncoding def
  currentdict
end
/Courier-BoldOblique exch definefont pop
/Courier-Oblique findfont
dup length dict begin
  {1 index /FID ne {def} {pop pop} ifelse} forall
  /Encoding WinAnsiEncoding def
  currentdict
end
/Courier-Oblique exch definefont pop
/Times-Roman findfont
dup length dict begin
  {1 index /FID ne {def} {pop pop} ifelse} forall
  /Encoding WinAnsiEncoding def
  currentdict
end
/Times-Roman exch definefont pop
/Helvetica-BoldOblique findfont
dup length dict begin
  {1 index /FID ne {def} {pop pop} ifelse} forall
  /Encoding WinAnsiEncoding def
  currentdict
end
/Helvetica-BoldOblique exch definefont pop
/Helvetica-Bold findfont
dup length dict begin
  {1 index /FID ne {def} {pop pop} ifelse} forall
  /Encoding WinAnsiEncoding def
  currentdict
end
/Helvetica-Bold exch definefont pop
/Helvetica-Oblique findfont
dup length dict begin
  {1 index /FID ne {def} {pop pop} ifelse} forall
  /Encoding WinAnsiEncoding def
  currentdict
end
/Helvetica-Oblique exch definefont pop
/Times-BoldItalic findfont
dup length dict begin
  {1 index /FID ne {def} {pop pop} ifelse} forall
  /Encoding WinAnsiEncoding def
  currentdict
end
/Times-BoldItalic exch definefont pop
/Courier findfont
dup length dict begin
  {1 index /FID ne {def} {pop pop} ifelse} forall
  /Encoding WinAnsiEncoding def
  currentdict
end
/Courier exch definefont pop
/Times-Italic findfont
dup length dict begin
  {1 index /FID ne {def} {pop pop} ifelse} forall
  /Encoding WinAnsiEncoding def
  currentdict
end
/Times-Italic exch definefont pop
/Times-Bold findfont
dup length dict begin
  {1 index /FID ne {def} {pop pop} ifelse} forall
  /Encoding WinAnsiEncoding def
  currentdict
end
/Times-Bold exch definefont pop
%FOPEndFontReencode
%%EndProlog
%%Page: 1 1
%%PageBoundingBox: 0 0 737 460
%%BeginPageSetup
[1 0 0 -1 0 460] CT
%%EndPageSetup
GS
[0.75 0 0 0.75 0 0.25] CT
N
0 0 M
983 0 L
983 613 L
0 613 L
0 0 L
cp
clip
1 GC
N
0 0 983 613 re
f
GR
GS
[0.75 0 0 0.75 0 0.25] CT
1 GC
N
0 0 983 613 re
f
GR
GS
[0.75 0 0 0.75 0 0.25] CT
1 GC
N
128 546 M
890 546 L
890 46 L
128 46 L
cp
f
GR
GS
[0.75 0 0 0.75 0 0.25] CT
0.149 GC
2 setlinecap
1 LJ
0.667 LW
N
128 546 M
890 546 L
S
GR
GS
[0.75 0 0 0.75 0 0.25] CT
0.149 GC
2 setlinecap
1 LJ
0.667 LW
N
128 546 M
128 538.38 L
S
GR
GS
[0.75 0 0 0.75 0 0.25] CT
0.149 GC
2 setlinecap
1 LJ
0.667 LW
N
204.2 546 M
204.2 538.38 L
S
GR
GS
[0.75 0 0 0.75 0 0.25] CT
0.149 GC
2 setlinecap
1 LJ
0.667 LW
N
280.4 546 M
280.4 538.38 L
S
GR
GS
[0.75 0 0 0.75 0 0.25] CT
0.149 GC
2 setlinecap
1 LJ
0.667 LW
N
356.6 546 M
356.6 538.38 L
S
GR
GS
[0.75 0 0 0.75 0 0.25] CT
0.149 GC
2 setlinecap
1 LJ
0.667 LW
N
432.8 546 M
432.8 538.38 L
S
GR
GS
[0.75 0 0 0.75 0 0.25] CT
0.149 GC
2 setlinecap
1 LJ
0.667 LW
N
509 546 M
509 538.38 L
S
GR
GS
[0.75 0 0 0.75 0 0.25] CT
0.149 GC
2 setlinecap
1 LJ
0.667 LW
N
585.2 546 M
585.2 538.38 L
S
GR
GS
[0.75 0 0 0.75 0 0.25] CT
0.149 GC
2 setlinecap
1 LJ
0.667 LW
N
661.4 546 M
661.4 538.38 L
S
GR
GS
[0.75 0 0 0.75 0 0.25] CT
0.149 GC
2 setlinecap
1 LJ
0.667 LW
N
737.6 546 M
737.6 538.38 L
S
GR
GS
[0.75 0 0 0.75 0 0.25] CT
0.149 GC
2 setlinecap
1 LJ
0.667 LW
N
813.8 546 M
813.8 538.38 L
S
GR
GS
[0.75 0 0 0.75 0 0.25] CT
0.149 GC
2 setlinecap
1 LJ
0.667 LW
N
890 546 M
890 538.38 L
S
GR
GS
[0.75 0 0 0.75 96 413.74998] CT
0.149 GC
/Helvetica 13.333 F
GS
[1 0 0 1 0 0] CT
-4.5 13 moveto 
1 -1 scale
(0) t 
GR
GR
GS
[0.75 0 0 0.75 153.15 413.74998] CT
0.149 GC
/Helvetica 13.333 F
GS
[1 0 0 1 0 0] CT
-8.5 13 moveto 
1 -1 scale
(50) t 
GR
GR
GS
[0.75 0 0 0.75 210.3 413.74998] CT
0.149 GC
/Helvetica 13.333 F
GS
[1 0 0 1 0 0] CT
-12.5 13 moveto 
1 -1 scale
(100) t 
GR
GR
GS
[0.75 0 0 0.75 267.45 413.74998] CT
0.149 GC
/Helvetica 13.333 F
GS
[1 0 0 1 0 0] CT
-12.5 13 moveto 
1 -1 scale
(150) t 
GR
GR
GS
[0.75 0 0 0.75 324.59999 413.74998] CT
0.149 GC
/Helvetica 13.333 F
GS
[1 0 0 1 0 0] CT
-12.5 13 moveto 
1 -1 scale
(200) t 
GR
GR
GS
[0.75 0 0 0.75 381.75 413.74998] CT
0.149 GC
/Helvetica 13.333 F
GS
[1 0 0 1 0 0] CT
-12.5 13 moveto 
1 -1 scale
(250) t 
GR
GR
GS
[0.75 0 0 0.75 438.90001 413.74998] CT
0.149 GC
/Helvetica 13.333 F
GS
[1 0 0 1 0 0] CT
-12.5 13 moveto 
1 -1 scale
(300) t 
GR
GR
GS
[0.75 0 0 0.75 496.05002 413.74998] CT
0.149 GC
/Helvetica 13.333 F
GS
[1 0 0 1 0 0] CT
-12.5 13 moveto 
1 -1 scale
(350) t 
GR
GR
GS
[0.75 0 0 0.75 553.19998 413.74998] CT
0.149 GC
/Helvetica 13.333 F
GS
[1 0 0 1 0 0] CT
-12.5 13 moveto 
1 -1 scale
(400) t 
GR
GR
GS
[0.75 0 0 0.75 610.34999 413.74998] CT
0.149 GC
/Helvetica 13.333 F
GS
[1 0 0 1 0 0] CT
-12.5 13 moveto 
1 -1 scale
(450) t 
GR
GR
GS
[0.75 0 0 0.75 667.5 413.74998] CT
0.149 GC
/Helvetica 13.333 F
GS
[1 0 0 1 0 0] CT
-12.5 13 moveto 
1 -1 scale
(500) t 
GR
GR
GS
[0.75 0 0 0.75 381.75027 427.50002] CT
0.149 GC
/Helvetica 14.667 F
GS
[1 0 0 1 0 0] CT
-57.5 14 moveto 
1 -1 scale
(Time \(seconds\)) t 
GR
GR
GS
[0.75 0 0 0.75 0 0.25] CT
0.149 GC
2 setlinecap
1 LJ
0.667 LW
N
128 546 M
128 46 L
S
GR
GS
[0.75 0 0 0.75 0 0.25] CT
0.149 GC
2 setlinecap
1 LJ
0.667 LW
N
128 546 M
135.62 546 L
S
GR
GS
[0.75 0 0 0.75 0 0.25] CT
0.149 GC
2 setlinecap
1 LJ
0.667 LW
N
128 462.667 M
135.62 462.667 L
S
GR
GS
[0.75 0 0 0.75 0 0.25] CT
0.149 GC
2 setlinecap
1 LJ
0.667 LW
N
128 379.333 M
135.62 379.333 L
S
GR
GS
[0.75 0 0 0.75 0 0.25] CT
0.149 GC
2 setlinecap
1 LJ
0.667 LW
N
128 296 M
135.62 296 L
S
GR
GS
[0.75 0 0 0.75 0 0.25] CT
0.149 GC
2 setlinecap
1 LJ
0.667 LW
N
128 212.667 M
135.62 212.667 L
S
GR
GS
[0.75 0 0 0.75 0 0.25] CT
0.149 GC
2 setlinecap
1 LJ
0.667 LW
N
128 129.333 M
135.62 129.333 L
S
GR
GS
[0.75 0 0 0.75 0 0.25] CT
0.149 GC
2 setlinecap
1 LJ
0.667 LW
N
128 46 M
135.62 46 L
S
GR
GS
[0.75 0 0 0.75 92 409.75] CT
0.149 GC
/Helvetica 13.333 F
GS
[1 0 0 1 0 0] CT
-34 4.5 moveto 
1 -1 scale
(-0.05) t 
GR
GR
GS
[0.75 0 0 0.75 92 347.24999] CT
0.149 GC
/Helvetica 13.333 F
GS
[1 0 0 1 0 0] CT
-9 4.5 moveto 
1 -1 scale
(0) t 
GR
GR
GS
[0.75 0 0 0.75 92 284.75001] CT
0.149 GC
/Helvetica 13.333 F
GS
[1 0 0 1 0 0] CT
-29 4.5 moveto 
1 -1 scale
(0.05) t 
GR
GR
GS
[0.75 0 0 0.75 92 222.25] CT
0.149 GC
/Helvetica 13.333 F
GS
[1 0 0 1 0 0] CT
-21 4.5 moveto 
1 -1 scale
(0.1) t 
GR
GR
GS
[0.75 0 0 0.75 92 159.74999] CT
0.149 GC
/Helvetica 13.333 F
GS
[1 0 0 1 0 0] CT
-29 4.5 moveto 
1 -1 scale
(0.15) t 
GR
GR
GS
[0.75 0 0 0.75 92 97.25] CT
0.149 GC
/Helvetica 13.333 F
GS
[1 0 0 1 0 0] CT
-21 4.5 moveto 
1 -1 scale
(0.2) t 
GR
GR
GS
[0.75 0 0 0.75 92 34.75] CT
0.149 GC
/Helvetica 13.333 F
GS
[1 0 0 1 0 0] CT
-29 4.5 moveto 
1 -1 scale
(0.25) t 
GR
GR
GS
[0 -0.75 0.75 0 63.5 222.24982] CT
0.149 GC
/Helvetica 14.667 F
GS
[1 0 0 1 0 0] CT
-17 -4 moveto 
1 -1 scale
(data) t 
GR
GR
GS
[0.75 0 0 0.75 381.75037 32.68749] CT
N
-251.109 -10.094 M
-250.234 -10.094 -249.852 -10.422 QT
-249.469 -10.75 -249.469 -11.5 QT
-249.469 -12.25 -249.852 -12.57 QT
-250.234 -12.891 -251.109 -12.891 QT
-252.297 -12.891 L
-252.297 -10.094 L
-251.109 -10.094 L
cp
-252.297 -8.141 M
-252.297 -4 L
-255.125 -4 L
-255.125 -14.938 L
-250.813 -14.938 L
-248.656 -14.938 -247.648 -14.211 QT
-246.641 -13.484 -246.641 -11.922 QT
-246.641 -10.828 -247.164 -10.133 QT
-247.688 -9.438 -248.75 -9.109 QT
-248.172 -8.984 -247.711 -8.516 QT
-247.25 -8.047 -246.781 -7.109 QT
-245.25 -4 L
-248.25 -4 L
-249.578 -6.719 L
-249.984 -7.531 -250.398 -7.836 QT
-250.813 -8.141 -251.5 -8.141 QT
-252.297 -8.141 L
cp
-252.375 -16.25 M
-254.016 -18.172 L
-252.703 -18.172 L
-251.25 -16.984 L
-249.797 -18.172 L
-248.484 -18.172 L
-250.125 -16.25 L
-252.375 -16.25 L
cp
-243.949 -12.203 M
-241.339 -12.203 L
-241.339 -4 L
-243.949 -4 L
-243.949 -12.203 L
cp
-241.48 -16 M
-239.402 -16 L
-242.105 -13.25 L
-243.543 -13.25 L
-241.48 -16 L
cp
-239.331 -12.203 M
-232.175 -12.203 L
-232.175 -10.375 L
-236.503 -5.875 L
-232.175 -5.875 L
-232.175 -4 L
-239.519 -4 L
-239.519 -5.828 L
-235.191 -10.328 L
-239.331 -10.328 L
-239.331 -12.203 L
cp
-222.207 -8.125 M
-222.207 -7.375 L
-228.348 -7.375 L
-228.254 -6.453 -227.676 -5.992 QT
-227.098 -5.531 -226.082 -5.531 QT
-225.254 -5.531 -224.387 -5.773 QT
-223.52 -6.016 -222.598 -6.516 QT
-222.598 -4.5 L
-223.535 -4.141 -224.465 -3.961 QT
-225.395 -3.781 -226.316 -3.781 QT
-228.551 -3.781 -229.785 -4.914 QT
-231.02 -6.047 -231.02 -8.094 QT
-231.02 -10.094 -229.809 -11.25 QT
-228.598 -12.406 -226.473 -12.406 QT
-224.535 -12.406 -223.371 -11.242 QT
-222.207 -10.078 -222.207 -8.125 QT
cp
-224.91 -9 M
-224.91 -9.75 -225.348 -10.203 QT
-225.785 -10.656 -226.488 -10.656 QT
-227.238 -10.656 -227.715 -10.227 QT
-228.191 -9.797 -228.316 -9 QT
-224.91 -9 L
cp
-212.22 -9 M
-212.22 -4 L
-214.845 -4 L
-214.845 -4.813 L
-214.845 -7.828 L
-214.845 -8.891 -214.892 -9.289 QT
-214.939 -9.688 -215.064 -9.875 QT
-215.22 -10.141 -215.478 -10.281 QT
-215.736 -10.422 -216.079 -10.422 QT
-216.908 -10.422 -217.376 -9.789 QT
-217.845 -9.156 -217.845 -8.031 QT
-217.845 -4 L
-220.454 -4 L
-220.454 -12.203 L
-217.845 -12.203 L
-217.845 -11 L
-217.251 -11.719 -216.579 -12.063 QT
-215.908 -12.406 -215.111 -12.406 QT
-213.689 -12.406 -212.954 -11.531 QT
-212.22 -10.656 -212.22 -9 QT
cp
-210.02 -12.203 M
-207.411 -12.203 L
-207.411 -4 L
-210.02 -4 L
-210.02 -12.203 L
cp
-207.552 -16 M
-205.474 -16 L
-208.177 -13.25 L
-209.614 -13.25 L
-207.552 -16 L
cp
-193.488 -11.953 M
-193.488 -9.953 L
-194.332 -10.313 -195.113 -10.484 QT
-195.894 -10.656 -196.597 -10.656 QT
-197.347 -10.656 -197.707 -10.469 QT
-198.066 -10.281 -198.066 -9.891 QT
-198.066 -9.578 -197.793 -9.414 QT
-197.519 -9.25 -196.816 -9.156 QT
-196.347 -9.094 L
-194.332 -8.844 -193.636 -8.258 QT
-192.941 -7.672 -192.941 -6.422 QT
-192.941 -5.109 -193.91 -4.445 QT
-194.879 -3.781 -196.8 -3.781 QT
-197.613 -3.781 -198.48 -3.914 QT
-199.347 -4.047 -200.254 -4.297 QT
-200.254 -6.297 L
-199.472 -5.906 -198.652 -5.719 QT
-197.832 -5.531 -196.972 -5.531 QT
-196.207 -5.531 -195.816 -5.742 QT
-195.425 -5.953 -195.425 -6.375 QT
-195.425 -6.719 -195.699 -6.891 QT
-195.972 -7.063 -196.769 -7.172 QT
-197.222 -7.219 L
-198.972 -7.438 -199.675 -8.031 QT
-200.379 -8.625 -200.379 -9.844 QT
-200.379 -11.141 -199.488 -11.773 QT
-198.597 -12.406 -196.754 -12.406 QT
-196.019 -12.406 -195.222 -12.297 QT
-194.425 -12.188 -193.488 -11.953 QT
cp
-182.983 -8.125 M
-182.983 -7.375 L
-189.124 -7.375 L
-189.03 -6.453 -188.452 -5.992 QT
-187.874 -5.531 -186.858 -5.531 QT
-186.03 -5.531 -185.163 -5.773 QT
-184.296 -6.016 -183.374 -6.516 QT
-183.374 -4.5 L
-184.311 -4.141 -185.241 -3.961 QT
-186.171 -3.781 -187.092 -3.781 QT
-189.327 -3.781 -190.561 -4.914 QT
-191.796 -6.047 -191.796 -8.094 QT
-191.796 -10.094 -190.585 -11.25 QT
-189.374 -12.406 -187.249 -12.406 QT
-185.311 -12.406 -184.147 -11.242 QT
-182.983 -10.078 -182.983 -8.125 QT
cp
-185.686 -9 M
-185.686 -9.75 -186.124 -10.203 QT
-186.561 -10.656 -187.264 -10.656 QT
-188.014 -10.656 -188.491 -10.227 QT
-188.967 -9.797 -189.092 -9 QT
-185.686 -9 L
cp
-176.534 -12.203 M
-169.378 -12.203 L
-169.378 -10.375 L
-173.706 -5.875 L
-169.378 -5.875 L
-169.378 -4 L
-176.722 -4 L
-176.722 -5.828 L
-172.393 -10.328 L
-176.534 -10.328 L
-176.534 -12.203 L
cp
-160.004 -10.844 M
-159.504 -11.609 -158.816 -12.008 QT
-158.129 -12.406 -157.316 -12.406 QT
-155.894 -12.406 -155.16 -11.531 QT
-154.426 -10.656 -154.426 -9 QT
-154.426 -4 L
-157.051 -4 L
-157.051 -8.281 L
-157.051 -8.375 -157.043 -8.477 QT
-157.035 -8.578 -157.035 -8.766 QT
-157.035 -9.641 -157.293 -10.031 QT
-157.551 -10.422 -158.129 -10.422 QT
-158.879 -10.422 -159.285 -9.805 QT
-159.691 -9.188 -159.707 -8.031 QT
-159.707 -4 L
-162.332 -4 L
-162.332 -8.281 L
-162.332 -9.641 -162.566 -10.031 QT
-162.801 -10.422 -163.41 -10.422 QT
-164.16 -10.422 -164.574 -9.805 QT
-164.988 -9.188 -164.988 -8.031 QT
-164.988 -4 L
-167.613 -4 L
-167.613 -12.203 L
-164.988 -12.203 L
-164.988 -11 L
-164.504 -11.703 -163.871 -12.055 QT
-163.238 -12.406 -162.488 -12.406 QT
-161.644 -12.406 -160.988 -11.992 QT
-160.332 -11.578 -160.004 -10.844 QT
cp
-144.138 -8.125 M
-144.138 -7.375 L
-150.279 -7.375 L
-150.185 -6.453 -149.607 -5.992 QT
-149.029 -5.531 -148.013 -5.531 QT
-147.185 -5.531 -146.318 -5.773 QT
-145.451 -6.016 -144.529 -6.516 QT
-144.529 -4.5 L
-145.466 -4.141 -146.396 -3.961 QT
-147.326 -3.781 -148.248 -3.781 QT
-150.482 -3.781 -151.716 -4.914 QT
-152.951 -6.047 -152.951 -8.094 QT
-152.951 -10.094 -151.74 -11.25 QT
-150.529 -12.406 -148.404 -12.406 QT
-146.466 -12.406 -145.302 -11.242 QT
-144.138 -10.078 -144.138 -8.125 QT
cp
-146.841 -9 M
-146.841 -9.75 -147.279 -10.203 QT
-147.716 -10.656 -148.419 -10.656 QT
-149.169 -10.656 -149.646 -10.227 QT
-150.123 -9.797 -150.248 -9 QT
-146.841 -9 L
cp
-148.732 -13.25 M
-150.607 -16 L
-149.294 -16 L
-147.841 -14.328 L
-146.388 -16 L
-145.076 -16 L
-146.951 -13.25 L
-148.732 -13.25 L
cp
-134.151 -9 M
-134.151 -4 L
-136.776 -4 L
-136.776 -4.813 L
-136.776 -7.828 L
-136.776 -8.891 -136.823 -9.289 QT
-136.87 -9.688 -136.995 -9.875 QT
-137.151 -10.141 -137.409 -10.281 QT
-137.667 -10.422 -138.011 -10.422 QT
-138.839 -10.422 -139.307 -9.789 QT
-139.776 -9.156 -139.776 -8.031 QT
-139.776 -4 L
-142.386 -4 L
-142.386 -12.203 L
-139.776 -12.203 L
-139.776 -11 L
-139.182 -11.719 -138.511 -12.063 QT
-137.839 -12.406 -137.042 -12.406 QT
-135.62 -12.406 -134.886 -11.531 QT
-134.151 -10.656 -134.151 -9 QT
cp
-128.061 -10.531 M
-128.92 -10.531 -129.381 -9.906 QT
-129.842 -9.281 -129.842 -8.094 QT
-129.842 -6.922 -129.381 -6.289 QT
-128.92 -5.656 -128.061 -5.656 QT
-127.202 -5.656 -126.748 -6.289 QT
-126.295 -6.922 -126.295 -8.094 QT
-126.295 -9.281 -126.748 -9.906 QT
-127.202 -10.531 -128.061 -10.531 QT
cp
-128.061 -12.406 M
-125.936 -12.406 -124.748 -11.258 QT
-123.561 -10.109 -123.561 -8.094 QT
-123.561 -6.078 -124.748 -4.93 QT
-125.936 -3.781 -128.061 -3.781 QT
-130.17 -3.781 -131.373 -4.93 QT
-132.577 -6.078 -132.577 -8.094 QT
-132.577 -10.109 -131.373 -11.258 QT
-130.17 -12.406 -128.061 -12.406 QT
cp
-121.976 -7.188 M
-121.976 -12.203 L
-119.336 -12.203 L
-119.336 -11.391 L
-119.336 -10.719 -119.343 -9.711 QT
-119.351 -8.703 -119.351 -8.359 QT
-119.351 -7.375 -119.304 -6.938 QT
-119.258 -6.5 -119.133 -6.313 QT
-118.961 -6.047 -118.703 -5.906 QT
-118.445 -5.766 -118.101 -5.766 QT
-117.289 -5.766 -116.82 -6.398 QT
-116.351 -7.031 -116.351 -8.156 QT
-116.351 -12.203 L
-113.726 -12.203 L
-113.726 -4 L
-116.351 -4 L
-116.351 -5.188 L
-116.945 -4.469 -117.609 -4.125 QT
-118.273 -3.781 -119.07 -3.781 QT
-120.492 -3.781 -121.234 -4.656 QT
-121.976 -5.531 -121.976 -7.188 QT
cp
-99.94 -11.953 M
-99.94 -9.953 L
-100.784 -10.313 -101.565 -10.484 QT
-102.346 -10.656 -103.049 -10.656 QT
-103.799 -10.656 -104.159 -10.469 QT
-104.518 -10.281 -104.518 -9.891 QT
-104.518 -9.578 -104.244 -9.414 QT
-103.971 -9.25 -103.268 -9.156 QT
-102.799 -9.094 L
-100.784 -8.844 -100.088 -8.258 QT
-99.393 -7.672 -99.393 -6.422 QT
-99.393 -5.109 -100.362 -4.445 QT
-101.33 -3.781 -103.252 -3.781 QT
-104.065 -3.781 -104.932 -3.914 QT
-105.799 -4.047 -106.705 -4.297 QT
-106.705 -6.297 L
-105.924 -5.906 -105.104 -5.719 QT
-104.284 -5.531 -103.424 -5.531 QT
-102.659 -5.531 -102.268 -5.742 QT
-101.877 -5.953 -101.877 -6.375 QT
-101.877 -6.719 -102.151 -6.891 QT
-102.424 -7.063 -103.221 -7.172 QT
-103.674 -7.219 L
-105.424 -7.438 -106.127 -8.031 QT
-106.83 -8.625 -106.83 -9.844 QT
-106.83 -11.141 -105.94 -11.773 QT
-105.049 -12.406 -103.205 -12.406 QT
-102.471 -12.406 -101.674 -12.297 QT
-100.877 -12.188 -99.94 -11.953 QT
cp
-95.013 -5.188 M
-95.013 -0.875 L
-97.622 -0.875 L
-97.622 -12.203 L
-95.013 -12.203 L
-95.013 -11 L
-94.466 -11.719 -93.802 -12.063 QT
-93.138 -12.406 -92.294 -12.406 QT
-90.779 -12.406 -89.802 -11.195 QT
-88.826 -9.984 -88.826 -8.094 QT
-88.826 -6.203 -89.802 -4.992 QT
-90.779 -3.781 -92.294 -3.781 QT
-93.138 -3.781 -93.802 -4.125 QT
-94.466 -4.469 -95.013 -5.188 QT
cp
-93.263 -10.5 M
-94.107 -10.5 -94.56 -9.883 QT
-95.013 -9.266 -95.013 -8.094 QT
-95.013 -6.938 -94.56 -6.313 QT
-94.107 -5.688 -93.263 -5.688 QT
-92.419 -5.688 -91.974 -6.305 QT
-91.529 -6.922 -91.529 -8.094 QT
-91.529 -9.266 -91.974 -9.883 QT
-92.419 -10.5 -93.263 -10.5 QT
cp
-73.794 -9 M
-73.794 -4 L
-76.419 -4 L
-76.419 -4.813 L
-76.419 -7.813 L
-76.419 -8.891 -76.466 -9.289 QT
-76.513 -9.688 -76.638 -9.875 QT
-76.794 -10.141 -77.052 -10.281 QT
-77.31 -10.422 -77.654 -10.422 QT
-78.482 -10.422 -78.951 -9.789 QT
-79.419 -9.156 -79.419 -8.031 QT
-79.419 -4 L
-82.029 -4 L
-82.029 -15.391 L
-79.419 -15.391 L
-79.419 -11 L
-78.826 -11.719 -78.154 -12.063 QT
-77.482 -12.406 -76.685 -12.406 QT
-75.263 -12.406 -74.529 -11.531 QT
-73.794 -10.656 -73.794 -9 QT
cp
-67.704 -10.531 M
-68.563 -10.531 -69.024 -9.906 QT
-69.485 -9.281 -69.485 -8.094 QT
-69.485 -6.922 -69.024 -6.289 QT
-68.563 -5.656 -67.704 -5.656 QT
-66.845 -5.656 -66.392 -6.289 QT
-65.938 -6.922 -65.938 -8.094 QT
-65.938 -9.281 -66.392 -9.906 QT
-66.845 -10.531 -67.704 -10.531 QT
cp
-67.704 -12.406 M
-65.579 -12.406 -64.392 -11.258 QT
-63.204 -10.109 -63.204 -8.094 QT
-63.204 -6.078 -64.392 -4.93 QT
-65.579 -3.781 -67.704 -3.781 QT
-69.813 -3.781 -71.017 -4.93 QT
-72.22 -6.078 -72.22 -8.094 QT
-72.22 -10.109 -71.017 -11.258 QT
-69.813 -12.406 -67.704 -12.406 QT
cp
-55.948 -11 M
-55.948 -15.391 L
-53.307 -15.391 L
-53.307 -4 L
-55.948 -4 L
-55.948 -5.188 L
-56.494 -4.469 -57.143 -4.125 QT
-57.791 -3.781 -58.651 -3.781 QT
-60.166 -3.781 -61.143 -4.992 QT
-62.119 -6.203 -62.119 -8.094 QT
-62.119 -9.984 -61.143 -11.195 QT
-60.166 -12.406 -58.651 -12.406 QT
-57.807 -12.406 -57.151 -12.063 QT
-56.494 -11.719 -55.948 -11 QT
cp
-57.682 -5.688 M
-56.838 -5.688 -56.393 -6.305 QT
-55.948 -6.922 -55.948 -8.094 QT
-55.948 -9.266 -56.393 -9.883 QT
-56.838 -10.5 -57.682 -10.5 QT
-58.51 -10.5 -58.955 -9.883 QT
-59.401 -9.266 -59.401 -8.094 QT
-59.401 -6.922 -58.955 -6.305 QT
-58.51 -5.688 -57.682 -5.688 QT
cp
-42.8 -9 M
-42.8 -4 L
-45.425 -4 L
-45.425 -4.813 L
-45.425 -7.828 L
-45.425 -8.891 -45.472 -9.289 QT
-45.519 -9.688 -45.644 -9.875 QT
-45.8 -10.141 -46.058 -10.281 QT
-46.316 -10.422 -46.659 -10.422 QT
-47.488 -10.422 -47.956 -9.789 QT
-48.425 -9.156 -48.425 -8.031 QT
-48.425 -4 L
-51.034 -4 L
-51.034 -12.203 L
-48.425 -12.203 L
-48.425 -11 L
-47.831 -11.719 -47.159 -12.063 QT
-46.488 -12.406 -45.691 -12.406 QT
-44.269 -12.406 -43.534 -11.531 QT
-42.8 -10.656 -42.8 -9 QT
cp
-36.71 -10.531 M
-37.569 -10.531 -38.03 -9.906 QT
-38.491 -9.281 -38.491 -8.094 QT
-38.491 -6.922 -38.03 -6.289 QT
-37.569 -5.656 -36.71 -5.656 QT
-35.85 -5.656 -35.397 -6.289 QT
-34.944 -6.922 -34.944 -8.094 QT
-34.944 -9.281 -35.397 -9.906 QT
-35.85 -10.531 -36.71 -10.531 QT
cp
-36.71 -12.406 M
-34.585 -12.406 -33.397 -11.258 QT
-32.21 -10.109 -32.21 -8.094 QT
-32.21 -6.078 -33.397 -4.93 QT
-34.585 -3.781 -36.71 -3.781 QT
-38.819 -3.781 -40.022 -4.93 QT
-41.225 -6.078 -41.225 -8.094 QT
-41.225 -10.109 -40.022 -11.258 QT
-38.819 -12.406 -36.71 -12.406 QT
cp
-27.672 -14.531 M
-27.672 -12.203 L
-24.969 -12.203 L
-24.969 -10.328 L
-27.672 -10.328 L
-27.672 -6.844 L
-27.672 -6.281 -27.446 -6.078 QT
-27.219 -5.875 -26.547 -5.875 QT
-25.203 -5.875 L
-25.203 -4 L
-27.453 -4 L
-29 -4 -29.649 -4.648 QT
-30.297 -5.297 -30.297 -6.844 QT
-30.297 -10.328 L
-31.594 -10.328 L
-31.594 -12.203 L
-30.297 -12.203 L
-30.297 -14.531 L
-27.672 -14.531 L
cp
-14.751 -7.688 M
-15.579 -7.688 -15.993 -7.414 QT
-16.407 -7.141 -16.407 -6.594 QT
-16.407 -6.094 -16.071 -5.813 QT
-15.735 -5.531 -15.142 -5.531 QT
-14.407 -5.531 -13.899 -6.063 QT
-13.392 -6.594 -13.392 -7.391 QT
-13.392 -7.688 L
-14.751 -7.688 L
cp
-10.751 -8.688 M
-10.751 -4 L
-13.392 -4 L
-13.392 -5.219 L
-13.923 -4.469 -14.579 -4.125 QT
-15.235 -3.781 -16.173 -3.781 QT
-17.454 -3.781 -18.251 -4.531 QT
-19.048 -5.281 -19.048 -6.469 QT
-19.048 -7.906 -18.056 -8.578 QT
-17.063 -9.25 -14.938 -9.25 QT
-13.392 -9.25 L
-13.392 -9.453 L
-13.392 -10.078 -13.884 -10.367 QT
-14.376 -10.656 -15.407 -10.656 QT
-16.251 -10.656 -16.978 -10.492 QT
-17.704 -10.328 -18.329 -9.984 QT
-18.329 -11.984 L
-17.485 -12.188 -16.634 -12.297 QT
-15.782 -12.406 -14.938 -12.406 QT
-12.72 -12.406 -11.735 -11.531 QT
-10.751 -10.656 -10.751 -8.688 QT
cp
-0.821 -5.188 M
-0.821 -0.875 L
-3.43 -0.875 L
-3.43 -12.203 L
-0.821 -12.203 L
-0.821 -11 L
-0.274 -11.719 0.39 -12.063 QT
1.054 -12.406 1.898 -12.406 QT
3.413 -12.406 4.39 -11.195 QT
5.367 -9.984 5.367 -8.094 QT
5.367 -6.203 4.39 -4.992 QT
3.413 -3.781 1.898 -3.781 QT
1.054 -3.781 0.39 -4.125 QT
-0.274 -4.469 -0.821 -5.188 QT
cp
0.929 -10.5 M
0.085 -10.5 -0.368 -9.883 QT
-0.821 -9.266 -0.821 -8.094 QT
-0.821 -6.938 -0.368 -6.313 QT
0.085 -5.688 0.929 -5.688 QT
1.773 -5.688 2.218 -6.305 QT
2.663 -6.922 2.663 -8.094 QT
2.663 -9.266 2.218 -9.883 QT
1.773 -10.5 0.929 -10.5 QT
cp
10.952 -10.531 M
10.092 -10.531 9.631 -9.906 QT
9.17 -9.281 9.17 -8.094 QT
9.17 -6.922 9.631 -6.289 QT
10.092 -5.656 10.952 -5.656 QT
11.811 -5.656 12.264 -6.289 QT
12.717 -6.922 12.717 -8.094 QT
12.717 -9.281 12.264 -9.906 QT
11.811 -10.531 10.952 -10.531 QT
cp
10.952 -12.406 M
13.077 -12.406 14.264 -11.258 QT
15.452 -10.109 15.452 -8.094 QT
15.452 -6.078 14.264 -4.93 QT
13.077 -3.781 10.952 -3.781 QT
8.842 -3.781 7.639 -4.93 QT
6.436 -6.078 6.436 -8.094 QT
6.436 -10.109 7.639 -11.258 QT
8.842 -12.406 10.952 -12.406 QT
cp
23.224 -9.969 M
22.88 -10.125 22.536 -10.203 QT
22.193 -10.281 21.849 -10.281 QT
20.833 -10.281 20.286 -9.633 QT
19.739 -8.984 19.739 -7.781 QT
19.739 -4 L
17.13 -4 L
17.13 -12.203 L
19.739 -12.203 L
19.739 -10.859 L
20.255 -11.656 20.911 -12.031 QT
21.568 -12.406 22.474 -12.406 QT
22.614 -12.406 22.763 -12.391 QT
22.911 -12.375 23.208 -12.344 QT
23.224 -9.969 L
cp
24.264 -7.188 M
24.264 -12.203 L
26.905 -12.203 L
26.905 -11.391 L
26.905 -10.719 26.897 -9.711 QT
26.889 -8.703 26.889 -8.359 QT
26.889 -7.375 26.936 -6.938 QT
26.983 -6.5 27.108 -6.313 QT
27.28 -6.047 27.538 -5.906 QT
27.795 -5.766 28.139 -5.766 QT
28.952 -5.766 29.42 -6.398 QT
29.889 -7.031 29.889 -8.156 QT
29.889 -12.203 L
32.514 -12.203 L
32.514 -4 L
29.889 -4 L
29.889 -5.188 L
29.295 -4.469 28.631 -4.125 QT
27.967 -3.781 27.17 -3.781 QT
25.749 -3.781 25.006 -4.656 QT
24.264 -5.531 24.264 -7.188 QT
cp
41.417 -11.953 M
41.417 -9.813 L
40.886 -10.172 40.347 -10.352 QT
39.808 -10.531 39.229 -10.531 QT
38.12 -10.531 37.511 -9.891 QT
36.901 -9.25 36.901 -8.094 QT
36.901 -6.938 37.511 -6.297 QT
38.12 -5.656 39.229 -5.656 QT
39.839 -5.656 40.393 -5.844 QT
40.948 -6.031 41.417 -6.391 QT
41.417 -4.234 L
40.792 -4.016 40.159 -3.898 QT
39.526 -3.781 38.901 -3.781 QT
36.683 -3.781 35.425 -4.922 QT
34.167 -6.063 34.167 -8.094 QT
34.167 -10.125 35.425 -11.266 QT
36.683 -12.406 38.901 -12.406 QT
39.542 -12.406 40.167 -12.289 QT
40.792 -12.172 41.417 -11.953 QT
cp
51.714 -9 M
51.714 -4 L
49.089 -4 L
49.089 -4.813 L
49.089 -7.813 L
49.089 -8.891 49.042 -9.289 QT
48.995 -9.688 48.87 -9.875 QT
48.714 -10.141 48.456 -10.281 QT
48.199 -10.422 47.855 -10.422 QT
47.027 -10.422 46.558 -9.789 QT
46.089 -9.156 46.089 -8.031 QT
46.089 -4 L
43.48 -4 L
43.48 -15.391 L
46.089 -15.391 L
46.089 -11 L
46.683 -11.719 47.355 -12.063 QT
48.027 -12.406 48.824 -12.406 QT
50.245 -12.406 50.98 -11.531 QT
51.714 -10.656 51.714 -9 QT
cp
57.804 -10.531 M
56.945 -10.531 56.484 -9.906 QT
56.023 -9.281 56.023 -8.094 QT
56.023 -6.922 56.484 -6.289 QT
56.945 -5.656 57.804 -5.656 QT
58.664 -5.656 59.117 -6.289 QT
59.57 -6.922 59.57 -8.094 QT
59.57 -9.281 59.117 -9.906 QT
58.664 -10.531 57.804 -10.531 QT
cp
57.804 -12.406 M
59.929 -12.406 61.117 -11.258 QT
62.304 -10.109 62.304 -8.094 QT
62.304 -6.078 61.117 -4.93 QT
59.929 -3.781 57.804 -3.781 QT
55.695 -3.781 54.492 -4.93 QT
53.289 -6.078 53.289 -8.094 QT
53.289 -10.109 54.492 -11.258 QT
55.695 -12.406 57.804 -12.406 QT
cp
63.889 -7.188 M
63.889 -12.203 L
66.53 -12.203 L
66.53 -11.391 L
66.53 -10.719 66.522 -9.711 QT
66.514 -8.703 66.514 -8.359 QT
66.514 -7.375 66.561 -6.938 QT
66.608 -6.5 66.733 -6.313 QT
66.905 -6.047 67.162 -5.906 QT
67.42 -5.766 67.764 -5.766 QT
68.577 -5.766 69.045 -6.398 QT
69.514 -7.031 69.514 -8.156 QT
69.514 -12.203 L
72.139 -12.203 L
72.139 -4 L
69.514 -4 L
69.514 -5.188 L
68.92 -4.469 68.256 -4.125 QT
67.592 -3.781 66.795 -3.781 QT
65.373 -3.781 64.631 -4.656 QT
63.889 -5.531 63.889 -7.188 QT
cp
87.754 -9 M
87.754 -4 L
85.129 -4 L
85.129 -4.813 L
85.129 -7.828 L
85.129 -8.891 85.082 -9.289 QT
85.035 -9.688 84.91 -9.875 QT
84.754 -10.141 84.496 -10.281 QT
84.238 -10.422 83.894 -10.422 QT
83.066 -10.422 82.597 -9.789 QT
82.129 -9.156 82.129 -8.031 QT
82.129 -4 L
79.519 -4 L
79.519 -12.203 L
82.129 -12.203 L
82.129 -11 L
82.722 -11.719 83.394 -12.063 QT
84.066 -12.406 84.863 -12.406 QT
86.285 -12.406 87.019 -11.531 QT
87.754 -10.656 87.754 -9 QT
cp
93.625 -7.688 M
92.797 -7.688 92.383 -7.414 QT
91.969 -7.141 91.969 -6.594 QT
91.969 -6.094 92.305 -5.813 QT
92.641 -5.531 93.235 -5.531 QT
93.969 -5.531 94.477 -6.063 QT
94.985 -6.594 94.985 -7.391 QT
94.985 -7.688 L
93.625 -7.688 L
cp
97.625 -8.688 M
97.625 -4 L
94.985 -4 L
94.985 -5.219 L
94.453 -4.469 93.797 -4.125 QT
93.141 -3.781 92.203 -3.781 QT
90.922 -3.781 90.125 -4.531 QT
89.328 -5.281 89.328 -6.469 QT
89.328 -7.906 90.32 -8.578 QT
91.313 -9.25 93.438 -9.25 QT
94.985 -9.25 L
94.985 -9.453 L
94.985 -10.078 94.492 -10.367 QT
94 -10.656 92.969 -10.656 QT
92.125 -10.656 91.399 -10.492 QT
90.672 -10.328 90.047 -9.984 QT
90.047 -11.984 L
90.891 -12.188 91.742 -12.297 QT
92.594 -12.406 93.438 -12.406 QT
95.656 -12.406 96.641 -11.531 QT
97.625 -10.656 97.625 -8.688 QT
cp
103.915 -12.203 M
106.524 -12.203 L
108.571 -6.531 L
110.602 -12.203 L
113.243 -12.203 L
110.008 -4 L
107.133 -4 L
103.915 -12.203 L
cp
113.422 -12.203 M
116.047 -12.203 L
118.25 -6.641 L
120.125 -12.203 L
122.734 -12.203 L
119.297 -3.219 L
118.765 -1.859 118.078 -1.313 QT
117.39 -0.766 116.25 -0.766 QT
114.734 -0.766 L
114.734 -2.484 L
115.562 -2.484 L
116.218 -2.484 116.523 -2.695 QT
116.828 -2.906 117 -3.453 QT
117.078 -3.688 L
113.422 -12.203 L
cp
118.968 -16 M
121.047 -16 L
118.343 -13.25 L
116.906 -13.25 L
118.968 -16 L
cp
130.46 -11.953 M
130.46 -9.953 L
129.616 -10.313 128.835 -10.484 QT
128.053 -10.656 127.35 -10.656 QT
126.6 -10.656 126.241 -10.469 QT
125.882 -10.281 125.882 -9.891 QT
125.882 -9.578 126.155 -9.414 QT
126.428 -9.25 127.132 -9.156 QT
127.6 -9.094 L
129.616 -8.844 130.311 -8.258 QT
131.007 -7.672 131.007 -6.422 QT
131.007 -5.109 130.038 -4.445 QT
129.069 -3.781 127.147 -3.781 QT
126.335 -3.781 125.467 -3.914 QT
124.6 -4.047 123.694 -4.297 QT
123.694 -6.297 L
124.475 -5.906 125.296 -5.719 QT
126.116 -5.531 126.975 -5.531 QT
127.741 -5.531 128.132 -5.742 QT
128.522 -5.953 128.522 -6.375 QT
128.522 -6.719 128.249 -6.891 QT
127.975 -7.063 127.178 -7.172 QT
126.725 -7.219 L
124.975 -7.438 124.272 -8.031 QT
123.569 -8.625 123.569 -9.844 QT
123.569 -11.141 124.46 -11.773 QT
125.35 -12.406 127.194 -12.406 QT
127.928 -12.406 128.725 -12.297 QT
129.522 -12.188 130.46 -11.953 QT
cp
135.636 -14.531 M
135.636 -12.203 L
138.34 -12.203 L
138.34 -10.328 L
135.636 -10.328 L
135.636 -6.844 L
135.636 -6.281 135.863 -6.078 QT
136.09 -5.875 136.761 -5.875 QT
138.105 -5.875 L
138.105 -4 L
135.855 -4 L
134.308 -4 133.66 -4.648 QT
133.011 -5.297 133.011 -6.844 QT
133.011 -10.328 L
131.715 -10.328 L
131.715 -12.203 L
133.011 -12.203 L
133.011 -14.531 L
135.636 -14.531 L
cp
139.689 -7.188 M
139.689 -12.203 L
142.33 -12.203 L
142.33 -11.391 L
142.33 -10.719 142.322 -9.711 QT
142.314 -8.703 142.314 -8.359 QT
142.314 -7.375 142.361 -6.938 QT
142.408 -6.5 142.533 -6.313 QT
142.705 -6.047 142.963 -5.906 QT
143.221 -5.766 143.564 -5.766 QT
144.377 -5.766 144.846 -6.398 QT
145.314 -7.031 145.314 -8.156 QT
145.314 -12.203 L
147.939 -12.203 L
147.939 -4 L
145.314 -4 L
145.314 -5.188 L
144.721 -4.469 144.057 -4.125 QT
143.393 -3.781 142.596 -3.781 QT
141.174 -3.781 140.432 -4.656 QT
139.689 -5.531 139.689 -7.188 QT
cp
152.827 -5.188 M
152.827 -0.875 L
150.217 -0.875 L
150.217 -12.203 L
152.827 -12.203 L
152.827 -11 L
153.373 -11.719 154.037 -12.063 QT
154.702 -12.406 155.545 -12.406 QT
157.061 -12.406 158.037 -11.195 QT
159.014 -9.984 159.014 -8.094 QT
159.014 -6.203 158.037 -4.992 QT
157.061 -3.781 155.545 -3.781 QT
154.702 -3.781 154.037 -4.125 QT
153.373 -4.469 152.827 -5.188 QT
cp
154.577 -10.5 M
153.733 -10.5 153.28 -9.883 QT
152.827 -9.266 152.827 -8.094 QT
152.827 -6.938 153.28 -6.313 QT
153.733 -5.688 154.577 -5.688 QT
155.42 -5.688 155.866 -6.305 QT
156.311 -6.922 156.311 -8.094 QT
156.311 -9.266 155.866 -9.883 QT
155.42 -10.5 154.577 -10.5 QT
cp
160.615 -7.188 M
160.615 -12.203 L
163.255 -12.203 L
163.255 -11.391 L
163.255 -10.719 163.247 -9.711 QT
163.24 -8.703 163.24 -8.359 QT
163.24 -7.375 163.286 -6.938 QT
163.333 -6.5 163.458 -6.313 QT
163.63 -6.047 163.888 -5.906 QT
164.146 -5.766 164.49 -5.766 QT
165.302 -5.766 165.771 -6.398 QT
166.24 -7.031 166.24 -8.156 QT
166.24 -12.203 L
168.865 -12.203 L
168.865 -4 L
166.24 -4 L
166.24 -5.188 L
165.646 -4.469 164.982 -4.125 QT
164.318 -3.781 163.521 -3.781 QT
162.099 -3.781 161.357 -4.656 QT
160.615 -5.531 160.615 -7.188 QT
cp
182.651 -11.953 M
182.651 -9.953 L
181.807 -10.313 181.026 -10.484 QT
180.245 -10.656 179.542 -10.656 QT
178.792 -10.656 178.432 -10.469 QT
178.073 -10.281 178.073 -9.891 QT
178.073 -9.578 178.346 -9.414 QT
178.62 -9.25 179.323 -9.156 QT
179.792 -9.094 L
181.807 -8.844 182.503 -8.258 QT
183.198 -7.672 183.198 -6.422 QT
183.198 -5.109 182.229 -4.445 QT
181.26 -3.781 179.339 -3.781 QT
178.526 -3.781 177.659 -3.914 QT
176.792 -4.047 175.885 -4.297 QT
175.885 -6.297 L
176.667 -5.906 177.487 -5.719 QT
178.307 -5.531 179.167 -5.531 QT
179.932 -5.531 180.323 -5.742 QT
180.714 -5.953 180.714 -6.375 QT
180.714 -6.719 180.44 -6.891 QT
180.167 -7.063 179.37 -7.172 QT
178.917 -7.219 L
177.167 -7.438 176.464 -8.031 QT
175.76 -8.625 175.76 -9.844 QT
175.76 -11.141 176.651 -11.773 QT
177.542 -12.406 179.385 -12.406 QT
180.12 -12.406 180.917 -12.297 QT
181.714 -12.188 182.651 -11.953 QT
cp
183.89 -12.203 M
186.515 -12.203 L
188.719 -6.641 L
190.594 -12.203 L
193.203 -12.203 L
189.765 -3.219 L
189.234 -1.859 188.547 -1.313 QT
187.859 -0.766 186.719 -0.766 QT
185.203 -0.766 L
185.203 -2.484 L
186.031 -2.484 L
186.687 -2.484 186.992 -2.695 QT
187.297 -2.906 187.469 -3.453 QT
187.547 -3.688 L
183.89 -12.203 L
cp
200.929 -11.953 M
200.929 -9.953 L
200.085 -10.313 199.304 -10.484 QT
198.522 -10.656 197.819 -10.656 QT
197.069 -10.656 196.71 -10.469 QT
196.35 -10.281 196.35 -9.891 QT
196.35 -9.578 196.624 -9.414 QT
196.897 -9.25 197.6 -9.156 QT
198.069 -9.094 L
200.085 -8.844 200.78 -8.258 QT
201.475 -7.672 201.475 -6.422 QT
201.475 -5.109 200.507 -4.445 QT
199.538 -3.781 197.616 -3.781 QT
196.804 -3.781 195.936 -3.914 QT
195.069 -4.047 194.163 -4.297 QT
194.163 -6.297 L
194.944 -5.906 195.764 -5.719 QT
196.585 -5.531 197.444 -5.531 QT
198.21 -5.531 198.6 -5.742 QT
198.991 -5.953 198.991 -6.375 QT
198.991 -6.719 198.718 -6.891 QT
198.444 -7.063 197.647 -7.172 QT
197.194 -7.219 L
195.444 -7.438 194.741 -8.031 QT
194.038 -8.625 194.038 -9.844 QT
194.038 -11.141 194.929 -11.773 QT
195.819 -12.406 197.663 -12.406 QT
198.397 -12.406 199.194 -12.297 QT
199.991 -12.188 200.929 -11.953 QT
cp
206.105 -14.531 M
206.105 -12.203 L
208.808 -12.203 L
208.808 -10.328 L
206.105 -10.328 L
206.105 -6.844 L
206.105 -6.281 206.332 -6.078 QT
206.558 -5.875 207.23 -5.875 QT
208.574 -5.875 L
208.574 -4 L
206.324 -4 L
204.777 -4 204.129 -4.648 QT
203.48 -5.297 203.48 -6.844 QT
203.48 -10.328 L
202.183 -10.328 L
202.183 -12.203 L
203.48 -12.203 L
203.48 -14.531 L
206.105 -14.531 L
cp
218.44 -8.125 M
218.44 -7.375 L
212.299 -7.375 L
212.393 -6.453 212.971 -5.992 QT
213.549 -5.531 214.565 -5.531 QT
215.393 -5.531 216.26 -5.773 QT
217.127 -6.016 218.049 -6.516 QT
218.049 -4.5 L
217.111 -4.141 216.182 -3.961 QT
215.252 -3.781 214.33 -3.781 QT
212.096 -3.781 210.861 -4.914 QT
209.627 -6.047 209.627 -8.094 QT
209.627 -10.094 210.838 -11.25 QT
212.049 -12.406 214.174 -12.406 QT
216.111 -12.406 217.275 -11.242 QT
218.44 -10.078 218.44 -8.125 QT
cp
215.736 -9 M
215.736 -9.75 215.299 -10.203 QT
214.861 -10.656 214.158 -10.656 QT
213.408 -10.656 212.932 -10.227 QT
212.455 -9.797 212.33 -9 QT
215.736 -9 L
cp
215.721 -16 M
217.799 -16 L
215.096 -13.25 L
213.658 -13.25 L
215.721 -16 L
cp
227.786 -10.844 M
228.286 -11.609 228.973 -12.008 QT
229.661 -12.406 230.473 -12.406 QT
231.895 -12.406 232.63 -11.531 QT
233.364 -10.656 233.364 -9 QT
233.364 -4 L
230.739 -4 L
230.739 -8.281 L
230.739 -8.375 230.747 -8.477 QT
230.755 -8.578 230.755 -8.766 QT
230.755 -9.641 230.497 -10.031 QT
230.239 -10.422 229.661 -10.422 QT
228.911 -10.422 228.505 -9.805 QT
228.098 -9.188 228.083 -8.031 QT
228.083 -4 L
225.458 -4 L
225.458 -8.281 L
225.458 -9.641 225.223 -10.031 QT
224.989 -10.422 224.38 -10.422 QT
223.63 -10.422 223.216 -9.805 QT
222.802 -9.188 222.802 -8.031 QT
222.802 -4 L
220.177 -4 L
220.177 -12.203 L
222.802 -12.203 L
222.802 -11 L
223.286 -11.703 223.919 -12.055 QT
224.552 -12.406 225.302 -12.406 QT
226.145 -12.406 226.802 -11.992 QT
227.458 -11.578 227.786 -10.844 QT
cp
235.37 -7.188 M
235.37 -12.203 L
238.011 -12.203 L
238.011 -11.391 L
238.011 -10.719 238.003 -9.711 QT
237.995 -8.703 237.995 -8.359 QT
237.995 -7.375 238.042 -6.938 QT
238.089 -6.5 238.214 -6.313 QT
238.386 -6.047 238.644 -5.906 QT
238.901 -5.766 239.245 -5.766 QT
240.058 -5.766 240.526 -6.398 QT
240.995 -7.031 240.995 -8.156 QT
240.995 -12.203 L
243.62 -12.203 L
243.62 -4 L
240.995 -4 L
240.995 -5.188 L
240.401 -4.469 239.737 -4.125 QT
239.073 -3.781 238.276 -3.781 QT
236.855 -3.781 236.112 -4.656 QT
235.37 -5.531 235.37 -7.188 QT
cp
f
GR
GS
[0.75 0 0 0.75 0 0.25] CT
0 0.447 0.741 RC
1 LJ
0.667 LW
N
128 462.667 M
128.001 462.667 L
128.005 462.667 L
128.028 462.667 L
128.143 462.667 L
128.664 462.667 L
129.606 462.667 L
130.803 462.667 L
132.136 462.667 L
133.641 462.667 L
135.546 462.667 L
137.734 462.667 L
140.788 462.667 L
144.884 462.667 L
149.978 462.667 L
154.924 462.667 L
160.393 462.667 L
167.423 462.667 L
177.466 462.667 L
189.809 462.667 L
202.376 462.667 L
204.2 462.667 L
204.2 462.667 L
205.076 462.666 L
205.953 462.662 L
207.074 462.647 L
208.347 462.612 L
209.742 462.547 L
211.557 462.412 L
213.593 462.181 L
215.955 461.797 L
218.758 461.161 L
223.033 459.779 L
229.493 456.696 L
237.965 450.867 L
248.883 440.795 L
258.7 429.983 L
266.435 420.782 L
274.171 411.338 L
282.276 401.481 L
290.343 391.948 L
298.626 382.637 L
306.531 374.319 L
313.903 367.116 L
321.208 360.531 L
328.998 354.113 L
337.292 347.944 L
345.471 342.493 L
353.036 337.968 L
360.233 334.085 L
367.728 330.439 L
371.84 328.595 L
371.84 328.595 L
371.84 328.595 L
374.327 327.493 L
376.814 326.263 L
380.447 324.16 L
384.926 321.093 L
391.246 315.983 L
400.007 307.603 L
407.43 299.537 L
414.854 290.811 L
423.149 280.552 L
431.717 269.693 L
432.8 268.313 L
432.8 268.313 L
432.8 268.313 L
435.417 264.404 L
438.033 260.638 L
441.841 255.418 L
446.561 249.257 L
453.504 240.548 L
463.759 228.051 L
469.852 220.771 L
475.946 213.613 L
478.52 210.638 L
478.52 210.638 L
478.52 210.638 L
483.301 204.991 L
488.082 199.272 L
494.332 191.961 L
501.977 183.47 L
511.849 173.421 L
524.921 161.87 L
532.372 156.208 L
539.823 151.199 L
548.702 146.037 L
557.765 141.604 L
565.413 138.463 L
571.917 136.18 L
578.72 134.13 L
586.963 132.054 L
596.269 130.175 L
604.732 128.829 L
611.604 127.956 L
618.006 127.288 L
625.469 126.661 L
634.491 126.088 L
643.651 125.672 L
651.231 125.437 L
657.614 125.303 L
664.37 125.21 L
672.691 125.152 L
682.127 125.149 L
688.903 125.185 L
695.679 125.243 L
703.912 125.336 L
713.24 125.464 L
721.732 125.598 L
728.605 125.721 L
734.985 125.84 L
742.424 125.98 L
751.447 126.153 L
760.637 126.327 L
768.237 126.475 L
774.61 126.601 L
781.341 126.73 L
789.644 126.884 L
799.096 127.051 L
805.88 127.171 L
812.664 127.287 L
820.899 127.42 L
830.221 127.562 L
838.704 127.684 L
845.577 127.785 L
851.964 127.873 L
859.409 127.969 L
868.433 128.078 L
877.613 128.179 L
885.208 128.261 L
890 128.316 L
S
GR
GS
[0.75 0 0 0.75 0 0.25] CT
0.851 0.325 0.098 RC
1 LJ
0.667 LW
N
128 462.667 M
128.001 462.667 L
128.005 462.667 L
128.028 462.667 L
128.143 462.667 L
128.664 462.667 L
129.606 462.667 L
130.803 462.667 L
132.136 462.667 L
133.641 462.667 L
135.546 462.667 L
137.734 462.667 L
140.788 462.667 L
144.884 462.667 L
149.978 462.667 L
154.924 462.667 L
160.393 462.667 L
167.423 462.667 L
177.466 462.667 L
189.809 462.667 L
202.376 462.667 L
204.2 462.667 L
204.2 462.667 L
205.076 462.667 L
205.953 462.667 L
207.074 462.668 L
208.347 462.666 L
209.742 462.655 L
211.557 462.617 L
213.593 462.526 L
215.955 462.329 L
218.758 461.938 L
223.033 460.941 L
229.493 458.382 L
237.965 453.021 L
248.883 443.102 L
258.7 432.032 L
266.435 422.436 L
274.171 412.489 L
282.276 402.048 L
290.343 391.928 L
298.626 382.048 L
306.531 373.247 L
313.903 365.662 L
321.208 358.765 L
328.998 352.091 L
337.292 345.73 L
345.471 340.164 L
353.036 335.591 L
360.233 331.705 L
367.728 328.093 L
371.84 326.284 L
371.84 326.284 L
371.84 326.284 L
374.327 325.279 L
376.814 324.449 L
380.447 323.552 L
384.926 322.793 L
391.246 321.979 L
400.007 320.758 L
407.43 319.38 L
414.854 317.642 L
423.149 315.343 L
431.717 312.715 L
432.8 312.374 L
432.8 312.374 L
432.8 312.374 L
435.417 311.436 L
438.033 310.228 L
441.841 307.992 L
446.561 304.557 L
453.504 298.442 L
463.759 287.61 L
469.852 280.388 L
475.946 272.752 L
478.52 269.435 L
478.52 269.435 L
478.52 269.435 L
483.301 261.883 L
488.082 254.33 L
494.332 244.556 L
501.977 232.911 L
511.849 218.655 L
524.921 201.555 L
532.372 192.837 L
539.823 184.898 L
548.702 176.445 L
557.765 168.897 L
565.413 163.316 L
571.917 159.094 L
578.72 155.155 L
586.963 150.974 L
596.269 146.947 L
604.732 143.838 L
611.604 141.647 L
618.006 139.847 L
625.469 138.011 L
634.491 136.119 L
643.651 134.513 L
651.231 133.383 L
657.614 132.554 L
664.37 131.789 L
672.691 130.984 L
682.127 130.23 L
688.903 129.774 L
695.679 129.383 L
703.912 128.987 L
713.24 128.627 L
721.732 128.37 L
728.605 128.198 L
734.985 128.068 L
742.424 127.95 L
751.447 127.847 L
760.637 127.781 L
768.237 127.746 L
774.61 127.728 L
781.341 127.723 L
789.644 127.733 L
799.096 127.763 L
805.88 127.788 L
812.664 127.82 L
820.899 127.866 L
830.221 127.927 L
838.704 127.987 L
845.577 128.032 L
851.964 128.076 L
859.409 128.13 L
868.433 128.197 L
877.613 128.268 L
885.208 128.321 L
890 128.351 L
S
GR
GS
[0.75 0 0 0.75 0 0.25] CT
0.929 0.694 0.125 RC
1 LJ
0.667 LW
N
128 462.667 M
128.001 462.667 L
128.005 462.667 L
128.028 462.667 L
128.143 462.667 L
128.664 462.667 L
129.606 462.667 L
130.803 462.667 L
132.136 462.667 L
133.641 462.667 L
135.546 462.667 L
137.734 462.667 L
140.788 462.667 L
144.884 462.667 L
149.978 462.667 L
154.924 462.667 L
160.393 462.667 L
167.423 462.667 L
177.466 462.667 L
189.809 462.667 L
202.376 462.667 L
204.2 462.667 L
204.2 296 L
205.076 296 L
205.953 296 L
207.074 296 L
208.347 296 L
209.742 296 L
211.557 296 L
213.593 296 L
215.955 296 L
218.758 296 L
223.033 296 L
229.493 296 L
237.965 296 L
248.883 296 L
258.7 296 L
266.435 296 L
274.171 296 L
282.276 296 L
290.343 296 L
298.626 296 L
306.531 296 L
313.903 296 L
321.208 296 L
328.998 296 L
337.292 296 L
345.471 296 L
353.036 296 L
360.233 296 L
367.728 296 L
371.84 296 L
371.84 129.333 L
371.84 129.333 L
374.327 129.333 L
376.814 129.333 L
380.447 129.333 L
384.926 129.333 L
391.246 129.333 L
400.007 129.333 L
407.43 129.333 L
414.854 129.333 L
423.149 129.333 L
431.717 129.333 L
432.8 129.333 L
432.8 129.333 L
432.8 129.333 L
435.417 129.333 L
438.033 129.333 L
441.841 129.333 L
446.561 129.333 L
453.504 129.333 L
463.759 129.333 L
469.852 129.333 L
475.946 129.333 L
478.52 129.333 L
478.52 129.333 L
478.52 129.333 L
483.301 129.333 L
488.082 129.333 L
494.332 129.333 L
501.977 129.333 L
511.849 129.333 L
524.921 129.333 L
532.372 129.333 L
539.823 129.333 L
548.702 129.333 L
557.765 129.333 L
565.413 129.333 L
571.917 129.333 L
578.72 129.333 L
586.963 129.333 L
596.269 129.333 L
604.732 129.333 L
611.604 129.333 L
618.006 129.333 L
625.469 129.333 L
634.491 129.333 L
643.651 129.333 L
651.231 129.333 L
657.614 129.333 L
664.37 129.333 L
672.691 129.333 L
682.127 129.333 L
688.903 129.333 L
695.679 129.333 L
703.912 129.333 L
713.24 129.333 L
721.732 129.333 L
728.605 129.333 L
734.985 129.333 L
742.424 129.333 L
751.447 129.333 L
760.637 129.333 L
768.237 129.333 L
774.61 129.333 L
781.341 129.333 L
789.644 129.333 L
799.096 129.333 L
805.88 129.333 L
812.664 129.333 L
820.899 129.333 L
830.221 129.333 L
838.704 129.333 L
845.577 129.333 L
851.964 129.333 L
859.409 129.333 L
868.433 129.333 L
877.613 129.333 L
885.208 129.333 L
890 129.333 L
S
GR
GS
[0.75 0 0 0.75 0 0.25] CT
0.494 0.184 0.557 RC
1 LJ
0.667 LW
N
128 462.667 M
128.001 462.667 L
128.005 462.667 L
128.028 462.667 L
128.143 462.667 L
128.664 462.667 L
129.606 462.667 L
130.803 462.667 L
132.136 462.667 L
133.641 462.667 L
135.546 462.667 L
137.734 462.667 L
140.788 462.667 L
144.884 462.667 L
149.978 462.667 L
154.924 462.667 L
160.393 462.667 L
167.423 462.667 L
177.466 462.667 L
189.809 462.667 L
202.376 462.667 L
204.2 462.667 L
204.2 296 L
205.076 296 L
205.953 296 L
207.074 296 L
208.347 296 L
209.742 296 L
211.557 296 L
213.593 296 L
215.955 296 L
218.758 296 L
223.033 296 L
229.493 296 L
237.965 296 L
248.883 296 L
258.7 296 L
266.435 296 L
274.171 296 L
282.276 296 L
290.343 296 L
298.626 296 L
306.531 296 L
313.903 296 L
321.208 296 L
328.998 296 L
337.292 296 L
345.471 296 L
353.036 296 L
360.233 296 L
367.728 296 L
371.84 296 L
371.84 296 L
371.84 296 L
374.327 296 L
376.814 296 L
380.447 296 L
384.926 296 L
391.246 296 L
400.007 296 L
407.43 296 L
414.854 296 L
423.149 296 L
431.717 296 L
432.8 296 L
432.8 129.333 L
432.8 129.333 L
435.417 129.333 L
438.033 129.333 L
441.841 129.333 L
446.561 129.333 L
453.504 129.333 L
463.759 129.333 L
469.852 129.333 L
475.946 129.333 L
478.52 129.333 L
478.52 129.333 L
478.52 129.333 L
483.301 129.333 L
488.082 129.333 L
494.332 129.333 L
501.977 129.333 L
511.849 129.333 L
524.921 129.333 L
532.372 129.333 L
539.823 129.333 L
548.702 129.333 L
557.765 129.333 L
565.413 129.333 L
571.917 129.333 L
578.72 129.333 L
586.963 129.333 L
596.269 129.333 L
604.732 129.333 L
611.604 129.333 L
618.006 129.333 L
625.469 129.333 L
634.491 129.333 L
643.651 129.333 L
651.231 129.333 L
657.614 129.333 L
664.37 129.333 L
672.691 129.333 L
682.127 129.333 L
688.903 129.333 L
695.679 129.333 L
703.912 129.333 L
713.24 129.333 L
721.732 129.333 L
728.605 129.333 L
734.985 129.333 L
742.424 129.333 L
751.447 129.333 L
760.637 129.333 L
768.237 129.333 L
774.61 129.333 L
781.341 129.333 L
789.644 129.333 L
799.096 129.333 L
805.88 129.333 L
812.664 129.333 L
820.899 129.333 L
830.221 129.333 L
838.704 129.333 L
845.577 129.333 L
851.964 129.333 L
859.409 129.333 L
868.433 129.333 L
877.613 129.333 L
885.208 129.333 L
890 129.333 L
S
GR
GS
[0.75 0 0 0.75 0 0.25] CT
1 GC
N
814 137 M
814 59 L
877 59 L
877 137 L
cp
f
GR
GS
[0.75 0 0 0.75 638.25 55.75] CT
/Helvetica 12 F
GS
[1 0 0 1 0 0] CT
0 0 moveto 
1 -1 scale
(h) t 
GR
GR
GS
[0.75 0 0 0.75 644.25 60.25] CT
/Helvetica 9.6 F
GS
[1 0 0 1 0 0] CT
0 0 moveto 
1 -1 scale
(1) t 
GR
GR
GS
[0.75 0 0 0.75 0 0.25] CT
0 0.447 0.741 RC
1 LJ
0.667 LW
N
818 71.581 M
848 71.581 L
S
GR
GS
[0.75 0 0 0.75 638.25 71.5] CT
/Helvetica 12 F
GS
[1 0 0 1 0 0] CT
0 0 moveto 
1 -1 scale
(h) t 
GR
GR
GS
[0.75 0 0 0.75 644.25 76] CT
/Helvetica 9.6 F
GS
[1 0 0 1 0 0] CT
0 0 moveto 
1 -1 scale
(2) t 
GR
GR
GS
[0.75 0 0 0.75 0 0.25] CT
0.851 0.325 0.098 RC
1 LJ
0.667 LW
N
818 93.219 M
848 93.219 L
S
GR
GS
[0.75 0 0 0.75 638.25 84.12903] CT
/Helvetica 12 F
GS
[1 0 0 1 0 0] CT
0 4.5 moveto 
1 -1 scale
(sp1) t 
GR
GR
GS
[0.75 0 0 0.75 0 0.25] CT
0.929 0.694 0.125 RC
1 LJ
0.667 LW
N
818 111.839 M
848 111.839 L
S
GR
GS
[0.75 0 0 0.75 638.25 95.82903] CT
/Helvetica 12 F
GS
[1 0 0 1 0 0] CT
0 4.5 moveto 
1 -1 scale
(sp2) t 
GR
GR
GS
[0.75 0 0 0.75 0 0.25] CT
0.494 0.184 0.557 RC
1 LJ
0.667 LW
N
818 127.439 M
848 127.439 L
S
GR
GS
[0.75 0 0 0.75 0 0.25] CT
0.149 GC
10.0 ML
0.667 LW
N
814 137 M
814 59 L
877 59 L
877 137 L
cp
S
GR
%%Trailer
%%Pages: 1
%%EOF
