%!PS-Adobe-3.0 EPSF-3.0
%%Creator: (MATLAB, The Mathworks, Inc. Version 9.1.0.441655 \(R2016b\). Operating System: Linux)
%%Title: /home/frdm/Documents/RLS/rls-2017/sp5/figures/tregulace.eps
%%CreationDate: 2018-02-09T12:31:35
%%Pages: (atend)
%%BoundingBox: 0 0 737 460
%%LanguageLevel: 3
%%EndComments
%%BeginProlog
%%BeginResource: procset (Apache XML Graphics Std ProcSet) 1.2 0
%%Version: 1.2 0
%%Copyright: (Copyright 2001-2003,2010 The Apache Software Foundation. License terms: http://www.apache.org/licenses/LICENSE-2.0)
/bd{bind def}bind def
/ld{load def}bd
/GR/grestore ld
/M/moveto ld
/LJ/setlinejoin ld
/C/curveto ld
/f/fill ld
/LW/setlinewidth ld
/GC/setgray ld
/t/show ld
/N/newpath ld
/CT/concat ld
/cp/closepath ld
/S/stroke ld
/L/lineto ld
/CC/setcmykcolor ld
/A/ashow ld
/GS/gsave ld
/RC/setrgbcolor ld
/RM/rmoveto ld
/ML/setmiterlimit ld
/re {4 2 roll M
1 index 0 rlineto
0 exch rlineto
neg 0 rlineto
cp } bd
/_ctm matrix def
/_tm matrix def
/BT { _ctm currentmatrix pop matrix _tm copy pop 0 0 moveto } bd
/ET { _ctm setmatrix } bd
/iTm { _ctm setmatrix _tm concat } bd
/Tm { _tm astore pop iTm 0 0 moveto } bd
/ux 0.0 def
/uy 0.0 def
/F {
  /Tp exch def
  /Tf exch def
  Tf findfont Tp scalefont setfont
  /cf Tf def  /cs Tp def
} bd
/ULS {currentpoint /uy exch def /ux exch def} bd
/ULE {
  /Tcx currentpoint pop def
  gsave
  newpath
  cf findfont cs scalefont dup
  /FontMatrix get 0 get /Ts exch def /FontInfo get dup
  /UnderlinePosition get Ts mul /To exch def
  /UnderlineThickness get Ts mul /Tt exch def
  ux uy To add moveto  Tcx uy To add lineto
  Tt setlinewidth stroke
  grestore
} bd
/OLE {
  /Tcx currentpoint pop def
  gsave
  newpath
  cf findfont cs scalefont dup
  /FontMatrix get 0 get /Ts exch def /FontInfo get dup
  /UnderlinePosition get Ts mul /To exch def
  /UnderlineThickness get Ts mul /Tt exch def
  ux uy To add cs add moveto Tcx uy To add cs add lineto
  Tt setlinewidth stroke
  grestore
} bd
/SOE {
  /Tcx currentpoint pop def
  gsave
  newpath
  cf findfont cs scalefont dup
  /FontMatrix get 0 get /Ts exch def /FontInfo get dup
  /UnderlinePosition get Ts mul /To exch def
  /UnderlineThickness get Ts mul /Tt exch def
  ux uy To add cs 10 mul 26 idiv add moveto Tcx uy To add cs 10 mul 26 idiv add lineto
  Tt setlinewidth stroke
  grestore
} bd
/QT {
/Y22 exch store
/X22 exch store
/Y21 exch store
/X21 exch store
currentpoint
/Y21 load 2 mul add 3 div exch
/X21 load 2 mul add 3 div exch
/X21 load 2 mul /X22 load add 3 div
/Y21 load 2 mul /Y22 load add 3 div
/X22 load /Y22 load curveto
} bd
/SSPD {
dup length /d exch dict def
{
/v exch def
/k exch def
currentpagedevice k known {
/cpdv currentpagedevice k get def
v cpdv ne {
/upd false def
/nullv v type /nulltype eq def
/nullcpdv cpdv type /nulltype eq def
nullv nullcpdv or
{
/upd true def
} {
/sametype v type cpdv type eq def
sametype {
v type /arraytype eq {
/vlen v length def
/cpdvlen cpdv length def
vlen cpdvlen eq {
0 1 vlen 1 sub {
/i exch def
/obj v i get def
/cpdobj cpdv i get def
obj cpdobj ne {
/upd true def
exit
} if
} for
} {
/upd true def
} ifelse
} {
v type /dicttype eq {
v {
/dv exch def
/dk exch def
/cpddv cpdv dk get def
dv cpddv ne {
/upd true def
exit
} if
} forall
} {
/upd true def
} ifelse
} ifelse
} if
} ifelse
upd true eq {
d k v put
} if
} if
} if
} forall
d length 0 gt {
d setpagedevice
} if
} bd
/RE { % /NewFontName [NewEncodingArray] /FontName RE -
  findfont dup length dict begin
  {
    1 index /FID ne
    {def} {pop pop} ifelse
  } forall
  /Encoding exch def
  /FontName 1 index def
  currentdict definefont pop
  end
} bind def
%%EndResource
%%BeginResource: procset (Apache XML Graphics EPS ProcSet) 1.0 0
%%Version: 1.0 0
%%Copyright: (Copyright 2002-2003 The Apache Software Foundation. License terms: http://www.apache.org/licenses/LICENSE-2.0)
/BeginEPSF { %def
/b4_Inc_state save def         % Save state for cleanup
/dict_count countdictstack def % Count objects on dict stack
/op_count count 1 sub def      % Count objects on operand stack
userdict begin                 % Push userdict on dict stack
/showpage { } def              % Redefine showpage, { } = null proc
0 setgray 0 setlinecap         % Prepare graphics state
1 setlinewidth 0 setlinejoin
10 setmiterlimit [ ] 0 setdash newpath
/languagelevel where           % If level not equal to 1 then
{pop languagelevel             % set strokeadjust and
1 ne                           % overprint to their defaults.
{false setstrokeadjust false setoverprint
} if
} if
} bd
/EndEPSF { %def
count op_count sub {pop} repeat            % Clean up stacks
countdictstack dict_count sub {end} repeat
b4_Inc_state restore
} bd
%%EndResource
%FOPBeginFontDict
%%IncludeResource: font Courier-Bold
%%IncludeResource: font Helvetica
%%IncludeResource: font Courier-BoldOblique
%%IncludeResource: font Courier-Oblique
%%IncludeResource: font Times-Roman
%%IncludeResource: font Helvetica-BoldOblique
%%IncludeResource: font Helvetica-Bold
%%IncludeResource: font Helvetica-Oblique
%%IncludeResource: font Times-BoldItalic
%%IncludeResource: font Courier
%%IncludeResource: font Times-Italic
%%IncludeResource: font Times-Bold
%%IncludeResource: font Symbol
%%IncludeResource: font ZapfDingbats
%FOPEndFontDict
%%BeginResource: encoding WinAnsiEncoding
/WinAnsiEncoding [
/.notdef /.notdef /.notdef /.notdef /.notdef
/.notdef /.notdef /.notdef /.notdef /.notdef
/.notdef /.notdef /.notdef /.notdef /.notdef
/.notdef /.notdef /.notdef /.notdef /.notdef
/.notdef /.notdef /.notdef /.notdef /.notdef
/.notdef /.notdef /.notdef /.notdef /.notdef
/.notdef /.notdef /space /exclam /quotedbl
/numbersign /dollar /percent /ampersand /quotesingle
/parenleft /parenright /asterisk /plus /comma
/hyphen /period /slash /zero /one
/two /three /four /five /six
/seven /eight /nine /colon /semicolon
/less /equal /greater /question /at
/A /B /C /D /E
/F /G /H /I /J
/K /L /M /N /O
/P /Q /R /S /T
/U /V /W /X /Y
/Z /bracketleft /backslash /bracketright /asciicircum
/underscore /quoteleft /a /b /c
/d /e /f /g /h
/i /j /k /l /m
/n /o /p /q /r
/s /t /u /v /w
/x /y /z /braceleft /bar
/braceright /asciitilde /bullet /Euro /bullet
/quotesinglbase /florin /quotedblbase /ellipsis /dagger
/daggerdbl /circumflex /perthousand /Scaron /guilsinglleft
/OE /bullet /Zcaron /bullet /bullet
/quoteleft /quoteright /quotedblleft /quotedblright /bullet
/endash /emdash /asciitilde /trademark /scaron
/guilsinglright /oe /bullet /zcaron /Ydieresis
/space /exclamdown /cent /sterling /currency
/yen /brokenbar /section /dieresis /copyright
/ordfeminine /guillemotleft /logicalnot /sfthyphen /registered
/macron /degree /plusminus /twosuperior /threesuperior
/acute /mu /paragraph /middot /cedilla
/onesuperior /ordmasculine /guillemotright /onequarter /onehalf
/threequarters /questiondown /Agrave /Aacute /Acircumflex
/Atilde /Adieresis /Aring /AE /Ccedilla
/Egrave /Eacute /Ecircumflex /Edieresis /Igrave
/Iacute /Icircumflex /Idieresis /Eth /Ntilde
/Ograve /Oacute /Ocircumflex /Otilde /Odieresis
/multiply /Oslash /Ugrave /Uacute /Ucircumflex
/Udieresis /Yacute /Thorn /germandbls /agrave
/aacute /acircumflex /atilde /adieresis /aring
/ae /ccedilla /egrave /eacute /ecircumflex
/edieresis /igrave /iacute /icircumflex /idieresis
/eth /ntilde /ograve /oacute /ocircumflex
/otilde /odieresis /divide /oslash /ugrave
/uacute /ucircumflex /udieresis /yacute /thorn
/ydieresis
] def
%%EndResource
%FOPBeginFontReencode
/Courier-Bold findfont
dup length dict begin
  {1 index /FID ne {def} {pop pop} ifelse} forall
  /Encoding WinAnsiEncoding def
  currentdict
end
/Courier-Bold exch definefont pop
/Helvetica findfont
dup length dict begin
  {1 index /FID ne {def} {pop pop} ifelse} forall
  /Encoding WinAnsiEncoding def
  currentdict
end
/Helvetica exch definefont pop
/Courier-BoldOblique findfont
dup length dict begin
  {1 index /FID ne {def} {pop pop} ifelse} forall
  /Encoding WinAnsiEncoding def
  currentdict
end
/Courier-BoldOblique exch definefont pop
/Courier-Oblique findfont
dup length dict begin
  {1 index /FID ne {def} {pop pop} ifelse} forall
  /Encoding WinAnsiEncoding def
  currentdict
end
/Courier-Oblique exch definefont pop
/Times-Roman findfont
dup length dict begin
  {1 index /FID ne {def} {pop pop} ifelse} forall
  /Encoding WinAnsiEncoding def
  currentdict
end
/Times-Roman exch definefont pop
/Helvetica-BoldOblique findfont
dup length dict begin
  {1 index /FID ne {def} {pop pop} ifelse} forall
  /Encoding WinAnsiEncoding def
  currentdict
end
/Helvetica-BoldOblique exch definefont pop
/Helvetica-Bold findfont
dup length dict begin
  {1 index /FID ne {def} {pop pop} ifelse} forall
  /Encoding WinAnsiEncoding def
  currentdict
end
/Helvetica-Bold exch definefont pop
/Helvetica-Oblique findfont
dup length dict begin
  {1 index /FID ne {def} {pop pop} ifelse} forall
  /Encoding WinAnsiEncoding def
  currentdict
end
/Helvetica-Oblique exch definefont pop
/Times-BoldItalic findfont
dup length dict begin
  {1 index /FID ne {def} {pop pop} ifelse} forall
  /Encoding WinAnsiEncoding def
  currentdict
end
/Times-BoldItalic exch definefont pop
/Courier findfont
dup length dict begin
  {1 index /FID ne {def} {pop pop} ifelse} forall
  /Encoding WinAnsiEncoding def
  currentdict
end
/Courier exch definefont pop
/Times-Italic findfont
dup length dict begin
  {1 index /FID ne {def} {pop pop} ifelse} forall
  /Encoding WinAnsiEncoding def
  currentdict
end
/Times-Italic exch definefont pop
/Times-Bold findfont
dup length dict begin
  {1 index /FID ne {def} {pop pop} ifelse} forall
  /Encoding WinAnsiEncoding def
  currentdict
end
/Times-Bold exch definefont pop
%FOPEndFontReencode
%%EndProlog
%%Page: 1 1
%%PageBoundingBox: 0 0 737 460
%%BeginPageSetup
[1 0 0 -1 0 460] CT
%%EndPageSetup
GS
[0.75 0 0 0.75 0 0.25] CT
N
0 0 M
983 0 L
983 613 L
0 613 L
0 0 L
cp
clip
1 GC
N
0 0 983 613 re
f
GR
GS
[0.75 0 0 0.75 0 0.25] CT
1 GC
N
0 0 983 613 re
f
GR
GS
[0.75 0 0 0.75 0 0.25] CT
1 GC
N
128 546 M
890 546 L
890 46 L
128 46 L
cp
f
GR
GS
[0.75 0 0 0.75 0 0.25] CT
0.149 GC
2 setlinecap
1 LJ
0.667 LW
N
128 546 M
890 546 L
S
GR
GS
[0.75 0 0 0.75 0 0.25] CT
0.149 GC
2 setlinecap
1 LJ
0.667 LW
N
128 546 M
128 538.38 L
S
GR
GS
[0.75 0 0 0.75 0 0.25] CT
0.149 GC
2 setlinecap
1 LJ
0.667 LW
N
204.2 546 M
204.2 538.38 L
S
GR
GS
[0.75 0 0 0.75 0 0.25] CT
0.149 GC
2 setlinecap
1 LJ
0.667 LW
N
280.4 546 M
280.4 538.38 L
S
GR
GS
[0.75 0 0 0.75 0 0.25] CT
0.149 GC
2 setlinecap
1 LJ
0.667 LW
N
356.6 546 M
356.6 538.38 L
S
GR
GS
[0.75 0 0 0.75 0 0.25] CT
0.149 GC
2 setlinecap
1 LJ
0.667 LW
N
432.8 546 M
432.8 538.38 L
S
GR
GS
[0.75 0 0 0.75 0 0.25] CT
0.149 GC
2 setlinecap
1 LJ
0.667 LW
N
509 546 M
509 538.38 L
S
GR
GS
[0.75 0 0 0.75 0 0.25] CT
0.149 GC
2 setlinecap
1 LJ
0.667 LW
N
585.2 546 M
585.2 538.38 L
S
GR
GS
[0.75 0 0 0.75 0 0.25] CT
0.149 GC
2 setlinecap
1 LJ
0.667 LW
N
661.4 546 M
661.4 538.38 L
S
GR
GS
[0.75 0 0 0.75 0 0.25] CT
0.149 GC
2 setlinecap
1 LJ
0.667 LW
N
737.6 546 M
737.6 538.38 L
S
GR
GS
[0.75 0 0 0.75 0 0.25] CT
0.149 GC
2 setlinecap
1 LJ
0.667 LW
N
813.8 546 M
813.8 538.38 L
S
GR
GS
[0.75 0 0 0.75 0 0.25] CT
0.149 GC
2 setlinecap
1 LJ
0.667 LW
N
890 546 M
890 538.38 L
S
GR
GS
[0.75 0 0 0.75 96 413.74998] CT
0.149 GC
/Helvetica 13.333 F
GS
[1 0 0 1 0 0] CT
-4.5 13 moveto 
1 -1 scale
(0) t 
GR
GR
GS
[0.75 0 0 0.75 153.15 413.74998] CT
0.149 GC
/Helvetica 13.333 F
GS
[1 0 0 1 0 0] CT
-8.5 13 moveto 
1 -1 scale
(50) t 
GR
GR
GS
[0.75 0 0 0.75 210.3 413.74998] CT
0.149 GC
/Helvetica 13.333 F
GS
[1 0 0 1 0 0] CT
-12.5 13 moveto 
1 -1 scale
(100) t 
GR
GR
GS
[0.75 0 0 0.75 267.45 413.74998] CT
0.149 GC
/Helvetica 13.333 F
GS
[1 0 0 1 0 0] CT
-12.5 13 moveto 
1 -1 scale
(150) t 
GR
GR
GS
[0.75 0 0 0.75 324.59999 413.74998] CT
0.149 GC
/Helvetica 13.333 F
GS
[1 0 0 1 0 0] CT
-12.5 13 moveto 
1 -1 scale
(200) t 
GR
GR
GS
[0.75 0 0 0.75 381.75 413.74998] CT
0.149 GC
/Helvetica 13.333 F
GS
[1 0 0 1 0 0] CT
-12.5 13 moveto 
1 -1 scale
(250) t 
GR
GR
GS
[0.75 0 0 0.75 438.90001 413.74998] CT
0.149 GC
/Helvetica 13.333 F
GS
[1 0 0 1 0 0] CT
-12.5 13 moveto 
1 -1 scale
(300) t 
GR
GR
GS
[0.75 0 0 0.75 496.05002 413.74998] CT
0.149 GC
/Helvetica 13.333 F
GS
[1 0 0 1 0 0] CT
-12.5 13 moveto 
1 -1 scale
(350) t 
GR
GR
GS
[0.75 0 0 0.75 553.19998 413.74998] CT
0.149 GC
/Helvetica 13.333 F
GS
[1 0 0 1 0 0] CT
-12.5 13 moveto 
1 -1 scale
(400) t 
GR
GR
GS
[0.75 0 0 0.75 610.34999 413.74998] CT
0.149 GC
/Helvetica 13.333 F
GS
[1 0 0 1 0 0] CT
-12.5 13 moveto 
1 -1 scale
(450) t 
GR
GR
GS
[0.75 0 0 0.75 667.5 413.74998] CT
0.149 GC
/Helvetica 13.333 F
GS
[1 0 0 1 0 0] CT
-12.5 13 moveto 
1 -1 scale
(500) t 
GR
GR
GS
[0.75 0 0 0.75 381.75027 427.50002] CT
0.149 GC
/Helvetica 14.667 F
GS
[1 0 0 1 0 0] CT
-57.5 14 moveto 
1 -1 scale
(Time \(seconds\)) t 
GR
GR
GS
[0.75 0 0 0.75 0 0.25] CT
0.149 GC
2 setlinecap
1 LJ
0.667 LW
N
128 546 M
128 46 L
S
GR
GS
[0.75 0 0 0.75 0 0.25] CT
0.149 GC
2 setlinecap
1 LJ
0.667 LW
N
128 546 M
135.62 546 L
S
GR
GS
[0.75 0 0 0.75 0 0.25] CT
0.149 GC
2 setlinecap
1 LJ
0.667 LW
N
128 462.667 M
135.62 462.667 L
S
GR
GS
[0.75 0 0 0.75 0 0.25] CT
0.149 GC
2 setlinecap
1 LJ
0.667 LW
N
128 379.333 M
135.62 379.333 L
S
GR
GS
[0.75 0 0 0.75 0 0.25] CT
0.149 GC
2 setlinecap
1 LJ
0.667 LW
N
128 296 M
135.62 296 L
S
GR
GS
[0.75 0 0 0.75 0 0.25] CT
0.149 GC
2 setlinecap
1 LJ
0.667 LW
N
128 212.667 M
135.62 212.667 L
S
GR
GS
[0.75 0 0 0.75 0 0.25] CT
0.149 GC
2 setlinecap
1 LJ
0.667 LW
N
128 129.333 M
135.62 129.333 L
S
GR
GS
[0.75 0 0 0.75 0 0.25] CT
0.149 GC
2 setlinecap
1 LJ
0.667 LW
N
128 46 M
135.62 46 L
S
GR
GS
[0.75 0 0 0.75 92 409.75] CT
0.149 GC
/Helvetica 13.333 F
GS
[1 0 0 1 0 0] CT
-34 4.5 moveto 
1 -1 scale
(-0.05) t 
GR
GR
GS
[0.75 0 0 0.75 92 347.24999] CT
0.149 GC
/Helvetica 13.333 F
GS
[1 0 0 1 0 0] CT
-9 4.5 moveto 
1 -1 scale
(0) t 
GR
GR
GS
[0.75 0 0 0.75 92 284.75001] CT
0.149 GC
/Helvetica 13.333 F
GS
[1 0 0 1 0 0] CT
-29 4.5 moveto 
1 -1 scale
(0.05) t 
GR
GR
GS
[0.75 0 0 0.75 92 222.25] CT
0.149 GC
/Helvetica 13.333 F
GS
[1 0 0 1 0 0] CT
-21 4.5 moveto 
1 -1 scale
(0.1) t 
GR
GR
GS
[0.75 0 0 0.75 92 159.74999] CT
0.149 GC
/Helvetica 13.333 F
GS
[1 0 0 1 0 0] CT
-29 4.5 moveto 
1 -1 scale
(0.15) t 
GR
GR
GS
[0.75 0 0 0.75 92 97.25] CT
0.149 GC
/Helvetica 13.333 F
GS
[1 0 0 1 0 0] CT
-21 4.5 moveto 
1 -1 scale
(0.2) t 
GR
GR
GS
[0.75 0 0 0.75 92 34.75] CT
0.149 GC
/Helvetica 13.333 F
GS
[1 0 0 1 0 0] CT
-29 4.5 moveto 
1 -1 scale
(0.25) t 
GR
GR
GS
[0 -0.75 0.75 0 63.5 222.24982] CT
0.149 GC
N
-48.203 -4 M
-52.375 -14.938 L
-50.844 -14.938 L
-47.375 -5.734 L
-43.906 -14.938 L
-42.359 -14.938 L
-46.531 -4 L
-48.203 -4 L
cp
-37.646 -3.234 M
-38.224 -1.766 -38.763 -1.32 QT
-39.302 -0.875 -40.208 -0.875 QT
-41.286 -0.875 L
-41.286 -2 L
-40.49 -2 L
-39.943 -2 -39.63 -2.266 QT
-39.318 -2.531 -38.958 -3.516 QT
-38.708 -4.125 L
-42.021 -12.203 L
-40.599 -12.203 L
-38.036 -5.781 L
-35.474 -12.203 L
-34.036 -12.203 L
-37.646 -3.234 L
cp
-36.708 -16 M
-35.255 -16 L
-37.63 -13.25 L
-38.755 -13.25 L
-36.708 -16 L
cp
-27.16 -11.969 M
-27.16 -10.688 L
-27.722 -10.984 -28.339 -11.125 QT
-28.957 -11.266 -29.613 -11.266 QT
-30.629 -11.266 -31.129 -10.961 QT
-31.629 -10.656 -31.629 -10.047 QT
-31.629 -9.578 -31.269 -9.313 QT
-30.91 -9.047 -29.816 -8.797 QT
-29.363 -8.688 L
-27.925 -8.391 -27.324 -7.828 QT
-26.722 -7.266 -26.722 -6.266 QT
-26.722 -5.125 -27.621 -4.453 QT
-28.519 -3.781 -30.113 -3.781 QT
-30.769 -3.781 -31.48 -3.914 QT
-32.191 -4.047 -32.988 -4.297 QT
-32.988 -5.688 L
-32.238 -5.297 -31.511 -5.109 QT
-30.785 -4.922 -30.082 -4.922 QT
-29.129 -4.922 -28.613 -5.242 QT
-28.097 -5.563 -28.097 -6.156 QT
-28.097 -6.703 -28.472 -7 QT
-28.847 -7.297 -30.097 -7.563 QT
-30.566 -7.672 L
-31.816 -7.938 -32.371 -8.484 QT
-32.925 -9.031 -32.925 -9.984 QT
-32.925 -11.141 -32.105 -11.773 QT
-31.285 -12.406 -29.785 -12.406 QT
-29.035 -12.406 -28.371 -12.297 QT
-27.707 -12.188 -27.16 -11.969 QT
cp
-30.363 -13.25 M
-32.16 -16 L
-31.144 -16 L
-29.816 -14.203 L
-28.504 -16 L
-27.488 -16 L
-29.269 -13.25 L
-30.363 -13.25 L
cp
-24.805 -15.391 M
-23.446 -15.391 L
-23.446 -8.672 L
-19.43 -12.203 L
-17.711 -12.203 L
-22.055 -8.359 L
-17.524 -4 L
-19.274 -4 L
-23.446 -8 L
-23.446 -4 L
-24.805 -4 L
-24.805 -15.391 L
cp
-12.536 -8.125 M
-14.161 -8.125 -14.794 -7.75 QT
-15.427 -7.375 -15.427 -6.469 QT
-15.427 -5.766 -14.958 -5.344 QT
-14.49 -4.922 -13.677 -4.922 QT
-12.552 -4.922 -11.872 -5.711 QT
-11.193 -6.5 -11.193 -7.828 QT
-11.193 -8.125 L
-12.536 -8.125 L
cp
-9.849 -8.688 M
-9.849 -4 L
-11.193 -4 L
-11.193 -5.25 L
-11.661 -4.5 -12.349 -4.141 QT
-13.036 -3.781 -14.036 -3.781 QT
-15.286 -3.781 -16.029 -4.492 QT
-16.771 -5.203 -16.771 -6.391 QT
-16.771 -7.766 -15.849 -8.469 QT
-14.927 -9.172 -13.083 -9.172 QT
-11.193 -9.172 L
-11.193 -9.313 L
-11.193 -10.234 -11.802 -10.75 QT
-12.411 -11.266 -13.521 -11.266 QT
-14.224 -11.266 -14.896 -11.094 QT
-15.568 -10.922 -16.177 -10.578 QT
-16.177 -11.828 L
-15.443 -12.109 -14.74 -12.258 QT
-14.036 -12.406 -13.38 -12.406 QT
-11.599 -12.406 -10.724 -11.484 QT
-9.849 -10.563 -9.849 -8.688 QT
cp
4.197 -8.953 M
4.197 -4 L
2.854 -4 L
2.854 -8.906 L
2.854 -10.078 2.4 -10.656 QT
1.947 -11.234 1.025 -11.234 QT
-0.053 -11.234 -0.685 -10.539 QT
-1.318 -9.844 -1.318 -8.641 QT
-1.318 -4 L
-2.678 -4 L
-2.678 -15.391 L
-1.318 -15.391 L
-1.318 -10.922 L
-0.834 -11.672 -0.178 -12.039 QT
0.479 -12.406 1.338 -12.406 QT
2.744 -12.406 3.471 -11.531 QT
4.197 -10.656 4.197 -8.953 QT
cp
6.658 -15.391 M
8.018 -15.391 L
8.018 -4 L
6.658 -4 L
6.658 -15.391 L
cp
14.465 -8.125 M
12.84 -8.125 12.207 -7.75 QT
11.574 -7.375 11.574 -6.469 QT
11.574 -5.766 12.043 -5.344 QT
12.511 -4.922 13.324 -4.922 QT
14.449 -4.922 15.129 -5.711 QT
15.808 -6.5 15.808 -7.828 QT
15.808 -8.125 L
14.465 -8.125 L
cp
17.152 -8.688 M
17.152 -4 L
15.808 -4 L
15.808 -5.25 L
15.34 -4.5 14.652 -4.141 QT
13.965 -3.781 12.965 -3.781 QT
11.715 -3.781 10.972 -4.492 QT
10.23 -5.203 10.23 -6.391 QT
10.23 -7.766 11.152 -8.469 QT
12.074 -9.172 13.918 -9.172 QT
15.808 -9.172 L
15.808 -9.313 L
15.808 -10.234 15.199 -10.75 QT
14.59 -11.266 13.48 -11.266 QT
12.777 -11.266 12.105 -11.094 QT
11.433 -10.922 10.824 -10.578 QT
10.824 -11.828 L
11.558 -12.109 12.261 -12.258 QT
12.965 -12.406 13.621 -12.406 QT
15.402 -12.406 16.277 -11.484 QT
17.152 -10.563 17.152 -8.688 QT
cp
25.118 -10.953 M
25.118 -15.391 L
26.461 -15.391 L
26.461 -4 L
25.118 -4 L
25.118 -5.234 L
24.696 -4.5 24.047 -4.141 QT
23.399 -3.781 22.493 -3.781 QT
21.008 -3.781 20.071 -4.969 QT
19.133 -6.156 19.133 -8.094 QT
19.133 -10.031 20.071 -11.219 QT
21.008 -12.406 22.493 -12.406 QT
23.399 -12.406 24.047 -12.047 QT
24.696 -11.688 25.118 -10.953 QT
cp
20.524 -8.094 M
20.524 -6.609 21.133 -5.766 QT
21.743 -4.922 22.821 -4.922 QT
23.883 -4.922 24.5 -5.766 QT
25.118 -6.609 25.118 -8.094 QT
25.118 -9.578 24.5 -10.422 QT
23.883 -11.266 22.821 -11.266 QT
21.743 -11.266 21.133 -10.422 QT
20.524 -9.578 20.524 -8.094 QT
cp
29.015 -12.203 M
30.374 -12.203 L
30.374 -4 L
29.015 -4 L
29.015 -12.203 L
cp
29.015 -15.391 M
30.374 -15.391 L
30.374 -13.688 L
29.015 -13.688 L
29.015 -15.391 L
cp
39.915 -8.953 M
39.915 -4 L
38.571 -4 L
38.571 -8.906 L
38.571 -10.078 38.118 -10.656 QT
37.665 -11.234 36.743 -11.234 QT
35.665 -11.234 35.032 -10.539 QT
34.399 -9.844 34.399 -8.641 QT
34.399 -4 L
33.04 -4 L
33.04 -12.203 L
34.399 -12.203 L
34.399 -10.922 L
34.884 -11.672 35.54 -12.039 QT
36.196 -12.406 37.055 -12.406 QT
38.462 -12.406 39.188 -11.531 QT
39.915 -10.656 39.915 -8.953 QT
cp
45.798 -3.234 M
45.219 -1.766 44.68 -1.32 QT
44.141 -0.875 43.235 -0.875 QT
42.157 -0.875 L
42.157 -2 L
42.954 -2 L
43.501 -2 43.813 -2.266 QT
44.126 -2.531 44.485 -3.516 QT
44.735 -4.125 L
41.423 -12.203 L
42.844 -12.203 L
45.407 -5.781 L
47.969 -12.203 L
49.407 -12.203 L
45.798 -3.234 L
cp
f
GR
GS
[0.75 0 0 0.75 381.75037 32.68749] CT
/Helvetica-Bold 14.667 F
GS
[1 0 0 1 0 0] CT
-115.5 -4 moveto 
1 -1 scale
(Dobra regulace pod 200 [s]) t 
GR
GR
GS
[0.75 0 0 0.75 0 0.25] CT
0 0.447 0.741 RC
1 LJ
0.667 LW
N
128 462.667 M
128.001 462.667 L
128.005 462.667 L
128.028 462.667 L
128.143 462.667 L
128.664 462.667 L
129.606 462.673 L
130.803 462.693 L
132.136 462.735 L
133.641 462.798 L
135.546 462.888 L
137.734 462.972 L
140.788 462.988 L
144.884 462.699 L
149.978 461.661 L
154.924 459.817 L
160.393 456.778 L
167.423 451.41 L
177.466 441.353 L
189.809 426.437 L
202.376 410.079 L
204.2 407.704 L
204.2 407.704 L
205.076 406.566 L
205.953 405.431 L
207.074 403.985 L
208.347 402.349 L
209.742 400.569 L
211.557 398.271 L
213.593 395.722 L
215.955 392.806 L
218.758 389.412 L
223.033 384.388 L
229.493 377.181 L
237.965 368.5 L
248.883 358.652 L
258.7 351.063 L
266.435 345.871 L
274.171 341.313 L
282.276 337.151 L
290.343 333.558 L
298.626 330.368 L
306.531 327.732 L
313.903 325.581 L
321.208 323.705 L
328.998 321.945 L
337.292 320.306 L
345.471 318.891 L
353.036 317.737 L
360.233 316.756 L
367.728 315.843 L
375.879 314.958 L
384.27 314.15 L
392.141 313.476 L
399.379 312.919 L
406.603 312.416 L
414.465 311.924 L
422.915 311.452 L
431.14 311.042 L
438.59 310.709 L
445.654 310.424 L
453.147 310.15 L
461.448 309.877 L
469.966 309.628 L
477.782 309.424 L
484.863 309.257 L
492.008 309.103 L
499.966 308.95 L
508.595 308.801 L
516.856 308.673 L
524.166 308.572 L
531.087 308.485 L
538.595 308.399 L
547.071 308.312 L
555.722 308.233 L
563.461 308.169 L
570.367 308.117 L
577.438 308.069 L
585.515 308.019 L
594.34 307.971 L
602.623 307.93 L
609.774 307.898 L
616.548 307.87 L
624.085 307.842 L
632.757 307.813 L
641.536 307.786 L
649.179 307.765 L
655.906 307.749 L
662.912 307.733 L
671.121 307.716 L
680.144 307.699 L
688.434 307.686 L
695.42 307.675 L
702.057 307.666 L
709.633 307.657 L
718.502 307.646 L
727.396 307.637 L
734.935 307.631 L
741.495 307.625 L
748.449 307.62 L
756.787 307.614 L
765.992 307.608 L
774.278 307.603 L
781.111 307.6 L
787.63 307.597 L
795.246 307.593 L
804.291 307.59 L
813.279 307.587 L
820.724 307.584 L
827.141 307.583 L
834.055 307.581 L
842.504 307.579 L
851.858 307.577 L
860.136 307.575 L
866.846 307.574 L
873.272 307.573 L
880.92 307.572 L
890 307.57 L
S
GR
GS
[0.75 0 0 0.75 0 0.25] CT
0.851 0.325 0.098 RC
1 LJ
0.667 LW
N
128 462.667 M
128.001 462.667 L
128.005 462.667 L
128.028 462.667 L
128.143 462.667 L
128.664 462.666 L
129.606 462.655 L
130.803 462.611 L
132.136 462.508 L
133.641 462.307 L
135.546 461.91 L
137.734 461.241 L
140.788 459.899 L
144.884 457.303 L
149.978 452.742 L
154.924 446.883 L
160.393 438.82 L
167.423 426.243 L
177.466 404.783 L
189.809 374.812 L
202.376 342.823 L
204.2 338.198 L
204.2 338.198 L
205.076 335.984 L
205.953 333.775 L
207.074 330.96 L
208.347 327.776 L
209.742 324.308 L
211.557 319.828 L
213.593 314.853 L
215.955 309.151 L
218.758 302.497 L
223.033 292.604 L
229.493 278.291 L
237.965 260.796 L
248.883 240.48 L
258.7 224.349 L
266.435 212.99 L
274.171 202.744 L
282.276 193.107 L
290.343 184.529 L
298.626 176.667 L
306.531 169.962 L
313.903 164.334 L
321.208 159.291 L
328.998 154.435 L
337.292 149.792 L
345.471 145.688 L
353.036 142.263 L
360.233 139.303 L
367.728 136.499 L
375.879 133.739 L
384.27 131.182 L
392.141 129.02 L
399.379 127.213 L
406.603 125.568 L
414.465 123.941 L
422.915 122.365 L
431.14 120.985 L
438.59 119.855 L
445.654 118.879 L
453.147 117.935 L
461.448 116.992 L
469.966 116.123 L
477.782 115.406 L
484.863 114.817 L
492.008 114.275 L
499.966 113.727 L
508.595 113.195 L
516.856 112.739 L
524.166 112.374 L
531.087 112.06 L
538.595 111.749 L
547.071 111.434 L
555.722 111.146 L
563.461 110.915 L
570.367 110.728 L
577.438 110.553 L
585.515 110.373 L
594.34 110.196 L
602.623 110.048 L
609.774 109.933 L
616.548 109.833 L
624.085 109.732 L
632.757 109.628 L
641.536 109.534 L
649.179 109.46 L
655.906 109.401 L
662.912 109.345 L
671.121 109.286 L
680.144 109.228 L
688.434 109.181 L
695.42 109.144 L
702.057 109.113 L
709.633 109.08 L
718.502 109.046 L
727.396 109.016 L
734.935 108.992 L
741.495 108.974 L
748.449 108.956 L
756.787 108.937 L
765.992 108.918 L
774.278 108.903 L
781.111 108.892 L
787.63 108.882 L
795.246 108.871 L
804.291 108.86 L
813.279 108.85 L
820.724 108.843 L
827.141 108.837 L
834.055 108.832 L
842.504 108.825 L
851.858 108.819 L
860.136 108.814 L
866.846 108.811 L
873.272 108.808 L
880.92 108.804 L
890 108.801 L
S
GR
GS
[0.75 0 0 0.75 0 0.25] CT
1 GC
N
801 94 M
801 59 L
877 59 L
877 94 L
cp
f
GR
GS
[0.75 0 0 0.75 628.5 51.72826] CT
/Helvetica 12 F
GS
[1 0 0 1 0 0] CT
0 4.5 moveto 
1 -1 scale
(data1) t 
GR
GR
GS
[0.75 0 0 0.75 0 0.25] CT
0 0.447 0.741 RC
1 LJ
0.667 LW
N
805 68.638 M
835 68.638 L
S
GR
GS
[0.75 0 0 0.75 628.5 63.52174] CT
/Helvetica 12 F
GS
[1 0 0 1 0 0] CT
0 4.5 moveto 
1 -1 scale
(data2) t 
GR
GR
GS
[0.75 0 0 0.75 0 0.25] CT
0.851 0.325 0.098 RC
1 LJ
0.667 LW
N
805 84.362 M
835 84.362 L
S
GR
GS
[0.75 0 0 0.75 0 0.25] CT
0.149 GC
10.0 ML
0.667 LW
N
801 94 M
801 59 L
877 59 L
877 94 L
cp
S
GR
GS
[0.75 0 0 0.75 0 0.25] CT
1 LJ
0.667 LW
N
432 534.613 M
432 57 L
S
GR
%%Trailer
%%Pages: 1
%%EOF
