%!PS-Adobe-3.0 EPSF-3.0
%%Creator: (MATLAB, The Mathworks, Inc. Version 9.0.0.341360 \(R2016a\). Operating System: Windows 8)
%%Title: C:/Users/Jan/Documents/rls-2017/sp4/figures/4_out.eps
%%CreationDate: 2018-02-18T14:51:00
%%Pages: (atend)
%%BoundingBox: 0 0 420 315
%%LanguageLevel: 3
%%EndComments
%%BeginProlog
%%BeginResource: procset (Apache XML Graphics Std ProcSet) 1.2 0
%%Version: 1.2 0
%%Copyright: (Copyright 2001-2003,2010 The Apache Software Foundation. License terms: http://www.apache.org/licenses/LICENSE-2.0)
/bd{bind def}bind def
/ld{load def}bd
/GR/grestore ld
/M/moveto ld
/LJ/setlinejoin ld
/C/curveto ld
/f/fill ld
/LW/setlinewidth ld
/GC/setgray ld
/t/show ld
/N/newpath ld
/CT/concat ld
/cp/closepath ld
/S/stroke ld
/L/lineto ld
/CC/setcmykcolor ld
/A/ashow ld
/GS/gsave ld
/RC/setrgbcolor ld
/RM/rmoveto ld
/ML/setmiterlimit ld
/re {4 2 roll M
1 index 0 rlineto
0 exch rlineto
neg 0 rlineto
cp } bd
/_ctm matrix def
/_tm matrix def
/BT { _ctm currentmatrix pop matrix _tm copy pop 0 0 moveto } bd
/ET { _ctm setmatrix } bd
/iTm { _ctm setmatrix _tm concat } bd
/Tm { _tm astore pop iTm 0 0 moveto } bd
/ux 0.0 def
/uy 0.0 def
/F {
  /Tp exch def
  /Tf exch def
  Tf findfont Tp scalefont setfont
  /cf Tf def  /cs Tp def
} bd
/ULS {currentpoint /uy exch def /ux exch def} bd
/ULE {
  /Tcx currentpoint pop def
  gsave
  newpath
  cf findfont cs scalefont dup
  /FontMatrix get 0 get /Ts exch def /FontInfo get dup
  /UnderlinePosition get Ts mul /To exch def
  /UnderlineThickness get Ts mul /Tt exch def
  ux uy To add moveto  Tcx uy To add lineto
  Tt setlinewidth stroke
  grestore
} bd
/OLE {
  /Tcx currentpoint pop def
  gsave
  newpath
  cf findfont cs scalefont dup
  /FontMatrix get 0 get /Ts exch def /FontInfo get dup
  /UnderlinePosition get Ts mul /To exch def
  /UnderlineThickness get Ts mul /Tt exch def
  ux uy To add cs add moveto Tcx uy To add cs add lineto
  Tt setlinewidth stroke
  grestore
} bd
/SOE {
  /Tcx currentpoint pop def
  gsave
  newpath
  cf findfont cs scalefont dup
  /FontMatrix get 0 get /Ts exch def /FontInfo get dup
  /UnderlinePosition get Ts mul /To exch def
  /UnderlineThickness get Ts mul /Tt exch def
  ux uy To add cs 10 mul 26 idiv add moveto Tcx uy To add cs 10 mul 26 idiv add lineto
  Tt setlinewidth stroke
  grestore
} bd
/QT {
/Y22 exch store
/X22 exch store
/Y21 exch store
/X21 exch store
currentpoint
/Y21 load 2 mul add 3 div exch
/X21 load 2 mul add 3 div exch
/X21 load 2 mul /X22 load add 3 div
/Y21 load 2 mul /Y22 load add 3 div
/X22 load /Y22 load curveto
} bd
/SSPD {
dup length /d exch dict def
{
/v exch def
/k exch def
currentpagedevice k known {
/cpdv currentpagedevice k get def
v cpdv ne {
/upd false def
/nullv v type /nulltype eq def
/nullcpdv cpdv type /nulltype eq def
nullv nullcpdv or
{
/upd true def
} {
/sametype v type cpdv type eq def
sametype {
v type /arraytype eq {
/vlen v length def
/cpdvlen cpdv length def
vlen cpdvlen eq {
0 1 vlen 1 sub {
/i exch def
/obj v i get def
/cpdobj cpdv i get def
obj cpdobj ne {
/upd true def
exit
} if
} for
} {
/upd true def
} ifelse
} {
v type /dicttype eq {
v {
/dv exch def
/dk exch def
/cpddv cpdv dk get def
dv cpddv ne {
/upd true def
exit
} if
} forall
} {
/upd true def
} ifelse
} ifelse
} if
} ifelse
upd true eq {
d k v put
} if
} if
} if
} forall
d length 0 gt {
d setpagedevice
} if
} bd
%%EndResource
%%BeginResource: procset (Apache XML Graphics EPS ProcSet) 1.0 0
%%Version: 1.0 0
%%Copyright: (Copyright 2002-2003 The Apache Software Foundation. License terms: http://www.apache.org/licenses/LICENSE-2.0)
/BeginEPSF { %def
/b4_Inc_state save def         % Save state for cleanup
/dict_count countdictstack def % Count objects on dict stack
/op_count count 1 sub def      % Count objects on operand stack
userdict begin                 % Push userdict on dict stack
/showpage { } def              % Redefine showpage, { } = null proc
0 setgray 0 setlinecap         % Prepare graphics state
1 setlinewidth 0 setlinejoin
10 setmiterlimit [ ] 0 setdash newpath
/languagelevel where           % If level not equal to 1 then
{pop languagelevel             % set strokeadjust and
1 ne                           % overprint to their defaults.
{false setstrokeadjust false setoverprint
} if
} if
} bd
/EndEPSF { %def
count op_count sub {pop} repeat            % Clean up stacks
countdictstack dict_count sub {end} repeat
b4_Inc_state restore
} bd
%%EndResource
%FOPBeginFontDict
%%IncludeResource: font Courier-Bold
%%IncludeResource: font Helvetica
%%IncludeResource: font Courier-BoldOblique
%%IncludeResource: font Courier-Oblique
%%IncludeResource: font Times-Roman
%%IncludeResource: font Helvetica-BoldOblique
%%IncludeResource: font Helvetica-Bold
%%IncludeResource: font Helvetica-Oblique
%%IncludeResource: font Times-BoldItalic
%%IncludeResource: font Courier
%%IncludeResource: font Times-Italic
%%IncludeResource: font Times-Bold
%%IncludeResource: font Symbol
%%IncludeResource: font ZapfDingbats
%FOPEndFontDict
%%BeginResource: encoding WinAnsiEncoding
/WinAnsiEncoding [
/.notdef /.notdef /.notdef /.notdef /.notdef
/.notdef /.notdef /.notdef /.notdef /.notdef
/.notdef /.notdef /.notdef /.notdef /.notdef
/.notdef /.notdef /.notdef /.notdef /.notdef
/.notdef /.notdef /.notdef /.notdef /.notdef
/.notdef /.notdef /.notdef /.notdef /.notdef
/.notdef /.notdef /space /exclam /quotedbl
/numbersign /dollar /percent /ampersand /quotesingle
/parenleft /parenright /asterisk /plus /comma
/hyphen /period /slash /zero /one
/two /three /four /five /six
/seven /eight /nine /colon /semicolon
/less /equal /greater /question /at
/A /B /C /D /E
/F /G /H /I /J
/K /L /M /N /O
/P /Q /R /S /T
/U /V /W /X /Y
/Z /bracketleft /backslash /bracketright /asciicircum
/underscore /quoteleft /a /b /c
/d /e /f /g /h
/i /j /k /l /m
/n /o /p /q /r
/s /t /u /v /w
/x /y /z /braceleft /bar
/braceright /asciitilde /bullet /Euro /bullet
/quotesinglbase /florin /quotedblbase /ellipsis /dagger
/daggerdbl /circumflex /perthousand /Scaron /guilsinglleft
/OE /bullet /Zcaron /bullet /bullet
/quoteleft /quoteright /quotedblleft /quotedblright /bullet
/endash /emdash /asciitilde /trademark /scaron
/guilsinglright /oe /bullet /zcaron /Ydieresis
/space /exclamdown /cent /sterling /currency
/yen /brokenbar /section /dieresis /copyright
/ordfeminine /guillemotleft /logicalnot /sfthyphen /registered
/macron /degree /plusminus /twosuperior /threesuperior
/acute /mu /paragraph /middot /cedilla
/onesuperior /ordmasculine /guillemotright /onequarter /onehalf
/threequarters /questiondown /Agrave /Aacute /Acircumflex
/Atilde /Adieresis /Aring /AE /Ccedilla
/Egrave /Eacute /Ecircumflex /Edieresis /Igrave
/Iacute /Icircumflex /Idieresis /Eth /Ntilde
/Ograve /Oacute /Ocircumflex /Otilde /Odieresis
/multiply /Oslash /Ugrave /Uacute /Ucircumflex
/Udieresis /Yacute /Thorn /germandbls /agrave
/aacute /acircumflex /atilde /adieresis /aring
/ae /ccedilla /egrave /eacute /ecircumflex
/edieresis /igrave /iacute /icircumflex /idieresis
/eth /ntilde /ograve /oacute /ocircumflex
/otilde /odieresis /divide /oslash /ugrave
/uacute /ucircumflex /udieresis /yacute /thorn
/ydieresis
] def
%%EndResource
%FOPBeginFontReencode
/Courier-Bold findfont
dup length dict begin
  {1 index /FID ne {def} {pop pop} ifelse} forall
  /Encoding WinAnsiEncoding def
  currentdict
end
/Courier-Bold exch definefont pop
/Helvetica findfont
dup length dict begin
  {1 index /FID ne {def} {pop pop} ifelse} forall
  /Encoding WinAnsiEncoding def
  currentdict
end
/Helvetica exch definefont pop
/Courier-BoldOblique findfont
dup length dict begin
  {1 index /FID ne {def} {pop pop} ifelse} forall
  /Encoding WinAnsiEncoding def
  currentdict
end
/Courier-BoldOblique exch definefont pop
/Courier-Oblique findfont
dup length dict begin
  {1 index /FID ne {def} {pop pop} ifelse} forall
  /Encoding WinAnsiEncoding def
  currentdict
end
/Courier-Oblique exch definefont pop
/Times-Roman findfont
dup length dict begin
  {1 index /FID ne {def} {pop pop} ifelse} forall
  /Encoding WinAnsiEncoding def
  currentdict
end
/Times-Roman exch definefont pop
/Helvetica-BoldOblique findfont
dup length dict begin
  {1 index /FID ne {def} {pop pop} ifelse} forall
  /Encoding WinAnsiEncoding def
  currentdict
end
/Helvetica-BoldOblique exch definefont pop
/Helvetica-Bold findfont
dup length dict begin
  {1 index /FID ne {def} {pop pop} ifelse} forall
  /Encoding WinAnsiEncoding def
  currentdict
end
/Helvetica-Bold exch definefont pop
/Helvetica-Oblique findfont
dup length dict begin
  {1 index /FID ne {def} {pop pop} ifelse} forall
  /Encoding WinAnsiEncoding def
  currentdict
end
/Helvetica-Oblique exch definefont pop
/Times-BoldItalic findfont
dup length dict begin
  {1 index /FID ne {def} {pop pop} ifelse} forall
  /Encoding WinAnsiEncoding def
  currentdict
end
/Times-BoldItalic exch definefont pop
/Courier findfont
dup length dict begin
  {1 index /FID ne {def} {pop pop} ifelse} forall
  /Encoding WinAnsiEncoding def
  currentdict
end
/Courier exch definefont pop
/Times-Italic findfont
dup length dict begin
  {1 index /FID ne {def} {pop pop} ifelse} forall
  /Encoding WinAnsiEncoding def
  currentdict
end
/Times-Italic exch definefont pop
/Times-Bold findfont
dup length dict begin
  {1 index /FID ne {def} {pop pop} ifelse} forall
  /Encoding WinAnsiEncoding def
  currentdict
end
/Times-Bold exch definefont pop
%FOPEndFontReencode
%%EndProlog
%%Page: 1 1
%%PageBoundingBox: 0 0 420 315
%%BeginPageSetup
[1 0 0 -1 0 315] CT
%%EndPageSetup
GS
[0.75 0 0 0.75 0 0] CT
1 GC
N
0 0 560 420 re
f
GR
GS
[0.75 0 0 0.75 0 0] CT
1 GC
N
0 0 560 420 re
f
GR
GS
[0.75 0 0 0.75 0 0] CT
1 GC
N
73 374 M
507 374 L
507 31 L
73 31 L
cp
f
GR
GS
[0.75 0 0 0.75 0 0] CT
0.873 GC
1 LJ
0.667 LW
N
73 374 M
73 31 L
S
GR
GS
[0.75 0 0 0.75 0 0] CT
0.873 GC
1 LJ
0.667 LW
N
116.4 374 M
116.4 31 L
S
GR
GS
[0.75 0 0 0.75 0 0] CT
0.873 GC
1 LJ
0.667 LW
N
159.8 374 M
159.8 31 L
S
GR
GS
[0.75 0 0 0.75 0 0] CT
0.873 GC
1 LJ
0.667 LW
N
203.2 374 M
203.2 31 L
S
GR
GS
[0.75 0 0 0.75 0 0] CT
0.873 GC
1 LJ
0.667 LW
N
246.6 374 M
246.6 31 L
S
GR
GS
[0.75 0 0 0.75 0 0] CT
0.873 GC
1 LJ
0.667 LW
N
290 374 M
290 31 L
S
GR
GS
[0.75 0 0 0.75 0 0] CT
0.873 GC
1 LJ
0.667 LW
N
333.4 374 M
333.4 31 L
S
GR
GS
[0.75 0 0 0.75 0 0] CT
0.873 GC
1 LJ
0.667 LW
N
376.8 374 M
376.8 31 L
S
GR
GS
[0.75 0 0 0.75 0 0] CT
0.873 GC
1 LJ
0.667 LW
N
420.2 374 M
420.2 31 L
S
GR
GS
[0.75 0 0 0.75 0 0] CT
0.873 GC
1 LJ
0.667 LW
N
463.6 374 M
463.6 31 L
S
GR
GS
[0.75 0 0 0.75 0 0] CT
0.873 GC
1 LJ
0.667 LW
N
507 374 M
507 31 L
S
GR
GS
[0.75 0 0 0.75 0 0] CT
0.873 GC
1 LJ
0.667 LW
N
507 374 M
73 374 L
S
GR
GS
[0.75 0 0 0.75 0 0] CT
0.873 GC
1 LJ
0.667 LW
N
507 339.7 M
73 339.7 L
S
GR
GS
[0.75 0 0 0.75 0 0] CT
0.873 GC
1 LJ
0.667 LW
N
507 305.4 M
73 305.4 L
S
GR
GS
[0.75 0 0 0.75 0 0] CT
0.873 GC
1 LJ
0.667 LW
N
507 271.1 M
73 271.1 L
S
GR
GS
[0.75 0 0 0.75 0 0] CT
0.873 GC
1 LJ
0.667 LW
N
507 236.8 M
73 236.8 L
S
GR
GS
[0.75 0 0 0.75 0 0] CT
0.873 GC
1 LJ
0.667 LW
N
507 202.5 M
73 202.5 L
S
GR
GS
[0.75 0 0 0.75 0 0] CT
0.873 GC
1 LJ
0.667 LW
N
507 168.2 M
73 168.2 L
S
GR
GS
[0.75 0 0 0.75 0 0] CT
0.873 GC
1 LJ
0.667 LW
N
507 133.9 M
73 133.9 L
S
GR
GS
[0.75 0 0 0.75 0 0] CT
0.873 GC
1 LJ
0.667 LW
N
507 99.6 M
73 99.6 L
S
GR
GS
[0.75 0 0 0.75 0 0] CT
0.873 GC
1 LJ
0.667 LW
N
507 65.3 M
73 65.3 L
S
GR
GS
[0.75 0 0 0.75 0 0] CT
0.873 GC
1 LJ
0.667 LW
N
507 31 M
73 31 L
S
GR
GS
[0.75 0 0 0.75 0 0] CT
0.149 GC
2 setlinecap
1 LJ
0.667 LW
N
73 374 M
507 374 L
S
GR
GS
[0.75 0 0 0.75 0 0] CT
0.149 GC
2 setlinecap
1 LJ
0.667 LW
N
73 31 M
507 31 L
S
GR
GS
[0.75 0 0 0.75 0 0] CT
0.149 GC
2 setlinecap
1 LJ
0.667 LW
N
73 374 M
73 369.66 L
S
GR
GS
[0.75 0 0 0.75 0 0] CT
0.149 GC
2 setlinecap
1 LJ
0.667 LW
N
116.4 374 M
116.4 369.66 L
S
GR
GS
[0.75 0 0 0.75 0 0] CT
0.149 GC
2 setlinecap
1 LJ
0.667 LW
N
159.8 374 M
159.8 369.66 L
S
GR
GS
[0.75 0 0 0.75 0 0] CT
0.149 GC
2 setlinecap
1 LJ
0.667 LW
N
203.2 374 M
203.2 369.66 L
S
GR
GS
[0.75 0 0 0.75 0 0] CT
0.149 GC
2 setlinecap
1 LJ
0.667 LW
N
246.6 374 M
246.6 369.66 L
S
GR
GS
[0.75 0 0 0.75 0 0] CT
0.149 GC
2 setlinecap
1 LJ
0.667 LW
N
290 374 M
290 369.66 L
S
GR
GS
[0.75 0 0 0.75 0 0] CT
0.149 GC
2 setlinecap
1 LJ
0.667 LW
N
333.4 374 M
333.4 369.66 L
S
GR
GS
[0.75 0 0 0.75 0 0] CT
0.149 GC
2 setlinecap
1 LJ
0.667 LW
N
376.8 374 M
376.8 369.66 L
S
GR
GS
[0.75 0 0 0.75 0 0] CT
0.149 GC
2 setlinecap
1 LJ
0.667 LW
N
420.2 374 M
420.2 369.66 L
S
GR
GS
[0.75 0 0 0.75 0 0] CT
0.149 GC
2 setlinecap
1 LJ
0.667 LW
N
463.6 374 M
463.6 369.66 L
S
GR
GS
[0.75 0 0 0.75 0 0] CT
0.149 GC
2 setlinecap
1 LJ
0.667 LW
N
507 374 M
507 369.66 L
S
GR
GS
[0.75 0 0 0.75 0 0] CT
0.149 GC
2 setlinecap
1 LJ
0.667 LW
N
73 31 M
73 35.34 L
S
GR
GS
[0.75 0 0 0.75 0 0] CT
0.149 GC
2 setlinecap
1 LJ
0.667 LW
N
116.4 31 M
116.4 35.34 L
S
GR
GS
[0.75 0 0 0.75 0 0] CT
0.149 GC
2 setlinecap
1 LJ
0.667 LW
N
159.8 31 M
159.8 35.34 L
S
GR
GS
[0.75 0 0 0.75 0 0] CT
0.149 GC
2 setlinecap
1 LJ
0.667 LW
N
203.2 31 M
203.2 35.34 L
S
GR
GS
[0.75 0 0 0.75 0 0] CT
0.149 GC
2 setlinecap
1 LJ
0.667 LW
N
246.6 31 M
246.6 35.34 L
S
GR
GS
[0.75 0 0 0.75 0 0] CT
0.149 GC
2 setlinecap
1 LJ
0.667 LW
N
290 31 M
290 35.34 L
S
GR
GS
[0.75 0 0 0.75 0 0] CT
0.149 GC
2 setlinecap
1 LJ
0.667 LW
N
333.4 31 M
333.4 35.34 L
S
GR
GS
[0.75 0 0 0.75 0 0] CT
0.149 GC
2 setlinecap
1 LJ
0.667 LW
N
376.8 31 M
376.8 35.34 L
S
GR
GS
[0.75 0 0 0.75 0 0] CT
0.149 GC
2 setlinecap
1 LJ
0.667 LW
N
420.2 31 M
420.2 35.34 L
S
GR
GS
[0.75 0 0 0.75 0 0] CT
0.149 GC
2 setlinecap
1 LJ
0.667 LW
N
463.6 31 M
463.6 35.34 L
S
GR
GS
[0.75 0 0 0.75 0 0] CT
0.149 GC
2 setlinecap
1 LJ
0.667 LW
N
507 31 M
507 35.34 L
S
GR
GS
[0.75 0 0 0.75 54.75 284.50001] CT
0.149 GC
/Helvetica 13.333 F
GS
[1 0 0 1 0 0] CT
-4 14 moveto 
1 -1 scale
(0) t 
GR
GR
GS
[0.75 0 0 0.75 87.3 284.50001] CT
0.149 GC
/Helvetica 13.333 F
GS
[1 0 0 1 0 0] CT
-11 14 moveto 
1 -1 scale
(200) t 
GR
GR
GS
[0.75 0 0 0.75 119.85 284.50001] CT
0.149 GC
/Helvetica 13.333 F
GS
[1 0 0 1 0 0] CT
-11 14 moveto 
1 -1 scale
(400) t 
GR
GR
GS
[0.75 0 0 0.75 152.4 284.50001] CT
0.149 GC
/Helvetica 13.333 F
GS
[1 0 0 1 0 0] CT
-11 14 moveto 
1 -1 scale
(600) t 
GR
GR
GS
[0.75 0 0 0.75 184.95 284.50001] CT
0.149 GC
/Helvetica 13.333 F
GS
[1 0 0 1 0 0] CT
-11 14 moveto 
1 -1 scale
(800) t 
GR
GR
GS
[0.75 0 0 0.75 217.5 284.50001] CT
0.149 GC
/Helvetica 13.333 F
GS
[1 0 0 1 0 0] CT
-14.5 14 moveto 
1 -1 scale
(1000) t 
GR
GR
GS
[0.75 0 0 0.75 250.05 284.50001] CT
0.149 GC
/Helvetica 13.333 F
GS
[1 0 0 1 0 0] CT
-14.5 14 moveto 
1 -1 scale
(1200) t 
GR
GR
GS
[0.75 0 0 0.75 282.59999 284.50001] CT
0.149 GC
/Helvetica 13.333 F
GS
[1 0 0 1 0 0] CT
-14.5 14 moveto 
1 -1 scale
(1400) t 
GR
GR
GS
[0.75 0 0 0.75 315.15001 284.50001] CT
0.149 GC
/Helvetica 13.333 F
GS
[1 0 0 1 0 0] CT
-14.5 14 moveto 
1 -1 scale
(1600) t 
GR
GR
GS
[0.75 0 0 0.75 347.7 284.50001] CT
0.149 GC
/Helvetica 13.333 F
GS
[1 0 0 1 0 0] CT
-14.5 14 moveto 
1 -1 scale
(1800) t 
GR
GR
GS
[0.75 0 0 0.75 380.25 284.50001] CT
0.149 GC
/Helvetica 13.333 F
GS
[1 0 0 1 0 0] CT
-14.5 14 moveto 
1 -1 scale
(2000) t 
GR
GR
GS
[0.75 0 0 0.75 0 0] CT
0.149 GC
2 setlinecap
1 LJ
0.667 LW
N
73 374 M
73 31 L
S
GR
GS
[0.75 0 0 0.75 0 0] CT
0.149 GC
2 setlinecap
1 LJ
0.667 LW
N
507 374 M
507 31 L
S
GR
GS
[0.75 0 0 0.75 0 0] CT
0.149 GC
2 setlinecap
1 LJ
0.667 LW
N
73 374 M
77.34 374 L
S
GR
GS
[0.75 0 0 0.75 0 0] CT
0.149 GC
2 setlinecap
1 LJ
0.667 LW
N
73 339.7 M
77.34 339.7 L
S
GR
GS
[0.75 0 0 0.75 0 0] CT
0.149 GC
2 setlinecap
1 LJ
0.667 LW
N
73 305.4 M
77.34 305.4 L
S
GR
GS
[0.75 0 0 0.75 0 0] CT
0.149 GC
2 setlinecap
1 LJ
0.667 LW
N
73 271.1 M
77.34 271.1 L
S
GR
GS
[0.75 0 0 0.75 0 0] CT
0.149 GC
2 setlinecap
1 LJ
0.667 LW
N
73 236.8 M
77.34 236.8 L
S
GR
GS
[0.75 0 0 0.75 0 0] CT
0.149 GC
2 setlinecap
1 LJ
0.667 LW
N
73 202.5 M
77.34 202.5 L
S
GR
GS
[0.75 0 0 0.75 0 0] CT
0.149 GC
2 setlinecap
1 LJ
0.667 LW
N
73 168.2 M
77.34 168.2 L
S
GR
GS
[0.75 0 0 0.75 0 0] CT
0.149 GC
2 setlinecap
1 LJ
0.667 LW
N
73 133.9 M
77.34 133.9 L
S
GR
GS
[0.75 0 0 0.75 0 0] CT
0.149 GC
2 setlinecap
1 LJ
0.667 LW
N
73 99.6 M
77.34 99.6 L
S
GR
GS
[0.75 0 0 0.75 0 0] CT
0.149 GC
2 setlinecap
1 LJ
0.667 LW
N
73 65.3 M
77.34 65.3 L
S
GR
GS
[0.75 0 0 0.75 0 0] CT
0.149 GC
2 setlinecap
1 LJ
0.667 LW
N
73 31 M
77.34 31 L
S
GR
GS
[0.75 0 0 0.75 0 0] CT
0.149 GC
2 setlinecap
1 LJ
0.667 LW
N
507 374 M
502.66 374 L
S
GR
GS
[0.75 0 0 0.75 0 0] CT
0.149 GC
2 setlinecap
1 LJ
0.667 LW
N
507 339.7 M
502.66 339.7 L
S
GR
GS
[0.75 0 0 0.75 0 0] CT
0.149 GC
2 setlinecap
1 LJ
0.667 LW
N
507 305.4 M
502.66 305.4 L
S
GR
GS
[0.75 0 0 0.75 0 0] CT
0.149 GC
2 setlinecap
1 LJ
0.667 LW
N
507 271.1 M
502.66 271.1 L
S
GR
GS
[0.75 0 0 0.75 0 0] CT
0.149 GC
2 setlinecap
1 LJ
0.667 LW
N
507 236.8 M
502.66 236.8 L
S
GR
GS
[0.75 0 0 0.75 0 0] CT
0.149 GC
2 setlinecap
1 LJ
0.667 LW
N
507 202.5 M
502.66 202.5 L
S
GR
GS
[0.75 0 0 0.75 0 0] CT
0.149 GC
2 setlinecap
1 LJ
0.667 LW
N
507 168.2 M
502.66 168.2 L
S
GR
GS
[0.75 0 0 0.75 0 0] CT
0.149 GC
2 setlinecap
1 LJ
0.667 LW
N
507 133.9 M
502.66 133.9 L
S
GR
GS
[0.75 0 0 0.75 0 0] CT
0.149 GC
2 setlinecap
1 LJ
0.667 LW
N
507 99.6 M
502.66 99.6 L
S
GR
GS
[0.75 0 0 0.75 0 0] CT
0.149 GC
2 setlinecap
1 LJ
0.667 LW
N
507 65.3 M
502.66 65.3 L
S
GR
GS
[0.75 0 0 0.75 0 0] CT
0.149 GC
2 setlinecap
1 LJ
0.667 LW
N
507 31 M
502.66 31 L
S
GR
GS
[0.75 0 0 0.75 50.75 280.5] CT
0.149 GC
/Helvetica 13.333 F
GS
[1 0 0 1 0 0] CT
-8 5.5 moveto 
1 -1 scale
(0) t 
GR
GR
GS
[0.75 0 0 0.75 50.75 254.77501] CT
0.149 GC
/Helvetica 13.333 F
GS
[1 0 0 1 0 0] CT
-33 5.5 moveto 
1 -1 scale
(0.002) t 
GR
GR
GS
[0.75 0 0 0.75 50.75 229.05] CT
0.149 GC
/Helvetica 13.333 F
GS
[1 0 0 1 0 0] CT
-33 5.5 moveto 
1 -1 scale
(0.004) t 
GR
GR
GS
[0.75 0 0 0.75 50.75 203.325] CT
0.149 GC
/Helvetica 13.333 F
GS
[1 0 0 1 0 0] CT
-33 5.5 moveto 
1 -1 scale
(0.006) t 
GR
GR
GS
[0.75 0 0 0.75 50.75 177.59999] CT
0.149 GC
/Helvetica 13.333 F
GS
[1 0 0 1 0 0] CT
-33 5.5 moveto 
1 -1 scale
(0.008) t 
GR
GR
GS
[0.75 0 0 0.75 50.75 151.875] CT
0.149 GC
/Helvetica 13.333 F
GS
[1 0 0 1 0 0] CT
-26 5.5 moveto 
1 -1 scale
(0.01) t 
GR
GR
GS
[0.75 0 0 0.75 50.75 126.15] CT
0.149 GC
/Helvetica 13.333 F
GS
[1 0 0 1 0 0] CT
-33 5.5 moveto 
1 -1 scale
(0.012) t 
GR
GR
GS
[0.75 0 0 0.75 50.75 100.425] CT
0.149 GC
/Helvetica 13.333 F
GS
[1 0 0 1 0 0] CT
-33 5.5 moveto 
1 -1 scale
(0.014) t 
GR
GR
GS
[0.75 0 0 0.75 50.75 74.69999] CT
0.149 GC
/Helvetica 13.333 F
GS
[1 0 0 1 0 0] CT
-33 5.5 moveto 
1 -1 scale
(0.016) t 
GR
GR
GS
[0.75 0 0 0.75 50.75 48.97501] CT
0.149 GC
/Helvetica 13.333 F
GS
[1 0 0 1 0 0] CT
-33 5.5 moveto 
1 -1 scale
(0.018) t 
GR
GR
GS
[0.75 0 0 0.75 50.75 23.25001] CT
0.149 GC
/Helvetica 13.333 F
GS
[1 0 0 1 0 0] CT
-26 5.5 moveto 
1 -1 scale
(0.02) t 
GR
GR
GS
[0.75 0 0 0.75 217.50021 21.18751] CT
/Helvetica-Bold 14.667 F
GS
[1 0 0 1 0 0] CT
-81 -4 moveto 
1 -1 scale
(ukol 4 - v\375stupy nadrzi) t 
GR
GR
GS
[0.75 0 0 0.75 0 0] CT
0 0.447 0.741 RC
1 LJ
0.667 LW
N
73 374 M
81.68 374 L
83.85 374 L
83.85 374 L
83.85 374 L
83.952 374 L
84.055 374 L
84.229 374 L
84.427 374 L
84.663 374 L
84.945 374 L
85.292 374 L
85.734 374 L
86.321 374 L
87.122 374 L
88.071 374 L
88.652 374 L
89.232 374 L
90.002 374 L
90.928 374 L
91.535 374 L
92.143 374 L
92.913 374 L
93.805 374 L
94.422 374 L
95.039 374 L
95.803 374 L
96.678 374 L
97.305 374 L
97.931 374 L
98.692 374 L
99.552 374 L
100.333 374 L
100.967 374 L
101.557 374 L
102.245 374 L
103.077 374 L
103.924 374 L
104.624 374 L
105.212 374 L
105.834 374 L
106.601 374 L
107.473 374 L
108.098 374 L
108.723 374 L
109.483 374 L
110.344 374 L
111.127 374 L
111.761 374 L
112.35 374 L
113.036 374 L
113.869 374 L
114.717 374 L
115.418 374 L
116.005 374 L
116.626 374 L
117.393 374 L
118.265 374 L
118.891 374 L
119.516 374 L
120.276 374 L
121.136 374 L
121.919 374 L
122.553 374 L
123.142 374 L
123.829 374 L
124.662 374 L
125.509 374 L
126.21 374 L
126.798 374 L
127.419 374 L
128.186 374 L
129.057 374 L
129.683 374 L
130.309 374 L
131.069 374 L
131.929 374 L
132.712 374 L
133.346 374 L
133.935 374 L
134.622 374 L
135.454 374 L
136.301 374 L
137.002 374 L
137.59 374 L
138.212 374 L
138.978 374 L
139.85 374 L
140.476 374 L
141.101 374 L
141.861 374 L
142.721 374 L
143.504 374 L
144.138 374 L
144.727 374 L
145.414 374 L
146.247 374 L
147.094 374 L
147.795 374 L
148.383 374 L
149.004 374 L
149.771 374 L
150.642 374 L
151.268 374 L
151.894 374 L
152.654 374 L
153.514 374 L
154.297 374 L
154.931 374 L
155.52 374 L
156.207 374 L
157.039 374 L
157.886 374 L
158.587 374 L
159.175 374 L
159.797 374 L
160.563 374 L
161.435 374 L
162.061 374 L
162.686 374 L
163.446 374 L
164.306 374 L
165.089 374 L
165.723 374 L
166.312 374 L
166.999 374 L
167.832 374 L
168.679 374 L
169.38 374 L
169.968 374 L
170.589 374 L
171.356 374 L
172.227 374 L
172.853 374 L
173.479 374 L
174.239 374 L
175.099 374 L
175.882 374 L
176.516 374 L
177.105 374 L
177.792 374 L
178.624 374 L
179.471 374 L
180.172 374 L
180.76 374 L
181.382 374 L
181.5 374 L
181.5 374 L
181.5 374 L
181.596 370.487 L
181.691 367.013 L
181.845 361.508 L
182.04 354.663 L
182.269 346.86 L
182.542 337.787 L
182.877 327.1 L
183.299 314.194 L
183.856 298.146 L
184.617 277.865 L
185.56 255.156 L
186.169 241.801 L
186.778 229.383 L
187.552 214.854 L
188.446 199.65 L
189.06 190.116 L
189.674 181.255 L
190.438 171.099 L
191.317 160.507 L
191.942 153.621 L
192.567 147.231 L
193.329 140.069 L
194.191 132.707 L
194.973 126.65 L
195.606 122.153 L
196.194 118.267 L
196.881 114.056 L
197.715 109.389 L
198.563 105.098 L
199.263 101.872 L
199.85 99.366 L
200.471 96.898 L
201.239 94.091 L
202.112 91.196 L
202.736 89.304 L
203.361 87.547 L
204.121 85.578 L
204.983 83.552 L
205.767 81.882 L
206.4 80.642 L
206.988 79.573 L
207.674 78.416 L
208.507 77.132 L
209.356 75.95 L
210.057 75.06 L
210.644 74.37 L
211.264 73.692 L
212.031 72.92 L
212.904 72.123 L
213.529 71.601 L
214.155 71.117 L
214.915 70.575 L
215.775 70.018 L
216.558 69.559 L
217.192 69.217 L
217.781 68.922 L
218.468 68.604 L
219.3 68.25 L
220.148 67.925 L
220.849 67.681 L
221.437 67.49 L
222.058 67.303 L
222.824 67.091 L
223.696 66.872 L
224.322 66.728 L
224.947 66.595 L
225.707 66.446 L
226.568 66.292 L
227.351 66.166 L
227.985 66.072 L
228.574 65.991 L
229.26 65.903 L
230.093 65.806 L
230.941 65.716 L
231.641 65.649 L
232.229 65.596 L
232.851 65.545 L
233.617 65.486 L
234.489 65.426 L
235.115 65.387 L
235.74 65.35 L
236.5 65.309 L
237.36 65.267 L
238.143 65.232 L
238.777 65.206 L
239.366 65.183 L
240.053 65.159 L
240.886 65.133 L
241.733 65.108 L
242.434 65.089 L
243.022 65.075 L
243.643 65.061 L
244.41 65.045 L
245.282 65.028 L
245.907 65.017 L
246.533 65.007 L
247.293 64.996 L
248.153 64.984 L
248.936 64.975 L
249.57 64.967 L
250.159 64.961 L
250.846 64.955 L
251.678 64.947 L
252.525 64.941 L
253.226 64.935 L
253.814 64.931 L
254.436 64.928 L
255.202 64.923 L
256.074 64.919 L
256.7 64.915 L
257.325 64.913 L
258.085 64.91 L
258.945 64.906 L
259.728 64.904 L
260.362 64.902 L
260.951 64.9 L
261.638 64.898 L
262.471 64.896 L
263.318 64.894 L
264.019 64.893 L
264.607 64.892 L
265.228 64.891 L
265.995 64.89 L
266.867 64.888 L
267.492 64.888 L
268.118 64.887 L
268.878 64.886 L
269.738 64.885 L
270.521 64.884 L
271.155 64.884 L
271.744 64.883 L
272.431 64.883 L
273.263 64.882 L
274.111 64.882 L
274.811 64.881 L
275.399 64.881 L
276.021 64.881 L
276.787 64.88 L
277.659 64.88 L
278.285 64.88 L
278.91 64.88 L
279.67 64.879 L
280.53 64.879 L
281.313 64.879 L
281.947 64.879 L
282.536 64.879 L
283.223 64.879 L
284.056 64.878 L
284.903 64.878 L
285.604 64.878 L
286.192 64.878 L
286.813 64.878 L
287.58 64.878 L
288.452 64.878 L
289.077 64.878 L
289.703 64.878 L
290.463 64.878 L
291.323 64.877 L
292.106 64.877 L
292.74 64.877 L
293.329 64.877 L
294.016 64.877 L
294.848 64.877 L
295.696 64.877 L
296.396 64.877 L
296.984 64.877 L
297.606 64.877 L
298.372 64.877 L
299.244 64.877 L
299.87 64.877 L
300.496 64.877 L
301.255 64.877 L
302.116 64.877 L
302.898 64.877 L
303.532 64.877 L
304.121 64.877 L
304.808 64.877 L
305.641 64.877 L
306.488 64.877 L
307.189 64.877 L
307.777 64.877 L
308.398 64.877 L
309.165 64.877 L
310.037 64.877 L
310.662 64.877 L
311.288 64.877 L
312.048 64.877 L
312.908 64.877 L
313.691 64.877 L
314.325 64.877 L
314.914 64.877 L
315.601 64.877 L
316.433 64.877 L
317.281 64.877 L
317.981 64.877 L
318.569 64.877 L
319.191 64.877 L
319.957 64.877 L
320.829 64.877 L
321.455 64.877 L
322.081 64.877 L
322.84 64.877 L
323.701 64.877 L
324.483 64.877 L
325.117 64.877 L
325.707 64.877 L
326.393 64.877 L
327.226 64.877 L
328.073 64.877 L
328.774 64.877 L
329.362 64.877 L
329.983 64.877 L
330.75 64.877 L
331.622 64.877 L
332.247 64.877 L
332.873 64.877 L
333.633 64.877 L
334.493 64.877 L
335.276 64.877 L
335.91 64.877 L
336.499 64.877 L
337.186 64.877 L
338.018 64.877 L
338.866 64.877 L
339.566 64.877 L
340.155 64.877 L
340.776 64.877 L
341.542 64.877 L
342.414 64.877 L
343.04 64.877 L
343.666 64.877 L
344.425 64.877 L
345.286 64.877 L
346.068 64.877 L
346.702 64.877 L
347.292 64.877 L
347.978 64.877 L
348.811 64.877 L
349.658 64.877 L
350.359 64.877 L
350.947 64.877 L
351.569 64.877 L
352.335 64.877 L
353.207 64.877 L
353.832 64.877 L
354.458 64.877 L
355.218 64.877 L
356.078 64.877 L
356.861 64.877 L
357.495 64.877 L
358.084 64.877 L
358.771 64.877 L
359.603 64.877 L
360.451 64.877 L
361.151 64.877 L
361.74 64.877 L
362.361 64.877 L
363.127 64.877 L
363.999 64.877 L
364.625 64.877 L
365.251 64.877 L
366.01 64.877 L
366.871 64.877 L
367.653 64.877 L
368.287 64.877 L
368.877 64.877 L
369.563 64.877 L
370.396 64.877 L
371.243 64.877 L
371.944 64.877 L
372.532 64.877 L
373.154 64.877 L
373.92 64.877 L
374.792 64.877 L
375.417 64.877 L
376.043 64.877 L
376.803 64.877 L
377.663 64.877 L
378.446 64.877 L
379.08 64.877 L
379.669 64.877 L
380.356 64.877 L
381.188 64.877 L
382.036 64.877 L
382.736 64.877 L
383.325 64.877 L
383.946 64.877 L
384.712 64.877 L
385.584 64.877 L
386.21 64.877 L
386.836 64.877 L
387.595 64.877 L
388.456 64.877 L
389.238 64.877 L
389.872 64.877 L
390.462 64.877 L
391.148 64.877 L
391.981 64.877 L
392.828 64.877 L
393.529 64.877 L
394.117 64.877 L
394.739 64.877 L
395.505 64.877 L
396.377 64.877 L
397.002 64.877 L
397.628 64.877 L
398.388 64.877 L
399.248 64.877 L
400.031 64.877 L
400.665 64.877 L
401.254 64.877 L
401.941 64.877 L
402.773 64.877 L
403.621 64.877 L
404.321 64.877 L
404.91 64.877 L
405.531 64.877 L
406.298 64.877 L
407.169 64.877 L
407.795 64.877 L
408.421 64.877 L
409.18 64.877 L
410.041 64.877 L
410.823 64.877 L
411.458 64.877 L
412.047 64.877 L
412.733 64.877 L
413.566 64.877 L
414.413 64.877 L
415.114 64.877 L
415.702 64.877 L
416.324 64.877 L
417.09 64.877 L
417.962 64.877 L
418.587 64.877 L
419.213 64.877 L
419.973 64.877 L
420.833 64.877 L
421.616 64.877 L
422.25 64.877 L
422.839 64.877 L
423.526 64.877 L
424.358 64.877 L
425.206 64.877 L
425.906 64.877 L
426.495 64.877 L
427.116 64.877 L
427.883 64.877 L
428.754 64.877 L
429.38 64.877 L
430.006 64.877 L
430.765 64.877 L
431.626 64.877 L
432.408 64.877 L
433.043 64.877 L
433.632 64.877 L
434.318 64.877 L
435.151 64.877 L
435.998 64.877 L
436.699 64.877 L
437.287 64.877 L
437.909 64.877 L
438.675 64.877 L
439.547 64.877 L
440.172 64.877 L
440.798 64.877 L
441.558 64.877 L
442.418 64.877 L
443.201 64.877 L
443.835 64.877 L
444.424 64.877 L
445.111 64.877 L
445.943 64.877 L
446.791 64.877 L
447.491 64.877 L
448.08 64.877 L
448.701 64.877 L
449.468 64.877 L
450.339 64.877 L
450.965 64.877 L
451.591 64.877 L
452.35 64.877 L
453.211 64.877 L
453.993 64.877 L
454.628 64.877 L
455.217 64.877 L
455.904 64.877 L
456.736 64.877 L
457.583 64.877 L
458.284 64.877 L
458.872 64.877 L
459.494 64.877 L
460.26 64.877 L
461.132 64.877 L
461.758 64.877 L
462.383 64.877 L
463.143 64.877 L
464.003 64.877 L
464.786 64.877 L
465.42 64.877 L
466.009 64.877 L
466.696 64.877 L
467.529 64.877 L
468.376 64.877 L
469.077 64.877 L
469.665 64.877 L
470.286 64.877 L
471.053 64.877 L
471.924 64.877 L
472.55 64.877 L
473.176 64.877 L
473.935 64.877 L
474.796 64.877 L
475.579 64.877 L
476.213 64.877 L
476.802 64.877 L
477.488 64.877 L
478.321 64.877 L
479.168 64.877 L
479.869 64.877 L
480.457 64.877 L
481.079 64.877 L
481.845 64.877 L
482.717 64.877 L
483.343 64.877 L
483.968 64.877 L
484.728 64.877 L
485.588 64.877 L
486.371 64.877 L
487.005 64.877 L
487.594 64.877 L
488.281 64.877 L
489.114 64.877 L
489.961 64.877 L
490.662 64.877 L
491.25 64.877 L
491.871 64.877 L
492.638 64.877 L
493.509 64.877 L
494.135 64.877 L
494.761 64.877 L
495.521 64.877 L
496.381 64.877 L
497.164 64.877 L
497.798 64.877 L
498.387 64.877 L
499.074 64.877 L
499.906 64.877 L
500.753 64.877 L
501.454 64.877 L
502.042 64.877 L
502.664 64.877 L
503.43 64.877 L
504.302 64.877 L
504.928 64.877 L
505.553 64.877 L
506.313 64.877 L
507 64.877 L
S
GR
GS
[0.75 0 0 0.75 0 0] CT
0.851 0.325 0.098 RC
1 LJ
0.667 LW
N
73 374 M
81.68 374 L
83.85 374 L
83.85 374 L
83.85 374 L
83.952 371.328 L
84.055 368.689 L
84.229 364.289 L
84.427 359.385 L
84.663 353.686 L
84.945 347.072 L
85.292 339.243 L
85.734 329.745 L
86.321 317.868 L
87.122 302.927 L
88.071 286.989 L
88.652 278.092 L
89.232 269.79 L
90.002 259.62 L
90.928 248.566 L
91.535 241.949 L
92.143 235.794 L
92.913 228.603 L
93.805 221.052 L
94.422 216.283 L
95.039 211.851 L
95.803 206.796 L
96.678 201.544 L
97.305 198.105 L
97.931 194.914 L
98.692 191.347 L
99.552 187.684 L
100.333 184.664 L
100.967 182.414 L
101.557 180.467 L
102.245 178.363 L
103.077 176.035 L
103.924 173.894 L
104.624 172.279 L
105.212 171.023 L
105.834 169.785 L
106.601 168.381 L
107.473 166.934 L
108.098 165.984 L
108.723 165.103 L
109.483 164.117 L
110.344 163.102 L
111.127 162.264 L
111.761 161.641 L
112.35 161.104 L
113.036 160.522 L
113.869 159.878 L
114.717 159.284 L
115.418 158.837 L
116.005 158.489 L
116.626 158.148 L
117.393 157.76 L
118.265 157.359 L
118.891 157.096 L
119.516 156.852 L
120.276 156.579 L
121.136 156.298 L
121.919 156.066 L
122.553 155.894 L
123.142 155.745 L
123.829 155.584 L
124.662 155.406 L
125.509 155.242 L
126.21 155.118 L
126.798 155.021 L
127.419 154.927 L
128.186 154.819 L
129.057 154.708 L
129.683 154.636 L
130.309 154.568 L
131.069 154.493 L
131.929 154.415 L
132.712 154.351 L
133.346 154.303 L
133.935 154.262 L
134.622 154.217 L
135.454 154.168 L
136.301 154.123 L
137.002 154.088 L
137.59 154.062 L
138.212 154.036 L
138.978 154.006 L
139.85 153.975 L
140.476 153.955 L
141.101 153.936 L
141.861 153.915 L
142.721 153.894 L
143.504 153.876 L
144.138 153.863 L
144.727 153.851 L
145.414 153.839 L
146.247 153.826 L
147.094 153.813 L
147.795 153.803 L
148.383 153.796 L
149.004 153.789 L
149.771 153.781 L
150.642 153.772 L
151.268 153.767 L
151.894 153.761 L
152.654 153.756 L
153.514 153.75 L
154.297 153.745 L
154.931 153.741 L
155.52 153.738 L
156.207 153.734 L
157.039 153.731 L
157.886 153.727 L
158.587 153.725 L
159.175 153.723 L
159.797 153.721 L
160.563 153.718 L
161.435 153.716 L
162.061 153.714 L
162.686 153.713 L
163.446 153.711 L
164.306 153.71 L
165.089 153.708 L
165.723 153.707 L
166.312 153.706 L
166.999 153.706 L
167.832 153.704 L
168.679 153.704 L
169.38 153.703 L
169.968 153.702 L
170.589 153.702 L
171.356 153.701 L
172.227 153.7 L
172.853 153.7 L
173.479 153.7 L
174.239 153.699 L
175.099 153.699 L
175.882 153.698 L
176.516 153.698 L
177.105 153.698 L
177.792 153.697 L
178.624 153.697 L
179.471 153.697 L
180.172 153.697 L
180.76 153.697 L
181.382 153.696 L
181.5 153.696 L
181.5 153.696 L
181.5 153.696 L
181.596 153.696 L
181.691 153.696 L
181.845 153.696 L
182.04 153.696 L
182.269 153.696 L
182.542 153.696 L
182.877 153.696 L
183.299 153.696 L
183.856 153.696 L
184.617 153.696 L
185.56 153.696 L
186.169 153.696 L
186.778 153.695 L
187.552 153.695 L
188.446 153.695 L
189.06 153.695 L
189.674 153.695 L
190.438 153.695 L
191.317 153.695 L
191.942 153.695 L
192.567 153.695 L
193.329 153.695 L
194.191 153.695 L
194.973 153.695 L
195.606 153.695 L
196.194 153.695 L
196.881 153.695 L
197.715 153.695 L
198.563 153.695 L
199.263 153.695 L
199.85 153.695 L
200.471 153.695 L
201.239 153.695 L
202.112 153.695 L
202.736 153.695 L
203.361 153.695 L
204.121 153.695 L
204.983 153.695 L
205.767 153.695 L
206.4 153.695 L
206.988 153.695 L
207.674 153.695 L
208.507 153.695 L
209.356 153.695 L
210.057 153.694 L
210.644 153.694 L
211.264 153.694 L
212.031 153.694 L
212.904 153.694 L
213.529 153.694 L
214.155 153.694 L
214.915 153.694 L
215.775 153.694 L
216.558 153.694 L
217.192 153.694 L
217.781 153.694 L
218.468 153.694 L
219.3 153.694 L
220.148 153.694 L
220.849 153.694 L
221.437 153.694 L
222.058 153.694 L
222.824 153.694 L
223.696 153.694 L
224.322 153.694 L
224.947 153.694 L
225.707 153.694 L
226.568 153.694 L
227.351 153.694 L
227.985 153.694 L
228.574 153.694 L
229.26 153.694 L
230.093 153.694 L
230.941 153.694 L
231.641 153.694 L
232.229 153.694 L
232.851 153.694 L
233.617 153.694 L
234.489 153.694 L
235.115 153.694 L
235.74 153.694 L
236.5 153.694 L
237.36 153.694 L
238.143 153.694 L
238.777 153.694 L
239.366 153.694 L
240.053 153.694 L
240.886 153.694 L
241.733 153.694 L
242.434 153.694 L
243.022 153.694 L
243.643 153.694 L
244.41 153.694 L
245.282 153.694 L
245.907 153.694 L
246.533 153.694 L
247.293 153.694 L
248.153 153.694 L
248.936 153.694 L
249.57 153.694 L
250.159 153.694 L
250.846 153.694 L
251.678 153.694 L
252.525 153.694 L
253.226 153.694 L
253.814 153.694 L
254.436 153.694 L
255.202 153.694 L
256.074 153.694 L
256.7 153.694 L
257.325 153.694 L
258.085 153.694 L
258.945 153.694 L
259.728 153.694 L
260.362 153.694 L
260.951 153.694 L
261.638 153.694 L
262.471 153.694 L
263.318 153.694 L
264.019 153.694 L
264.607 153.694 L
265.228 153.694 L
265.995 153.694 L
266.867 153.694 L
267.492 153.694 L
268.118 153.694 L
268.878 153.694 L
269.738 153.694 L
270.521 153.694 L
271.155 153.694 L
271.744 153.694 L
272.431 153.694 L
273.263 153.694 L
274.111 153.694 L
274.811 153.694 L
275.399 153.694 L
276.021 153.694 L
276.787 153.694 L
277.659 153.694 L
278.285 153.694 L
278.91 153.694 L
279.67 153.694 L
280.53 153.694 L
281.313 153.694 L
281.947 153.694 L
282.536 153.694 L
283.223 153.694 L
284.056 153.694 L
284.903 153.694 L
285.604 153.694 L
286.192 153.694 L
286.813 153.694 L
287.58 153.694 L
288.452 153.694 L
289.077 153.694 L
289.703 153.694 L
290.463 153.694 L
291.323 153.694 L
292.106 153.694 L
292.74 153.694 L
293.329 153.694 L
294.016 153.694 L
294.848 153.694 L
295.696 153.694 L
296.396 153.694 L
296.984 153.694 L
297.606 153.694 L
298.372 153.694 L
299.244 153.694 L
299.87 153.694 L
300.496 153.694 L
301.255 153.694 L
302.116 153.694 L
302.898 153.694 L
303.532 153.694 L
304.121 153.694 L
304.808 153.694 L
305.641 153.694 L
306.488 153.694 L
307.189 153.694 L
307.777 153.694 L
308.398 153.694 L
309.165 153.694 L
310.037 153.694 L
310.662 153.694 L
311.288 153.694 L
312.048 153.694 L
312.908 153.694 L
313.691 153.694 L
314.325 153.694 L
314.914 153.694 L
315.601 153.694 L
316.433 153.694 L
317.281 153.694 L
317.981 153.694 L
318.569 153.694 L
319.191 153.694 L
319.957 153.694 L
320.829 153.694 L
321.455 153.694 L
322.081 153.694 L
322.84 153.694 L
323.701 153.694 L
324.483 153.694 L
325.117 153.694 L
325.707 153.694 L
326.393 153.694 L
327.226 153.694 L
328.073 153.694 L
328.774 153.694 L
329.362 153.694 L
329.983 153.694 L
330.75 153.694 L
331.622 153.694 L
332.247 153.694 L
332.873 153.694 L
333.633 153.694 L
334.493 153.694 L
335.276 153.694 L
335.91 153.694 L
336.499 153.694 L
337.186 153.694 L
338.018 153.694 L
338.866 153.694 L
339.566 153.694 L
340.155 153.694 L
340.776 153.694 L
341.542 153.694 L
342.414 153.694 L
343.04 153.694 L
343.666 153.694 L
344.425 153.694 L
345.286 153.694 L
346.068 153.694 L
346.702 153.694 L
347.292 153.694 L
347.978 153.694 L
348.811 153.694 L
349.658 153.694 L
350.359 153.694 L
350.947 153.694 L
351.569 153.694 L
352.335 153.694 L
353.207 153.694 L
353.832 153.694 L
354.458 153.694 L
355.218 153.694 L
356.078 153.694 L
356.861 153.694 L
357.495 153.694 L
358.084 153.694 L
358.771 153.694 L
359.603 153.694 L
360.451 153.694 L
361.151 153.694 L
361.74 153.694 L
362.361 153.694 L
363.127 153.694 L
363.999 153.694 L
364.625 153.694 L
365.251 153.694 L
366.01 153.694 L
366.871 153.694 L
367.653 153.694 L
368.287 153.694 L
368.877 153.694 L
369.563 153.694 L
370.396 153.694 L
371.243 153.694 L
371.944 153.694 L
372.532 153.694 L
373.154 153.694 L
373.92 153.694 L
374.792 153.694 L
375.417 153.694 L
376.043 153.694 L
376.803 153.694 L
377.663 153.694 L
378.446 153.694 L
379.08 153.694 L
379.669 153.694 L
380.356 153.694 L
381.188 153.694 L
382.036 153.694 L
382.736 153.694 L
383.325 153.694 L
383.946 153.694 L
384.712 153.694 L
385.584 153.694 L
386.21 153.694 L
386.836 153.694 L
387.595 153.694 L
388.456 153.694 L
389.238 153.694 L
389.872 153.694 L
390.462 153.694 L
391.148 153.694 L
391.981 153.694 L
392.828 153.694 L
393.529 153.694 L
394.117 153.694 L
394.739 153.694 L
395.505 153.694 L
396.377 153.694 L
397.002 153.694 L
397.628 153.694 L
398.388 153.694 L
399.248 153.694 L
400.031 153.694 L
400.665 153.694 L
401.254 153.694 L
401.941 153.694 L
402.773 153.694 L
403.621 153.694 L
404.321 153.694 L
404.91 153.694 L
405.531 153.694 L
406.298 153.694 L
407.169 153.694 L
407.795 153.694 L
408.421 153.694 L
409.18 153.694 L
410.041 153.694 L
410.823 153.694 L
411.458 153.694 L
412.047 153.694 L
412.733 153.694 L
413.566 153.694 L
414.413 153.694 L
415.114 153.694 L
415.702 153.694 L
416.324 153.694 L
417.09 153.694 L
417.962 153.694 L
418.587 153.694 L
419.213 153.694 L
419.973 153.694 L
420.833 153.694 L
421.616 153.694 L
422.25 153.694 L
422.839 153.694 L
423.526 153.694 L
424.358 153.694 L
425.206 153.694 L
425.906 153.694 L
426.495 153.694 L
427.116 153.694 L
427.883 153.694 L
428.754 153.694 L
429.38 153.694 L
430.006 153.694 L
430.765 153.694 L
431.626 153.694 L
432.408 153.694 L
433.043 153.694 L
433.632 153.694 L
434.318 153.694 L
435.151 153.694 L
435.998 153.694 L
436.699 153.694 L
437.287 153.694 L
437.909 153.694 L
438.675 153.694 L
439.547 153.694 L
440.172 153.694 L
440.798 153.694 L
441.558 153.694 L
442.418 153.694 L
443.201 153.694 L
443.835 153.694 L
444.424 153.694 L
445.111 153.694 L
445.943 153.694 L
446.791 153.694 L
447.491 153.694 L
448.08 153.694 L
448.701 153.694 L
449.468 153.694 L
450.339 153.694 L
450.965 153.694 L
451.591 153.694 L
452.35 153.694 L
453.211 153.694 L
453.993 153.694 L
454.628 153.694 L
455.217 153.694 L
455.904 153.694 L
456.736 153.694 L
457.583 153.694 L
458.284 153.694 L
458.872 153.694 L
459.494 153.694 L
460.26 153.694 L
461.132 153.694 L
461.758 153.694 L
462.383 153.694 L
463.143 153.694 L
464.003 153.694 L
464.786 153.694 L
465.42 153.694 L
466.009 153.694 L
466.696 153.694 L
467.529 153.694 L
468.376 153.694 L
469.077 153.694 L
469.665 153.694 L
470.286 153.694 L
471.053 153.694 L
471.924 153.694 L
472.55 153.694 L
473.176 153.694 L
473.935 153.694 L
474.796 153.694 L
475.579 153.694 L
476.213 153.694 L
476.802 153.694 L
477.488 153.694 L
478.321 153.694 L
479.168 153.694 L
479.869 153.694 L
480.457 153.694 L
481.079 153.694 L
481.845 153.694 L
482.717 153.694 L
483.343 153.694 L
483.968 153.694 L
484.728 153.694 L
485.588 153.694 L
486.371 153.694 L
487.005 153.694 L
487.594 153.694 L
488.281 153.694 L
489.114 153.694 L
489.961 153.694 L
490.662 153.694 L
491.25 153.694 L
491.871 153.694 L
492.638 153.694 L
493.509 153.694 L
494.135 153.694 L
494.761 153.694 L
495.521 153.694 L
496.381 153.694 L
497.164 153.694 L
497.798 153.694 L
498.387 153.694 L
499.074 153.694 L
499.906 153.694 L
500.753 153.694 L
501.454 153.694 L
502.042 153.694 L
502.664 153.694 L
503.43 153.694 L
504.302 153.694 L
504.928 153.694 L
505.553 153.694 L
506.313 153.694 L
507 153.694 L
S
GR
GS
[0.75 0 0 0.75 0 0] CT
1 GC
N
383 251 M
383 209 L
437 209 L
437 251 L
cp
f
GR
GS
[0.75 0 0 0.75 315 164.34036] CT
/Helvetica 12 F
GS
[1 0 0 1 0 0] CT
0 5 moveto 
1 -1 scale
(y1) t 
GR
GR
GS
[0.75 0 0 0.75 0 0] CT
0 0.447 0.741 RC
1 LJ
0.667 LW
N
387 219.12 M
417 219.12 L
S
GR
GS
[0.75 0 0 0.75 315 180.75] CT
/Helvetica 12 F
GS
[1 0 0 1 0 0] CT
0 0 moveto 
1 -1 scale
(y) t 
GR
GR
GS
[0.75 0 0 0.75 319.5 185.25] CT
/Helvetica 9.333 F
GS
[1 0 0 1 0 0] CT
0 0 moveto 
1 -1 scale
(2) t 
GR
GR
GS
[0.75 0 0 0.75 0 0] CT
0.851 0.325 0.098 RC
1 LJ
0.667 LW
N
387 238.349 M
417 238.349 L
S
GR
GS
[0.75 0 0 0.75 0 0] CT
0.149 GC
10.0 ML
0.667 LW
N
383 251 M
383 209 L
437 209 L
437 251 L
cp
S
GR
%%Trailer
%%Pages: 1
%%EOF
