%!PS-Adobe-3.0 EPSF-3.0
%%Creator: (MATLAB, The Mathworks, Inc. Version 9.1.0.441655 \(R2016b\). Operating System: Linux)
%%Title: /home/frdm/Documents/RLS/rls-2017/sp2/figures/f3.eps
%%CreationDate: 2017-11-14T02:07:01
%%Pages: (atend)
%%BoundingBox: 0 0 731 458
%%LanguageLevel: 3
%%EndComments
%%BeginProlog
%%BeginResource: procset (Apache XML Graphics Std ProcSet) 1.2 0
%%Version: 1.2 0
%%Copyright: (Copyright 2001-2003,2010 The Apache Software Foundation. License terms: http://www.apache.org/licenses/LICENSE-2.0)
/bd{bind def}bind def
/ld{load def}bd
/GR/grestore ld
/M/moveto ld
/LJ/setlinejoin ld
/C/curveto ld
/f/fill ld
/LW/setlinewidth ld
/GC/setgray ld
/t/show ld
/N/newpath ld
/CT/concat ld
/cp/closepath ld
/S/stroke ld
/L/lineto ld
/CC/setcmykcolor ld
/A/ashow ld
/GS/gsave ld
/RC/setrgbcolor ld
/RM/rmoveto ld
/ML/setmiterlimit ld
/re {4 2 roll M
1 index 0 rlineto
0 exch rlineto
neg 0 rlineto
cp } bd
/_ctm matrix def
/_tm matrix def
/BT { _ctm currentmatrix pop matrix _tm copy pop 0 0 moveto } bd
/ET { _ctm setmatrix } bd
/iTm { _ctm setmatrix _tm concat } bd
/Tm { _tm astore pop iTm 0 0 moveto } bd
/ux 0.0 def
/uy 0.0 def
/F {
  /Tp exch def
  /Tf exch def
  Tf findfont Tp scalefont setfont
  /cf Tf def  /cs Tp def
} bd
/ULS {currentpoint /uy exch def /ux exch def} bd
/ULE {
  /Tcx currentpoint pop def
  gsave
  newpath
  cf findfont cs scalefont dup
  /FontMatrix get 0 get /Ts exch def /FontInfo get dup
  /UnderlinePosition get Ts mul /To exch def
  /UnderlineThickness get Ts mul /Tt exch def
  ux uy To add moveto  Tcx uy To add lineto
  Tt setlinewidth stroke
  grestore
} bd
/OLE {
  /Tcx currentpoint pop def
  gsave
  newpath
  cf findfont cs scalefont dup
  /FontMatrix get 0 get /Ts exch def /FontInfo get dup
  /UnderlinePosition get Ts mul /To exch def
  /UnderlineThickness get Ts mul /Tt exch def
  ux uy To add cs add moveto Tcx uy To add cs add lineto
  Tt setlinewidth stroke
  grestore
} bd
/SOE {
  /Tcx currentpoint pop def
  gsave
  newpath
  cf findfont cs scalefont dup
  /FontMatrix get 0 get /Ts exch def /FontInfo get dup
  /UnderlinePosition get Ts mul /To exch def
  /UnderlineThickness get Ts mul /Tt exch def
  ux uy To add cs 10 mul 26 idiv add moveto Tcx uy To add cs 10 mul 26 idiv add lineto
  Tt setlinewidth stroke
  grestore
} bd
/QT {
/Y22 exch store
/X22 exch store
/Y21 exch store
/X21 exch store
currentpoint
/Y21 load 2 mul add 3 div exch
/X21 load 2 mul add 3 div exch
/X21 load 2 mul /X22 load add 3 div
/Y21 load 2 mul /Y22 load add 3 div
/X22 load /Y22 load curveto
} bd
/SSPD {
dup length /d exch dict def
{
/v exch def
/k exch def
currentpagedevice k known {
/cpdv currentpagedevice k get def
v cpdv ne {
/upd false def
/nullv v type /nulltype eq def
/nullcpdv cpdv type /nulltype eq def
nullv nullcpdv or
{
/upd true def
} {
/sametype v type cpdv type eq def
sametype {
v type /arraytype eq {
/vlen v length def
/cpdvlen cpdv length def
vlen cpdvlen eq {
0 1 vlen 1 sub {
/i exch def
/obj v i get def
/cpdobj cpdv i get def
obj cpdobj ne {
/upd true def
exit
} if
} for
} {
/upd true def
} ifelse
} {
v type /dicttype eq {
v {
/dv exch def
/dk exch def
/cpddv cpdv dk get def
dv cpddv ne {
/upd true def
exit
} if
} forall
} {
/upd true def
} ifelse
} ifelse
} if
} ifelse
upd true eq {
d k v put
} if
} if
} if
} forall
d length 0 gt {
d setpagedevice
} if
} bd
/RE { % /NewFontName [NewEncodingArray] /FontName RE -
  findfont dup length dict begin
  {
    1 index /FID ne
    {def} {pop pop} ifelse
  } forall
  /Encoding exch def
  /FontName 1 index def
  currentdict definefont pop
  end
} bind def
%%EndResource
%%BeginResource: procset (Apache XML Graphics EPS ProcSet) 1.0 0
%%Version: 1.0 0
%%Copyright: (Copyright 2002-2003 The Apache Software Foundation. License terms: http://www.apache.org/licenses/LICENSE-2.0)
/BeginEPSF { %def
/b4_Inc_state save def         % Save state for cleanup
/dict_count countdictstack def % Count objects on dict stack
/op_count count 1 sub def      % Count objects on operand stack
userdict begin                 % Push userdict on dict stack
/showpage { } def              % Redefine showpage, { } = null proc
0 setgray 0 setlinecap         % Prepare graphics state
1 setlinewidth 0 setlinejoin
10 setmiterlimit [ ] 0 setdash newpath
/languagelevel where           % If level not equal to 1 then
{pop languagelevel             % set strokeadjust and
1 ne                           % overprint to their defaults.
{false setstrokeadjust false setoverprint
} if
} if
} bd
/EndEPSF { %def
count op_count sub {pop} repeat            % Clean up stacks
countdictstack dict_count sub {end} repeat
b4_Inc_state restore
} bd
%%EndResource
%FOPBeginFontDict
%%IncludeResource: font Courier-Bold
%%IncludeResource: font Helvetica
%%IncludeResource: font Courier-BoldOblique
%%IncludeResource: font Courier-Oblique
%%IncludeResource: font Times-Roman
%%IncludeResource: font Helvetica-BoldOblique
%%IncludeResource: font Helvetica-Bold
%%IncludeResource: font Helvetica-Oblique
%%IncludeResource: font Times-BoldItalic
%%IncludeResource: font Courier
%%IncludeResource: font Times-Italic
%%IncludeResource: font Times-Bold
%%IncludeResource: font Symbol
%%IncludeResource: font ZapfDingbats
%FOPEndFontDict
%%BeginResource: encoding WinAnsiEncoding
/WinAnsiEncoding [
/.notdef /.notdef /.notdef /.notdef /.notdef
/.notdef /.notdef /.notdef /.notdef /.notdef
/.notdef /.notdef /.notdef /.notdef /.notdef
/.notdef /.notdef /.notdef /.notdef /.notdef
/.notdef /.notdef /.notdef /.notdef /.notdef
/.notdef /.notdef /.notdef /.notdef /.notdef
/.notdef /.notdef /space /exclam /quotedbl
/numbersign /dollar /percent /ampersand /quotesingle
/parenleft /parenright /asterisk /plus /comma
/hyphen /period /slash /zero /one
/two /three /four /five /six
/seven /eight /nine /colon /semicolon
/less /equal /greater /question /at
/A /B /C /D /E
/F /G /H /I /J
/K /L /M /N /O
/P /Q /R /S /T
/U /V /W /X /Y
/Z /bracketleft /backslash /bracketright /asciicircum
/underscore /quoteleft /a /b /c
/d /e /f /g /h
/i /j /k /l /m
/n /o /p /q /r
/s /t /u /v /w
/x /y /z /braceleft /bar
/braceright /asciitilde /bullet /Euro /bullet
/quotesinglbase /florin /quotedblbase /ellipsis /dagger
/daggerdbl /circumflex /perthousand /Scaron /guilsinglleft
/OE /bullet /Zcaron /bullet /bullet
/quoteleft /quoteright /quotedblleft /quotedblright /bullet
/endash /emdash /asciitilde /trademark /scaron
/guilsinglright /oe /bullet /zcaron /Ydieresis
/space /exclamdown /cent /sterling /currency
/yen /brokenbar /section /dieresis /copyright
/ordfeminine /guillemotleft /logicalnot /sfthyphen /registered
/macron /degree /plusminus /twosuperior /threesuperior
/acute /mu /paragraph /middot /cedilla
/onesuperior /ordmasculine /guillemotright /onequarter /onehalf
/threequarters /questiondown /Agrave /Aacute /Acircumflex
/Atilde /Adieresis /Aring /AE /Ccedilla
/Egrave /Eacute /Ecircumflex /Edieresis /Igrave
/Iacute /Icircumflex /Idieresis /Eth /Ntilde
/Ograve /Oacute /Ocircumflex /Otilde /Odieresis
/multiply /Oslash /Ugrave /Uacute /Ucircumflex
/Udieresis /Yacute /Thorn /germandbls /agrave
/aacute /acircumflex /atilde /adieresis /aring
/ae /ccedilla /egrave /eacute /ecircumflex
/edieresis /igrave /iacute /icircumflex /idieresis
/eth /ntilde /ograve /oacute /ocircumflex
/otilde /odieresis /divide /oslash /ugrave
/uacute /ucircumflex /udieresis /yacute /thorn
/ydieresis
] def
%%EndResource
%FOPBeginFontReencode
/Courier-Bold findfont
dup length dict begin
  {1 index /FID ne {def} {pop pop} ifelse} forall
  /Encoding WinAnsiEncoding def
  currentdict
end
/Courier-Bold exch definefont pop
/Helvetica findfont
dup length dict begin
  {1 index /FID ne {def} {pop pop} ifelse} forall
  /Encoding WinAnsiEncoding def
  currentdict
end
/Helvetica exch definefont pop
/Courier-BoldOblique findfont
dup length dict begin
  {1 index /FID ne {def} {pop pop} ifelse} forall
  /Encoding WinAnsiEncoding def
  currentdict
end
/Courier-BoldOblique exch definefont pop
/Courier-Oblique findfont
dup length dict begin
  {1 index /FID ne {def} {pop pop} ifelse} forall
  /Encoding WinAnsiEncoding def
  currentdict
end
/Courier-Oblique exch definefont pop
/Times-Roman findfont
dup length dict begin
  {1 index /FID ne {def} {pop pop} ifelse} forall
  /Encoding WinAnsiEncoding def
  currentdict
end
/Times-Roman exch definefont pop
/Helvetica-BoldOblique findfont
dup length dict begin
  {1 index /FID ne {def} {pop pop} ifelse} forall
  /Encoding WinAnsiEncoding def
  currentdict
end
/Helvetica-BoldOblique exch definefont pop
/Helvetica-Bold findfont
dup length dict begin
  {1 index /FID ne {def} {pop pop} ifelse} forall
  /Encoding WinAnsiEncoding def
  currentdict
end
/Helvetica-Bold exch definefont pop
/Helvetica-Oblique findfont
dup length dict begin
  {1 index /FID ne {def} {pop pop} ifelse} forall
  /Encoding WinAnsiEncoding def
  currentdict
end
/Helvetica-Oblique exch definefont pop
/Times-BoldItalic findfont
dup length dict begin
  {1 index /FID ne {def} {pop pop} ifelse} forall
  /Encoding WinAnsiEncoding def
  currentdict
end
/Times-BoldItalic exch definefont pop
/Courier findfont
dup length dict begin
  {1 index /FID ne {def} {pop pop} ifelse} forall
  /Encoding WinAnsiEncoding def
  currentdict
end
/Courier exch definefont pop
/Times-Italic findfont
dup length dict begin
  {1 index /FID ne {def} {pop pop} ifelse} forall
  /Encoding WinAnsiEncoding def
  currentdict
end
/Times-Italic exch definefont pop
/Times-Bold findfont
dup length dict begin
  {1 index /FID ne {def} {pop pop} ifelse} forall
  /Encoding WinAnsiEncoding def
  currentdict
end
/Times-Bold exch definefont pop
%FOPEndFontReencode
%%EndProlog
%%Page: 1 1
%%PageBoundingBox: 0 0 731 458
%%BeginPageSetup
[1 0 0 -1 0 458] CT
%%EndPageSetup
GS
[0.75 0 0 0.75 0 -0.25] CT
1 GC
N
0 0 975 611 re
f
GR
GS
[0.75 0 0 0.75 0 -0.25] CT
1 GC
N
0 0 975 611 re
f
GR
GS
[0.75 0 0 0.75 0 -0.25] CT
1 GC
N
127 544 M
882 544 L
882 46 L
127 46 L
cp
f
GR
GS
[0.75 0 0 0.75 0 -0.25] CT
0.149 GC
2 setlinecap
1 LJ
0.667 LW
N
127 544 M
882 544 L
S
GR
GS
[0.75 0 0 0.75 0 -0.25] CT
0.149 GC
2 setlinecap
1 LJ
0.667 LW
N
127 46 M
882 46 L
S
GR
GS
[0.75 0 0 0.75 0 -0.25] CT
0.149 GC
2 setlinecap
1 LJ
0.667 LW
N
127 544 M
127 536.45 L
S
GR
GS
[0.75 0 0 0.75 0 -0.25] CT
0.149 GC
2 setlinecap
1 LJ
0.667 LW
N
212.795 544 M
212.795 536.45 L
S
GR
GS
[0.75 0 0 0.75 0 -0.25] CT
0.149 GC
2 setlinecap
1 LJ
0.667 LW
N
298.591 544 M
298.591 536.45 L
S
GR
GS
[0.75 0 0 0.75 0 -0.25] CT
0.149 GC
2 setlinecap
1 LJ
0.667 LW
N
384.386 544 M
384.386 536.45 L
S
GR
GS
[0.75 0 0 0.75 0 -0.25] CT
0.149 GC
2 setlinecap
1 LJ
0.667 LW
N
470.182 544 M
470.182 536.45 L
S
GR
GS
[0.75 0 0 0.75 0 -0.25] CT
0.149 GC
2 setlinecap
1 LJ
0.667 LW
N
555.977 544 M
555.977 536.45 L
S
GR
GS
[0.75 0 0 0.75 0 -0.25] CT
0.149 GC
2 setlinecap
1 LJ
0.667 LW
N
641.773 544 M
641.773 536.45 L
S
GR
GS
[0.75 0 0 0.75 0 -0.25] CT
0.149 GC
2 setlinecap
1 LJ
0.667 LW
N
727.568 544 M
727.568 536.45 L
S
GR
GS
[0.75 0 0 0.75 0 -0.25] CT
0.149 GC
2 setlinecap
1 LJ
0.667 LW
N
813.364 544 M
813.364 536.45 L
S
GR
GS
[0.75 0 0 0.75 0 -0.25] CT
0.149 GC
2 setlinecap
1 LJ
0.667 LW
N
127 46 M
127 53.55 L
S
GR
GS
[0.75 0 0 0.75 0 -0.25] CT
0.149 GC
2 setlinecap
1 LJ
0.667 LW
N
212.795 46 M
212.795 53.55 L
S
GR
GS
[0.75 0 0 0.75 0 -0.25] CT
0.149 GC
2 setlinecap
1 LJ
0.667 LW
N
298.591 46 M
298.591 53.55 L
S
GR
GS
[0.75 0 0 0.75 0 -0.25] CT
0.149 GC
2 setlinecap
1 LJ
0.667 LW
N
384.386 46 M
384.386 53.55 L
S
GR
GS
[0.75 0 0 0.75 0 -0.25] CT
0.149 GC
2 setlinecap
1 LJ
0.667 LW
N
470.182 46 M
470.182 53.55 L
S
GR
GS
[0.75 0 0 0.75 0 -0.25] CT
0.149 GC
2 setlinecap
1 LJ
0.667 LW
N
555.977 46 M
555.977 53.55 L
S
GR
GS
[0.75 0 0 0.75 0 -0.25] CT
0.149 GC
2 setlinecap
1 LJ
0.667 LW
N
641.773 46 M
641.773 53.55 L
S
GR
GS
[0.75 0 0 0.75 0 -0.25] CT
0.149 GC
2 setlinecap
1 LJ
0.667 LW
N
727.568 46 M
727.568 53.55 L
S
GR
GS
[0.75 0 0 0.75 0 -0.25] CT
0.149 GC
2 setlinecap
1 LJ
0.667 LW
N
813.364 46 M
813.364 53.55 L
S
GR
GS
[0.75 0 0 0.75 95.25 411.74998] CT
0.149 GC
/Helvetica 13.333 F
GS
[1 0 0 1 0 0] CT
-4.5 13 moveto 
1 -1 scale
(0) t 
GR
GR
GS
[0.75 0 0 0.75 159.59659 411.74998] CT
0.149 GC
/Helvetica 13.333 F
GS
[1 0 0 1 0 0] CT
-8.5 13 moveto 
1 -1 scale
(50) t 
GR
GR
GS
[0.75 0 0 0.75 223.94318 411.74998] CT
0.149 GC
/Helvetica 13.333 F
GS
[1 0 0 1 0 0] CT
-12.5 13 moveto 
1 -1 scale
(100) t 
GR
GR
GS
[0.75 0 0 0.75 288.28976 411.74998] CT
0.149 GC
/Helvetica 13.333 F
GS
[1 0 0 1 0 0] CT
-12.5 13 moveto 
1 -1 scale
(150) t 
GR
GR
GS
[0.75 0 0 0.75 352.63637 411.74998] CT
0.149 GC
/Helvetica 13.333 F
GS
[1 0 0 1 0 0] CT
-12.5 13 moveto 
1 -1 scale
(200) t 
GR
GR
GS
[0.75 0 0 0.75 416.98297 411.74998] CT
0.149 GC
/Helvetica 13.333 F
GS
[1 0 0 1 0 0] CT
-12.5 13 moveto 
1 -1 scale
(250) t 
GR
GR
GS
[0.75 0 0 0.75 481.32953 411.74998] CT
0.149 GC
/Helvetica 13.333 F
GS
[1 0 0 1 0 0] CT
-12.5 13 moveto 
1 -1 scale
(300) t 
GR
GR
GS
[0.75 0 0 0.75 545.67613 411.74998] CT
0.149 GC
/Helvetica 13.333 F
GS
[1 0 0 1 0 0] CT
-12.5 13 moveto 
1 -1 scale
(350) t 
GR
GR
GS
[0.75 0 0 0.75 610.02274 411.74998] CT
0.149 GC
/Helvetica 13.333 F
GS
[1 0 0 1 0 0] CT
-12.5 13 moveto 
1 -1 scale
(400) t 
GR
GR
GS
[0.75 0 0 0.75 378.37527 425.50002] CT
0.149 GC
/Helvetica 14.667 F
GS
[1 0 0 1 0 0] CT
-57.5 14 moveto 
1 -1 scale
(Time \(seconds\)) t 
GR
GR
GS
[0.75 0 0 0.75 0 -0.25] CT
0.149 GC
2 setlinecap
1 LJ
0.667 LW
N
127 544 M
127 46 L
S
GR
GS
[0.75 0 0 0.75 0 -0.25] CT
0.149 GC
2 setlinecap
1 LJ
0.667 LW
N
882 544 M
882 46 L
S
GR
GS
[0.75 0 0 0.75 0 -0.25] CT
0.149 GC
2 setlinecap
1 LJ
0.667 LW
N
127 505.692 M
134.55 505.692 L
S
GR
GS
[0.75 0 0 0.75 0 -0.25] CT
0.149 GC
2 setlinecap
1 LJ
0.667 LW
N
127 429.077 M
134.55 429.077 L
S
GR
GS
[0.75 0 0 0.75 0 -0.25] CT
0.149 GC
2 setlinecap
1 LJ
0.667 LW
N
127 352.462 M
134.55 352.462 L
S
GR
GS
[0.75 0 0 0.75 0 -0.25] CT
0.149 GC
2 setlinecap
1 LJ
0.667 LW
N
127 275.846 M
134.55 275.846 L
S
GR
GS
[0.75 0 0 0.75 0 -0.25] CT
0.149 GC
2 setlinecap
1 LJ
0.667 LW
N
127 199.231 M
134.55 199.231 L
S
GR
GS
[0.75 0 0 0.75 0 -0.25] CT
0.149 GC
2 setlinecap
1 LJ
0.667 LW
N
127 122.615 M
134.55 122.615 L
S
GR
GS
[0.75 0 0 0.75 0 -0.25] CT
0.149 GC
2 setlinecap
1 LJ
0.667 LW
N
127 46 M
134.55 46 L
S
GR
GS
[0.75 0 0 0.75 0 -0.25] CT
0.149 GC
2 setlinecap
1 LJ
0.667 LW
N
882 505.692 M
874.45 505.692 L
S
GR
GS
[0.75 0 0 0.75 0 -0.25] CT
0.149 GC
2 setlinecap
1 LJ
0.667 LW
N
882 429.077 M
874.45 429.077 L
S
GR
GS
[0.75 0 0 0.75 0 -0.25] CT
0.149 GC
2 setlinecap
1 LJ
0.667 LW
N
882 352.462 M
874.45 352.462 L
S
GR
GS
[0.75 0 0 0.75 0 -0.25] CT
0.149 GC
2 setlinecap
1 LJ
0.667 LW
N
882 275.846 M
874.45 275.846 L
S
GR
GS
[0.75 0 0 0.75 0 -0.25] CT
0.149 GC
2 setlinecap
1 LJ
0.667 LW
N
882 199.231 M
874.45 199.231 L
S
GR
GS
[0.75 0 0 0.75 0 -0.25] CT
0.149 GC
2 setlinecap
1 LJ
0.667 LW
N
882 122.615 M
874.45 122.615 L
S
GR
GS
[0.75 0 0 0.75 0 -0.25] CT
0.149 GC
2 setlinecap
1 LJ
0.667 LW
N
882 46 M
874.45 46 L
S
GR
GS
[0.75 0 0 0.75 91.25 379.01924] CT
0.149 GC
/Helvetica 13.333 F
GS
[1 0 0 1 0 0] CT
-9 4.5 moveto 
1 -1 scale
(0) t 
GR
GR
GS
[0.75 0 0 0.75 91.25 321.5577] CT
0.149 GC
/Helvetica 13.333 F
GS
[1 0 0 1 0 0] CT
-21 4.5 moveto 
1 -1 scale
(0.2) t 
GR
GR
GS
[0.75 0 0 0.75 91.25 264.09616] CT
0.149 GC
/Helvetica 13.333 F
GS
[1 0 0 1 0 0] CT
-21 4.5 moveto 
1 -1 scale
(0.4) t 
GR
GR
GS
[0.75 0 0 0.75 91.25 206.6346] CT
0.149 GC
/Helvetica 13.333 F
GS
[1 0 0 1 0 0] CT
-21 4.5 moveto 
1 -1 scale
(0.6) t 
GR
GR
GS
[0.75 0 0 0.75 91.25 149.17307] CT
0.149 GC
/Helvetica 13.333 F
GS
[1 0 0 1 0 0] CT
-21 4.5 moveto 
1 -1 scale
(0.8) t 
GR
GR
GS
[0.75 0 0 0.75 91.25 91.71154] CT
0.149 GC
/Helvetica 13.333 F
GS
[1 0 0 1 0 0] CT
-9 4.5 moveto 
1 -1 scale
(1) t 
GR
GR
GS
[0.75 0 0 0.75 91.25 34.24999] CT
0.149 GC
/Helvetica 13.333 F
GS
[1 0 0 1 0 0] CT
-21 4.5 moveto 
1 -1 scale
(1.2) t 
GR
GR
GS
[0 -0.75 0.75 0 72.5 220.99982] CT
0.149 GC
/Helvetica 14.667 F
GS
[1 0 0 1 0 0] CT
-17 -4 moveto 
1 -1 scale
(data) t 
GR
GR
GS
[0.75 0 0 0.75 378.37534 32.1875] CT
/Helvetica-Bold 14.667 F
GS
[1 0 0 1 0 0] CT
-72 -4 moveto 
1 -1 scale
(Time Series Plot:) t 
GR
GR
GS
[0.75 0 0 0.75 0 -0.25] CT
0 0.447 0.741 RC
1 LJ
0.667 LW
N
127 505.692 M
127.003 505.692 L
127.021 505.692 L
127.107 505.692 L
127.538 505.692 L
129.693 505.692 L
132.933 505.692 L
136.384 505.692 L
140.254 505.692 L
144.622 505.692 L
149.307 505.692 L
149.307 84.308 L
149.307 84.308 L
152.4 84.308 L
155.493 84.308 L
159.091 84.308 L
163.268 84.308 L
166.466 84.308 L
166.466 84.308 L
166.466 84.308 L
170.115 84.308 L
173.763 84.308 L
177.936 84.308 L
182.613 84.308 L
187.979 84.308 L
194.288 84.308 L
195.636 84.308 L
195.636 84.308 L
195.636 84.308 L
203.577 84.308 L
211.517 84.308 L
222.523 84.308 L
235.558 84.308 L
250.658 84.308 L
265.758 84.308 L
280.858 84.308 L
295.958 84.308 L
311.058 84.308 L
326.158 84.308 L
341.258 84.308 L
356.358 84.308 L
371.458 84.308 L
386.558 84.308 L
401.658 84.308 L
416.758 84.308 L
431.858 84.308 L
446.958 84.308 L
462.058 84.308 L
477.158 84.308 L
492.258 84.308 L
507.358 84.308 L
522.458 84.308 L
537.558 84.308 L
552.658 84.308 L
567.758 84.308 L
582.858 84.308 L
597.958 84.308 L
613.058 84.308 L
628.158 84.308 L
643.258 84.308 L
658.358 84.308 L
673.458 84.308 L
688.558 84.308 L
703.658 84.308 L
718.758 84.308 L
733.858 84.308 L
748.958 84.308 L
764.058 84.308 L
779.158 84.308 L
794.258 84.308 L
809.358 84.308 L
824.458 84.308 L
839.558 84.308 L
854.658 84.308 L
869.758 84.308 L
882 84.308 L
S
GR
GS
[0.75 0 0 0.75 0 -0.25] CT
0.851 0.325 0.098 RC
1 LJ
0.667 LW
N
127 505.692 M
127.003 505.692 L
127.021 505.692 L
127.107 505.692 L
127.538 505.692 L
129.693 505.692 L
132.933 505.692 L
136.384 505.692 L
140.254 505.692 L
144.622 505.692 L
149.307 505.692 L
149.307 505.692 L
149.307 505.692 L
152.4 505.692 L
155.493 505.692 L
159.091 505.692 L
163.268 505.692 L
166.466 505.692 L
166.466 160.923 L
166.466 160.923 L
170.115 160.923 L
173.763 160.923 L
177.936 160.923 L
182.613 160.923 L
187.979 160.923 L
194.288 160.923 L
195.636 160.923 L
195.636 160.923 L
195.636 160.923 L
203.577 160.923 L
211.517 160.923 L
222.523 160.923 L
235.558 160.923 L
250.658 160.923 L
265.758 160.923 L
280.858 160.923 L
295.958 160.923 L
311.058 160.923 L
326.158 160.923 L
341.258 160.923 L
356.358 160.923 L
371.458 160.923 L
386.558 160.923 L
401.658 160.923 L
416.758 160.923 L
431.858 160.923 L
446.958 160.923 L
462.058 160.923 L
477.158 160.923 L
492.258 160.923 L
507.358 160.923 L
522.458 160.923 L
537.558 160.923 L
552.658 160.923 L
567.758 160.923 L
582.858 160.923 L
597.958 160.923 L
613.058 160.923 L
628.158 160.923 L
643.258 160.923 L
658.358 160.923 L
673.458 160.923 L
688.558 160.923 L
703.658 160.923 L
718.758 160.923 L
733.858 160.923 L
748.958 160.923 L
764.058 160.923 L
779.158 160.923 L
794.258 160.923 L
809.358 160.923 L
824.458 160.923 L
839.558 160.923 L
854.658 160.923 L
869.758 160.923 L
882 160.923 L
S
GR
GS
[0.75 0 0 0.75 0 -0.25] CT
0.929 0.694 0.125 RC
1 LJ
0.667 LW
N
127 467.385 M
127.003 467.392 L
127.021 467.431 L
127.107 467.624 L
127.538 468.634 L
129.693 474.328 L
132.933 483.166 L
136.384 491.219 L
140.254 497.953 L
144.622 502.968 L
149.307 506.144 L
149.307 506.144 L
149.307 506.144 L
152.4 507.648 L
155.493 507.456 L
159.091 503.335 L
163.268 493.435 L
166.466 482.952 L
166.466 482.952 L
166.466 482.952 L
170.115 465.786 L
173.763 444.646 L
177.936 420.065 L
182.613 394.297 L
187.979 367.847 L
194.288 340.658 L
195.636 335.318 L
195.636 335.318 L
195.636 335.318 L
203.577 306.345 L
211.517 281.359 L
222.523 251.8 L
235.558 222.721 L
250.658 195.363 L
265.758 173.428 L
280.858 155.827 L
295.958 141.704 L
311.058 130.369 L
326.158 121.273 L
341.258 113.973 L
356.358 108.115 L
371.458 103.413 L
386.558 99.64 L
401.658 96.612 L
416.758 94.182 L
431.858 92.232 L
446.958 90.667 L
462.058 89.411 L
477.158 88.404 L
492.258 87.595 L
507.358 86.946 L
522.458 86.425 L
537.558 86.007 L
552.658 85.671 L
567.758 85.402 L
582.858 85.186 L
597.958 85.012 L
613.058 84.873 L
628.158 84.762 L
643.258 84.672 L
658.358 84.6 L
673.458 84.542 L
688.558 84.496 L
703.658 84.459 L
718.758 84.429 L
733.858 84.405 L
748.958 84.386 L
764.058 84.37 L
779.158 84.358 L
794.258 84.348 L
809.358 84.34 L
824.458 84.334 L
839.558 84.329 L
854.658 84.324 L
869.758 84.321 L
882 84.319 L
S
GR
GS
[0.75 0 0 0.75 0 -0.25] CT
0.494 0.184 0.557 RC
1 LJ
0.667 LW
N
127 467.385 M
127.003 467.384 L
127.021 467.383 L
127.107 467.382 L
127.538 467.472 L
129.693 469.812 L
132.933 476.486 L
136.384 484.464 L
140.254 492.36 L
144.622 499.123 L
149.307 504.01 L
149.307 504.01 L
149.307 504.01 L
152.4 504.514 L
155.493 502.565 L
159.091 499.292 L
163.268 495.645 L
166.466 493.416 L
166.466 493.416 L
166.466 493.416 L
170.115 491.92 L
173.763 489.76 L
177.936 484.392 L
182.613 474.552 L
187.979 459.557 L
194.288 439.15 L
195.636 434.608 L
195.636 434.608 L
195.636 434.608 L
203.577 407.589 L
211.517 381.822 L
222.523 349.651 L
235.558 317.173 L
250.658 286.354 L
265.758 261.591 L
280.858 241.712 L
295.958 225.758 L
311.058 212.954 L
326.158 202.679 L
341.258 194.433 L
356.358 187.816 L
371.458 182.505 L
386.558 178.243 L
401.658 174.822 L
416.758 172.078 L
431.858 169.875 L
446.958 168.107 L
462.058 166.688 L
477.158 165.55 L
492.258 164.636 L
507.358 163.903 L
522.458 163.314 L
537.558 162.842 L
552.658 162.463 L
567.758 162.159 L
582.858 161.915 L
597.958 161.719 L
613.058 161.562 L
628.158 161.436 L
643.258 161.334 L
658.358 161.253 L
673.458 161.188 L
688.558 161.136 L
703.658 161.094 L
718.758 161.06 L
733.858 161.033 L
748.958 161.011 L
764.058 160.994 L
779.158 160.98 L
794.258 160.969 L
809.358 160.96 L
824.458 160.952 L
839.558 160.947 L
854.658 160.942 L
869.758 160.938 L
882 160.936 L
S
GR
GS
[0.75 0 0 0.75 0 -0.25] CT
0.467 0.675 0.188 RC
1 LJ
0.667 LW
N
127 505.692 M
127.003 505.692 L
127.021 505.692 L
127.107 505.692 L
127.538 505.692 L
129.693 505.692 L
132.933 505.692 L
136.384 505.692 L
140.254 505.692 L
144.622 505.692 L
149.307 505.692 L
149.307 505.692 L
149.307 505.692 L
152.4 505.692 L
155.493 505.692 L
159.091 505.692 L
163.268 505.692 L
166.466 505.692 L
166.466 505.692 L
166.466 505.692 L
170.115 505.692 L
173.763 505.692 L
177.936 505.692 L
182.613 505.692 L
187.979 505.692 L
194.288 505.692 L
195.636 505.692 L
195.636 352.462 L
195.636 352.462 L
203.577 352.462 L
211.517 352.462 L
222.523 352.462 L
235.558 352.462 L
250.658 352.462 L
265.758 352.462 L
280.858 352.462 L
295.958 352.462 L
311.058 352.462 L
326.158 352.462 L
341.258 352.462 L
356.358 352.462 L
371.458 352.462 L
386.558 352.462 L
401.658 352.462 L
416.758 352.462 L
431.858 352.462 L
446.958 352.462 L
462.058 352.462 L
477.158 352.462 L
492.258 352.462 L
507.358 352.462 L
522.458 352.462 L
537.558 352.462 L
552.658 352.462 L
567.758 352.462 L
582.858 352.462 L
597.958 352.462 L
613.058 352.462 L
628.158 352.462 L
643.258 352.462 L
658.358 352.462 L
673.458 352.462 L
688.558 352.462 L
703.658 352.462 L
718.758 352.462 L
733.858 352.462 L
748.958 352.462 L
764.058 352.462 L
779.158 352.462 L
794.258 352.462 L
809.358 352.462 L
824.458 352.462 L
839.558 352.462 L
854.658 352.462 L
869.758 352.462 L
882 352.462 L
S
GR
GS
[0.75 0 0 0.75 0 -0.25] CT
1 GC
N
677 305 M
677 194 L
858 194 L
858 305 L
cp
f
GR
GS
[0.75 0 0 0.75 535.5 156.5] CT
/Helvetica 12 F
GS
[1 0 0 1 0 0] CT
0 0 moveto 
1 -1 scale
(sp: u) t 
GR
GR
GS
[0.75 0 0 0.75 558 161] CT
/Helvetica 9.6 F
GS
[1 0 0 1 0 0] CT
0 0 moveto 
1 -1 scale
(1) t 
GR
GR
GS
[0.75 0 0 0.75 0 -0.25] CT
0 0.447 0.741 RC
1 LJ
0.667 LW
N
681 206.5 M
711 206.5 L
S
GR
GS
[0.75 0 0 0.75 535.5 172.25] CT
/Helvetica 12 F
GS
[1 0 0 1 0 0] CT
0 0 moveto 
1 -1 scale
(sp: u) t 
GR
GR
GS
[0.75 0 0 0.75 558 176.75] CT
/Helvetica 9.6 F
GS
[1 0 0 1 0 0] CT
0 0 moveto 
1 -1 scale
(2) t 
GR
GR
GS
[0.75 0 0 0.75 0 -0.25] CT
0.851 0.325 0.098 RC
1 LJ
0.667 LW
N
681 228 M
711 228 L
S
GR
GS
[0.75 0 0 0.75 535.5 188.75] CT
/Helvetica 12 F
GS
[1 0 0 1 0 0] CT
0 0 moveto 
1 -1 scale
(h) t 
GR
GR
GS
[0.75 0 0 0.75 541.5 193.25] CT
/Helvetica 9.6 F
GS
[1 0 0 1 0 0] CT
0 0 moveto 
1 -1 scale
(1) t 
GR
GR
GS
[0.75 0 0 0.75 0 -0.25] CT
0.929 0.694 0.125 RC
1 LJ
0.667 LW
N
681 249.5 M
711 249.5 L
S
GR
GS
[0.75 0 0 0.75 535.5 204.5] CT
/Helvetica 12 F
GS
[1 0 0 1 0 0] CT
0 0 moveto 
1 -1 scale
(h) t 
GR
GR
GS
[0.75 0 0 0.75 541.5 209] CT
/Helvetica 9.6 F
GS
[1 0 0 1 0 0] CT
0 0 moveto 
1 -1 scale
(2) t 
GR
GR
GS
[0.75 0 0 0.75 0 -0.25] CT
0.494 0.184 0.557 RC
1 LJ
0.667 LW
N
681 271 M
711 271 L
S
GR
GS
[0.75 0 0 0.75 535.5 221] CT
N
2.359 -7.781 M
2.359 -4.484 L
3.844 -4.484 L
4.672 -4.484 5.125 -4.914 QT
5.578 -5.344 5.578 -6.141 QT
5.578 -6.922 5.125 -7.352 QT
4.672 -7.781 3.844 -7.781 QT
2.359 -7.781 L
cp
1.172 -8.75 M
3.844 -8.75 L
5.328 -8.75 6.078 -8.086 QT
6.828 -7.422 6.828 -6.141 QT
6.828 -4.844 6.078 -4.18 QT
5.328 -3.516 3.844 -3.516 QT
2.359 -3.516 L
2.359 0 L
1.172 0 L
1.172 -8.75 L
cp
11.346 -3.297 M
10.049 -3.297 9.541 -3 QT
9.033 -2.703 9.033 -1.984 QT
9.033 -1.406 9.416 -1.07 QT
9.799 -0.734 10.439 -0.734 QT
11.346 -0.734 11.885 -1.367 QT
12.424 -2 12.424 -3.063 QT
12.424 -3.297 L
11.346 -3.297 L
cp
13.502 -3.75 M
13.502 0 L
12.424 0 L
12.424 -1 L
12.049 -0.406 11.502 -0.117 QT
10.955 0.172 10.158 0.172 QT
9.143 0.172 8.549 -0.398 QT
7.955 -0.969 7.955 -1.906 QT
7.955 -3.016 8.697 -3.578 QT
9.439 -4.141 10.908 -4.141 QT
12.424 -4.141 L
12.424 -4.25 L
12.424 -5 11.932 -5.406 QT
11.439 -5.813 10.564 -5.813 QT
10.002 -5.813 9.463 -5.672 QT
8.924 -5.531 8.439 -5.266 QT
8.439 -6.266 L
9.033 -6.5 9.588 -6.609 QT
10.143 -6.719 10.674 -6.719 QT
12.096 -6.719 12.799 -5.984 QT
13.502 -5.25 13.502 -3.75 QT
cp
19.527 -5.563 M
19.34 -5.656 19.129 -5.711 QT
18.918 -5.766 18.652 -5.766 QT
17.746 -5.766 17.254 -5.172 QT
16.762 -4.578 16.762 -3.453 QT
16.762 0 L
15.684 0 L
15.684 -6.563 L
16.762 -6.563 L
16.762 -5.547 L
17.105 -6.141 17.652 -6.43 QT
18.199 -6.719 18.98 -6.719 QT
19.09 -6.719 19.223 -6.703 QT
19.355 -6.688 19.512 -6.656 QT
19.527 -5.563 L
cp
23.633 -3.297 M
22.336 -3.297 21.828 -3 QT
21.32 -2.703 21.32 -1.984 QT
21.32 -1.406 21.703 -1.07 QT
22.086 -0.734 22.727 -0.734 QT
23.633 -0.734 24.172 -1.367 QT
24.711 -2 24.711 -3.063 QT
24.711 -3.297 L
23.633 -3.297 L
cp
25.789 -3.75 M
25.789 0 L
24.711 0 L
24.711 -1 L
24.336 -0.406 23.789 -0.117 QT
23.242 0.172 22.445 0.172 QT
21.43 0.172 20.836 -0.398 QT
20.242 -0.969 20.242 -1.906 QT
20.242 -3.016 20.984 -3.578 QT
21.727 -4.141 23.195 -4.141 QT
24.711 -4.141 L
24.711 -4.25 L
24.711 -5 24.219 -5.406 QT
23.727 -5.813 22.852 -5.813 QT
22.289 -5.813 21.75 -5.672 QT
21.211 -5.531 20.727 -5.266 QT
20.727 -6.266 L
21.32 -6.5 21.875 -6.609 QT
22.43 -6.719 22.961 -6.719 QT
24.383 -6.719 25.086 -5.984 QT
25.789 -5.25 25.789 -3.75 QT
cp
27.533 -6.563 M
32.658 -6.563 L
32.658 -5.578 L
28.611 -0.859 L
32.658 -0.859 L
32.658 0 L
27.393 0 L
27.393 -0.984 L
31.455 -5.703 L
27.533 -5.703 L
27.533 -6.563 L
cp
34.301 -6.563 M
35.379 -6.563 L
35.379 0 L
34.301 0 L
34.301 -6.563 L
cp
34.301 -9.125 M
35.379 -9.125 L
35.379 -7.75 L
34.301 -7.75 L
34.301 -9.125 L
cp
38.713 -8.422 M
38.713 -6.563 L
40.932 -6.563 L
40.932 -5.719 L
38.713 -5.719 L
38.713 -2.156 L
38.713 -1.359 38.932 -1.133 QT
39.15 -0.906 39.822 -0.906 QT
40.932 -0.906 L
40.932 0 L
39.822 0 L
38.572 0 38.096 -0.469 QT
37.619 -0.938 37.619 -2.156 QT
37.619 -5.719 L
36.838 -5.719 L
36.838 -6.563 L
37.619 -6.563 L
37.619 -8.422 L
38.713 -8.422 L
cp
47.809 -3.969 M
47.809 0 L
46.73 0 L
46.73 -3.922 L
46.73 -4.859 46.363 -5.32 QT
45.996 -5.781 45.277 -5.781 QT
44.402 -5.781 43.895 -5.227 QT
43.387 -4.672 43.387 -3.703 QT
43.387 0 L
42.309 0 L
42.309 -6.563 L
43.387 -6.563 L
43.387 -5.547 L
43.777 -6.141 44.301 -6.43 QT
44.824 -6.719 45.512 -6.719 QT
46.637 -6.719 47.223 -6.023 QT
47.809 -5.328 47.809 -3.969 QT
cp
51.633 -9.594 M
52.805 -9.594 L
50.898 -7.391 L
49.992 -7.391 L
51.633 -9.594 L
cp
49.945 -6.563 M
51.023 -6.563 L
51.023 0 L
49.945 0 L
49.945 -6.563 L
cp
58.141 -0.984 M
58.141 2.5 L
57.063 2.5 L
57.063 -6.563 L
58.141 -6.563 L
58.141 -5.563 L
58.484 -6.156 59 -6.438 QT
59.516 -6.719 60.234 -6.719 QT
61.438 -6.719 62.188 -5.773 QT
62.938 -4.828 62.938 -3.281 QT
62.938 -1.734 62.188 -0.781 QT
61.438 0.172 60.234 0.172 QT
59.516 0.172 59 -0.117 QT
58.484 -0.406 58.141 -0.984 QT
cp
61.813 -3.281 M
61.813 -4.469 61.32 -5.141 QT
60.828 -5.813 59.984 -5.813 QT
59.125 -5.813 58.633 -5.141 QT
58.141 -4.469 58.141 -3.281 QT
58.141 -2.094 58.633 -1.414 QT
59.125 -0.734 59.984 -0.734 QT
60.828 -0.734 61.32 -1.414 QT
61.813 -2.094 61.813 -3.281 QT
cp
68.523 -5.563 M
68.336 -5.656 68.125 -5.711 QT
67.914 -5.766 67.648 -5.766 QT
66.742 -5.766 66.25 -5.172 QT
65.758 -4.578 65.758 -3.453 QT
65.758 0 L
64.68 0 L
64.68 -6.563 L
65.758 -6.563 L
65.758 -5.547 L
66.102 -6.141 66.648 -6.43 QT
67.195 -6.719 67.977 -6.719 QT
68.086 -6.719 68.219 -6.703 QT
68.352 -6.688 68.508 -6.656 QT
68.523 -5.563 L
cp
66.148 -7.391 M
64.68 -9.594 L
65.508 -9.594 L
66.602 -8.156 L
67.68 -9.594 L
68.508 -9.594 L
67.039 -7.391 L
66.148 -7.391 L
cp
71.332 -9.594 M
72.504 -9.594 L
70.598 -7.391 L
69.691 -7.391 L
71.332 -9.594 L
cp
69.645 -6.563 M
70.723 -6.563 L
70.723 0 L
69.645 0 L
69.645 -6.563 L
cp
74.057 -8.422 M
74.057 -6.563 L
76.275 -6.563 L
76.275 -5.719 L
74.057 -5.719 L
74.057 -2.156 L
74.057 -1.359 74.275 -1.133 QT
74.494 -0.906 75.166 -0.906 QT
76.275 -0.906 L
76.275 0 L
75.166 0 L
73.916 0 73.439 -0.469 QT
72.963 -0.938 72.963 -2.156 QT
72.963 -5.719 L
72.182 -5.719 L
72.182 -6.563 L
72.963 -6.563 L
72.963 -8.422 L
74.057 -8.422 L
cp
80.23 -5.813 M
79.371 -5.813 78.863 -5.133 QT
78.355 -4.453 78.355 -3.281 QT
78.355 -2.094 78.855 -1.422 QT
79.355 -0.75 80.23 -0.75 QT
81.09 -0.75 81.598 -1.43 QT
82.105 -2.109 82.105 -3.281 QT
82.105 -4.438 81.598 -5.125 QT
81.09 -5.813 80.23 -5.813 QT
cp
80.23 -6.719 M
81.637 -6.719 82.441 -5.805 QT
83.246 -4.891 83.246 -3.281 QT
83.246 -1.672 82.441 -0.75 QT
81.637 0.172 80.23 0.172 QT
78.824 0.172 78.02 -0.75 QT
77.215 -1.672 77.215 -3.281 QT
77.215 -4.891 78.02 -5.805 QT
78.824 -6.719 80.23 -6.719 QT
cp
84.994 -9.125 M
86.072 -9.125 L
86.072 -3.734 L
89.291 -6.563 L
90.666 -6.563 L
87.182 -3.5 L
90.822 0 L
89.416 0 L
86.072 -3.203 L
86.072 0 L
84.994 0 L
84.994 -9.125 L
cp
95.68 -2.594 M
95.68 -6.563 L
96.758 -6.563 L
96.758 -2.625 L
96.758 -1.703 97.125 -1.234 QT
97.492 -0.766 98.211 -0.766 QT
99.086 -0.766 99.594 -1.32 QT
100.102 -1.875 100.102 -2.844 QT
100.102 -6.563 L
101.18 -6.563 L
101.18 0 L
100.102 0 L
100.102 -1.016 L
99.711 -0.406 99.195 -0.117 QT
98.68 0.172 97.992 0.172 QT
96.852 0.172 96.266 -0.531 QT
95.68 -1.234 95.68 -2.594 QT
cp
f
GR
GS
[0.75 0 0 0.75 612.75 225.5] CT
/Helvetica 9.6 F
GS
[1 0 0 1 0 0] CT
0 0 moveto 
1 -1 scale
(1) t 
GR
GR
GS
[0.75 0 0 0.75 618 221] CT
/Helvetica 12 F
GS
[1 0 0 1 0 0] CT
0 0 moveto 
1 -1 scale
( a u) t 
GR
GR
GS
[0.75 0 0 0.75 635.25 225.5] CT
/Helvetica 9.6 F
GS
[1 0 0 1 0 0] CT
0 0 moveto 
1 -1 scale
(2) t 
GR
GR
GS
[0.75 0 0 0.75 0 -0.25] CT
0.467 0.675 0.188 RC
1 LJ
0.667 LW
N
681 292.5 M
711 292.5 L
S
GR
GS
[0.75 0 0 0.75 0 -0.25] CT
0.149 GC
10.0 ML
0.667 LW
N
677 305 M
677 194 L
858 194 L
858 305 L
cp
S
GR
%%Trailer
%%Pages: 1
%%EOF
