\relax 
\catcode `"\active 
\catcode `-\active 
\catcode 95\active
\select@language{czech}
\@writefile{toc}{\select@language{czech}}
\@writefile{lof}{\select@language{czech}}
\@writefile{lot}{\select@language{czech}}
\@writefile{toc}{\contentsline {section}{\numberline {1}FIR a IIR filtry}{2}}
\@writefile{lof}{\contentsline {figure}{\numberline {1}{\ignorespaces Frekven\IeC {\v c}n\IeC {\'\i } spektrum zadan\IeC {\'e}ho sign\IeC {\'a}lu\relax }}{2}}
\providecommand*\caption@xref[2]{\@setref\relax\@undefined{#1}}
\newlabel{fig:S-freq-spec}{{1}{2}}
\@writefile{toc}{\contentsline {subsection}{\numberline {1.1}FIR filtry}{2}}
\@writefile{lof}{\contentsline {figure}{\numberline {2}{\ignorespaces Porovn\IeC {\'a}n\IeC {\'\i } ok\IeC {\'e}nkov\IeC {\'y}ch funkc\IeC {\'\i } pro FIR doln\IeC {\'\i } propust\relax }}{3}}
\newlabel{fig:fir-lowpass-windows}{{2}{3}}
\@writefile{lof}{\contentsline {figure}{\numberline {3}{\ignorespaces Porovn\IeC {\'a}n\IeC {\'\i } ok\IeC {\'e}nkov\IeC {\'y}ch funkc\IeC {\'\i } pro FIR p\IeC {\'a}smovou z\IeC {\'a}dr\IeC {\v z}\relax }}{3}}
\newlabel{fig:fir-bandstop-windows}{{3}{3}}
\@writefile{lof}{\contentsline {figure}{\numberline {4}{\ignorespaces Porovn\IeC {\'a}n\IeC {\'\i } frekven\IeC {\v c}n\IeC {\'\i }ch spekter sign\IeC {\'a}lu p\IeC {\v r}ed a po filtraci FIR filtry\relax }}{3}}
\newlabel{fig:fir-freq-spec}{{4}{3}}
\@writefile{toc}{\contentsline {subsection}{\numberline {1.2}IIR filtry}{4}}
\@writefile{lof}{\contentsline {figure}{\numberline {5}{\ignorespaces IIR Butterworth doln\IeC {\'\i } propust\relax }}{4}}
\newlabel{fig:iir-lowpass}{{5}{4}}
\@writefile{lof}{\contentsline {figure}{\numberline {6}{\ignorespaces IIR Butterworth p\IeC {\'a}smov\IeC {\'a} z\IeC {\'a}dr\IeC {\v z}\relax }}{4}}
\newlabel{fig:iir-bandstop}{{6}{4}}
\@writefile{lof}{\contentsline {figure}{\numberline {7}{\ignorespaces Porovn\IeC {\'a}n\IeC {\'\i } frekven\IeC {\v c}n\IeC {\'\i }ch septer sign\IeC {\'a}lu p\IeC {\v r}ed a po filtraci IIR filtry\relax }}{5}}
\newlabel{fig:iir-freq-spec}{{7}{5}}
\@writefile{toc}{\contentsline {section}{\numberline {2}P\IeC {\v r}evzorkov\IeC {\'a}n\IeC {\'\i }}{5}}
\@writefile{lof}{\contentsline {figure}{\numberline {8}{\ignorespaces Frekven\IeC {\v c}n\IeC {\'\i } spektrum sign\IeC {\'a}lu pro p\IeC {\v r}evzorkov\IeC {\'a}n\IeC {\'\i }\relax }}{5}}
\newlabel{fig:S4-freq-spec}{{8}{5}}
\@writefile{toc}{\contentsline {section}{\numberline {3}Odstran\IeC {\v e}n\IeC {\'\i } \IeC {\v s}umu}{6}}
\@writefile{toc}{\contentsline {subsection}{\numberline {3.1}Metoda spektr\IeC {\'a}ln\IeC {\'\i }ho ode\IeC {\v c}tu}{6}}
\@writefile{lof}{\contentsline {figure}{\numberline {9}{\ignorespaces Porovn\IeC {\'a}n\IeC {\'\i } frekven\IeC {\v c}n\IeC {\'\i }ch spekter sign\IeC {\'a}lu p\IeC {\v r}ed a po odstran\IeC {\v e}n\IeC {\'\i } \IeC {\v s}umu\relax }}{6}}
\newlabel{fig:noise-freq-rem}{{9}{6}}
\@writefile{toc}{\contentsline {subsection}{\numberline {3.2}Metoda klouzav\IeC {\'e}ho pr\IeC {\r u}m\IeC {\v e}ru}{6}}
\@writefile{toc}{\contentsline {section}{\numberline {4}Vlastn\IeC {\'\i } implementace}{6}}
\@writefile{lof}{\contentsline {figure}{\numberline {10}{\ignorespaces Porovn\IeC {\'a}n\IeC {\'\i } frekven\IeC {\v c}n\IeC {\'\i }ch spekter sign\IeC {\'a}lu p\IeC {\v r}ed a po pr\IeC {\r u}m\IeC {\v e}rov\IeC {\'a}n\IeC {\'\i }\relax }}{7}}
\newlabel{fig:noise-average-spec}{{10}{7}}
\@writefile{toc}{\contentsline {section}{\numberline {5}Z\IeC {\'a}v\IeC {\v e}r}{7}}
\newlabel{LastPage}{{}{7}}
\xdef\lastpage@lastpage{7}
\gdef\lastpage@lastpageHy{}
