\relax 
\catcode `"\active 
\catcode `-\active 
\catcode 95\active
\select@language{czech}
\@writefile{toc}{\select@language{czech}}
\@writefile{lof}{\select@language{czech}}
\@writefile{lot}{\select@language{czech}}
\@writefile{toc}{\contentsline {section}{\numberline {1}Na\IeC {\v c}ten\IeC {\'\i } a zobrazen\IeC {\'\i } sign\IeC {\'a}lu}{2}}
\@writefile{lof}{\contentsline {figure}{\numberline {1}{\ignorespaces Zobrazen\IeC {\'\i } zadan\IeC {\'e}ho sign\IeC {\'a}lu\relax }}{2}}
\providecommand*\caption@xref[2]{\@setref\relax\@undefined{#1}}
\newlabel{fig:signal}{{1}{2}}
\@writefile{toc}{\contentsline {section}{\numberline {2}Identifikace lok\IeC {\'a}ln\IeC {\'\i }ch extr\IeC {\'e}m\IeC {\r u}}{2}}
\@writefile{toc}{\contentsline {section}{\numberline {3}Empirick\IeC {\'a} mod\IeC {\'a}ln\IeC {\'\i } dekompozice}{2}}
\@writefile{lof}{\contentsline {figure}{\numberline {2}{\ignorespaces Porovn\IeC {\'a}n\IeC {\'\i } z\IeC {\'a}kladn\IeC {\'\i }ho sign\IeC {\'a}lu a jeho IMF komponent\relax }}{3}}
\newlabel{fig:imf}{{2}{3}}
\@writefile{toc}{\contentsline {section}{\numberline {4}Porovn\IeC {\'a}n\IeC {\'\i } IMF komponent}{3}}
\@writefile{lof}{\contentsline {figure}{\numberline {3}{\ignorespaces Porovn\IeC {\'a}n\IeC {\'\i } frekven\IeC {\v c}n\IeC {\'\i }ho spektra z\IeC {\'a}kladn\IeC {\'\i }ho sign\IeC {\'a}lu a jeho IMF komponent\relax }}{3}}
\newlabel{fig:spectrum}{{3}{3}}
\@writefile{lof}{\contentsline {figure}{\numberline {4}{\ignorespaces Detail frekven\IeC {\v c}n\IeC {\'\i }ch spekter\relax }}{4}}
\newlabel{fig:spectrum-detail}{{4}{4}}
\@writefile{toc}{\contentsline {section}{\numberline {5}Okam\IeC {\v z}it\IeC {\'a} frekvence IMF}{4}}
\@writefile{lof}{\contentsline {figure}{\numberline {5}{\ignorespaces Okam\IeC {\v z}it\IeC {\'e} frekvence IMF komponent pro 50 iterac\IeC {\'\i }\relax }}{4}}
\newlabel{fig:hilbert-50}{{5}{4}}
\@writefile{lof}{\contentsline {figure}{\numberline {6}{\ignorespaces Okam\IeC {\v z}it\IeC {\'e} frekvence IMF komponent pro 100 iterac\IeC {\'\i }\relax }}{5}}
\newlabel{fig:hilbert-100}{{6}{5}}
\@writefile{lot}{\contentsline {table}{\numberline {1}{\ignorespaces Porovn\IeC {\'a}n\IeC {\'\i } varianc\IeC {\'\i } okam\IeC {\v z}it\IeC {\'y}ch frekvenc\IeC {\'\i } pro jednotliv\IeC {\'e} IMF komponenty\relax }}{5}}
\newlabel{tab:hilbert}{{1}{5}}
\newlabel{LastPage}{{}{5}}
\xdef\lastpage@lastpage{5}
\gdef\lastpage@lastpageHy{}
