%!PS-Adobe-3.0 EPSF-3.0
%%Creator: (MATLAB, The Mathworks, Inc. Version 9.0.0.341360 \(R2016a\). Operating System: Windows 8)
%%Title: C:/Users/Jan/Documents/JC.ISF/isf3/graf2.eps
%%CreationDate: 2017-06-11T16:00:29
%%Pages: (atend)
%%BoundingBox: 0 0 420 315
%%LanguageLevel: 3
%%EndComments
%%BeginProlog
%%BeginResource: procset (Apache XML Graphics Std ProcSet) 1.2 0
%%Version: 1.2 0
%%Copyright: (Copyright 2001-2003,2010 The Apache Software Foundation. License terms: http://www.apache.org/licenses/LICENSE-2.0)
/bd{bind def}bind def
/ld{load def}bd
/GR/grestore ld
/M/moveto ld
/LJ/setlinejoin ld
/C/curveto ld
/f/fill ld
/LW/setlinewidth ld
/GC/setgray ld
/t/show ld
/N/newpath ld
/CT/concat ld
/cp/closepath ld
/S/stroke ld
/L/lineto ld
/CC/setcmykcolor ld
/A/ashow ld
/GS/gsave ld
/RC/setrgbcolor ld
/RM/rmoveto ld
/ML/setmiterlimit ld
/re {4 2 roll M
1 index 0 rlineto
0 exch rlineto
neg 0 rlineto
cp } bd
/_ctm matrix def
/_tm matrix def
/BT { _ctm currentmatrix pop matrix _tm copy pop 0 0 moveto } bd
/ET { _ctm setmatrix } bd
/iTm { _ctm setmatrix _tm concat } bd
/Tm { _tm astore pop iTm 0 0 moveto } bd
/ux 0.0 def
/uy 0.0 def
/F {
  /Tp exch def
  /Tf exch def
  Tf findfont Tp scalefont setfont
  /cf Tf def  /cs Tp def
} bd
/ULS {currentpoint /uy exch def /ux exch def} bd
/ULE {
  /Tcx currentpoint pop def
  gsave
  newpath
  cf findfont cs scalefont dup
  /FontMatrix get 0 get /Ts exch def /FontInfo get dup
  /UnderlinePosition get Ts mul /To exch def
  /UnderlineThickness get Ts mul /Tt exch def
  ux uy To add moveto  Tcx uy To add lineto
  Tt setlinewidth stroke
  grestore
} bd
/OLE {
  /Tcx currentpoint pop def
  gsave
  newpath
  cf findfont cs scalefont dup
  /FontMatrix get 0 get /Ts exch def /FontInfo get dup
  /UnderlinePosition get Ts mul /To exch def
  /UnderlineThickness get Ts mul /Tt exch def
  ux uy To add cs add moveto Tcx uy To add cs add lineto
  Tt setlinewidth stroke
  grestore
} bd
/SOE {
  /Tcx currentpoint pop def
  gsave
  newpath
  cf findfont cs scalefont dup
  /FontMatrix get 0 get /Ts exch def /FontInfo get dup
  /UnderlinePosition get Ts mul /To exch def
  /UnderlineThickness get Ts mul /Tt exch def
  ux uy To add cs 10 mul 26 idiv add moveto Tcx uy To add cs 10 mul 26 idiv add lineto
  Tt setlinewidth stroke
  grestore
} bd
/QT {
/Y22 exch store
/X22 exch store
/Y21 exch store
/X21 exch store
currentpoint
/Y21 load 2 mul add 3 div exch
/X21 load 2 mul add 3 div exch
/X21 load 2 mul /X22 load add 3 div
/Y21 load 2 mul /Y22 load add 3 div
/X22 load /Y22 load curveto
} bd
/SSPD {
dup length /d exch dict def
{
/v exch def
/k exch def
currentpagedevice k known {
/cpdv currentpagedevice k get def
v cpdv ne {
/upd false def
/nullv v type /nulltype eq def
/nullcpdv cpdv type /nulltype eq def
nullv nullcpdv or
{
/upd true def
} {
/sametype v type cpdv type eq def
sametype {
v type /arraytype eq {
/vlen v length def
/cpdvlen cpdv length def
vlen cpdvlen eq {
0 1 vlen 1 sub {
/i exch def
/obj v i get def
/cpdobj cpdv i get def
obj cpdobj ne {
/upd true def
exit
} if
} for
} {
/upd true def
} ifelse
} {
v type /dicttype eq {
v {
/dv exch def
/dk exch def
/cpddv cpdv dk get def
dv cpddv ne {
/upd true def
exit
} if
} forall
} {
/upd true def
} ifelse
} ifelse
} if
} ifelse
upd true eq {
d k v put
} if
} if
} if
} forall
d length 0 gt {
d setpagedevice
} if
} bd
%%EndResource
%%BeginResource: procset (Apache XML Graphics EPS ProcSet) 1.0 0
%%Version: 1.0 0
%%Copyright: (Copyright 2002-2003 The Apache Software Foundation. License terms: http://www.apache.org/licenses/LICENSE-2.0)
/BeginEPSF { %def
/b4_Inc_state save def         % Save state for cleanup
/dict_count countdictstack def % Count objects on dict stack
/op_count count 1 sub def      % Count objects on operand stack
userdict begin                 % Push userdict on dict stack
/showpage { } def              % Redefine showpage, { } = null proc
0 setgray 0 setlinecap         % Prepare graphics state
1 setlinewidth 0 setlinejoin
10 setmiterlimit [ ] 0 setdash newpath
/languagelevel where           % If level not equal to 1 then
{pop languagelevel             % set strokeadjust and
1 ne                           % overprint to their defaults.
{false setstrokeadjust false setoverprint
} if
} if
} bd
/EndEPSF { %def
count op_count sub {pop} repeat            % Clean up stacks
countdictstack dict_count sub {end} repeat
b4_Inc_state restore
} bd
%%EndResource
%FOPBeginFontDict
%%IncludeResource: font Courier-Bold
%%IncludeResource: font Helvetica
%%IncludeResource: font Courier-BoldOblique
%%IncludeResource: font Courier-Oblique
%%IncludeResource: font Times-Roman
%%IncludeResource: font Helvetica-BoldOblique
%%IncludeResource: font Helvetica-Bold
%%IncludeResource: font Helvetica-Oblique
%%IncludeResource: font Times-BoldItalic
%%IncludeResource: font Courier
%%IncludeResource: font Times-Italic
%%IncludeResource: font Times-Bold
%%IncludeResource: font Symbol
%%IncludeResource: font ZapfDingbats
%FOPEndFontDict
%%BeginResource: encoding WinAnsiEncoding
/WinAnsiEncoding [
/.notdef /.notdef /.notdef /.notdef /.notdef
/.notdef /.notdef /.notdef /.notdef /.notdef
/.notdef /.notdef /.notdef /.notdef /.notdef
/.notdef /.notdef /.notdef /.notdef /.notdef
/.notdef /.notdef /.notdef /.notdef /.notdef
/.notdef /.notdef /.notdef /.notdef /.notdef
/.notdef /.notdef /space /exclam /quotedbl
/numbersign /dollar /percent /ampersand /quotesingle
/parenleft /parenright /asterisk /plus /comma
/hyphen /period /slash /zero /one
/two /three /four /five /six
/seven /eight /nine /colon /semicolon
/less /equal /greater /question /at
/A /B /C /D /E
/F /G /H /I /J
/K /L /M /N /O
/P /Q /R /S /T
/U /V /W /X /Y
/Z /bracketleft /backslash /bracketright /asciicircum
/underscore /quoteleft /a /b /c
/d /e /f /g /h
/i /j /k /l /m
/n /o /p /q /r
/s /t /u /v /w
/x /y /z /braceleft /bar
/braceright /asciitilde /bullet /Euro /bullet
/quotesinglbase /florin /quotedblbase /ellipsis /dagger
/daggerdbl /circumflex /perthousand /Scaron /guilsinglleft
/OE /bullet /Zcaron /bullet /bullet
/quoteleft /quoteright /quotedblleft /quotedblright /bullet
/endash /emdash /asciitilde /trademark /scaron
/guilsinglright /oe /bullet /zcaron /Ydieresis
/space /exclamdown /cent /sterling /currency
/yen /brokenbar /section /dieresis /copyright
/ordfeminine /guillemotleft /logicalnot /sfthyphen /registered
/macron /degree /plusminus /twosuperior /threesuperior
/acute /mu /paragraph /middot /cedilla
/onesuperior /ordmasculine /guillemotright /onequarter /onehalf
/threequarters /questiondown /Agrave /Aacute /Acircumflex
/Atilde /Adieresis /Aring /AE /Ccedilla
/Egrave /Eacute /Ecircumflex /Edieresis /Igrave
/Iacute /Icircumflex /Idieresis /Eth /Ntilde
/Ograve /Oacute /Ocircumflex /Otilde /Odieresis
/multiply /Oslash /Ugrave /Uacute /Ucircumflex
/Udieresis /Yacute /Thorn /germandbls /agrave
/aacute /acircumflex /atilde /adieresis /aring
/ae /ccedilla /egrave /eacute /ecircumflex
/edieresis /igrave /iacute /icircumflex /idieresis
/eth /ntilde /ograve /oacute /ocircumflex
/otilde /odieresis /divide /oslash /ugrave
/uacute /ucircumflex /udieresis /yacute /thorn
/ydieresis
] def
%%EndResource
%FOPBeginFontReencode
/Courier-Bold findfont
dup length dict begin
  {1 index /FID ne {def} {pop pop} ifelse} forall
  /Encoding WinAnsiEncoding def
  currentdict
end
/Courier-Bold exch definefont pop
/Helvetica findfont
dup length dict begin
  {1 index /FID ne {def} {pop pop} ifelse} forall
  /Encoding WinAnsiEncoding def
  currentdict
end
/Helvetica exch definefont pop
/Courier-BoldOblique findfont
dup length dict begin
  {1 index /FID ne {def} {pop pop} ifelse} forall
  /Encoding WinAnsiEncoding def
  currentdict
end
/Courier-BoldOblique exch definefont pop
/Courier-Oblique findfont
dup length dict begin
  {1 index /FID ne {def} {pop pop} ifelse} forall
  /Encoding WinAnsiEncoding def
  currentdict
end
/Courier-Oblique exch definefont pop
/Times-Roman findfont
dup length dict begin
  {1 index /FID ne {def} {pop pop} ifelse} forall
  /Encoding WinAnsiEncoding def
  currentdict
end
/Times-Roman exch definefont pop
/Helvetica-BoldOblique findfont
dup length dict begin
  {1 index /FID ne {def} {pop pop} ifelse} forall
  /Encoding WinAnsiEncoding def
  currentdict
end
/Helvetica-BoldOblique exch definefont pop
/Helvetica-Bold findfont
dup length dict begin
  {1 index /FID ne {def} {pop pop} ifelse} forall
  /Encoding WinAnsiEncoding def
  currentdict
end
/Helvetica-Bold exch definefont pop
/Helvetica-Oblique findfont
dup length dict begin
  {1 index /FID ne {def} {pop pop} ifelse} forall
  /Encoding WinAnsiEncoding def
  currentdict
end
/Helvetica-Oblique exch definefont pop
/Times-BoldItalic findfont
dup length dict begin
  {1 index /FID ne {def} {pop pop} ifelse} forall
  /Encoding WinAnsiEncoding def
  currentdict
end
/Times-BoldItalic exch definefont pop
/Courier findfont
dup length dict begin
  {1 index /FID ne {def} {pop pop} ifelse} forall
  /Encoding WinAnsiEncoding def
  currentdict
end
/Courier exch definefont pop
/Times-Italic findfont
dup length dict begin
  {1 index /FID ne {def} {pop pop} ifelse} forall
  /Encoding WinAnsiEncoding def
  currentdict
end
/Times-Italic exch definefont pop
/Times-Bold findfont
dup length dict begin
  {1 index /FID ne {def} {pop pop} ifelse} forall
  /Encoding WinAnsiEncoding def
  currentdict
end
/Times-Bold exch definefont pop
%FOPEndFontReencode
%%EndProlog
%%Page: 1 1
%%PageBoundingBox: 0 0 420 315
%%BeginPageSetup
[1 0 0 -1 0 315] CT
%%EndPageSetup
GS
[0.75 0 0 0.75 0 0] CT
1 GC
N
0 0 560 420 re
f
GR
GS
[0.75 0 0 0.75 0 0] CT
1 GC
N
0 0 560 420 re
f
GR
GS
[0.75 0 0 0.75 0 0] CT
1 GC
N
73 374 M
507 374 L
507 31 L
73 31 L
cp
f
GR
GS
[0.75 0 0 0.75 0 0] CT
0.873 GC
1 LJ
0.667 LW
N
73 374 M
73 31 L
S
GR
GS
[0.75 0 0 0.75 0 0] CT
0.873 GC
1 LJ
0.667 LW
N
127.25 374 M
127.25 31 L
S
GR
GS
[0.75 0 0 0.75 0 0] CT
0.873 GC
1 LJ
0.667 LW
N
181.5 374 M
181.5 31 L
S
GR
GS
[0.75 0 0 0.75 0 0] CT
0.873 GC
1 LJ
0.667 LW
N
235.75 374 M
235.75 31 L
S
GR
GS
[0.75 0 0 0.75 0 0] CT
0.873 GC
1 LJ
0.667 LW
N
290 374 M
290 31 L
S
GR
GS
[0.75 0 0 0.75 0 0] CT
0.873 GC
1 LJ
0.667 LW
N
344.25 374 M
344.25 31 L
S
GR
GS
[0.75 0 0 0.75 0 0] CT
0.873 GC
1 LJ
0.667 LW
N
398.5 374 M
398.5 31 L
S
GR
GS
[0.75 0 0 0.75 0 0] CT
0.873 GC
1 LJ
0.667 LW
N
452.75 374 M
452.75 31 L
S
GR
GS
[0.75 0 0 0.75 0 0] CT
0.873 GC
1 LJ
0.667 LW
N
507 374 M
507 31 L
S
GR
GS
[0.75 0 0 0.75 0 0] CT
0.873 GC
1 LJ
0.667 LW
N
507 374 M
73 374 L
S
GR
GS
[0.75 0 0 0.75 0 0] CT
0.873 GC
1 LJ
0.667 LW
N
507 305.4 M
73 305.4 L
S
GR
GS
[0.75 0 0 0.75 0 0] CT
0.873 GC
1 LJ
0.667 LW
N
507 236.8 M
73 236.8 L
S
GR
GS
[0.75 0 0 0.75 0 0] CT
0.873 GC
1 LJ
0.667 LW
N
507 168.2 M
73 168.2 L
S
GR
GS
[0.75 0 0 0.75 0 0] CT
0.873 GC
1 LJ
0.667 LW
N
507 99.6 M
73 99.6 L
S
GR
GS
[0.75 0 0 0.75 0 0] CT
0.873 GC
1 LJ
0.667 LW
N
507 31 M
73 31 L
S
GR
GS
[0.75 0 0 0.75 0 0] CT
0.149 GC
2 setlinecap
1 LJ
0.667 LW
N
73 374 M
507 374 L
S
GR
GS
[0.75 0 0 0.75 0 0] CT
0.149 GC
2 setlinecap
1 LJ
0.667 LW
N
73 374 M
73 369.66 L
S
GR
GS
[0.75 0 0 0.75 0 0] CT
0.149 GC
2 setlinecap
1 LJ
0.667 LW
N
127.25 374 M
127.25 369.66 L
S
GR
GS
[0.75 0 0 0.75 0 0] CT
0.149 GC
2 setlinecap
1 LJ
0.667 LW
N
181.5 374 M
181.5 369.66 L
S
GR
GS
[0.75 0 0 0.75 0 0] CT
0.149 GC
2 setlinecap
1 LJ
0.667 LW
N
235.75 374 M
235.75 369.66 L
S
GR
GS
[0.75 0 0 0.75 0 0] CT
0.149 GC
2 setlinecap
1 LJ
0.667 LW
N
290 374 M
290 369.66 L
S
GR
GS
[0.75 0 0 0.75 0 0] CT
0.149 GC
2 setlinecap
1 LJ
0.667 LW
N
344.25 374 M
344.25 369.66 L
S
GR
GS
[0.75 0 0 0.75 0 0] CT
0.149 GC
2 setlinecap
1 LJ
0.667 LW
N
398.5 374 M
398.5 369.66 L
S
GR
GS
[0.75 0 0 0.75 0 0] CT
0.149 GC
2 setlinecap
1 LJ
0.667 LW
N
452.75 374 M
452.75 369.66 L
S
GR
GS
[0.75 0 0 0.75 0 0] CT
0.149 GC
2 setlinecap
1 LJ
0.667 LW
N
507 374 M
507 369.66 L
S
GR
GS
[0.75 0 0 0.75 54.75 284.50001] CT
0.149 GC
/Helvetica 13.333 F
GS
[1 0 0 1 0 0] CT
-9.5 14 moveto 
1 -1 scale
(-20) t 
GR
GR
GS
[0.75 0 0 0.75 95.4375 284.50001] CT
0.149 GC
/Helvetica 13.333 F
GS
[1 0 0 1 0 0] CT
-9.5 14 moveto 
1 -1 scale
(-15) t 
GR
GR
GS
[0.75 0 0 0.75 136.125 284.50001] CT
0.149 GC
/Helvetica 13.333 F
GS
[1 0 0 1 0 0] CT
-9.5 14 moveto 
1 -1 scale
(-10) t 
GR
GR
GS
[0.75 0 0 0.75 176.8125 284.50001] CT
0.149 GC
/Helvetica 13.333 F
GS
[1 0 0 1 0 0] CT
-6 14 moveto 
1 -1 scale
(-5) t 
GR
GR
GS
[0.75 0 0 0.75 217.5 284.50001] CT
0.149 GC
/Helvetica 13.333 F
GS
[1 0 0 1 0 0] CT
-4 14 moveto 
1 -1 scale
(0) t 
GR
GR
GS
[0.75 0 0 0.75 258.1875 284.50001] CT
0.149 GC
/Helvetica 13.333 F
GS
[1 0 0 1 0 0] CT
-4 14 moveto 
1 -1 scale
(5) t 
GR
GR
GS
[0.75 0 0 0.75 298.875 284.50001] CT
0.149 GC
/Helvetica 13.333 F
GS
[1 0 0 1 0 0] CT
-7.5 14 moveto 
1 -1 scale
(10) t 
GR
GR
GS
[0.75 0 0 0.75 339.5625 284.50001] CT
0.149 GC
/Helvetica 13.333 F
GS
[1 0 0 1 0 0] CT
-7.5 14 moveto 
1 -1 scale
(15) t 
GR
GR
GS
[0.75 0 0 0.75 380.25 284.50001] CT
0.149 GC
/Helvetica 13.333 F
GS
[1 0 0 1 0 0] CT
-7.5 14 moveto 
1 -1 scale
(20) t 
GR
GR
GS
[0.75 0 0 0.75 217.50016 298.24999] CT
0.149 GC
/Helvetica 14.667 F
GS
[1 0 0 1 0 0] CT
-4 16 moveto 
1 -1 scale
(x) t 
GR
GR
GS
[0.75 0 0 0.75 0 0] CT
0.149 GC
2 setlinecap
1 LJ
0.667 LW
N
73 374 M
73 31 L
S
GR
GS
[0.75 0 0 0.75 0 0] CT
0.149 GC
2 setlinecap
1 LJ
0.667 LW
N
73 374 M
77.34 374 L
S
GR
GS
[0.75 0 0 0.75 0 0] CT
0.149 GC
2 setlinecap
1 LJ
0.667 LW
N
73 305.4 M
77.34 305.4 L
S
GR
GS
[0.75 0 0 0.75 0 0] CT
0.149 GC
2 setlinecap
1 LJ
0.667 LW
N
73 236.8 M
77.34 236.8 L
S
GR
GS
[0.75 0 0 0.75 0 0] CT
0.149 GC
2 setlinecap
1 LJ
0.667 LW
N
73 168.2 M
77.34 168.2 L
S
GR
GS
[0.75 0 0 0.75 0 0] CT
0.149 GC
2 setlinecap
1 LJ
0.667 LW
N
73 99.6 M
77.34 99.6 L
S
GR
GS
[0.75 0 0 0.75 0 0] CT
0.149 GC
2 setlinecap
1 LJ
0.667 LW
N
73 31 M
77.34 31 L
S
GR
GS
[0.75 0 0 0.75 50.74999 280.5] CT
0.149 GC
/Helvetica 13.333 F
GS
[1 0 0 1 0 0] CT
-19 5.5 moveto 
1 -1 scale
(-20) t 
GR
GR
GS
[0.75 0 0 0.75 50.74999 229.05] CT
0.149 GC
/Helvetica 13.333 F
GS
[1 0 0 1 0 0] CT
-19 5.5 moveto 
1 -1 scale
(-15) t 
GR
GR
GS
[0.75 0 0 0.75 50.74999 177.6] CT
0.149 GC
/Helvetica 13.333 F
GS
[1 0 0 1 0 0] CT
-19 5.5 moveto 
1 -1 scale
(-10) t 
GR
GR
GS
[0.75 0 0 0.75 50.74999 126.15] CT
0.149 GC
/Helvetica 13.333 F
GS
[1 0 0 1 0 0] CT
-12 5.5 moveto 
1 -1 scale
(-5) t 
GR
GR
GS
[0.75 0 0 0.75 50.74999 74.7] CT
0.149 GC
/Helvetica 13.333 F
GS
[1 0 0 1 0 0] CT
-8 5.5 moveto 
1 -1 scale
(0) t 
GR
GR
GS
[0.75 0 0 0.75 50.74999 23.25] CT
0.149 GC
/Helvetica 13.333 F
GS
[1 0 0 1 0 0] CT
-8 5.5 moveto 
1 -1 scale
(5) t 
GR
GR
GS
[0 -0.75 0.75 0 33.50001 151.87487] CT
0.149 GC
/Helvetica 14.667 F
GS
[1 0 0 1 0 0] CT
-4 -4 moveto 
1 -1 scale
(y) t 
GR
GR
GS
[0.75 0 0 0.75 217.50021 21.1875] CT
/Helvetica-Bold 14.667 F
GS
[1 0 0 1 0 0] CT
-85 -4 moveto 
1 -1 scale
(Odhad rychlosti xy EKF) t 
GR
GR
GS
[0.75 0 0 0.75 0 0] CT
1 0 0 RC
1 LJ
0.667 LW
N
290 264.24 M
265.207 232.073 L
231.955 227.622 L
217.215 223.926 L
212.133 226.823 L
215.852 227.838 L
213.031 228.399 L
211.777 227.587 L
211.654 229.846 L
211.448 226.315 L
207.922 224.594 L
209.773 224.408 L
212.563 225.633 L
211.978 223.573 L
210.34 227.076 L
211.697 227.537 L
209.662 228.516 L
210.165 226.565 L
208.738 227.63 L
210.948 229.292 L
213.754 228.417 L
215.102 228.539 L
218.017 226.036 L
219.235 227.43 L
220.082 226.663 L
214.378 225.932 L
212.331 227.42 L
212.483 228.456 L
213.32 226.956 L
212.337 224.571 L
209.937 222.539 L
209.213 224.297 L
206.643 223.414 L
206.564 223.944 L
208.825 226.077 L
211.138 229.2 L
214.542 226.681 L
214.557 226.983 L
215.224 229.278 L
215.391 226.948 L
212.906 229.565 L
213.497 228.548 L
208.543 229.377 L
211.186 227.8 L
212.304 225.188 L
212.103 226.198 L
211.543 223.91 L
213.361 225.862 L
212.425 224.015 L
215.619 230.482 L
213.163 229.415 L
222.78 200.793 L
240.873 164.325 L
255.991 127.338 L
273.013 96.967 L
280.428 78.967 L
287.096 70.439 L
288.349 68.233 L
286.64 76.155 L
282.512 84.08 L
277.388 91.099 L
276.105 100.978 L
271.975 108.683 L
268.33 114.723 L
266.242 119.346 L
264.416 123.085 L
261.503 122.833 L
258.234 122.986 L
259.428 125.049 L
260.451 124.062 L
260.614 119.996 L
261.418 117.718 L
265.704 116.206 L
267.758 115.329 L
267.713 114.249 L
266.11 116.921 L
266.911 114.139 L
266.354 115.332 L
263.624 115.961 L
264.107 118.413 L
261.99 118.117 L
263.784 118.026 L
264.486 121.141 L
264.406 118.397 L
265.715 120.729 L
265.699 117.338 L
266.203 120.374 L
261.838 116.297 L
263.423 117.334 L
264.641 116.222 L
263.515 113.77 L
264.787 115.452 L
263.436 116.136 L
261.739 113.642 L
261.039 117.065 L
263.314 118.832 L
264.536 118.529 L
265.387 117.524 L
265.259 116.588 L
265.823 114.466 L
263.931 115.659 L
264.21 115.499 L
264.677 115.896 L
265.388 115.811 L
265.201 118.456 L
266.271 119.984 L
267.889 121.568 L
265.972 119.036 L
264.923 114.526 L
264.963 117.846 L
266.22 117.791 L
264.519 118.332 L
262.961 117.27 L
262.779 117.94 L
265.384 117.578 L
266.637 119.922 L
262.956 116.898 L
262.699 117.825 L
264.346 117.631 L
262.877 117.411 L
263.449 116.876 L
264.397 118.133 L
266.585 118.007 L
268.423 118.213 L
267.235 119.621 L
263.786 117.081 L
263.223 114.257 L
264.622 112.856 L
264.832 113.988 L
262.653 113.5 L
263.322 111.144 L
266.182 115.256 L
263.32 120.613 L
263.992 121.568 L
265.126 121.795 L
266.254 119.892 L
265.989 120.381 L
266.85 118.472 L
265.163 116.588 L
265.244 119.989 L
265.043 123.358 L
266.262 120.648 L
265.844 116.532 L
266.031 116.367 L
264.62 115.323 L
262.837 116.49 L
261.613 116.624 L
262.449 115.539 L
263.052 114.266 L
260.606 115.018 L
261.401 117.059 L
262.814 114.581 L
265.832 117.064 L
266.33 115.954 L
264.945 116.615 L
266.841 117.543 L
263.459 117.033 L
265.948 118.303 L
266.95 119.463 L
263.596 117.691 L
264.9 116.422 L
265.715 115.9 L
265.074 116.158 L
263.776 117.873 L
265.633 121.104 L
263.143 116.098 L
262.904 117.474 L
265.915 117.028 L
269.771 117.559 L
267.372 116.975 L
266.736 116.161 L
263.705 114.494 L
261.753 115.826 L
263.124 118.513 L
264.715 119.29 L
263.341 118.812 L
243.202 114.839 L
212.912 108.467 L
178.118 101.76 L
150.818 93.954 L
129.807 90.924 L
115.474 88.882 L
104.592 91.081 L
101.647 92.523 L
108.317 91.874 L
117.376 92.598 L
121.567 92.993 L
129.15 92.788 L
135.927 92.887 L
141.93 92.404 L
149.996 93.391 L
158.603 95.453 L
159.573 95.346 L
161.756 95.984 L
159.193 98.435 L
159.615 93.592 L
157.69 98.048 L
156.77 96.22 L
156.04 100.599 L
155.297 101.626 L
156.216 101.173 L
153.089 101.16 L
151.12 94.528 L
151.993 94.968 L
151.794 95.506 L
152.92 97.656 L
151.402 99.23 L
149.371 98.196 L
149.146 95.837 L
151.198 95.56 L
152.052 92.321 L
155.968 94.202 L
154.562 95.524 L
155.813 94.449 L
156.532 92.468 L
154.552 96.577 L
154.843 96.304 L
154.03 96.211 L
153.83 96.062 L
153.579 97.496 L
153.676 97.753 L
152.246 96.02 L
155.32 100.9 L
153.649 100.43 L
151.986 98.345 L
151.813 95.704 L
150.582 99.357 L
150.139 95.165 L
149.692 94.463 L
151.27 97.197 L
151.818 96.944 L
153.526 95.182 L
155.158 94.574 L
155.956 91.785 L
154.663 95.922 L
154.454 95.057 L
151.965 98.724 L
150.131 98.328 L
154.693 97.591 L
154.633 98.708 L
153.492 98.088 L
154.79 98.206 L
154.712 97.289 L
154.924 97.826 L
154.831 96.359 L
151.962 98.308 L
152.629 97.356 L
148.607 97.774 L
152.903 95.509 L
151.506 93.69 L
151.645 95.75 L
149.645 97.696 L
151.076 98.406 L
151.865 95.471 L
153.452 95.832 L
155.444 96.486 L
157.495 96.584 L
156.841 97.519 L
153.921 95.861 L
155.229 95.472 L
156.891 94.345 L
151.916 94.365 L
149.798 95.071 L
151.541 94.06 L
153.069 96.714 L
153.014 98.242 L
155.474 97.332 L
154.46 98.08 L
152.297 99.049 L
150.521 98.982 L
146.716 99.538 L
148.723 96.154 L
150.033 97.754 L
152.846 97.85 L
153.044 95.422 L
150.216 98.706 L
151.712 101.101 L
154.404 100.078 L
157.016 96.793 L
155.842 96.8 L
155.721 94.363 L
156.466 94.311 L
157.346 96.614 L
155.452 93.417 L
152.771 96.751 L
152.319 95.802 L
153.208 96.442 L
150.189 98.748 L
149.588 99.211 L
150.308 96.794 L
152.861 96.341 L
153.77 99.237 L
152.304 100.045 L
151.001 99.537 L
149.638 96.641 L
151.245 97.701 L
156.041 97.42 L
152.291 97.483 L
153.709 94.656 L
156.31 93.524 L
156.132 95.574 L
155.031 95.071 L
154.072 94.932 L
153.517 95.386 L
154.743 96.804 L
153.696 97.105 L
151.45 98.088 L
150.259 98.64 L
152.537 96.074 L
151.632 98.366 L
152.211 98.196 L
152.274 97.659 L
152.895 100.825 L
153.742 99.321 L
156.831 95.767 L
153.116 95.151 L
149.981 95.23 L
152.079 96.708 L
154.052 95.51 L
151.94 96.455 L
154.322 93.921 L
151.121 95.802 L
150.954 96.885 L
151.334 98.422 L
155.758 98.617 L
155.51 99.664 L
156.045 98.201 L
152.502 100.14 L
152.865 97.302 L
154.96 97.477 L
152.637 92.017 L
153.288 94.1 L
152.706 96.996 L
151.751 98.804 L
153.057 96.294 L
155.07 99.354 L
154.595 95.998 L
154.705 94.64 L
154.226 93.039 L
152.864 95.028 L
151.802 96.255 L
149.323 99.735 L
155.117 95.787 L
153.783 96.007 L
152.835 95.929 L
155.611 93.754 L
154.942 90.233 L
154.507 90.164 L
154.372 95.93 L
155.207 96.342 L
152.672 97.694 L
151.26 97.59 L
150.883 100.505 L
150.469 98.726 L
149.621 99.232 L
151.625 97.839 L
152.944 100.908 L
152.682 98.854 L
152.629 97.791 L
152.966 99.559 L
155.856 99.566 L
155.349 95.084 L
153.36 96.17 L
151.547 95.317 L
155.001 95.058 L
153.414 95.735 L
154.213 96.692 L
155.786 97.312 L
154.362 98.182 L
155.173 99.924 L
152.868 97.508 L
152.852 98.531 L
153.751 94.233 L
151.878 96.058 L
152.45 98.4 L
155.006 95.389 L
206.613 138.678 L
278.369 197.902 L
349.226 253.138 L
411.815 290.751 L
455.788 311.208 L
482.625 321.44 L
495.107 316.704 L
494.468 302.048 L
480.875 283.422 L
461.353 265.97 L
443.363 250.8 L
426.371 240.801 L
414.353 229.563 L
401.87 229.609 L
390.926 229.957 L
387.7 232.061 L
383.172 236.827 L
382.021 238.716 L
384.883 239.71 L
385.589 240.134 L
388.874 239.682 L
388.399 245.617 L
389.942 246.717 L
393.11 249.21 L
395.753 247.799 L
396.237 251.608 L
399.014 252.64 L
396.465 248.195 L
393.719 250.078 L
392.758 247.883 L
353.341 226.651 L
295.575 202.693 L
243.083 181.305 L
194.714 168.161 L
158.958 164.439 L
139.029 169.368 L
129.405 175.749 L
131.214 187.003 L
137.251 197.834 L
148.839 206.762 L
165.198 210.72 L
179.665 214.346 L
192.615 212.477 L
201.256 216.762 L
207.582 214.362 L
212.564 214.45 L
215.771 205.647 L
213.425 202.505 L
210.631 202.67 L
211.526 197.721 L
210.928 196.723 L
210.939 191.991 L
211.55 188.802 L
215.604 193.244 L
214.732 193.271 L
212.235 197.856 L
205.289 201.782 L
203.035 205.72 L
202.775 204.191 L
203.918 202.42 L
203.301 199.172 L
202.324 197.29 L
203.62 196.202 L
207.866 194.727 L
207.166 200.339 L
208.13 201.632 L
205.382 201.466 L
207.905 202.225 L
209.933 204.071 L
211.027 201.928 L
210.378 200.905 L
208.409 199.269 L
207.221 203.495 L
209.038 202.508 L
208.627 199.206 L
207.343 196.767 L
206.697 194.984 L
203.757 196.578 L
205.109 197.048 L
S
GR
GS
[0.75 0 0 0.75 0 0] CT
1 LJ
0.667 LW
N
212.497 226.833 M
212.536 226.795 L
212.544 226.798 L
212.551 226.815 L
212.559 226.819 L
212.548 226.83 L
212.562 226.853 L
212.553 226.854 L
212.544 226.853 L
212.535 226.848 L
212.541 226.833 L
212.53 226.8 L
212.521 226.82 L
212.537 226.816 L
212.546 226.819 L
212.554 226.784 L
212.549 226.808 L
212.552 226.816 L
212.529 226.828 L
212.545 226.855 L
212.56 226.869 L
212.567 226.897 L
212.57 226.897 L
212.571 226.901 L
212.558 226.908 L
212.558 226.919 L
212.555 226.927 L
212.573 226.923 L
212.559 226.955 L
212.557 226.952 L
212.548 226.957 L
212.555 226.958 L
212.556 226.946 L
212.558 226.96 L
212.561 226.973 L
212.551 226.98 L
212.568 226.983 L
212.551 226.99 L
212.556 227.007 L
212.556 227.048 L
212.56 227.049 L
212.561 227.048 L
212.557 227.051 L
212.567 227.074 L
212.573 227.091 L
212.583 227.1 L
212.583 227.101 L
212.594 227.097 L
212.593 227.124 L
212.566 227.116 L
264.651 117.347 L
264.66 117.339 L
264.637 117.346 L
264.626 117.353 L
264.616 117.355 L
264.613 117.375 L
264.586 117.369 L
264.583 117.347 L
264.592 117.343 L
264.593 117.335 L
264.61 117.347 L
264.606 117.348 L
264.61 117.36 L
264.636 117.347 L
264.647 117.336 L
264.64 117.35 L
264.639 117.341 L
264.634 117.339 L
264.647 117.338 L
264.644 117.345 L
264.644 117.346 L
264.664 117.356 L
264.64 117.374 L
264.649 117.367 L
264.649 117.344 L
264.638 117.336 L
264.627 117.322 L
264.611 117.332 L
264.607 117.321 L
264.596 117.311 L
264.595 117.302 L
264.597 117.296 L
264.616 117.305 L
264.615 117.292 L
264.616 117.254 L
264.611 117.257 L
264.631 117.24 L
264.631 117.239 L
264.634 117.238 L
264.623 117.22 L
264.634 117.225 L
264.623 117.228 L
264.635 117.236 L
264.631 117.242 L
264.627 117.232 L
264.627 117.208 L
264.635 117.204 L
264.627 117.215 L
264.619 117.224 L
264.621 117.217 L
264.621 117.217 L
264.623 117.198 L
264.608 117.195 L
264.618 117.191 L
264.631 117.192 L
264.617 117.187 L
264.593 117.203 L
264.576 117.201 L
264.56 117.202 L
264.562 117.197 L
264.556 117.215 L
264.565 117.206 L
264.592 117.192 L
264.584 117.2 L
264.582 117.194 L
264.58 117.196 L
264.585 117.208 L
264.583 117.199 L
264.568 117.198 L
264.573 117.199 L
264.577 117.209 L
264.588 117.221 L
264.576 117.24 L
264.57 117.244 L
264.579 117.238 L
264.58 117.252 L
264.565 117.279 L
264.577 117.265 L
264.564 117.256 L
264.566 117.257 L
264.556 117.275 L
264.565 117.29 L
264.58 117.285 L
264.586 117.306 L
264.591 117.311 L
264.588 117.307 L
264.59 117.311 L
264.586 117.318 L
264.596 117.32 L
264.583 117.305 L
264.587 117.31 L
264.585 117.304 L
264.571 117.335 L
264.559 117.33 L
264.556 117.343 L
264.57 117.334 L
264.598 117.321 L
264.615 117.344 L
264.61 117.318 L
264.598 117.313 L
264.599 117.296 L
264.597 117.308 L
264.573 117.319 L
264.592 117.32 L
264.601 117.341 L
264.615 117.352 L
264.618 117.365 L
264.627 117.359 L
264.625 117.362 L
264.612 117.329 L
264.621 117.339 L
264.627 117.344 L
264.635 117.34 L
264.618 117.314 L
264.621 117.325 L
264.629 117.329 L
264.641 117.345 L
264.647 117.356 L
264.643 117.352 L
264.653 117.355 L
264.649 117.358 L
264.651 117.377 L
264.639 117.374 L
264.641 117.4 L
264.641 117.372 L
152.892 96.777 L
152.882 96.769 L
152.886 96.766 L
152.902 96.773 L
152.893 96.786 L
152.907 96.821 L
152.897 96.81 L
152.905 96.794 L
152.904 96.802 L
152.917 96.813 L
152.926 96.81 L
152.936 96.811 L
152.953 96.801 L
152.959 96.797 L
152.949 96.795 L
152.946 96.789 L
152.951 96.766 L
152.937 96.758 L
152.932 96.759 L
152.939 96.773 L
152.944 96.773 L
152.973 96.789 L
152.98 96.793 L
152.985 96.802 L
152.977 96.814 L
152.997 96.819 L
152.999 96.815 L
152.994 96.802 L
153.012 96.784 L
153.02 96.786 L
153.02 96.776 L
153.033 96.768 L
153.029 96.75 L
153.032 96.728 L
153.028 96.723 L
153.057 96.727 L
153.049 96.716 L
153.064 96.716 L
153.066 96.721 L
153.067 96.718 L
153.09 96.707 L
153.079 96.71 L
153.098 96.715 L
153.102 96.721 L
153.089 96.715 L
153.086 96.726 L
153.084 96.726 L
153.091 96.729 L
153.084 96.739 L
153.092 96.705 L
153.092 96.729 L
153.103 96.715 L
153.107 96.715 L
153.105 96.717 L
153.101 96.717 L
153.1 96.695 L
153.102 96.685 L
153.111 96.696 L
153.095 96.682 L
153.095 96.692 L
153.077 96.725 L
153.085 96.745 L
153.086 96.771 L
153.086 96.784 L
153.076 96.773 L
153.073 96.747 L
153.075 96.741 L
153.072 96.755 L
153.071 96.763 L
153.065 96.778 L
153.069 96.791 L
153.065 96.81 L
153.071 96.782 L
153.072 96.795 L
153.098 96.798 L
153.103 96.797 L
153.094 96.787 L
153.106 96.773 L
153.121 96.793 L
153.111 96.797 L
153.104 96.802 L
153.117 96.791 L
153.122 96.789 L
153.127 96.787 L
153.122 96.815 L
153.125 96.827 L
153.144 96.832 L
153.147 96.825 L
153.151 96.856 L
153.167 96.868 L
153.156 96.89 L
153.144 96.882 L
153.144 96.878 L
153.153 96.863 L
153.14 96.841 L
153.127 96.836 L
153.128 96.823 L
153.129 96.85 L
153.14 96.839 L
153.129 96.845 L
153.122 96.824 L
153.133 96.82 L
153.146 96.827 L
153.135 96.836 L
153.115 96.837 L
153.124 96.839 L
153.129 96.827 L
153.133 96.831 L
153.125 96.823 L
153.132 96.823 L
153.148 96.84 L
153.157 96.837 L
153.164 96.841 L
153.173 96.839 L
153.169 96.84 L
153.169 96.83 L
153.159 96.839 L
153.135 96.841 L
153.152 96.844 L
153.163 96.846 L
153.167 96.841 L
153.169 96.839 L
153.167 96.861 L
153.166 96.884 L
153.155 96.892 L
153.169 96.877 L
153.179 96.882 L
153.181 96.879 L
153.184 96.873 L
153.151 96.866 L
153.146 96.877 L
153.155 96.897 L
153.159 96.886 L
153.153 96.893 L
153.17 96.909 L
153.178 96.92 L
153.204 96.915 L
153.202 96.933 L
153.192 96.946 L
153.179 96.963 L
153.184 96.955 L
153.185 96.964 L
153.19 96.973 L
153.199 96.958 L
153.202 96.94 L
153.18 96.946 L
153.176 96.944 L
153.164 96.939 L
153.154 96.944 L
153.172 96.952 L
153.178 96.981 L
153.178 96.994 L
153.19 96.986 L
153.197 96.981 L
153.202 96.973 L
153.212 96.984 L
153.223 96.991 L
153.205 96.964 L
153.208 96.947 L
153.209 96.932 L
153.195 96.932 L
153.192 96.928 L
153.21 96.939 L
153.232 96.953 L
153.25 96.945 L
153.251 96.919 L
153.247 96.92 L
153.264 96.913 L
153.285 96.893 L
153.287 96.914 L
153.279 96.933 L
153.263 96.936 L
153.268 96.923 L
153.266 96.932 L
153.269 96.934 L
153.268 96.937 L
153.26 96.949 L
153.254 96.97 L
153.234 96.964 L
153.236 96.963 L
153.223 96.977 L
153.227 96.975 L
153.235 96.989 L
153.215 97.004 L
153.239 97.003 L
153.25 96.978 L
153.238 96.985 L
153.241 96.997 L
153.24 97.009 L
153.231 97.006 L
153.235 97.021 L
153.242 96.997 L
153.237 96.963 L
153.214 96.974 L
153.221 96.992 L
153.228 96.999 L
153.208 96.988 L
153.191 97.002 L
153.185 97.013 L
153.185 97.026 L
393.739 245.6 L
393.748 245.597 L
393.753 245.6 L
393.751 245.612 L
393.754 245.605 L
393.756 245.633 L
393.752 245.625 L
393.731 245.636 L
393.713 245.642 L
393.702 245.654 L
393.692 245.645 L
393.691 245.653 L
393.72 245.653 L
393.726 245.664 L
393.727 245.654 L
393.73 245.667 L
393.738 245.646 L
393.752 245.654 L
393.737 245.645 L
393.733 245.647 L
393.728 245.657 L
393.714 245.659 L
393.717 245.656 L
393.71 245.657 L
393.709 245.641 L
393.705 245.651 L
393.689 245.633 L
393.692 245.63 L
393.686 245.624 L
393.695 245.617 L
207.082 199.918 L
207.092 199.917 L
207.1 199.905 L
207.081 199.917 L
207.084 199.927 L
207.084 199.924 L
207.084 199.918 L
207.089 199.918 L
207.088 199.918 L
207.108 199.921 L
207.094 199.925 L
207.077 199.919 L
207.081 199.922 L
207.091 199.94 L
207.1 199.949 L
207.106 199.942 L
207.102 199.936 L
207.116 199.915 L
207.121 199.911 L
207.125 199.911 L
207.111 199.901 L
207.091 199.879 L
207.094 199.862 L
207.099 199.872 L
207.1 199.875 L
207.094 199.886 L
207.099 199.89 L
207.09 199.888 L
207.103 199.882 L
207.108 199.883 L
207.102 199.896 L
207.113 199.898 L
207.131 199.891 L
207.136 199.899 L
207.134 199.897 L
207.131 199.913 L
207.132 199.89 L
207.14 199.909 L
207.14 199.899 L
207.122 199.877 L
207.12 199.867 L
207.125 199.872 L
207.117 199.869 L
207.124 199.86 L
207.134 199.86 L
207.119 199.876 L
207.126 199.881 L
207.121 199.901 L
207.128 199.896 L
207.128 199.913 L
S
GR
GS
[0.75 0 0 0.75 0 0] CT
1 GC
N
432 81 M
432 44 L
494 44 L
494 81 L
cp
f
GR
GS
[0.75 0 0 0.75 351.75 40.60274] CT
/Helvetica 12 F
GS
[1 0 0 1 0 0] CT
0 5 moveto 
1 -1 scale
(ekf) t 
GR
GR
GS
[0.75 0 0 0.75 0 0] CT
1 0 0 RC
1 LJ
0.667 LW
N
436 54.137 M
466 54.137 L
S
GR
GS
[0.75 0 0 0.75 351.75 53.14726] CT
/Helvetica 12 F
GS
[1 0 0 1 0 0] CT
0 5 moveto 
1 -1 scale
(real) t 
GR
GR
GS
[0.75 0 0 0.75 0 0] CT
1 LJ
0.667 LW
N
436 70.863 M
466 70.863 L
S
GR
GS
[0.75 0 0 0.75 0 0] CT
0.149 GC
10.0 ML
0.667 LW
N
432 81 M
432 44 L
494 44 L
494 81 L
cp
S
GR
%%Trailer
%%Pages: 1
%%EOF
