%!PS-Adobe-3.0 EPSF-3.0
%%Creator: (MATLAB, The Mathworks, Inc. Version 9.0.0.341360 \(R2016a\). Operating System: Windows 8)
%%Title: C:/Users/Jan/Documents/JC.ISF/isf3/graf6.eps
%%CreationDate: 2017-06-11T16:01:15
%%Pages: (atend)
%%BoundingBox: 0 0 420 315
%%LanguageLevel: 3
%%EndComments
%%BeginProlog
%%BeginResource: procset (Apache XML Graphics Std ProcSet) 1.2 0
%%Version: 1.2 0
%%Copyright: (Copyright 2001-2003,2010 The Apache Software Foundation. License terms: http://www.apache.org/licenses/LICENSE-2.0)
/bd{bind def}bind def
/ld{load def}bd
/GR/grestore ld
/M/moveto ld
/LJ/setlinejoin ld
/C/curveto ld
/f/fill ld
/LW/setlinewidth ld
/GC/setgray ld
/t/show ld
/N/newpath ld
/CT/concat ld
/cp/closepath ld
/S/stroke ld
/L/lineto ld
/CC/setcmykcolor ld
/A/ashow ld
/GS/gsave ld
/RC/setrgbcolor ld
/RM/rmoveto ld
/ML/setmiterlimit ld
/re {4 2 roll M
1 index 0 rlineto
0 exch rlineto
neg 0 rlineto
cp } bd
/_ctm matrix def
/_tm matrix def
/BT { _ctm currentmatrix pop matrix _tm copy pop 0 0 moveto } bd
/ET { _ctm setmatrix } bd
/iTm { _ctm setmatrix _tm concat } bd
/Tm { _tm astore pop iTm 0 0 moveto } bd
/ux 0.0 def
/uy 0.0 def
/F {
  /Tp exch def
  /Tf exch def
  Tf findfont Tp scalefont setfont
  /cf Tf def  /cs Tp def
} bd
/ULS {currentpoint /uy exch def /ux exch def} bd
/ULE {
  /Tcx currentpoint pop def
  gsave
  newpath
  cf findfont cs scalefont dup
  /FontMatrix get 0 get /Ts exch def /FontInfo get dup
  /UnderlinePosition get Ts mul /To exch def
  /UnderlineThickness get Ts mul /Tt exch def
  ux uy To add moveto  Tcx uy To add lineto
  Tt setlinewidth stroke
  grestore
} bd
/OLE {
  /Tcx currentpoint pop def
  gsave
  newpath
  cf findfont cs scalefont dup
  /FontMatrix get 0 get /Ts exch def /FontInfo get dup
  /UnderlinePosition get Ts mul /To exch def
  /UnderlineThickness get Ts mul /Tt exch def
  ux uy To add cs add moveto Tcx uy To add cs add lineto
  Tt setlinewidth stroke
  grestore
} bd
/SOE {
  /Tcx currentpoint pop def
  gsave
  newpath
  cf findfont cs scalefont dup
  /FontMatrix get 0 get /Ts exch def /FontInfo get dup
  /UnderlinePosition get Ts mul /To exch def
  /UnderlineThickness get Ts mul /Tt exch def
  ux uy To add cs 10 mul 26 idiv add moveto Tcx uy To add cs 10 mul 26 idiv add lineto
  Tt setlinewidth stroke
  grestore
} bd
/QT {
/Y22 exch store
/X22 exch store
/Y21 exch store
/X21 exch store
currentpoint
/Y21 load 2 mul add 3 div exch
/X21 load 2 mul add 3 div exch
/X21 load 2 mul /X22 load add 3 div
/Y21 load 2 mul /Y22 load add 3 div
/X22 load /Y22 load curveto
} bd
/SSPD {
dup length /d exch dict def
{
/v exch def
/k exch def
currentpagedevice k known {
/cpdv currentpagedevice k get def
v cpdv ne {
/upd false def
/nullv v type /nulltype eq def
/nullcpdv cpdv type /nulltype eq def
nullv nullcpdv or
{
/upd true def
} {
/sametype v type cpdv type eq def
sametype {
v type /arraytype eq {
/vlen v length def
/cpdvlen cpdv length def
vlen cpdvlen eq {
0 1 vlen 1 sub {
/i exch def
/obj v i get def
/cpdobj cpdv i get def
obj cpdobj ne {
/upd true def
exit
} if
} for
} {
/upd true def
} ifelse
} {
v type /dicttype eq {
v {
/dv exch def
/dk exch def
/cpddv cpdv dk get def
dv cpddv ne {
/upd true def
exit
} if
} forall
} {
/upd true def
} ifelse
} ifelse
} if
} ifelse
upd true eq {
d k v put
} if
} if
} if
} forall
d length 0 gt {
d setpagedevice
} if
} bd
%%EndResource
%%BeginResource: procset (Apache XML Graphics EPS ProcSet) 1.0 0
%%Version: 1.0 0
%%Copyright: (Copyright 2002-2003 The Apache Software Foundation. License terms: http://www.apache.org/licenses/LICENSE-2.0)
/BeginEPSF { %def
/b4_Inc_state save def         % Save state for cleanup
/dict_count countdictstack def % Count objects on dict stack
/op_count count 1 sub def      % Count objects on operand stack
userdict begin                 % Push userdict on dict stack
/showpage { } def              % Redefine showpage, { } = null proc
0 setgray 0 setlinecap         % Prepare graphics state
1 setlinewidth 0 setlinejoin
10 setmiterlimit [ ] 0 setdash newpath
/languagelevel where           % If level not equal to 1 then
{pop languagelevel             % set strokeadjust and
1 ne                           % overprint to their defaults.
{false setstrokeadjust false setoverprint
} if
} if
} bd
/EndEPSF { %def
count op_count sub {pop} repeat            % Clean up stacks
countdictstack dict_count sub {end} repeat
b4_Inc_state restore
} bd
%%EndResource
%FOPBeginFontDict
%%IncludeResource: font Courier-Bold
%%IncludeResource: font Helvetica
%%IncludeResource: font Courier-BoldOblique
%%IncludeResource: font Courier-Oblique
%%IncludeResource: font Times-Roman
%%IncludeResource: font Helvetica-BoldOblique
%%IncludeResource: font Helvetica-Bold
%%IncludeResource: font Helvetica-Oblique
%%IncludeResource: font Times-BoldItalic
%%IncludeResource: font Courier
%%IncludeResource: font Times-Italic
%%IncludeResource: font Times-Bold
%%IncludeResource: font Symbol
%%IncludeResource: font ZapfDingbats
%FOPEndFontDict
%%BeginResource: encoding WinAnsiEncoding
/WinAnsiEncoding [
/.notdef /.notdef /.notdef /.notdef /.notdef
/.notdef /.notdef /.notdef /.notdef /.notdef
/.notdef /.notdef /.notdef /.notdef /.notdef
/.notdef /.notdef /.notdef /.notdef /.notdef
/.notdef /.notdef /.notdef /.notdef /.notdef
/.notdef /.notdef /.notdef /.notdef /.notdef
/.notdef /.notdef /space /exclam /quotedbl
/numbersign /dollar /percent /ampersand /quotesingle
/parenleft /parenright /asterisk /plus /comma
/hyphen /period /slash /zero /one
/two /three /four /five /six
/seven /eight /nine /colon /semicolon
/less /equal /greater /question /at
/A /B /C /D /E
/F /G /H /I /J
/K /L /M /N /O
/P /Q /R /S /T
/U /V /W /X /Y
/Z /bracketleft /backslash /bracketright /asciicircum
/underscore /quoteleft /a /b /c
/d /e /f /g /h
/i /j /k /l /m
/n /o /p /q /r
/s /t /u /v /w
/x /y /z /braceleft /bar
/braceright /asciitilde /bullet /Euro /bullet
/quotesinglbase /florin /quotedblbase /ellipsis /dagger
/daggerdbl /circumflex /perthousand /Scaron /guilsinglleft
/OE /bullet /Zcaron /bullet /bullet
/quoteleft /quoteright /quotedblleft /quotedblright /bullet
/endash /emdash /asciitilde /trademark /scaron
/guilsinglright /oe /bullet /zcaron /Ydieresis
/space /exclamdown /cent /sterling /currency
/yen /brokenbar /section /dieresis /copyright
/ordfeminine /guillemotleft /logicalnot /sfthyphen /registered
/macron /degree /plusminus /twosuperior /threesuperior
/acute /mu /paragraph /middot /cedilla
/onesuperior /ordmasculine /guillemotright /onequarter /onehalf
/threequarters /questiondown /Agrave /Aacute /Acircumflex
/Atilde /Adieresis /Aring /AE /Ccedilla
/Egrave /Eacute /Ecircumflex /Edieresis /Igrave
/Iacute /Icircumflex /Idieresis /Eth /Ntilde
/Ograve /Oacute /Ocircumflex /Otilde /Odieresis
/multiply /Oslash /Ugrave /Uacute /Ucircumflex
/Udieresis /Yacute /Thorn /germandbls /agrave
/aacute /acircumflex /atilde /adieresis /aring
/ae /ccedilla /egrave /eacute /ecircumflex
/edieresis /igrave /iacute /icircumflex /idieresis
/eth /ntilde /ograve /oacute /ocircumflex
/otilde /odieresis /divide /oslash /ugrave
/uacute /ucircumflex /udieresis /yacute /thorn
/ydieresis
] def
%%EndResource
%FOPBeginFontReencode
/Courier-Bold findfont
dup length dict begin
  {1 index /FID ne {def} {pop pop} ifelse} forall
  /Encoding WinAnsiEncoding def
  currentdict
end
/Courier-Bold exch definefont pop
/Helvetica findfont
dup length dict begin
  {1 index /FID ne {def} {pop pop} ifelse} forall
  /Encoding WinAnsiEncoding def
  currentdict
end
/Helvetica exch definefont pop
/Courier-BoldOblique findfont
dup length dict begin
  {1 index /FID ne {def} {pop pop} ifelse} forall
  /Encoding WinAnsiEncoding def
  currentdict
end
/Courier-BoldOblique exch definefont pop
/Courier-Oblique findfont
dup length dict begin
  {1 index /FID ne {def} {pop pop} ifelse} forall
  /Encoding WinAnsiEncoding def
  currentdict
end
/Courier-Oblique exch definefont pop
/Times-Roman findfont
dup length dict begin
  {1 index /FID ne {def} {pop pop} ifelse} forall
  /Encoding WinAnsiEncoding def
  currentdict
end
/Times-Roman exch definefont pop
/Helvetica-BoldOblique findfont
dup length dict begin
  {1 index /FID ne {def} {pop pop} ifelse} forall
  /Encoding WinAnsiEncoding def
  currentdict
end
/Helvetica-BoldOblique exch definefont pop
/Helvetica-Bold findfont
dup length dict begin
  {1 index /FID ne {def} {pop pop} ifelse} forall
  /Encoding WinAnsiEncoding def
  currentdict
end
/Helvetica-Bold exch definefont pop
/Helvetica-Oblique findfont
dup length dict begin
  {1 index /FID ne {def} {pop pop} ifelse} forall
  /Encoding WinAnsiEncoding def
  currentdict
end
/Helvetica-Oblique exch definefont pop
/Times-BoldItalic findfont
dup length dict begin
  {1 index /FID ne {def} {pop pop} ifelse} forall
  /Encoding WinAnsiEncoding def
  currentdict
end
/Times-BoldItalic exch definefont pop
/Courier findfont
dup length dict begin
  {1 index /FID ne {def} {pop pop} ifelse} forall
  /Encoding WinAnsiEncoding def
  currentdict
end
/Courier exch definefont pop
/Times-Italic findfont
dup length dict begin
  {1 index /FID ne {def} {pop pop} ifelse} forall
  /Encoding WinAnsiEncoding def
  currentdict
end
/Times-Italic exch definefont pop
/Times-Bold findfont
dup length dict begin
  {1 index /FID ne {def} {pop pop} ifelse} forall
  /Encoding WinAnsiEncoding def
  currentdict
end
/Times-Bold exch definefont pop
%FOPEndFontReencode
%%EndProlog
%%Page: 1 1
%%PageBoundingBox: 0 0 420 315
%%BeginPageSetup
[1 0 0 -1 0 315] CT
%%EndPageSetup
GS
[0.75 0 0 0.75 0 0] CT
1 GC
N
0 0 560 420 re
f
GR
GS
[0.75 0 0 0.75 0 0] CT
1 GC
N
0 0 560 420 re
f
GR
GS
[0.75 0 0 0.75 0 0] CT
1 GC
N
73 374 M
507 374 L
507 31 L
73 31 L
cp
f
GR
GS
[0.75 0 0 0.75 0 0] CT
0.149 GC
2 setlinecap
1 LJ
0.667 LW
N
73 374 M
507 374 L
S
GR
GS
[0.75 0 0 0.75 0 0] CT
0.149 GC
2 setlinecap
1 LJ
0.667 LW
N
73 31 M
507 31 L
S
GR
GS
[0.75 0 0 0.75 0 0] CT
0.149 GC
2 setlinecap
1 LJ
0.667 LW
N
73 374 M
73 369.66 L
S
GR
GS
[0.75 0 0 0.75 0 0] CT
0.149 GC
2 setlinecap
1 LJ
0.667 LW
N
116.4 374 M
116.4 369.66 L
S
GR
GS
[0.75 0 0 0.75 0 0] CT
0.149 GC
2 setlinecap
1 LJ
0.667 LW
N
159.8 374 M
159.8 369.66 L
S
GR
GS
[0.75 0 0 0.75 0 0] CT
0.149 GC
2 setlinecap
1 LJ
0.667 LW
N
203.2 374 M
203.2 369.66 L
S
GR
GS
[0.75 0 0 0.75 0 0] CT
0.149 GC
2 setlinecap
1 LJ
0.667 LW
N
246.6 374 M
246.6 369.66 L
S
GR
GS
[0.75 0 0 0.75 0 0] CT
0.149 GC
2 setlinecap
1 LJ
0.667 LW
N
290 374 M
290 369.66 L
S
GR
GS
[0.75 0 0 0.75 0 0] CT
0.149 GC
2 setlinecap
1 LJ
0.667 LW
N
333.4 374 M
333.4 369.66 L
S
GR
GS
[0.75 0 0 0.75 0 0] CT
0.149 GC
2 setlinecap
1 LJ
0.667 LW
N
376.8 374 M
376.8 369.66 L
S
GR
GS
[0.75 0 0 0.75 0 0] CT
0.149 GC
2 setlinecap
1 LJ
0.667 LW
N
420.2 374 M
420.2 369.66 L
S
GR
GS
[0.75 0 0 0.75 0 0] CT
0.149 GC
2 setlinecap
1 LJ
0.667 LW
N
463.6 374 M
463.6 369.66 L
S
GR
GS
[0.75 0 0 0.75 0 0] CT
0.149 GC
2 setlinecap
1 LJ
0.667 LW
N
507 374 M
507 369.66 L
S
GR
GS
[0.75 0 0 0.75 0 0] CT
0.149 GC
2 setlinecap
1 LJ
0.667 LW
N
73 31 M
73 35.34 L
S
GR
GS
[0.75 0 0 0.75 0 0] CT
0.149 GC
2 setlinecap
1 LJ
0.667 LW
N
116.4 31 M
116.4 35.34 L
S
GR
GS
[0.75 0 0 0.75 0 0] CT
0.149 GC
2 setlinecap
1 LJ
0.667 LW
N
159.8 31 M
159.8 35.34 L
S
GR
GS
[0.75 0 0 0.75 0 0] CT
0.149 GC
2 setlinecap
1 LJ
0.667 LW
N
203.2 31 M
203.2 35.34 L
S
GR
GS
[0.75 0 0 0.75 0 0] CT
0.149 GC
2 setlinecap
1 LJ
0.667 LW
N
246.6 31 M
246.6 35.34 L
S
GR
GS
[0.75 0 0 0.75 0 0] CT
0.149 GC
2 setlinecap
1 LJ
0.667 LW
N
290 31 M
290 35.34 L
S
GR
GS
[0.75 0 0 0.75 0 0] CT
0.149 GC
2 setlinecap
1 LJ
0.667 LW
N
333.4 31 M
333.4 35.34 L
S
GR
GS
[0.75 0 0 0.75 0 0] CT
0.149 GC
2 setlinecap
1 LJ
0.667 LW
N
376.8 31 M
376.8 35.34 L
S
GR
GS
[0.75 0 0 0.75 0 0] CT
0.149 GC
2 setlinecap
1 LJ
0.667 LW
N
420.2 31 M
420.2 35.34 L
S
GR
GS
[0.75 0 0 0.75 0 0] CT
0.149 GC
2 setlinecap
1 LJ
0.667 LW
N
463.6 31 M
463.6 35.34 L
S
GR
GS
[0.75 0 0 0.75 0 0] CT
0.149 GC
2 setlinecap
1 LJ
0.667 LW
N
507 31 M
507 35.34 L
S
GR
GS
[0.75 0 0 0.75 54.75 284.50001] CT
0.149 GC
/Helvetica 13.333 F
GS
[1 0 0 1 0 0] CT
-4 14 moveto 
1 -1 scale
(0) t 
GR
GR
GS
[0.75 0 0 0.75 87.3 284.50001] CT
0.149 GC
/Helvetica 13.333 F
GS
[1 0 0 1 0 0] CT
-7.5 14 moveto 
1 -1 scale
(50) t 
GR
GR
GS
[0.75 0 0 0.75 119.85 284.50001] CT
0.149 GC
/Helvetica 13.333 F
GS
[1 0 0 1 0 0] CT
-11 14 moveto 
1 -1 scale
(100) t 
GR
GR
GS
[0.75 0 0 0.75 152.4 284.50001] CT
0.149 GC
/Helvetica 13.333 F
GS
[1 0 0 1 0 0] CT
-11 14 moveto 
1 -1 scale
(150) t 
GR
GR
GS
[0.75 0 0 0.75 184.95 284.50001] CT
0.149 GC
/Helvetica 13.333 F
GS
[1 0 0 1 0 0] CT
-11 14 moveto 
1 -1 scale
(200) t 
GR
GR
GS
[0.75 0 0 0.75 217.5 284.50001] CT
0.149 GC
/Helvetica 13.333 F
GS
[1 0 0 1 0 0] CT
-11 14 moveto 
1 -1 scale
(250) t 
GR
GR
GS
[0.75 0 0 0.75 250.05 284.50001] CT
0.149 GC
/Helvetica 13.333 F
GS
[1 0 0 1 0 0] CT
-11 14 moveto 
1 -1 scale
(300) t 
GR
GR
GS
[0.75 0 0 0.75 282.59999 284.50001] CT
0.149 GC
/Helvetica 13.333 F
GS
[1 0 0 1 0 0] CT
-11 14 moveto 
1 -1 scale
(350) t 
GR
GR
GS
[0.75 0 0 0.75 315.15001 284.50001] CT
0.149 GC
/Helvetica 13.333 F
GS
[1 0 0 1 0 0] CT
-11 14 moveto 
1 -1 scale
(400) t 
GR
GR
GS
[0.75 0 0 0.75 347.7 284.50001] CT
0.149 GC
/Helvetica 13.333 F
GS
[1 0 0 1 0 0] CT
-11 14 moveto 
1 -1 scale
(450) t 
GR
GR
GS
[0.75 0 0 0.75 380.25 284.50001] CT
0.149 GC
/Helvetica 13.333 F
GS
[1 0 0 1 0 0] CT
-11 14 moveto 
1 -1 scale
(500) t 
GR
GR
GS
[0.75 0 0 0.75 217.50016 298.24999] CT
0.149 GC
/Helvetica 14.667 F
GS
[1 0 0 1 0 0] CT
-14.5 16 moveto 
1 -1 scale
(krok) t 
GR
GR
GS
[0.75 0 0 0.75 0 0] CT
0.149 GC
2 setlinecap
1 LJ
0.667 LW
N
73 374 M
73 31 L
S
GR
GS
[0.75 0 0 0.75 0 0] CT
0.149 GC
2 setlinecap
1 LJ
0.667 LW
N
507 374 M
507 31 L
S
GR
GS
[0.75 0 0 0.75 0 0] CT
0.149 GC
2 setlinecap
1 LJ
0.667 LW
N
73 374 M
77.34 374 L
S
GR
GS
[0.75 0 0 0.75 0 0] CT
0.149 GC
2 setlinecap
1 LJ
0.667 LW
N
73 316.833 M
77.34 316.833 L
S
GR
GS
[0.75 0 0 0.75 0 0] CT
0.149 GC
2 setlinecap
1 LJ
0.667 LW
N
73 259.667 M
77.34 259.667 L
S
GR
GS
[0.75 0 0 0.75 0 0] CT
0.149 GC
2 setlinecap
1 LJ
0.667 LW
N
73 202.5 M
77.34 202.5 L
S
GR
GS
[0.75 0 0 0.75 0 0] CT
0.149 GC
2 setlinecap
1 LJ
0.667 LW
N
73 145.333 M
77.34 145.333 L
S
GR
GS
[0.75 0 0 0.75 0 0] CT
0.149 GC
2 setlinecap
1 LJ
0.667 LW
N
73 88.167 M
77.34 88.167 L
S
GR
GS
[0.75 0 0 0.75 0 0] CT
0.149 GC
2 setlinecap
1 LJ
0.667 LW
N
73 31 M
77.34 31 L
S
GR
GS
[0.75 0 0 0.75 0 0] CT
0.149 GC
2 setlinecap
1 LJ
0.667 LW
N
507 374 M
502.66 374 L
S
GR
GS
[0.75 0 0 0.75 0 0] CT
0.149 GC
2 setlinecap
1 LJ
0.667 LW
N
507 316.833 M
502.66 316.833 L
S
GR
GS
[0.75 0 0 0.75 0 0] CT
0.149 GC
2 setlinecap
1 LJ
0.667 LW
N
507 259.667 M
502.66 259.667 L
S
GR
GS
[0.75 0 0 0.75 0 0] CT
0.149 GC
2 setlinecap
1 LJ
0.667 LW
N
507 202.5 M
502.66 202.5 L
S
GR
GS
[0.75 0 0 0.75 0 0] CT
0.149 GC
2 setlinecap
1 LJ
0.667 LW
N
507 145.333 M
502.66 145.333 L
S
GR
GS
[0.75 0 0 0.75 0 0] CT
0.149 GC
2 setlinecap
1 LJ
0.667 LW
N
507 88.167 M
502.66 88.167 L
S
GR
GS
[0.75 0 0 0.75 0 0] CT
0.149 GC
2 setlinecap
1 LJ
0.667 LW
N
507 31 M
502.66 31 L
S
GR
GS
[0.75 0 0 0.75 50.75 280.5] CT
0.149 GC
/Helvetica 13.333 F
GS
[1 0 0 1 0 0] CT
-8 5.5 moveto 
1 -1 scale
(0) t 
GR
GR
GS
[0.75 0 0 0.75 50.75 237.62501] CT
0.149 GC
/Helvetica 13.333 F
GS
[1 0 0 1 0 0] CT
-26 5.5 moveto 
1 -1 scale
(0.05) t 
GR
GR
GS
[0.75 0 0 0.75 50.75 194.74999] CT
0.149 GC
/Helvetica 13.333 F
GS
[1 0 0 1 0 0] CT
-19 5.5 moveto 
1 -1 scale
(0.1) t 
GR
GR
GS
[0.75 0 0 0.75 50.75 151.875] CT
0.149 GC
/Helvetica 13.333 F
GS
[1 0 0 1 0 0] CT
-26 5.5 moveto 
1 -1 scale
(0.15) t 
GR
GR
GS
[0.75 0 0 0.75 50.75 109] CT
0.149 GC
/Helvetica 13.333 F
GS
[1 0 0 1 0 0] CT
-19 5.5 moveto 
1 -1 scale
(0.2) t 
GR
GR
GS
[0.75 0 0 0.75 50.75 66.125] CT
0.149 GC
/Helvetica 13.333 F
GS
[1 0 0 1 0 0] CT
-26 5.5 moveto 
1 -1 scale
(0.25) t 
GR
GR
GS
[0.75 0 0 0.75 50.75 23.24999] CT
0.149 GC
/Helvetica 13.333 F
GS
[1 0 0 1 0 0] CT
-19 5.5 moveto 
1 -1 scale
(0.3) t 
GR
GR
GS
[0 -0.75 0.75 0 28.25 151.87486] CT
0.149 GC
/Helvetica 14.667 F
GS
[1 0 0 1 0 0] CT
-47 -4 moveto 
1 -1 scale
(velikost chyby) t 
GR
GR
GS
[0.75 0 0 0.75 217.50021 21.18748] CT
/Helvetica-Bold 14.667 F
GS
[1 0 0 1 0 0] CT
-85.5 -4 moveto 
1 -1 scale
(Euklidovska chyba UKF) t 
GR
GR
GS
[0.75 0 0 0.75 0 0] CT
0 0 1 RC
1 LJ
0.667 LW
N
73.868 303.646 M
74.736 283.717 L
75.604 297.069 L
76.472 330.753 L
77.34 352.128 L
78.208 324.045 L
79.076 339.947 L
79.944 350.181 L
80.812 346.738 L
81.68 355.816 L
82.548 367.149 L
83.416 366.314 L
84.284 361.329 L
85.152 358.602 L
86.02 370.089 L
86.888 370.582 L
87.756 363.504 L
88.624 360.357 L
89.492 347.343 L
90.36 353.491 L
91.228 361.695 L
92.096 363.019 L
92.964 355.106 L
93.832 340.672 L
94.7 327.489 L
95.568 352.597 L
96.436 357.654 L
97.304 350.079 L
98.172 346.519 L
99.04 353.793 L
99.908 362.945 L
100.776 368.816 L
101.644 354.225 L
102.512 347.357 L
103.38 355.143 L
104.248 363.99 L
105.116 365.727 L
105.984 366.261 L
106.852 358.884 L
107.72 357.039 L
108.588 362.145 L
109.456 359.248 L
110.324 352.739 L
111.192 360.092 L
112.06 368.738 L
112.928 365.596 L
113.796 362.289 L
114.664 371.511 L
115.532 361.499 L
116.4 356.389 L
117.268 363.756 L
118.136 269.738 L
119.004 253.108 L
119.872 275.142 L
120.74 329.211 L
121.608 366.953 L
122.476 340.368 L
123.344 314.674 L
124.212 311.222 L
125.08 314.129 L
125.948 317.012 L
126.816 317.703 L
127.684 327.549 L
128.552 338.016 L
129.42 344.916 L
130.288 350.261 L
131.156 362.503 L
132.024 365.933 L
132.892 355.889 L
133.76 351.669 L
134.628 356.418 L
135.496 355.662 L
136.364 368.932 L
137.232 362.577 L
138.1 359.529 L
138.968 364.695 L
139.836 356.684 L
140.704 356.193 L
141.572 366.802 L
142.44 369.127 L
143.308 365.981 L
144.176 373.056 L
145.044 360.69 L
145.912 366.958 L
146.78 354.271 L
147.648 362.444 L
148.516 348.87 L
149.384 360.417 L
150.252 361.878 L
151.12 367.912 L
151.988 364.192 L
152.856 371.114 L
153.724 362.656 L
154.592 347.714 L
155.46 343.776 L
156.328 350.157 L
157.196 356.708 L
158.064 361.033 L
158.932 361.326 L
159.8 359.885 L
160.668 352.598 L
161.536 352.529 L
162.404 355.161 L
163.272 357.799 L
164.14 361.531 L
165.008 364.937 L
165.876 358.89 L
166.744 365.944 L
167.612 365.081 L
168.48 372.324 L
169.348 369.162 L
170.216 371.439 L
171.084 361.921 L
171.952 361.123 L
172.82 372.523 L
173.688 358.137 L
174.556 363.944 L
175.424 358.821 L
176.292 366.51 L
177.16 360.263 L
178.028 361.095 L
178.896 362.554 L
179.764 365.512 L
180.632 352.644 L
181.5 348.909 L
182.368 361.932 L
183.236 369.641 L
184.104 368.397 L
184.972 367.174 L
185.84 359.405 L
186.708 345.828 L
187.576 353.476 L
188.444 369.087 L
189.312 367.147 L
190.18 362.723 L
191.048 364.198 L
191.916 361.346 L
192.784 358.8 L
193.652 365.145 L
194.52 357.321 L
195.388 343.475 L
196.256 343.861 L
197.124 353.225 L
197.992 351.408 L
198.86 358.637 L
199.728 362.04 L
200.596 364.745 L
201.464 368.894 L
202.332 370.963 L
203.2 362.092 L
204.068 360.741 L
204.936 362.393 L
205.804 368.705 L
206.672 365.453 L
207.54 371.214 L
208.408 361.906 L
209.276 365.621 L
210.144 368.995 L
211.012 360.533 L
211.88 369.277 L
212.748 369.136 L
213.616 365.031 L
214.484 366.545 L
215.352 368.747 L
216.22 360.528 L
217.088 362.236 L
217.956 360.112 L
218.824 371.5 L
219.692 348.813 L
220.56 358.409 L
221.428 357.466 L
222.296 359.244 L
223.164 359.349 L
224.032 366.575 L
224.9 370.14 L
225.768 364.801 L
226.636 261.038 L
227.504 224.326 L
228.372 252.284 L
229.24 288.893 L
230.108 332.355 L
230.976 364.523 L
231.844 318.234 L
232.712 283.734 L
233.58 287.309 L
234.448 301.288 L
235.316 288.549 L
236.184 294.169 L
237.052 298.706 L
237.92 304.263 L
238.788 328.842 L
239.656 365.768 L
240.524 368.852 L
241.392 361.906 L
242.26 371.455 L
243.128 355.126 L
243.996 366.776 L
244.864 362.483 L
245.732 362.991 L
246.6 357.847 L
247.468 350.282 L
248.336 354.409 L
249.204 369.331 L
250.072 367.701 L
250.94 369.665 L
251.808 365.925 L
252.676 362.132 L
253.544 356.585 L
254.412 352.908 L
255.28 358.404 L
256.148 356.178 L
257.016 368.422 L
257.884 369.341 L
258.752 367.918 L
259.62 357.997 L
260.488 370.441 L
261.356 366.64 L
262.224 366.744 L
263.092 366.084 L
263.96 370.546 L
264.828 368.475 L
265.696 365.988 L
266.564 356.375 L
267.432 358.514 L
268.3 365.398 L
269.168 371.4 L
270.036 358.885 L
270.904 364.211 L
271.772 357.79 L
272.64 359.731 L
273.508 359.228 L
274.376 368.405 L
275.244 371.124 L
276.112 354.856 L
276.98 365.9 L
277.848 361.946 L
278.716 366.485 L
279.584 355.238 L
280.452 372.498 L
281.32 367.529 L
282.188 367.521 L
283.056 364.851 L
283.924 363.615 L
284.792 358.31 L
285.66 358.801 L
286.528 360.037 L
287.396 362.341 L
288.264 354.844 L
289.132 369.302 L
290 366.021 L
290.868 370.927 L
291.736 356.423 L
292.604 358.743 L
293.472 361.151 L
294.34 367.258 L
295.208 367.66 L
296.076 358.591 L
296.944 356.171 L
297.812 368.324 L
298.68 357.299 L
299.548 344.25 L
300.416 363.204 L
301.284 365.026 L
302.152 358.561 L
303.02 361.366 L
303.888 364.99 L
304.756 349.894 L
305.624 354.214 L
306.492 365.943 L
307.36 372.267 L
308.228 348.037 L
309.096 350.907 L
309.964 354.256 L
310.832 365.06 L
311.7 359.875 L
312.568 344.972 L
313.436 346.267 L
314.304 357.242 L
315.172 371.923 L
316.04 372.132 L
316.908 363.896 L
317.776 357.724 L
318.644 355.598 L
319.512 353.574 L
320.38 368.751 L
321.248 364.939 L
322.116 363.732 L
322.984 363.498 L
323.852 357.269 L
324.72 355.807 L
325.588 364.303 L
326.456 369.149 L
327.324 361.078 L
328.192 353.774 L
329.06 346.361 L
329.928 349.474 L
330.796 367.576 L
331.664 354.504 L
332.532 364.936 L
333.4 360.453 L
334.268 363.204 L
335.136 362.391 L
336.004 361.289 L
336.872 360.532 L
337.74 357.225 L
338.608 361.223 L
339.476 368.128 L
340.344 363.818 L
341.212 360.614 L
342.08 368.634 L
342.948 369.618 L
343.816 365.243 L
344.684 358.27 L
345.552 362.283 L
346.42 355.11 L
347.288 370.785 L
348.156 358.02 L
349.024 365.881 L
349.892 368.596 L
350.76 365.049 L
351.628 359.267 L
352.496 357.571 L
353.364 355.316 L
354.232 355.971 L
355.1 369.191 L
355.968 364.892 L
356.836 362.693 L
357.704 359.739 L
358.572 369.273 L
359.44 366.473 L
360.308 357.574 L
361.176 363.862 L
362.044 370.385 L
362.912 360.455 L
363.78 371.056 L
364.648 359.671 L
365.516 366.458 L
366.384 364.069 L
367.252 360.472 L
368.12 370.274 L
368.988 368.866 L
369.856 345.05 L
370.724 366.485 L
371.592 371.477 L
372.46 369.748 L
373.328 357.292 L
374.196 343.742 L
375.064 338.723 L
375.932 352.938 L
376.8 348.306 L
377.668 358.14 L
378.536 360.662 L
379.404 365.035 L
380.272 360.725 L
381.14 355.452 L
382.008 362.743 L
382.876 363.991 L
383.744 364.893 L
384.612 363.267 L
385.48 358.954 L
386.348 361.347 L
387.216 367.423 L
388.084 368.883 L
388.952 359.923 L
389.82 368.85 L
390.688 367.19 L
391.556 371.039 L
392.424 368.011 L
393.292 370.783 L
394.16 361.132 L
395.028 368.101 L
395.896 365.754 L
396.764 363.473 L
397.632 367.847 L
398.5 366.441 L
399.368 358.746 L
400.236 125.225 L
401.104 62.148 L
401.972 98.98 L
402.84 195.407 L
403.708 287.434 L
404.576 299.59 L
405.444 247.271 L
406.312 201.774 L
407.18 195.577 L
408.048 213.178 L
408.916 233.478 L
409.784 259.549 L
410.652 269.353 L
411.52 300.388 L
412.388 335.147 L
413.256 344.414 L
414.124 369.665 L
414.992 360.769 L
415.86 363.539 L
416.728 356.692 L
417.596 348.825 L
418.464 357.619 L
419.332 356.848 L
420.2 368.485 L
421.068 362.204 L
421.936 362.243 L
422.804 345.268 L
423.672 355.391 L
424.54 357.747 L
425.408 361.621 L
426.276 183.59 L
427.144 146.521 L
428.012 159.505 L
428.88 223.679 L
429.748 290.303 L
430.616 319.615 L
431.484 288.936 L
432.352 266.385 L
433.22 242.192 L
434.088 232.645 L
434.956 251.453 L
435.824 271.085 L
436.692 304.326 L
437.56 313.455 L
438.428 326.682 L
439.296 324.497 L
440.164 350.412 L
441.032 353.158 L
441.9 341.427 L
442.768 360.154 L
443.636 362.529 L
444.504 362.618 L
445.372 341.333 L
446.24 332.361 L
447.108 323.029 L
447.976 333.766 L
448.844 367.386 L
449.712 351.211 L
450.58 350.097 L
451.448 356.202 L
452.316 359.399 L
453.184 349.425 L
454.052 346.878 L
454.92 350.064 L
455.788 360.221 L
456.656 364.681 L
457.524 351.814 L
458.392 363.841 L
459.26 364.927 L
460.128 365.218 L
460.996 363.294 L
461.864 369.431 L
462.732 355.254 L
463.6 356.409 L
464.468 362.301 L
465.336 362.232 L
466.204 355.937 L
467.072 359.921 L
467.94 359.834 L
S
GR
GS
[0.75 0 0 0.75 0 0] CT
1 GC
N
436 64 M
436 44 L
494 44 L
494 64 L
cp
f
GR
GS
[0.75 0 0 0.75 354.75 40.5] CT
/Helvetica 12 F
GS
[1 0 0 1 0 0] CT
0 5 moveto 
1 -1 scale
(ukf) t 
GR
GR
GS
[0.75 0 0 0.75 0 0] CT
0 0 1 RC
1 LJ
0.667 LW
N
440 54 M
470 54 L
S
GR
GS
[0.75 0 0 0.75 0 0] CT
0.149 GC
10.0 ML
0.667 LW
N
436 64 M
436 44 L
494 44 L
494 64 L
cp
S
GR
%%Trailer
%%Pages: 1
%%EOF
