%!PS-Adobe-3.0 EPSF-3.0
%%Creator: (MATLAB, The Mathworks, Inc. Version 9.0.0.341360 \(R2016a\). Operating System: Windows 8)
%%Title: C:/Users/Jan/Documents/JC.ISF/isf3/graf8.eps
%%CreationDate: 2017-06-11T16:01:32
%%Pages: (atend)
%%BoundingBox: 0 0 420 315
%%LanguageLevel: 3
%%EndComments
%%BeginProlog
%%BeginResource: procset (Apache XML Graphics Std ProcSet) 1.2 0
%%Version: 1.2 0
%%Copyright: (Copyright 2001-2003,2010 The Apache Software Foundation. License terms: http://www.apache.org/licenses/LICENSE-2.0)
/bd{bind def}bind def
/ld{load def}bd
/GR/grestore ld
/M/moveto ld
/LJ/setlinejoin ld
/C/curveto ld
/f/fill ld
/LW/setlinewidth ld
/GC/setgray ld
/t/show ld
/N/newpath ld
/CT/concat ld
/cp/closepath ld
/S/stroke ld
/L/lineto ld
/CC/setcmykcolor ld
/A/ashow ld
/GS/gsave ld
/RC/setrgbcolor ld
/RM/rmoveto ld
/ML/setmiterlimit ld
/re {4 2 roll M
1 index 0 rlineto
0 exch rlineto
neg 0 rlineto
cp } bd
/_ctm matrix def
/_tm matrix def
/BT { _ctm currentmatrix pop matrix _tm copy pop 0 0 moveto } bd
/ET { _ctm setmatrix } bd
/iTm { _ctm setmatrix _tm concat } bd
/Tm { _tm astore pop iTm 0 0 moveto } bd
/ux 0.0 def
/uy 0.0 def
/F {
  /Tp exch def
  /Tf exch def
  Tf findfont Tp scalefont setfont
  /cf Tf def  /cs Tp def
} bd
/ULS {currentpoint /uy exch def /ux exch def} bd
/ULE {
  /Tcx currentpoint pop def
  gsave
  newpath
  cf findfont cs scalefont dup
  /FontMatrix get 0 get /Ts exch def /FontInfo get dup
  /UnderlinePosition get Ts mul /To exch def
  /UnderlineThickness get Ts mul /Tt exch def
  ux uy To add moveto  Tcx uy To add lineto
  Tt setlinewidth stroke
  grestore
} bd
/OLE {
  /Tcx currentpoint pop def
  gsave
  newpath
  cf findfont cs scalefont dup
  /FontMatrix get 0 get /Ts exch def /FontInfo get dup
  /UnderlinePosition get Ts mul /To exch def
  /UnderlineThickness get Ts mul /Tt exch def
  ux uy To add cs add moveto Tcx uy To add cs add lineto
  Tt setlinewidth stroke
  grestore
} bd
/SOE {
  /Tcx currentpoint pop def
  gsave
  newpath
  cf findfont cs scalefont dup
  /FontMatrix get 0 get /Ts exch def /FontInfo get dup
  /UnderlinePosition get Ts mul /To exch def
  /UnderlineThickness get Ts mul /Tt exch def
  ux uy To add cs 10 mul 26 idiv add moveto Tcx uy To add cs 10 mul 26 idiv add lineto
  Tt setlinewidth stroke
  grestore
} bd
/QT {
/Y22 exch store
/X22 exch store
/Y21 exch store
/X21 exch store
currentpoint
/Y21 load 2 mul add 3 div exch
/X21 load 2 mul add 3 div exch
/X21 load 2 mul /X22 load add 3 div
/Y21 load 2 mul /Y22 load add 3 div
/X22 load /Y22 load curveto
} bd
/SSPD {
dup length /d exch dict def
{
/v exch def
/k exch def
currentpagedevice k known {
/cpdv currentpagedevice k get def
v cpdv ne {
/upd false def
/nullv v type /nulltype eq def
/nullcpdv cpdv type /nulltype eq def
nullv nullcpdv or
{
/upd true def
} {
/sametype v type cpdv type eq def
sametype {
v type /arraytype eq {
/vlen v length def
/cpdvlen cpdv length def
vlen cpdvlen eq {
0 1 vlen 1 sub {
/i exch def
/obj v i get def
/cpdobj cpdv i get def
obj cpdobj ne {
/upd true def
exit
} if
} for
} {
/upd true def
} ifelse
} {
v type /dicttype eq {
v {
/dv exch def
/dk exch def
/cpddv cpdv dk get def
dv cpddv ne {
/upd true def
exit
} if
} forall
} {
/upd true def
} ifelse
} ifelse
} if
} ifelse
upd true eq {
d k v put
} if
} if
} if
} forall
d length 0 gt {
d setpagedevice
} if
} bd
%%EndResource
%%BeginResource: procset (Apache XML Graphics EPS ProcSet) 1.0 0
%%Version: 1.0 0
%%Copyright: (Copyright 2002-2003 The Apache Software Foundation. License terms: http://www.apache.org/licenses/LICENSE-2.0)
/BeginEPSF { %def
/b4_Inc_state save def         % Save state for cleanup
/dict_count countdictstack def % Count objects on dict stack
/op_count count 1 sub def      % Count objects on operand stack
userdict begin                 % Push userdict on dict stack
/showpage { } def              % Redefine showpage, { } = null proc
0 setgray 0 setlinecap         % Prepare graphics state
1 setlinewidth 0 setlinejoin
10 setmiterlimit [ ] 0 setdash newpath
/languagelevel where           % If level not equal to 1 then
{pop languagelevel             % set strokeadjust and
1 ne                           % overprint to their defaults.
{false setstrokeadjust false setoverprint
} if
} if
} bd
/EndEPSF { %def
count op_count sub {pop} repeat            % Clean up stacks
countdictstack dict_count sub {end} repeat
b4_Inc_state restore
} bd
%%EndResource
%FOPBeginFontDict
%%IncludeResource: font Courier-Bold
%%IncludeResource: font Helvetica
%%IncludeResource: font Courier-BoldOblique
%%IncludeResource: font Courier-Oblique
%%IncludeResource: font Times-Roman
%%IncludeResource: font Helvetica-BoldOblique
%%IncludeResource: font Helvetica-Bold
%%IncludeResource: font Helvetica-Oblique
%%IncludeResource: font Times-BoldItalic
%%IncludeResource: font Courier
%%IncludeResource: font Times-Italic
%%IncludeResource: font Times-Bold
%%IncludeResource: font Symbol
%%IncludeResource: font ZapfDingbats
%FOPEndFontDict
%%BeginResource: encoding WinAnsiEncoding
/WinAnsiEncoding [
/.notdef /.notdef /.notdef /.notdef /.notdef
/.notdef /.notdef /.notdef /.notdef /.notdef
/.notdef /.notdef /.notdef /.notdef /.notdef
/.notdef /.notdef /.notdef /.notdef /.notdef
/.notdef /.notdef /.notdef /.notdef /.notdef
/.notdef /.notdef /.notdef /.notdef /.notdef
/.notdef /.notdef /space /exclam /quotedbl
/numbersign /dollar /percent /ampersand /quotesingle
/parenleft /parenright /asterisk /plus /comma
/hyphen /period /slash /zero /one
/two /three /four /five /six
/seven /eight /nine /colon /semicolon
/less /equal /greater /question /at
/A /B /C /D /E
/F /G /H /I /J
/K /L /M /N /O
/P /Q /R /S /T
/U /V /W /X /Y
/Z /bracketleft /backslash /bracketright /asciicircum
/underscore /quoteleft /a /b /c
/d /e /f /g /h
/i /j /k /l /m
/n /o /p /q /r
/s /t /u /v /w
/x /y /z /braceleft /bar
/braceright /asciitilde /bullet /Euro /bullet
/quotesinglbase /florin /quotedblbase /ellipsis /dagger
/daggerdbl /circumflex /perthousand /Scaron /guilsinglleft
/OE /bullet /Zcaron /bullet /bullet
/quoteleft /quoteright /quotedblleft /quotedblright /bullet
/endash /emdash /asciitilde /trademark /scaron
/guilsinglright /oe /bullet /zcaron /Ydieresis
/space /exclamdown /cent /sterling /currency
/yen /brokenbar /section /dieresis /copyright
/ordfeminine /guillemotleft /logicalnot /sfthyphen /registered
/macron /degree /plusminus /twosuperior /threesuperior
/acute /mu /paragraph /middot /cedilla
/onesuperior /ordmasculine /guillemotright /onequarter /onehalf
/threequarters /questiondown /Agrave /Aacute /Acircumflex
/Atilde /Adieresis /Aring /AE /Ccedilla
/Egrave /Eacute /Ecircumflex /Edieresis /Igrave
/Iacute /Icircumflex /Idieresis /Eth /Ntilde
/Ograve /Oacute /Ocircumflex /Otilde /Odieresis
/multiply /Oslash /Ugrave /Uacute /Ucircumflex
/Udieresis /Yacute /Thorn /germandbls /agrave
/aacute /acircumflex /atilde /adieresis /aring
/ae /ccedilla /egrave /eacute /ecircumflex
/edieresis /igrave /iacute /icircumflex /idieresis
/eth /ntilde /ograve /oacute /ocircumflex
/otilde /odieresis /divide /oslash /ugrave
/uacute /ucircumflex /udieresis /yacute /thorn
/ydieresis
] def
%%EndResource
%FOPBeginFontReencode
/Courier-Bold findfont
dup length dict begin
  {1 index /FID ne {def} {pop pop} ifelse} forall
  /Encoding WinAnsiEncoding def
  currentdict
end
/Courier-Bold exch definefont pop
/Helvetica findfont
dup length dict begin
  {1 index /FID ne {def} {pop pop} ifelse} forall
  /Encoding WinAnsiEncoding def
  currentdict
end
/Helvetica exch definefont pop
/Courier-BoldOblique findfont
dup length dict begin
  {1 index /FID ne {def} {pop pop} ifelse} forall
  /Encoding WinAnsiEncoding def
  currentdict
end
/Courier-BoldOblique exch definefont pop
/Courier-Oblique findfont
dup length dict begin
  {1 index /FID ne {def} {pop pop} ifelse} forall
  /Encoding WinAnsiEncoding def
  currentdict
end
/Courier-Oblique exch definefont pop
/Times-Roman findfont
dup length dict begin
  {1 index /FID ne {def} {pop pop} ifelse} forall
  /Encoding WinAnsiEncoding def
  currentdict
end
/Times-Roman exch definefont pop
/Helvetica-BoldOblique findfont
dup length dict begin
  {1 index /FID ne {def} {pop pop} ifelse} forall
  /Encoding WinAnsiEncoding def
  currentdict
end
/Helvetica-BoldOblique exch definefont pop
/Helvetica-Bold findfont
dup length dict begin
  {1 index /FID ne {def} {pop pop} ifelse} forall
  /Encoding WinAnsiEncoding def
  currentdict
end
/Helvetica-Bold exch definefont pop
/Helvetica-Oblique findfont
dup length dict begin
  {1 index /FID ne {def} {pop pop} ifelse} forall
  /Encoding WinAnsiEncoding def
  currentdict
end
/Helvetica-Oblique exch definefont pop
/Times-BoldItalic findfont
dup length dict begin
  {1 index /FID ne {def} {pop pop} ifelse} forall
  /Encoding WinAnsiEncoding def
  currentdict
end
/Times-BoldItalic exch definefont pop
/Courier findfont
dup length dict begin
  {1 index /FID ne {def} {pop pop} ifelse} forall
  /Encoding WinAnsiEncoding def
  currentdict
end
/Courier exch definefont pop
/Times-Italic findfont
dup length dict begin
  {1 index /FID ne {def} {pop pop} ifelse} forall
  /Encoding WinAnsiEncoding def
  currentdict
end
/Times-Italic exch definefont pop
/Times-Bold findfont
dup length dict begin
  {1 index /FID ne {def} {pop pop} ifelse} forall
  /Encoding WinAnsiEncoding def
  currentdict
end
/Times-Bold exch definefont pop
%FOPEndFontReencode
%%EndProlog
%%Page: 1 1
%%PageBoundingBox: 0 0 420 315
%%BeginPageSetup
[1 0 0 -1 0 315] CT
%%EndPageSetup
GS
[0.75 0 0 0.75 0 0] CT
1 GC
N
0 0 560 420 re
f
GR
GS
[0.75 0 0 0.75 0 0] CT
1 GC
N
0 0 560 420 re
f
GR
GS
[0.75 0 0 0.75 0 0] CT
1 GC
N
73 374 M
507 374 L
507 31 L
73 31 L
cp
f
GR
GS
[0.75 0 0 0.75 0 0] CT
0.149 GC
2 setlinecap
1 LJ
0.667 LW
N
73 374 M
507 374 L
S
GR
GS
[0.75 0 0 0.75 0 0] CT
0.149 GC
2 setlinecap
1 LJ
0.667 LW
N
73 31 M
507 31 L
S
GR
GS
[0.75 0 0 0.75 0 0] CT
0.149 GC
2 setlinecap
1 LJ
0.667 LW
N
73 374 M
73 369.66 L
S
GR
GS
[0.75 0 0 0.75 0 0] CT
0.149 GC
2 setlinecap
1 LJ
0.667 LW
N
116.4 374 M
116.4 369.66 L
S
GR
GS
[0.75 0 0 0.75 0 0] CT
0.149 GC
2 setlinecap
1 LJ
0.667 LW
N
159.8 374 M
159.8 369.66 L
S
GR
GS
[0.75 0 0 0.75 0 0] CT
0.149 GC
2 setlinecap
1 LJ
0.667 LW
N
203.2 374 M
203.2 369.66 L
S
GR
GS
[0.75 0 0 0.75 0 0] CT
0.149 GC
2 setlinecap
1 LJ
0.667 LW
N
246.6 374 M
246.6 369.66 L
S
GR
GS
[0.75 0 0 0.75 0 0] CT
0.149 GC
2 setlinecap
1 LJ
0.667 LW
N
290 374 M
290 369.66 L
S
GR
GS
[0.75 0 0 0.75 0 0] CT
0.149 GC
2 setlinecap
1 LJ
0.667 LW
N
333.4 374 M
333.4 369.66 L
S
GR
GS
[0.75 0 0 0.75 0 0] CT
0.149 GC
2 setlinecap
1 LJ
0.667 LW
N
376.8 374 M
376.8 369.66 L
S
GR
GS
[0.75 0 0 0.75 0 0] CT
0.149 GC
2 setlinecap
1 LJ
0.667 LW
N
420.2 374 M
420.2 369.66 L
S
GR
GS
[0.75 0 0 0.75 0 0] CT
0.149 GC
2 setlinecap
1 LJ
0.667 LW
N
463.6 374 M
463.6 369.66 L
S
GR
GS
[0.75 0 0 0.75 0 0] CT
0.149 GC
2 setlinecap
1 LJ
0.667 LW
N
507 374 M
507 369.66 L
S
GR
GS
[0.75 0 0 0.75 0 0] CT
0.149 GC
2 setlinecap
1 LJ
0.667 LW
N
73 31 M
73 35.34 L
S
GR
GS
[0.75 0 0 0.75 0 0] CT
0.149 GC
2 setlinecap
1 LJ
0.667 LW
N
116.4 31 M
116.4 35.34 L
S
GR
GS
[0.75 0 0 0.75 0 0] CT
0.149 GC
2 setlinecap
1 LJ
0.667 LW
N
159.8 31 M
159.8 35.34 L
S
GR
GS
[0.75 0 0 0.75 0 0] CT
0.149 GC
2 setlinecap
1 LJ
0.667 LW
N
203.2 31 M
203.2 35.34 L
S
GR
GS
[0.75 0 0 0.75 0 0] CT
0.149 GC
2 setlinecap
1 LJ
0.667 LW
N
246.6 31 M
246.6 35.34 L
S
GR
GS
[0.75 0 0 0.75 0 0] CT
0.149 GC
2 setlinecap
1 LJ
0.667 LW
N
290 31 M
290 35.34 L
S
GR
GS
[0.75 0 0 0.75 0 0] CT
0.149 GC
2 setlinecap
1 LJ
0.667 LW
N
333.4 31 M
333.4 35.34 L
S
GR
GS
[0.75 0 0 0.75 0 0] CT
0.149 GC
2 setlinecap
1 LJ
0.667 LW
N
376.8 31 M
376.8 35.34 L
S
GR
GS
[0.75 0 0 0.75 0 0] CT
0.149 GC
2 setlinecap
1 LJ
0.667 LW
N
420.2 31 M
420.2 35.34 L
S
GR
GS
[0.75 0 0 0.75 0 0] CT
0.149 GC
2 setlinecap
1 LJ
0.667 LW
N
463.6 31 M
463.6 35.34 L
S
GR
GS
[0.75 0 0 0.75 0 0] CT
0.149 GC
2 setlinecap
1 LJ
0.667 LW
N
507 31 M
507 35.34 L
S
GR
GS
[0.75 0 0 0.75 54.75 284.50001] CT
0.149 GC
/Helvetica 13.333 F
GS
[1 0 0 1 0 0] CT
-4 14 moveto 
1 -1 scale
(0) t 
GR
GR
GS
[0.75 0 0 0.75 87.3 284.50001] CT
0.149 GC
/Helvetica 13.333 F
GS
[1 0 0 1 0 0] CT
-7.5 14 moveto 
1 -1 scale
(50) t 
GR
GR
GS
[0.75 0 0 0.75 119.85 284.50001] CT
0.149 GC
/Helvetica 13.333 F
GS
[1 0 0 1 0 0] CT
-11 14 moveto 
1 -1 scale
(100) t 
GR
GR
GS
[0.75 0 0 0.75 152.4 284.50001] CT
0.149 GC
/Helvetica 13.333 F
GS
[1 0 0 1 0 0] CT
-11 14 moveto 
1 -1 scale
(150) t 
GR
GR
GS
[0.75 0 0 0.75 184.95 284.50001] CT
0.149 GC
/Helvetica 13.333 F
GS
[1 0 0 1 0 0] CT
-11 14 moveto 
1 -1 scale
(200) t 
GR
GR
GS
[0.75 0 0 0.75 217.5 284.50001] CT
0.149 GC
/Helvetica 13.333 F
GS
[1 0 0 1 0 0] CT
-11 14 moveto 
1 -1 scale
(250) t 
GR
GR
GS
[0.75 0 0 0.75 250.05 284.50001] CT
0.149 GC
/Helvetica 13.333 F
GS
[1 0 0 1 0 0] CT
-11 14 moveto 
1 -1 scale
(300) t 
GR
GR
GS
[0.75 0 0 0.75 282.59999 284.50001] CT
0.149 GC
/Helvetica 13.333 F
GS
[1 0 0 1 0 0] CT
-11 14 moveto 
1 -1 scale
(350) t 
GR
GR
GS
[0.75 0 0 0.75 315.15001 284.50001] CT
0.149 GC
/Helvetica 13.333 F
GS
[1 0 0 1 0 0] CT
-11 14 moveto 
1 -1 scale
(400) t 
GR
GR
GS
[0.75 0 0 0.75 347.7 284.50001] CT
0.149 GC
/Helvetica 13.333 F
GS
[1 0 0 1 0 0] CT
-11 14 moveto 
1 -1 scale
(450) t 
GR
GR
GS
[0.75 0 0 0.75 380.25 284.50001] CT
0.149 GC
/Helvetica 13.333 F
GS
[1 0 0 1 0 0] CT
-11 14 moveto 
1 -1 scale
(500) t 
GR
GR
GS
[0.75 0 0 0.75 217.50016 298.24999] CT
0.149 GC
/Helvetica 14.667 F
GS
[1 0 0 1 0 0] CT
-14.5 16 moveto 
1 -1 scale
(krok) t 
GR
GR
GS
[0.75 0 0 0.75 0 0] CT
0.149 GC
2 setlinecap
1 LJ
0.667 LW
N
73 374 M
73 31 L
S
GR
GS
[0.75 0 0 0.75 0 0] CT
0.149 GC
2 setlinecap
1 LJ
0.667 LW
N
507 374 M
507 31 L
S
GR
GS
[0.75 0 0 0.75 0 0] CT
0.149 GC
2 setlinecap
1 LJ
0.667 LW
N
73 374 M
77.34 374 L
S
GR
GS
[0.75 0 0 0.75 0 0] CT
0.149 GC
2 setlinecap
1 LJ
0.667 LW
N
73 316.833 M
77.34 316.833 L
S
GR
GS
[0.75 0 0 0.75 0 0] CT
0.149 GC
2 setlinecap
1 LJ
0.667 LW
N
73 259.667 M
77.34 259.667 L
S
GR
GS
[0.75 0 0 0.75 0 0] CT
0.149 GC
2 setlinecap
1 LJ
0.667 LW
N
73 202.5 M
77.34 202.5 L
S
GR
GS
[0.75 0 0 0.75 0 0] CT
0.149 GC
2 setlinecap
1 LJ
0.667 LW
N
73 145.333 M
77.34 145.333 L
S
GR
GS
[0.75 0 0 0.75 0 0] CT
0.149 GC
2 setlinecap
1 LJ
0.667 LW
N
73 88.167 M
77.34 88.167 L
S
GR
GS
[0.75 0 0 0.75 0 0] CT
0.149 GC
2 setlinecap
1 LJ
0.667 LW
N
73 31 M
77.34 31 L
S
GR
GS
[0.75 0 0 0.75 0 0] CT
0.149 GC
2 setlinecap
1 LJ
0.667 LW
N
507 374 M
502.66 374 L
S
GR
GS
[0.75 0 0 0.75 0 0] CT
0.149 GC
2 setlinecap
1 LJ
0.667 LW
N
507 316.833 M
502.66 316.833 L
S
GR
GS
[0.75 0 0 0.75 0 0] CT
0.149 GC
2 setlinecap
1 LJ
0.667 LW
N
507 259.667 M
502.66 259.667 L
S
GR
GS
[0.75 0 0 0.75 0 0] CT
0.149 GC
2 setlinecap
1 LJ
0.667 LW
N
507 202.5 M
502.66 202.5 L
S
GR
GS
[0.75 0 0 0.75 0 0] CT
0.149 GC
2 setlinecap
1 LJ
0.667 LW
N
507 145.333 M
502.66 145.333 L
S
GR
GS
[0.75 0 0 0.75 0 0] CT
0.149 GC
2 setlinecap
1 LJ
0.667 LW
N
507 88.167 M
502.66 88.167 L
S
GR
GS
[0.75 0 0 0.75 0 0] CT
0.149 GC
2 setlinecap
1 LJ
0.667 LW
N
507 31 M
502.66 31 L
S
GR
GS
[0.75 0 0 0.75 50.75 280.5] CT
0.149 GC
/Helvetica 13.333 F
GS
[1 0 0 1 0 0] CT
-30 5.5 moveto 
1 -1 scale
(-0.01) t 
GR
GR
GS
[0.75 0 0 0.75 50.75 237.62501] CT
0.149 GC
/Helvetica 13.333 F
GS
[1 0 0 1 0 0] CT
-37 5.5 moveto 
1 -1 scale
(-0.005) t 
GR
GR
GS
[0.75 0 0 0.75 50.75 194.74999] CT
0.149 GC
/Helvetica 13.333 F
GS
[1 0 0 1 0 0] CT
-8 5.5 moveto 
1 -1 scale
(0) t 
GR
GR
GS
[0.75 0 0 0.75 50.75 151.875] CT
0.149 GC
/Helvetica 13.333 F
GS
[1 0 0 1 0 0] CT
-33 5.5 moveto 
1 -1 scale
(0.005) t 
GR
GR
GS
[0.75 0 0 0.75 50.75 109.00001] CT
0.149 GC
/Helvetica 13.333 F
GS
[1 0 0 1 0 0] CT
-26 5.5 moveto 
1 -1 scale
(0.01) t 
GR
GR
GS
[0.75 0 0 0.75 50.75 66.125] CT
0.149 GC
/Helvetica 13.333 F
GS
[1 0 0 1 0 0] CT
-33 5.5 moveto 
1 -1 scale
(0.015) t 
GR
GR
GS
[0.75 0 0 0.75 50.75 23.25] CT
0.149 GC
/Helvetica 13.333 F
GS
[1 0 0 1 0 0] CT
-26 5.5 moveto 
1 -1 scale
(0.02) t 
GR
GR
GS
[0 -0.75 0.75 0 20 151.87487] CT
0.149 GC
/Helvetica 14.667 F
GS
[1 0 0 1 0 0] CT
-47 -4 moveto 
1 -1 scale
(velikost chyby) t 
GR
GR
GS
[0.75 0 0 0.75 217.50021 21.1875] CT
/Helvetica-Bold 14.667 F
GS
[1 0 0 1 0 0] CT
-128.5 -4 moveto 
1 -1 scale
(Rozdil euklidovskych chyb ekf a ukf) t 
GR
GR
GS
[0.75 0 0 0.75 0 0] CT
0 1 0 RC
1 LJ
0.667 LW
N
73.868 355.679 M
74.736 67.157 L
75.604 241.772 L
76.472 286.599 L
77.34 323.884 L
78.208 335.661 L
79.076 331.047 L
79.944 316.23 L
80.812 314.586 L
81.68 296.027 L
82.548 241.683 L
83.416 269.577 L
84.284 263.239 L
85.152 272.147 L
86.02 280.902 L
86.888 244.253 L
87.756 273.036 L
88.624 277.482 L
89.492 273.778 L
90.36 268.837 L
91.228 264.799 L
92.096 260.542 L
92.964 256.325 L
93.832 258.537 L
94.7 259.904 L
95.568 260.936 L
96.436 261.98 L
97.304 262.131 L
98.172 262.107 L
99.04 261.834 L
99.908 260.609 L
100.776 260.267 L
101.644 258.843 L
102.512 259.165 L
103.38 259.459 L
104.248 259.623 L
105.116 259.503 L
105.984 259.392 L
106.852 259.302 L
107.72 259.292 L
108.588 259.421 L
109.456 259.429 L
110.324 259.846 L
111.192 259.778 L
112.06 259.771 L
112.928 259.725 L
113.796 259.66 L
114.664 259.682 L
115.532 259.61 L
116.4 259.729 L
117.268 259.709 L
118.136 259.677 L
119.004 259.685 L
119.872 259.686 L
120.74 259.697 L
121.608 259.701 L
122.476 259.645 L
123.344 259.637 L
124.212 259.635 L
125.08 259.633 L
125.948 259.632 L
126.816 259.634 L
127.684 259.635 L
128.552 259.637 L
129.42 259.644 L
130.288 259.656 L
131.156 259.661 L
132.024 259.688 L
132.892 259.699 L
133.76 259.699 L
134.628 259.693 L
135.496 259.686 L
136.364 259.694 L
137.232 259.663 L
138.1 259.654 L
138.968 259.669 L
139.836 259.645 L
140.704 259.647 L
141.572 259.634 L
142.44 259.668 L
143.308 259.675 L
144.176 259.68 L
145.044 259.696 L
145.912 259.698 L
146.78 259.692 L
147.648 259.681 L
148.516 259.689 L
149.384 259.689 L
150.252 259.698 L
151.12 259.698 L
151.988 259.66 L
152.856 259.656 L
153.724 259.671 L
154.592 259.66 L
155.46 259.673 L
156.328 259.683 L
157.196 259.685 L
158.064 259.678 L
158.932 259.67 L
159.8 259.651 L
160.668 259.665 L
161.536 259.662 L
162.404 259.661 L
163.272 259.659 L
164.14 259.674 L
165.008 259.696 L
165.876 259.692 L
166.744 259.697 L
167.612 259.642 L
168.48 259.693 L
169.348 259.654 L
170.216 259.686 L
171.084 259.671 L
171.952 259.677 L
172.82 259.679 L
173.688 259.686 L
174.556 259.682 L
175.424 259.687 L
176.292 259.695 L
177.16 259.688 L
178.028 259.687 L
178.896 259.696 L
179.764 259.686 L
180.632 259.676 L
181.5 259.683 L
182.368 259.698 L
183.236 259.69 L
184.104 259.637 L
184.972 259.638 L
185.84 259.643 L
186.708 259.639 L
187.576 259.636 L
188.444 259.663 L
189.312 259.698 L
190.18 259.695 L
191.048 259.679 L
191.916 259.685 L
192.784 259.667 L
193.652 259.654 L
194.52 259.685 L
195.388 259.693 L
196.256 259.688 L
197.124 259.682 L
197.992 259.68 L
198.86 259.678 L
199.728 259.693 L
200.596 259.698 L
201.464 259.697 L
202.332 259.656 L
203.2 259.669 L
204.068 259.681 L
204.936 259.653 L
205.804 259.657 L
206.672 259.647 L
207.54 259.635 L
208.408 259.657 L
209.276 259.657 L
210.144 259.655 L
211.012 259.671 L
211.88 259.678 L
212.748 259.636 L
213.616 259.641 L
214.484 259.64 L
215.352 259.671 L
216.22 259.696 L
217.088 259.661 L
217.956 259.673 L
218.824 259.638 L
219.692 259.661 L
220.56 259.659 L
221.428 259.651 L
222.296 259.637 L
223.164 259.649 L
224.032 259.678 L
224.9 259.694 L
225.768 259.687 L
226.636 259.666 L
227.504 259.665 L
228.372 259.665 L
229.24 259.662 L
230.108 259.66 L
230.976 259.639 L
231.844 259.67 L
232.712 259.671 L
233.58 259.67 L
234.448 259.671 L
235.316 259.671 L
236.184 259.671 L
237.052 259.669 L
237.92 259.667 L
238.788 259.666 L
239.656 259.67 L
240.524 259.646 L
241.392 259.652 L
242.26 259.692 L
243.128 259.638 L
243.996 259.65 L
244.864 259.639 L
245.732 259.676 L
246.6 259.685 L
247.468 259.681 L
248.336 259.695 L
249.204 259.639 L
250.072 259.637 L
250.94 259.636 L
251.808 259.684 L
252.676 259.697 L
253.544 259.686 L
254.412 259.675 L
255.28 259.675 L
256.148 259.651 L
257.016 259.637 L
257.884 259.657 L
258.752 259.641 L
259.62 259.642 L
260.488 259.643 L
261.356 259.648 L
262.224 259.646 L
263.092 259.643 L
263.96 259.654 L
264.828 259.66 L
265.696 259.636 L
266.564 259.685 L
267.432 259.69 L
268.3 259.696 L
269.168 259.666 L
270.036 259.695 L
270.904 259.671 L
271.772 259.659 L
272.64 259.678 L
273.508 259.678 L
274.376 259.664 L
275.244 259.64 L
276.112 259.64 L
276.98 259.647 L
277.848 259.641 L
278.716 259.668 L
279.584 259.663 L
280.452 259.669 L
281.32 259.697 L
282.188 259.692 L
283.056 259.695 L
283.924 259.694 L
284.792 259.693 L
285.66 259.684 L
286.528 259.698 L
287.396 259.696 L
288.264 259.679 L
289.132 259.687 L
290 259.636 L
290.868 259.643 L
291.736 259.667 L
292.604 259.675 L
293.472 259.653 L
294.34 259.644 L
295.208 259.662 L
296.076 259.676 L
296.944 259.683 L
297.812 259.68 L
298.68 259.672 L
299.548 259.667 L
300.416 259.649 L
301.284 259.636 L
302.152 259.638 L
303.02 259.653 L
303.888 259.662 L
304.756 259.666 L
305.624 259.667 L
306.492 259.67 L
307.36 259.674 L
308.228 259.661 L
309.096 259.647 L
309.964 259.653 L
310.832 259.654 L
311.7 259.638 L
312.568 259.658 L
313.436 259.669 L
314.304 259.677 L
315.172 259.693 L
316.04 259.67 L
316.908 259.642 L
317.776 259.654 L
318.644 259.668 L
319.512 259.651 L
320.38 259.637 L
321.248 259.637 L
322.116 259.654 L
322.984 259.663 L
323.852 259.665 L
324.72 259.648 L
325.588 259.637 L
326.456 259.687 L
327.324 259.676 L
328.192 259.668 L
329.06 259.656 L
329.928 259.661 L
330.796 259.695 L
331.664 259.665 L
332.532 259.641 L
333.4 259.65 L
334.268 259.666 L
335.136 259.657 L
336.004 259.645 L
336.872 259.642 L
337.74 259.659 L
338.608 259.654 L
339.476 259.634 L
340.344 259.641 L
341.212 259.642 L
342.08 259.637 L
342.948 259.642 L
343.816 259.647 L
344.684 259.684 L
345.552 259.694 L
346.42 259.682 L
347.288 259.648 L
348.156 259.644 L
349.024 259.649 L
349.892 259.646 L
350.76 259.646 L
351.628 259.645 L
352.496 259.638 L
353.364 259.642 L
354.232 259.651 L
355.1 259.694 L
355.968 259.7 L
356.836 259.69 L
357.704 259.684 L
358.572 259.662 L
359.44 259.697 L
360.308 259.637 L
361.176 259.642 L
362.044 259.656 L
362.912 259.671 L
363.78 259.649 L
364.648 259.7 L
365.516 259.699 L
366.384 259.68 L
367.252 259.663 L
368.12 259.672 L
368.988 259.666 L
369.856 259.669 L
370.724 259.693 L
371.592 259.7 L
372.46 259.678 L
373.328 259.672 L
374.196 259.654 L
375.064 259.652 L
375.932 259.657 L
376.8 259.663 L
377.668 259.651 L
378.536 259.636 L
379.404 259.641 L
380.272 259.634 L
381.14 259.642 L
382.008 259.634 L
382.876 259.677 L
383.744 259.657 L
384.612 259.648 L
385.48 259.666 L
386.348 259.701 L
387.216 259.67 L
388.084 259.655 L
388.952 259.642 L
389.82 259.644 L
390.688 259.632 L
391.556 259.633 L
392.424 259.674 L
393.292 259.701 L
394.16 259.702 L
395.028 259.675 L
395.896 259.689 L
396.764 259.654 L
397.632 259.631 L
398.5 259.673 L
399.368 259.671 L
400.236 259.633 L
401.104 259.634 L
401.972 259.636 L
402.84 259.64 L
403.708 259.652 L
404.576 259.696 L
405.444 259.703 L
406.312 259.701 L
407.18 259.699 L
408.048 259.698 L
408.916 259.696 L
409.784 259.694 L
410.652 259.686 L
411.52 259.685 L
412.388 259.68 L
413.256 259.675 L
414.124 259.637 L
414.992 259.635 L
415.86 259.631 L
416.728 259.631 L
417.596 259.641 L
418.464 259.632 L
419.332 259.633 L
420.2 259.633 L
421.068 259.66 L
421.936 259.701 L
422.804 259.7 L
423.672 259.694 L
424.54 259.699 L
425.408 259.697 L
426.276 259.693 L
427.144 259.691 L
428.012 259.687 L
428.88 259.681 L
429.748 259.667 L
430.616 259.639 L
431.484 259.633 L
432.352 259.636 L
433.22 259.64 L
434.088 259.643 L
434.956 259.644 L
435.824 259.647 L
436.692 259.647 L
437.56 259.659 L
438.428 259.667 L
439.296 259.682 L
440.164 259.694 L
441.032 259.682 L
441.9 259.674 L
442.768 259.673 L
443.636 259.676 L
444.504 259.65 L
445.372 259.652 L
446.24 259.674 L
447.108 259.673 L
447.976 259.679 L
448.844 259.692 L
449.712 259.679 L
450.58 259.675 L
451.448 259.677 L
452.316 259.65 L
453.184 259.638 L
454.052 259.634 L
454.92 259.64 L
455.788 259.635 L
456.656 259.637 L
457.524 259.641 L
458.392 259.643 L
459.26 259.688 L
460.128 259.697 L
460.996 259.697 L
461.864 259.678 L
462.732 259.683 L
463.6 259.698 L
464.468 259.699 L
465.336 259.68 L
466.204 259.66 L
467.072 259.634 L
467.94 259.637 L
S
GR
GS
[0.75 0 0 0.75 0 0] CT
1 GC
N
268 64 M
268 44 L
494 44 L
494 64 L
cp
f
GR
GS
[0.75 0 0 0.75 228.75 40.5] CT
/Helvetica 12 F
GS
[1 0 0 1 0 0] CT
0 5 moveto 
1 -1 scale
(rozdil euklidovskych chyb ekf a ukf) t 
GR
GR
GS
[0.75 0 0 0.75 0 0] CT
0 1 0 RC
1 LJ
0.667 LW
N
272 54 M
302 54 L
S
GR
GS
[0.75 0 0 0.75 0 0] CT
0.149 GC
10.0 ML
0.667 LW
N
268 64 M
268 44 L
494 44 L
494 64 L
cp
S
GR
%%Trailer
%%Pages: 1
%%EOF
