%!PS-Adobe-3.0 EPSF-3.0
%%Creator: (MATLAB, The Mathworks, Inc. Version 9.0.0.341360 \(R2016a\). Operating System: Windows 8)
%%Title: C:/Users/Jan/Documents/JC.ISF/isf3/graf7.eps
%%CreationDate: 2017-06-11T16:01:25
%%Pages: (atend)
%%BoundingBox: 0 0 420 315
%%LanguageLevel: 3
%%EndComments
%%BeginProlog
%%BeginResource: procset (Apache XML Graphics Std ProcSet) 1.2 0
%%Version: 1.2 0
%%Copyright: (Copyright 2001-2003,2010 The Apache Software Foundation. License terms: http://www.apache.org/licenses/LICENSE-2.0)
/bd{bind def}bind def
/ld{load def}bd
/GR/grestore ld
/M/moveto ld
/LJ/setlinejoin ld
/C/curveto ld
/f/fill ld
/LW/setlinewidth ld
/GC/setgray ld
/t/show ld
/N/newpath ld
/CT/concat ld
/cp/closepath ld
/S/stroke ld
/L/lineto ld
/CC/setcmykcolor ld
/A/ashow ld
/GS/gsave ld
/RC/setrgbcolor ld
/RM/rmoveto ld
/ML/setmiterlimit ld
/re {4 2 roll M
1 index 0 rlineto
0 exch rlineto
neg 0 rlineto
cp } bd
/_ctm matrix def
/_tm matrix def
/BT { _ctm currentmatrix pop matrix _tm copy pop 0 0 moveto } bd
/ET { _ctm setmatrix } bd
/iTm { _ctm setmatrix _tm concat } bd
/Tm { _tm astore pop iTm 0 0 moveto } bd
/ux 0.0 def
/uy 0.0 def
/F {
  /Tp exch def
  /Tf exch def
  Tf findfont Tp scalefont setfont
  /cf Tf def  /cs Tp def
} bd
/ULS {currentpoint /uy exch def /ux exch def} bd
/ULE {
  /Tcx currentpoint pop def
  gsave
  newpath
  cf findfont cs scalefont dup
  /FontMatrix get 0 get /Ts exch def /FontInfo get dup
  /UnderlinePosition get Ts mul /To exch def
  /UnderlineThickness get Ts mul /Tt exch def
  ux uy To add moveto  Tcx uy To add lineto
  Tt setlinewidth stroke
  grestore
} bd
/OLE {
  /Tcx currentpoint pop def
  gsave
  newpath
  cf findfont cs scalefont dup
  /FontMatrix get 0 get /Ts exch def /FontInfo get dup
  /UnderlinePosition get Ts mul /To exch def
  /UnderlineThickness get Ts mul /Tt exch def
  ux uy To add cs add moveto Tcx uy To add cs add lineto
  Tt setlinewidth stroke
  grestore
} bd
/SOE {
  /Tcx currentpoint pop def
  gsave
  newpath
  cf findfont cs scalefont dup
  /FontMatrix get 0 get /Ts exch def /FontInfo get dup
  /UnderlinePosition get Ts mul /To exch def
  /UnderlineThickness get Ts mul /Tt exch def
  ux uy To add cs 10 mul 26 idiv add moveto Tcx uy To add cs 10 mul 26 idiv add lineto
  Tt setlinewidth stroke
  grestore
} bd
/QT {
/Y22 exch store
/X22 exch store
/Y21 exch store
/X21 exch store
currentpoint
/Y21 load 2 mul add 3 div exch
/X21 load 2 mul add 3 div exch
/X21 load 2 mul /X22 load add 3 div
/Y21 load 2 mul /Y22 load add 3 div
/X22 load /Y22 load curveto
} bd
/SSPD {
dup length /d exch dict def
{
/v exch def
/k exch def
currentpagedevice k known {
/cpdv currentpagedevice k get def
v cpdv ne {
/upd false def
/nullv v type /nulltype eq def
/nullcpdv cpdv type /nulltype eq def
nullv nullcpdv or
{
/upd true def
} {
/sametype v type cpdv type eq def
sametype {
v type /arraytype eq {
/vlen v length def
/cpdvlen cpdv length def
vlen cpdvlen eq {
0 1 vlen 1 sub {
/i exch def
/obj v i get def
/cpdobj cpdv i get def
obj cpdobj ne {
/upd true def
exit
} if
} for
} {
/upd true def
} ifelse
} {
v type /dicttype eq {
v {
/dv exch def
/dk exch def
/cpddv cpdv dk get def
dv cpddv ne {
/upd true def
exit
} if
} forall
} {
/upd true def
} ifelse
} ifelse
} if
} ifelse
upd true eq {
d k v put
} if
} if
} if
} forall
d length 0 gt {
d setpagedevice
} if
} bd
%%EndResource
%%BeginResource: procset (Apache XML Graphics EPS ProcSet) 1.0 0
%%Version: 1.0 0
%%Copyright: (Copyright 2002-2003 The Apache Software Foundation. License terms: http://www.apache.org/licenses/LICENSE-2.0)
/BeginEPSF { %def
/b4_Inc_state save def         % Save state for cleanup
/dict_count countdictstack def % Count objects on dict stack
/op_count count 1 sub def      % Count objects on operand stack
userdict begin                 % Push userdict on dict stack
/showpage { } def              % Redefine showpage, { } = null proc
0 setgray 0 setlinecap         % Prepare graphics state
1 setlinewidth 0 setlinejoin
10 setmiterlimit [ ] 0 setdash newpath
/languagelevel where           % If level not equal to 1 then
{pop languagelevel             % set strokeadjust and
1 ne                           % overprint to their defaults.
{false setstrokeadjust false setoverprint
} if
} if
} bd
/EndEPSF { %def
count op_count sub {pop} repeat            % Clean up stacks
countdictstack dict_count sub {end} repeat
b4_Inc_state restore
} bd
%%EndResource
%FOPBeginFontDict
%%IncludeResource: font Courier-Bold
%%IncludeResource: font Helvetica
%%IncludeResource: font Courier-BoldOblique
%%IncludeResource: font Courier-Oblique
%%IncludeResource: font Times-Roman
%%IncludeResource: font Helvetica-BoldOblique
%%IncludeResource: font Helvetica-Bold
%%IncludeResource: font Helvetica-Oblique
%%IncludeResource: font Times-BoldItalic
%%IncludeResource: font Courier
%%IncludeResource: font Times-Italic
%%IncludeResource: font Times-Bold
%%IncludeResource: font Symbol
%%IncludeResource: font ZapfDingbats
%FOPEndFontDict
%%BeginResource: encoding WinAnsiEncoding
/WinAnsiEncoding [
/.notdef /.notdef /.notdef /.notdef /.notdef
/.notdef /.notdef /.notdef /.notdef /.notdef
/.notdef /.notdef /.notdef /.notdef /.notdef
/.notdef /.notdef /.notdef /.notdef /.notdef
/.notdef /.notdef /.notdef /.notdef /.notdef
/.notdef /.notdef /.notdef /.notdef /.notdef
/.notdef /.notdef /space /exclam /quotedbl
/numbersign /dollar /percent /ampersand /quotesingle
/parenleft /parenright /asterisk /plus /comma
/hyphen /period /slash /zero /one
/two /three /four /five /six
/seven /eight /nine /colon /semicolon
/less /equal /greater /question /at
/A /B /C /D /E
/F /G /H /I /J
/K /L /M /N /O
/P /Q /R /S /T
/U /V /W /X /Y
/Z /bracketleft /backslash /bracketright /asciicircum
/underscore /quoteleft /a /b /c
/d /e /f /g /h
/i /j /k /l /m
/n /o /p /q /r
/s /t /u /v /w
/x /y /z /braceleft /bar
/braceright /asciitilde /bullet /Euro /bullet
/quotesinglbase /florin /quotedblbase /ellipsis /dagger
/daggerdbl /circumflex /perthousand /Scaron /guilsinglleft
/OE /bullet /Zcaron /bullet /bullet
/quoteleft /quoteright /quotedblleft /quotedblright /bullet
/endash /emdash /asciitilde /trademark /scaron
/guilsinglright /oe /bullet /zcaron /Ydieresis
/space /exclamdown /cent /sterling /currency
/yen /brokenbar /section /dieresis /copyright
/ordfeminine /guillemotleft /logicalnot /sfthyphen /registered
/macron /degree /plusminus /twosuperior /threesuperior
/acute /mu /paragraph /middot /cedilla
/onesuperior /ordmasculine /guillemotright /onequarter /onehalf
/threequarters /questiondown /Agrave /Aacute /Acircumflex
/Atilde /Adieresis /Aring /AE /Ccedilla
/Egrave /Eacute /Ecircumflex /Edieresis /Igrave
/Iacute /Icircumflex /Idieresis /Eth /Ntilde
/Ograve /Oacute /Ocircumflex /Otilde /Odieresis
/multiply /Oslash /Ugrave /Uacute /Ucircumflex
/Udieresis /Yacute /Thorn /germandbls /agrave
/aacute /acircumflex /atilde /adieresis /aring
/ae /ccedilla /egrave /eacute /ecircumflex
/edieresis /igrave /iacute /icircumflex /idieresis
/eth /ntilde /ograve /oacute /ocircumflex
/otilde /odieresis /divide /oslash /ugrave
/uacute /ucircumflex /udieresis /yacute /thorn
/ydieresis
] def
%%EndResource
%FOPBeginFontReencode
/Courier-Bold findfont
dup length dict begin
  {1 index /FID ne {def} {pop pop} ifelse} forall
  /Encoding WinAnsiEncoding def
  currentdict
end
/Courier-Bold exch definefont pop
/Helvetica findfont
dup length dict begin
  {1 index /FID ne {def} {pop pop} ifelse} forall
  /Encoding WinAnsiEncoding def
  currentdict
end
/Helvetica exch definefont pop
/Courier-BoldOblique findfont
dup length dict begin
  {1 index /FID ne {def} {pop pop} ifelse} forall
  /Encoding WinAnsiEncoding def
  currentdict
end
/Courier-BoldOblique exch definefont pop
/Courier-Oblique findfont
dup length dict begin
  {1 index /FID ne {def} {pop pop} ifelse} forall
  /Encoding WinAnsiEncoding def
  currentdict
end
/Courier-Oblique exch definefont pop
/Times-Roman findfont
dup length dict begin
  {1 index /FID ne {def} {pop pop} ifelse} forall
  /Encoding WinAnsiEncoding def
  currentdict
end
/Times-Roman exch definefont pop
/Helvetica-BoldOblique findfont
dup length dict begin
  {1 index /FID ne {def} {pop pop} ifelse} forall
  /Encoding WinAnsiEncoding def
  currentdict
end
/Helvetica-BoldOblique exch definefont pop
/Helvetica-Bold findfont
dup length dict begin
  {1 index /FID ne {def} {pop pop} ifelse} forall
  /Encoding WinAnsiEncoding def
  currentdict
end
/Helvetica-Bold exch definefont pop
/Helvetica-Oblique findfont
dup length dict begin
  {1 index /FID ne {def} {pop pop} ifelse} forall
  /Encoding WinAnsiEncoding def
  currentdict
end
/Helvetica-Oblique exch definefont pop
/Times-BoldItalic findfont
dup length dict begin
  {1 index /FID ne {def} {pop pop} ifelse} forall
  /Encoding WinAnsiEncoding def
  currentdict
end
/Times-BoldItalic exch definefont pop
/Courier findfont
dup length dict begin
  {1 index /FID ne {def} {pop pop} ifelse} forall
  /Encoding WinAnsiEncoding def
  currentdict
end
/Courier exch definefont pop
/Times-Italic findfont
dup length dict begin
  {1 index /FID ne {def} {pop pop} ifelse} forall
  /Encoding WinAnsiEncoding def
  currentdict
end
/Times-Italic exch definefont pop
/Times-Bold findfont
dup length dict begin
  {1 index /FID ne {def} {pop pop} ifelse} forall
  /Encoding WinAnsiEncoding def
  currentdict
end
/Times-Bold exch definefont pop
%FOPEndFontReencode
%%EndProlog
%%Page: 1 1
%%PageBoundingBox: 0 0 420 315
%%BeginPageSetup
[1 0 0 -1 0 315] CT
%%EndPageSetup
GS
[0.75 0 0 0.75 0 0] CT
1 GC
N
0 0 560 420 re
f
GR
GS
[0.75 0 0 0.75 0 0] CT
1 GC
N
0 0 560 420 re
f
GR
GS
[0.75 0 0 0.75 0 0] CT
1 GC
N
73 374 M
507 374 L
507 31 L
73 31 L
cp
f
GR
GS
[0.75 0 0 0.75 0 0] CT
0.149 GC
2 setlinecap
1 LJ
0.667 LW
N
73 374 M
507 374 L
S
GR
GS
[0.75 0 0 0.75 0 0] CT
0.149 GC
2 setlinecap
1 LJ
0.667 LW
N
73 31 M
507 31 L
S
GR
GS
[0.75 0 0 0.75 0 0] CT
0.149 GC
2 setlinecap
1 LJ
0.667 LW
N
73 374 M
73 369.66 L
S
GR
GS
[0.75 0 0 0.75 0 0] CT
0.149 GC
2 setlinecap
1 LJ
0.667 LW
N
116.4 374 M
116.4 369.66 L
S
GR
GS
[0.75 0 0 0.75 0 0] CT
0.149 GC
2 setlinecap
1 LJ
0.667 LW
N
159.8 374 M
159.8 369.66 L
S
GR
GS
[0.75 0 0 0.75 0 0] CT
0.149 GC
2 setlinecap
1 LJ
0.667 LW
N
203.2 374 M
203.2 369.66 L
S
GR
GS
[0.75 0 0 0.75 0 0] CT
0.149 GC
2 setlinecap
1 LJ
0.667 LW
N
246.6 374 M
246.6 369.66 L
S
GR
GS
[0.75 0 0 0.75 0 0] CT
0.149 GC
2 setlinecap
1 LJ
0.667 LW
N
290 374 M
290 369.66 L
S
GR
GS
[0.75 0 0 0.75 0 0] CT
0.149 GC
2 setlinecap
1 LJ
0.667 LW
N
333.4 374 M
333.4 369.66 L
S
GR
GS
[0.75 0 0 0.75 0 0] CT
0.149 GC
2 setlinecap
1 LJ
0.667 LW
N
376.8 374 M
376.8 369.66 L
S
GR
GS
[0.75 0 0 0.75 0 0] CT
0.149 GC
2 setlinecap
1 LJ
0.667 LW
N
420.2 374 M
420.2 369.66 L
S
GR
GS
[0.75 0 0 0.75 0 0] CT
0.149 GC
2 setlinecap
1 LJ
0.667 LW
N
463.6 374 M
463.6 369.66 L
S
GR
GS
[0.75 0 0 0.75 0 0] CT
0.149 GC
2 setlinecap
1 LJ
0.667 LW
N
507 374 M
507 369.66 L
S
GR
GS
[0.75 0 0 0.75 0 0] CT
0.149 GC
2 setlinecap
1 LJ
0.667 LW
N
73 31 M
73 35.34 L
S
GR
GS
[0.75 0 0 0.75 0 0] CT
0.149 GC
2 setlinecap
1 LJ
0.667 LW
N
116.4 31 M
116.4 35.34 L
S
GR
GS
[0.75 0 0 0.75 0 0] CT
0.149 GC
2 setlinecap
1 LJ
0.667 LW
N
159.8 31 M
159.8 35.34 L
S
GR
GS
[0.75 0 0 0.75 0 0] CT
0.149 GC
2 setlinecap
1 LJ
0.667 LW
N
203.2 31 M
203.2 35.34 L
S
GR
GS
[0.75 0 0 0.75 0 0] CT
0.149 GC
2 setlinecap
1 LJ
0.667 LW
N
246.6 31 M
246.6 35.34 L
S
GR
GS
[0.75 0 0 0.75 0 0] CT
0.149 GC
2 setlinecap
1 LJ
0.667 LW
N
290 31 M
290 35.34 L
S
GR
GS
[0.75 0 0 0.75 0 0] CT
0.149 GC
2 setlinecap
1 LJ
0.667 LW
N
333.4 31 M
333.4 35.34 L
S
GR
GS
[0.75 0 0 0.75 0 0] CT
0.149 GC
2 setlinecap
1 LJ
0.667 LW
N
376.8 31 M
376.8 35.34 L
S
GR
GS
[0.75 0 0 0.75 0 0] CT
0.149 GC
2 setlinecap
1 LJ
0.667 LW
N
420.2 31 M
420.2 35.34 L
S
GR
GS
[0.75 0 0 0.75 0 0] CT
0.149 GC
2 setlinecap
1 LJ
0.667 LW
N
463.6 31 M
463.6 35.34 L
S
GR
GS
[0.75 0 0 0.75 0 0] CT
0.149 GC
2 setlinecap
1 LJ
0.667 LW
N
507 31 M
507 35.34 L
S
GR
GS
[0.75 0 0 0.75 54.75 284.50001] CT
0.149 GC
/Helvetica 13.333 F
GS
[1 0 0 1 0 0] CT
-4 14 moveto 
1 -1 scale
(0) t 
GR
GR
GS
[0.75 0 0 0.75 87.3 284.50001] CT
0.149 GC
/Helvetica 13.333 F
GS
[1 0 0 1 0 0] CT
-7.5 14 moveto 
1 -1 scale
(50) t 
GR
GR
GS
[0.75 0 0 0.75 119.85 284.50001] CT
0.149 GC
/Helvetica 13.333 F
GS
[1 0 0 1 0 0] CT
-11 14 moveto 
1 -1 scale
(100) t 
GR
GR
GS
[0.75 0 0 0.75 152.4 284.50001] CT
0.149 GC
/Helvetica 13.333 F
GS
[1 0 0 1 0 0] CT
-11 14 moveto 
1 -1 scale
(150) t 
GR
GR
GS
[0.75 0 0 0.75 184.95 284.50001] CT
0.149 GC
/Helvetica 13.333 F
GS
[1 0 0 1 0 0] CT
-11 14 moveto 
1 -1 scale
(200) t 
GR
GR
GS
[0.75 0 0 0.75 217.5 284.50001] CT
0.149 GC
/Helvetica 13.333 F
GS
[1 0 0 1 0 0] CT
-11 14 moveto 
1 -1 scale
(250) t 
GR
GR
GS
[0.75 0 0 0.75 250.05 284.50001] CT
0.149 GC
/Helvetica 13.333 F
GS
[1 0 0 1 0 0] CT
-11 14 moveto 
1 -1 scale
(300) t 
GR
GR
GS
[0.75 0 0 0.75 282.59999 284.50001] CT
0.149 GC
/Helvetica 13.333 F
GS
[1 0 0 1 0 0] CT
-11 14 moveto 
1 -1 scale
(350) t 
GR
GR
GS
[0.75 0 0 0.75 315.15001 284.50001] CT
0.149 GC
/Helvetica 13.333 F
GS
[1 0 0 1 0 0] CT
-11 14 moveto 
1 -1 scale
(400) t 
GR
GR
GS
[0.75 0 0 0.75 347.7 284.50001] CT
0.149 GC
/Helvetica 13.333 F
GS
[1 0 0 1 0 0] CT
-11 14 moveto 
1 -1 scale
(450) t 
GR
GR
GS
[0.75 0 0 0.75 380.25 284.50001] CT
0.149 GC
/Helvetica 13.333 F
GS
[1 0 0 1 0 0] CT
-11 14 moveto 
1 -1 scale
(500) t 
GR
GR
GS
[0.75 0 0 0.75 217.50016 298.24999] CT
0.149 GC
/Helvetica 14.667 F
GS
[1 0 0 1 0 0] CT
-14.5 16 moveto 
1 -1 scale
(krok) t 
GR
GR
GS
[0.75 0 0 0.75 0 0] CT
0.149 GC
2 setlinecap
1 LJ
0.667 LW
N
73 374 M
73 31 L
S
GR
GS
[0.75 0 0 0.75 0 0] CT
0.149 GC
2 setlinecap
1 LJ
0.667 LW
N
507 374 M
507 31 L
S
GR
GS
[0.75 0 0 0.75 0 0] CT
0.149 GC
2 setlinecap
1 LJ
0.667 LW
N
73 374 M
77.34 374 L
S
GR
GS
[0.75 0 0 0.75 0 0] CT
0.149 GC
2 setlinecap
1 LJ
0.667 LW
N
73 316.833 M
77.34 316.833 L
S
GR
GS
[0.75 0 0 0.75 0 0] CT
0.149 GC
2 setlinecap
1 LJ
0.667 LW
N
73 259.667 M
77.34 259.667 L
S
GR
GS
[0.75 0 0 0.75 0 0] CT
0.149 GC
2 setlinecap
1 LJ
0.667 LW
N
73 202.5 M
77.34 202.5 L
S
GR
GS
[0.75 0 0 0.75 0 0] CT
0.149 GC
2 setlinecap
1 LJ
0.667 LW
N
73 145.333 M
77.34 145.333 L
S
GR
GS
[0.75 0 0 0.75 0 0] CT
0.149 GC
2 setlinecap
1 LJ
0.667 LW
N
73 88.167 M
77.34 88.167 L
S
GR
GS
[0.75 0 0 0.75 0 0] CT
0.149 GC
2 setlinecap
1 LJ
0.667 LW
N
73 31 M
77.34 31 L
S
GR
GS
[0.75 0 0 0.75 0 0] CT
0.149 GC
2 setlinecap
1 LJ
0.667 LW
N
507 374 M
502.66 374 L
S
GR
GS
[0.75 0 0 0.75 0 0] CT
0.149 GC
2 setlinecap
1 LJ
0.667 LW
N
507 316.833 M
502.66 316.833 L
S
GR
GS
[0.75 0 0 0.75 0 0] CT
0.149 GC
2 setlinecap
1 LJ
0.667 LW
N
507 259.667 M
502.66 259.667 L
S
GR
GS
[0.75 0 0 0.75 0 0] CT
0.149 GC
2 setlinecap
1 LJ
0.667 LW
N
507 202.5 M
502.66 202.5 L
S
GR
GS
[0.75 0 0 0.75 0 0] CT
0.149 GC
2 setlinecap
1 LJ
0.667 LW
N
507 145.333 M
502.66 145.333 L
S
GR
GS
[0.75 0 0 0.75 0 0] CT
0.149 GC
2 setlinecap
1 LJ
0.667 LW
N
507 88.167 M
502.66 88.167 L
S
GR
GS
[0.75 0 0 0.75 0 0] CT
0.149 GC
2 setlinecap
1 LJ
0.667 LW
N
507 31 M
502.66 31 L
S
GR
GS
[0.75 0 0 0.75 50.75 280.5] CT
0.149 GC
/Helvetica 13.333 F
GS
[1 0 0 1 0 0] CT
-8 5.5 moveto 
1 -1 scale
(0) t 
GR
GR
GS
[0.75 0 0 0.75 50.75 237.62501] CT
0.149 GC
/Helvetica 13.333 F
GS
[1 0 0 1 0 0] CT
-26 5.5 moveto 
1 -1 scale
(0.05) t 
GR
GR
GS
[0.75 0 0 0.75 50.75 194.74999] CT
0.149 GC
/Helvetica 13.333 F
GS
[1 0 0 1 0 0] CT
-19 5.5 moveto 
1 -1 scale
(0.1) t 
GR
GR
GS
[0.75 0 0 0.75 50.75 151.875] CT
0.149 GC
/Helvetica 13.333 F
GS
[1 0 0 1 0 0] CT
-26 5.5 moveto 
1 -1 scale
(0.15) t 
GR
GR
GS
[0.75 0 0 0.75 50.75 109] CT
0.149 GC
/Helvetica 13.333 F
GS
[1 0 0 1 0 0] CT
-19 5.5 moveto 
1 -1 scale
(0.2) t 
GR
GR
GS
[0.75 0 0 0.75 50.75 66.125] CT
0.149 GC
/Helvetica 13.333 F
GS
[1 0 0 1 0 0] CT
-26 5.5 moveto 
1 -1 scale
(0.25) t 
GR
GR
GS
[0.75 0 0 0.75 50.75 23.24999] CT
0.149 GC
/Helvetica 13.333 F
GS
[1 0 0 1 0 0] CT
-19 5.5 moveto 
1 -1 scale
(0.3) t 
GR
GR
GS
[0 -0.75 0.75 0 28.25 151.87486] CT
0.149 GC
/Helvetica 14.667 F
GS
[1 0 0 1 0 0] CT
-47 -4 moveto 
1 -1 scale
(velikost chyby) t 
GR
GR
GS
[0.75 0 0 0.75 217.50021 21.18748] CT
/Helvetica-Bold 14.667 F
GS
[1 0 0 1 0 0] CT
-85 -4 moveto 
1 -1 scale
(Euklidovska chyba EKF) t 
GR
GR
GS
[0.75 0 0 0.75 0 0] CT
1 0 0 RC
1 LJ
0.667 LW
N
73.868 313.247 M
74.736 264.466 L
75.604 295.279 L
76.472 333.446 L
77.34 358.55 L
78.208 331.644 L
79.076 347.085 L
79.944 355.837 L
80.812 352.23 L
81.68 359.452 L
82.548 365.351 L
83.416 367.305 L
84.284 361.686 L
85.152 359.85 L
86.02 372.212 L
86.888 369.041 L
87.756 364.841 L
88.624 362.139 L
89.492 348.754 L
90.36 354.408 L
91.228 362.208 L
92.096 363.107 L
92.964 354.772 L
93.832 340.559 L
94.7 327.513 L
95.568 352.724 L
96.436 357.885 L
97.304 350.325 L
98.172 346.763 L
99.04 354.01 L
99.908 363.04 L
100.776 368.876 L
101.644 354.143 L
102.512 347.307 L
103.38 355.122 L
104.248 363.985 L
105.116 365.711 L
105.984 366.233 L
106.852 358.848 L
107.72 357.001 L
108.588 362.121 L
109.456 359.224 L
110.324 352.757 L
111.192 360.103 L
112.06 368.748 L
112.928 365.602 L
113.796 362.288 L
114.664 371.512 L
115.532 361.493 L
116.4 356.395 L
117.268 363.76 L
118.136 269.739 L
119.004 253.11 L
119.872 275.144 L
120.74 329.214 L
121.608 366.957 L
122.476 340.366 L
123.344 314.671 L
124.212 311.219 L
125.08 314.126 L
125.948 317.009 L
126.816 317.7 L
127.684 327.546 L
128.552 338.013 L
129.42 344.914 L
130.288 350.26 L
131.156 362.503 L
132.024 365.935 L
132.892 355.892 L
133.76 351.672 L
134.628 356.42 L
135.496 355.664 L
136.364 368.935 L
137.232 362.577 L
138.1 359.528 L
138.968 364.696 L
139.836 356.682 L
140.704 356.191 L
141.572 366.799 L
142.44 369.127 L
143.308 365.982 L
144.176 373.058 L
145.044 360.693 L
145.912 366.961 L
146.78 354.274 L
147.648 362.445 L
148.516 348.872 L
149.384 360.419 L
150.252 361.881 L
151.12 367.915 L
151.988 364.191 L
152.856 371.113 L
153.724 362.656 L
154.592 347.713 L
155.46 343.776 L
156.328 350.158 L
157.196 356.71 L
158.064 361.034 L
158.932 361.326 L
159.8 359.883 L
160.668 352.597 L
161.536 352.529 L
162.404 355.161 L
163.272 357.799 L
164.14 361.531 L
165.008 364.94 L
165.876 358.893 L
166.744 365.947 L
167.612 365.079 L
168.48 372.326 L
169.348 369.161 L
170.216 371.441 L
171.084 361.921 L
171.952 361.124 L
172.82 372.524 L
173.688 358.139 L
174.556 363.945 L
175.424 358.823 L
176.292 366.512 L
177.16 360.265 L
178.028 361.097 L
178.896 362.557 L
179.764 365.514 L
180.632 352.645 L
181.5 348.911 L
182.368 361.935 L
183.236 369.644 L
184.104 368.394 L
184.972 367.171 L
185.84 359.402 L
186.708 345.825 L
187.576 353.473 L
188.444 369.086 L
189.312 367.15 L
190.18 362.726 L
191.048 364.199 L
191.916 361.348 L
192.784 358.8 L
193.652 365.144 L
194.52 357.323 L
195.388 343.478 L
196.256 343.863 L
197.124 353.226 L
197.992 351.409 L
198.86 358.638 L
199.728 362.042 L
200.596 364.748 L
201.464 368.897 L
202.332 370.962 L
203.2 362.092 L
204.068 360.743 L
204.936 362.391 L
205.804 368.704 L
206.672 365.451 L
207.54 371.211 L
208.408 361.905 L
209.276 365.62 L
210.144 368.994 L
211.012 360.534 L
211.88 369.279 L
212.748 369.133 L
213.616 365.029 L
214.484 366.543 L
215.352 368.747 L
216.22 360.531 L
217.088 362.235 L
217.956 360.112 L
218.824 371.497 L
219.692 348.812 L
220.56 358.408 L
221.428 357.465 L
222.296 359.241 L
223.164 359.347 L
224.032 366.576 L
224.9 370.143 L
225.768 364.803 L
226.636 261.038 L
227.504 224.326 L
228.372 252.283 L
229.24 288.893 L
230.108 332.354 L
230.976 364.52 L
231.844 318.234 L
232.712 283.735 L
233.58 287.309 L
234.448 301.288 L
235.316 288.549 L
236.184 294.169 L
237.052 298.706 L
237.92 304.263 L
238.788 328.842 L
239.656 365.768 L
240.524 368.85 L
241.392 361.905 L
242.26 371.457 L
243.128 355.123 L
243.996 366.774 L
244.864 362.48 L
245.732 362.992 L
246.6 357.849 L
247.468 350.283 L
248.336 354.412 L
249.204 369.328 L
250.072 367.698 L
250.94 369.662 L
251.808 365.927 L
252.676 362.135 L
253.544 356.587 L
254.412 352.909 L
255.28 358.405 L
256.148 356.177 L
257.016 368.419 L
257.884 369.34 L
258.752 367.915 L
259.62 357.995 L
260.488 370.438 L
261.356 366.638 L
262.224 366.742 L
263.092 366.082 L
263.96 370.544 L
264.828 368.474 L
265.696 365.985 L
266.564 356.377 L
267.432 358.517 L
268.3 365.401 L
269.168 371.4 L
270.036 358.888 L
270.904 364.211 L
271.772 357.79 L
272.64 359.732 L
273.508 359.229 L
274.376 368.405 L
275.244 371.121 L
276.112 354.854 L
276.98 365.898 L
277.848 361.944 L
278.716 366.485 L
279.584 355.237 L
280.452 372.499 L
281.32 367.532 L
282.188 367.524 L
283.056 364.854 L
283.924 363.617 L
284.792 358.313 L
285.66 358.803 L
286.528 360.04 L
287.396 362.343 L
288.264 354.845 L
289.132 369.304 L
290 366.018 L
290.868 370.924 L
291.736 356.423 L
292.604 358.744 L
293.472 361.15 L
294.34 367.255 L
295.208 367.66 L
296.076 358.592 L
296.944 356.173 L
297.812 368.325 L
298.68 357.299 L
299.548 344.25 L
300.416 363.202 L
301.284 365.023 L
302.152 358.558 L
303.02 361.364 L
303.888 364.99 L
304.756 349.894 L
305.624 354.214 L
306.492 365.944 L
307.36 372.267 L
308.228 348.037 L
309.096 350.905 L
309.964 354.254 L
310.832 365.059 L
311.7 359.872 L
312.568 344.971 L
313.436 346.267 L
314.304 357.243 L
315.172 371.925 L
316.04 372.132 L
316.908 363.893 L
317.776 357.722 L
318.644 355.598 L
319.512 353.573 L
320.38 368.748 L
321.248 364.936 L
322.116 363.73 L
322.984 363.497 L
323.852 357.269 L
324.72 355.806 L
325.588 364.3 L
326.456 369.151 L
327.324 361.079 L
328.192 353.774 L
329.06 346.36 L
329.928 349.474 L
330.796 367.579 L
331.664 354.504 L
332.532 364.933 L
333.4 360.451 L
334.268 363.203 L
335.136 362.39 L
336.004 361.287 L
336.872 360.53 L
337.74 357.224 L
338.608 361.222 L
339.476 368.124 L
340.344 363.815 L
341.212 360.612 L
342.08 368.631 L
342.948 369.615 L
343.816 365.241 L
344.684 358.272 L
345.552 362.286 L
346.42 355.112 L
347.288 370.783 L
348.156 358.018 L
349.024 365.88 L
349.892 368.594 L
350.76 365.047 L
351.628 359.265 L
352.496 357.568 L
353.364 355.314 L
354.232 355.969 L
355.1 369.194 L
355.968 364.895 L
356.836 362.696 L
357.704 359.74 L
358.572 369.272 L
359.44 366.476 L
360.308 357.571 L
361.176 363.859 L
362.044 370.384 L
362.912 360.455 L
363.78 371.054 L
364.648 359.674 L
365.516 366.462 L
366.384 364.071 L
367.252 360.471 L
368.12 370.275 L
368.988 368.866 L
369.856 345.05 L
370.724 366.488 L
371.592 371.48 L
372.46 369.75 L
373.328 357.293 L
374.196 343.741 L
375.064 338.722 L
375.932 352.937 L
376.8 348.305 L
377.668 358.138 L
378.536 360.659 L
379.404 365.032 L
380.272 360.721 L
381.14 355.45 L
382.008 362.74 L
382.876 363.992 L
383.744 364.893 L
384.612 363.265 L
385.48 358.954 L
386.348 361.351 L
387.216 367.424 L
388.084 368.882 L
388.952 359.92 L
389.82 368.848 L
390.688 367.186 L
391.556 371.036 L
392.424 368.012 L
393.292 370.786 L
394.16 361.135 L
395.028 368.102 L
395.896 365.756 L
396.764 363.472 L
397.632 367.844 L
398.5 366.441 L
399.368 358.746 L
400.236 125.222 L
401.104 62.145 L
401.972 98.977 L
402.84 195.405 L
403.708 287.432 L
404.576 299.593 L
405.444 247.274 L
406.312 201.777 L
407.18 195.58 L
408.048 213.181 L
408.916 233.481 L
409.784 259.552 L
410.652 269.355 L
411.52 300.389 L
412.388 335.148 L
413.256 344.414 L
414.124 369.662 L
414.992 360.765 L
415.86 363.535 L
416.728 356.688 L
417.596 348.822 L
418.464 357.615 L
419.332 356.845 L
420.2 368.481 L
421.068 362.204 L
421.936 362.246 L
422.804 345.272 L
423.672 355.394 L
424.54 357.751 L
425.408 361.624 L
426.276 183.593 L
427.144 146.523 L
428.012 159.507 L
428.88 223.681 L
429.748 290.303 L
430.616 319.612 L
431.484 288.932 L
432.352 266.382 L
433.22 242.189 L
434.088 232.643 L
434.956 251.451 L
435.824 271.083 L
436.692 304.324 L
437.56 313.454 L
438.428 326.682 L
439.296 324.498 L
440.164 350.415 L
441.032 353.159 L
441.9 341.427 L
442.768 360.154 L
443.636 362.53 L
444.504 362.617 L
445.372 341.332 L
446.24 332.362 L
447.108 323.029 L
447.976 333.767 L
448.844 367.389 L
449.712 351.213 L
450.58 350.098 L
451.448 356.203 L
452.316 359.398 L
453.184 349.422 L
454.052 346.875 L
454.92 350.061 L
455.788 360.218 L
456.656 364.678 L
457.524 351.812 L
458.392 363.839 L
459.26 364.929 L
460.128 365.221 L
460.996 363.298 L
461.864 369.432 L
462.732 355.255 L
463.6 356.412 L
464.468 362.305 L
465.336 362.233 L
466.204 355.937 L
467.072 359.918 L
467.94 359.831 L
S
GR
GS
[0.75 0 0 0.75 0 0] CT
1 GC
N
436 64 M
436 44 L
494 44 L
494 64 L
cp
f
GR
GS
[0.75 0 0 0.75 354.75 40.5] CT
/Helvetica 12 F
GS
[1 0 0 1 0 0] CT
0 5 moveto 
1 -1 scale
(ekf) t 
GR
GR
GS
[0.75 0 0 0.75 0 0] CT
1 0 0 RC
1 LJ
0.667 LW
N
440 54 M
470 54 L
S
GR
GS
[0.75 0 0 0.75 0 0] CT
0.149 GC
10.0 ML
0.667 LW
N
436 64 M
436 44 L
494 44 L
494 64 L
cp
S
GR
%%Trailer
%%Pages: 1
%%EOF
