\relax 
\catcode `"\active 
\catcode `-\active 
\select@language{czech}
\@writefile{toc}{\select@language{czech}}
\@writefile{lof}{\select@language{czech}}
\@writefile{lot}{\select@language{czech}}
\@writefile{toc}{\contentsline {chapter}{\numberline {1}Odhad parametr\IeC {\r u} dynamick\IeC {\'e}ho syst\IeC {\'e}mu (identifikovatelnost syst\IeC {\'e}mu)}{1}}
\@writefile{lof}{\addvspace {10\p@ }}
\@writefile{lot}{\addvspace {10\p@ }}
\@writefile{toc}{\contentsline {section}{\numberline {1.1}Zad\IeC {\'a}n\IeC {\'\i }}{1}}
\newlabel{1}{{1.4}{2}}
\@writefile{toc}{\contentsline {section}{\numberline {1.2}\IeC {\v R}e\IeC {\v s}en\IeC {\'\i }}{2}}
\@writefile{toc}{\contentsline {subsection}{\numberline {1.2.1}Prvn\IeC {\'\i } \IeC {\'u}kol}{2}}
\@writefile{lof}{\contentsline {figure}{\numberline {1.1}{\ignorespaces Vstupn\IeC {\v e} v\IeC {\'y}stupn\IeC {\'\i } sady dat pro $S_1$.}}{3}}
\@writefile{lof}{\contentsline {figure}{\numberline {1.2}{\ignorespaces Vstupn\IeC {\v e} v\IeC {\'y}stupn\IeC {\'\i } sady dat pro $S_2$.}}{3}}
\@writefile{toc}{\contentsline {subsection}{\numberline {1.2.2}Druh\IeC {\'y} \IeC {\'u}kol}{4}}
\@writefile{toc}{\contentsline {paragraph}{Metoda nejmen\IeC {\v s}\IeC {\'\i }ch \IeC {\v c}tverc\IeC {\r u}}{4}}
\newlabel{mnc}{{1.5}{4}}
\@writefile{toc}{\contentsline {subsection}{\numberline {1.2.3}T\IeC {\v r}et\IeC {\'\i } \IeC {\'u}kol}{5}}
\@writefile{toc}{\contentsline {subsubsection}{Anal\IeC {\'y}za vstupn\IeC {\'\i }ho sign\IeC {\'a}lu z hlediska bohatosti}{5}}
\newlabel{2}{{1.6}{5}}
\@writefile{toc}{\contentsline {paragraph}{Jednotkov\IeC {\'y} impuls}{6}}
\@writefile{toc}{\contentsline {paragraph}{Jednotkov\IeC {\'y} skok}{6}}
\@writefile{toc}{\contentsline {paragraph}{B\IeC {\'\i }l\IeC {\'y} \IeC {\v s}um}{6}}
\@writefile{toc}{\contentsline {subsubsection}{Odvozen\IeC {\'\i } vztah\IeC {\r u} pro odhad parametr\IeC {\r u} jako funkce zdroje}{6}}
\newlabel{mnc2}{{1.9}{6}}
\@writefile{toc}{\contentsline {paragraph}{Parametrick\IeC {\'e} rovnice pro b\IeC {\'\i }l\IeC {\'y} \IeC {\v s}um}{7}}
\newlabel{vyraz}{{1.10}{7}}
\@writefile{toc}{\contentsline {paragraph}{Parametrick\IeC {\'e} rovnice pro impuls}{8}}
\newlabel{impuls}{{1.19}{8}}
\@writefile{toc}{\contentsline {paragraph}{Parametrick\IeC {\'e} rovnice pro skok}{8}}
\@writefile{toc}{\contentsline {subsubsection}{Porovn\IeC {\'a}n\IeC {\'\i } teoretick\IeC {\'y}ch a experiment\IeC {\'a}ln\IeC {\'\i }ch v\IeC {\'y}sledk\IeC {\r u}}{9}}
\@writefile{lot}{\contentsline {table}{\numberline {1.1}{\ignorespaces Odhady parametr\IeC {\r u} pro S1.}}{10}}
\newlabel{my-label}{{1.1}{10}}
\@writefile{lot}{\contentsline {table}{\numberline {1.2}{\ignorespaces Odhady parametr\IeC {\r u} pro S2.}}{11}}
\newlabel{my-label}{{1.2}{11}}
\@writefile{toc}{\contentsline {subsection}{\numberline {1.2.4}Zaveden\IeC {\'\i } zp\IeC {\v e}tn\IeC {\'e} vazby}{12}}
\@writefile{toc}{\contentsline {subsubsection}{Zaveden\IeC {\'\i } \IeC {\v s}umu do zp\IeC {\v e}tn\IeC {\'e} vazby}{12}}
\newlabel{my-label}{{1.2.4}{14}}
\@writefile{toc}{\contentsline {section}{\numberline {1.3}Z\IeC {\'a}v\IeC {\v e}r}{14}}
\@writefile{toc}{\contentsline {chapter}{\numberline {2}Odhad parametr\IeC {\r u} statick\IeC {\'e}ho syst\IeC {\'e}mu (struktura modelu)}{15}}
\@writefile{lof}{\addvspace {10\p@ }}
\@writefile{lot}{\addvspace {10\p@ }}
\@writefile{toc}{\contentsline {section}{\numberline {2.1}Zad\IeC {\'a}n\IeC {\'\i }}{15}}
\@writefile{toc}{\contentsline {section}{\numberline {2.2}\IeC {\v R}e\IeC {\v s}en\IeC {\'\i }}{16}}
\@writefile{toc}{\contentsline {subsection}{\numberline {2.2.1}Odvozen\IeC {\'\i } z\IeC {\'a}kladn\IeC {\'\i }ch vztah\IeC {\r u} pro v\IeC {\'y}po\IeC {\v c}et parametr\IeC {\r u}}{16}}
\@writefile{toc}{\contentsline {subsection}{\numberline {2.2.2}Stru\IeC {\v c}n\IeC {\'y} popis metod}{18}}
\@writefile{toc}{\contentsline {subsection}{\numberline {2.2.3}Porovn\IeC {\'a}n\IeC {\'\i } aplikace metod a chyby}{18}}
\@writefile{toc}{\contentsline {subsubsection}{Grafy k prvn\IeC {\'\i } metod\IeC {\v e}}{18}}
\@writefile{lof}{\contentsline {figure}{\numberline {2.1}{\ignorespaces Graf v\IeC {\'y}voje st\IeC {\v r}edn\IeC {\'\i } chyby pro jednotliv\IeC {\'e} \IeC {\v r}\IeC {\'a}dy.}}{19}}
\@writefile{lof}{\contentsline {figure}{\numberline {2.2}{\ignorespaces Graf v\IeC {\'y}voje st\IeC {\v r}edn\IeC {\'\i } chyby pro jednotliv\IeC {\'e} \IeC {\v r}\IeC {\'a}dy. - detail}}{20}}
\@writefile{lof}{\contentsline {figure}{\numberline {2.3}{\ignorespaces Porovn\IeC {\'a}n\IeC {\'\i } odhadu valida\IeC {\v c}n\IeC {\'\i }ch dat pro \IeC {\v r}\IeC {\'a}d s nejmen\IeC {\v s}\IeC {\'\i } chybou.}}{21}}
\@writefile{toc}{\contentsline {subsubsection}{Grafy ke druh\IeC {\'e} metod\IeC {\v e}}{22}}
\@writefile{lof}{\contentsline {figure}{\numberline {2.4}{\ignorespaces Graf v\IeC {\'y}voje st\IeC {\v r}edn\IeC {\'\i } chyby pro jednotliv\IeC {\'e} \IeC {\v r}\IeC {\'a}dy.}}{23}}
\@writefile{lof}{\contentsline {figure}{\numberline {2.5}{\ignorespaces Graf v\IeC {\'y}voje st\IeC {\v r}edn\IeC {\'\i } chyby pro jednotliv\IeC {\'e} \IeC {\v r}\IeC {\'a}dy. - detail}}{24}}
\@writefile{lof}{\contentsline {figure}{\numberline {2.6}{\ignorespaces Porovn\IeC {\'a}n\IeC {\'\i } odhadu valida\IeC {\v c}n\IeC {\'\i }ch dat pro \IeC {\v r}\IeC {\'a}d s nejmen\IeC {\v s}\IeC {\'\i } chybou.}}{25}}
\@writefile{toc}{\contentsline {subsubsection}{Grafy ke t\IeC {\v r}et\IeC {\'\i } metod\IeC {\v e}}{26}}
\@writefile{lof}{\contentsline {figure}{\numberline {2.7}{\ignorespaces Graf v\IeC {\'y}voje st\IeC {\v r}edn\IeC {\'\i } chyby pro jednotliv\IeC {\'e} \IeC {\v r}\IeC {\'a}dy.}}{27}}
\@writefile{lof}{\contentsline {figure}{\numberline {2.8}{\ignorespaces Porovn\IeC {\'a}n\IeC {\'\i } odhadu valida\IeC {\v c}n\IeC {\'\i }ch dat pro \IeC {\v r}\IeC {\'a}d s nejmen\IeC {\v s}\IeC {\'\i } chybou.}}{28}}
\@writefile{toc}{\contentsline {section}{\numberline {2.3}Z\IeC {\'a}v\IeC {\v e}r}{29}}
