%!PS-Adobe-3.0 EPSF-3.0
%%Creator: (MATLAB, The Mathworks, Inc. Version 9.0.0.341360 \(R2016a\). Operating System: Windows 8)
%%Title: C:/Users/Jan/Documents/JC.ISF/isf3/graf5.eps
%%CreationDate: 2017-06-11T16:01:01
%%Pages: (atend)
%%BoundingBox: 0 0 420 315
%%LanguageLevel: 3
%%EndComments
%%BeginProlog
%%BeginResource: procset (Apache XML Graphics Std ProcSet) 1.2 0
%%Version: 1.2 0
%%Copyright: (Copyright 2001-2003,2010 The Apache Software Foundation. License terms: http://www.apache.org/licenses/LICENSE-2.0)
/bd{bind def}bind def
/ld{load def}bd
/GR/grestore ld
/M/moveto ld
/LJ/setlinejoin ld
/C/curveto ld
/f/fill ld
/LW/setlinewidth ld
/GC/setgray ld
/t/show ld
/N/newpath ld
/CT/concat ld
/cp/closepath ld
/S/stroke ld
/L/lineto ld
/CC/setcmykcolor ld
/A/ashow ld
/GS/gsave ld
/RC/setrgbcolor ld
/RM/rmoveto ld
/ML/setmiterlimit ld
/re {4 2 roll M
1 index 0 rlineto
0 exch rlineto
neg 0 rlineto
cp } bd
/_ctm matrix def
/_tm matrix def
/BT { _ctm currentmatrix pop matrix _tm copy pop 0 0 moveto } bd
/ET { _ctm setmatrix } bd
/iTm { _ctm setmatrix _tm concat } bd
/Tm { _tm astore pop iTm 0 0 moveto } bd
/ux 0.0 def
/uy 0.0 def
/F {
  /Tp exch def
  /Tf exch def
  Tf findfont Tp scalefont setfont
  /cf Tf def  /cs Tp def
} bd
/ULS {currentpoint /uy exch def /ux exch def} bd
/ULE {
  /Tcx currentpoint pop def
  gsave
  newpath
  cf findfont cs scalefont dup
  /FontMatrix get 0 get /Ts exch def /FontInfo get dup
  /UnderlinePosition get Ts mul /To exch def
  /UnderlineThickness get Ts mul /Tt exch def
  ux uy To add moveto  Tcx uy To add lineto
  Tt setlinewidth stroke
  grestore
} bd
/OLE {
  /Tcx currentpoint pop def
  gsave
  newpath
  cf findfont cs scalefont dup
  /FontMatrix get 0 get /Ts exch def /FontInfo get dup
  /UnderlinePosition get Ts mul /To exch def
  /UnderlineThickness get Ts mul /Tt exch def
  ux uy To add cs add moveto Tcx uy To add cs add lineto
  Tt setlinewidth stroke
  grestore
} bd
/SOE {
  /Tcx currentpoint pop def
  gsave
  newpath
  cf findfont cs scalefont dup
  /FontMatrix get 0 get /Ts exch def /FontInfo get dup
  /UnderlinePosition get Ts mul /To exch def
  /UnderlineThickness get Ts mul /Tt exch def
  ux uy To add cs 10 mul 26 idiv add moveto Tcx uy To add cs 10 mul 26 idiv add lineto
  Tt setlinewidth stroke
  grestore
} bd
/QT {
/Y22 exch store
/X22 exch store
/Y21 exch store
/X21 exch store
currentpoint
/Y21 load 2 mul add 3 div exch
/X21 load 2 mul add 3 div exch
/X21 load 2 mul /X22 load add 3 div
/Y21 load 2 mul /Y22 load add 3 div
/X22 load /Y22 load curveto
} bd
/SSPD {
dup length /d exch dict def
{
/v exch def
/k exch def
currentpagedevice k known {
/cpdv currentpagedevice k get def
v cpdv ne {
/upd false def
/nullv v type /nulltype eq def
/nullcpdv cpdv type /nulltype eq def
nullv nullcpdv or
{
/upd true def
} {
/sametype v type cpdv type eq def
sametype {
v type /arraytype eq {
/vlen v length def
/cpdvlen cpdv length def
vlen cpdvlen eq {
0 1 vlen 1 sub {
/i exch def
/obj v i get def
/cpdobj cpdv i get def
obj cpdobj ne {
/upd true def
exit
} if
} for
} {
/upd true def
} ifelse
} {
v type /dicttype eq {
v {
/dv exch def
/dk exch def
/cpddv cpdv dk get def
dv cpddv ne {
/upd true def
exit
} if
} forall
} {
/upd true def
} ifelse
} ifelse
} if
} ifelse
upd true eq {
d k v put
} if
} if
} if
} forall
d length 0 gt {
d setpagedevice
} if
} bd
%%EndResource
%%BeginResource: procset (Apache XML Graphics EPS ProcSet) 1.0 0
%%Version: 1.0 0
%%Copyright: (Copyright 2002-2003 The Apache Software Foundation. License terms: http://www.apache.org/licenses/LICENSE-2.0)
/BeginEPSF { %def
/b4_Inc_state save def         % Save state for cleanup
/dict_count countdictstack def % Count objects on dict stack
/op_count count 1 sub def      % Count objects on operand stack
userdict begin                 % Push userdict on dict stack
/showpage { } def              % Redefine showpage, { } = null proc
0 setgray 0 setlinecap         % Prepare graphics state
1 setlinewidth 0 setlinejoin
10 setmiterlimit [ ] 0 setdash newpath
/languagelevel where           % If level not equal to 1 then
{pop languagelevel             % set strokeadjust and
1 ne                           % overprint to their defaults.
{false setstrokeadjust false setoverprint
} if
} if
} bd
/EndEPSF { %def
count op_count sub {pop} repeat            % Clean up stacks
countdictstack dict_count sub {end} repeat
b4_Inc_state restore
} bd
%%EndResource
%FOPBeginFontDict
%%IncludeResource: font Courier-Bold
%%IncludeResource: font Helvetica
%%IncludeResource: font Courier-BoldOblique
%%IncludeResource: font Courier-Oblique
%%IncludeResource: font Times-Roman
%%IncludeResource: font Helvetica-BoldOblique
%%IncludeResource: font Helvetica-Bold
%%IncludeResource: font Helvetica-Oblique
%%IncludeResource: font Times-BoldItalic
%%IncludeResource: font Courier
%%IncludeResource: font Times-Italic
%%IncludeResource: font Times-Bold
%%IncludeResource: font Symbol
%%IncludeResource: font ZapfDingbats
%FOPEndFontDict
%%BeginResource: encoding WinAnsiEncoding
/WinAnsiEncoding [
/.notdef /.notdef /.notdef /.notdef /.notdef
/.notdef /.notdef /.notdef /.notdef /.notdef
/.notdef /.notdef /.notdef /.notdef /.notdef
/.notdef /.notdef /.notdef /.notdef /.notdef
/.notdef /.notdef /.notdef /.notdef /.notdef
/.notdef /.notdef /.notdef /.notdef /.notdef
/.notdef /.notdef /space /exclam /quotedbl
/numbersign /dollar /percent /ampersand /quotesingle
/parenleft /parenright /asterisk /plus /comma
/hyphen /period /slash /zero /one
/two /three /four /five /six
/seven /eight /nine /colon /semicolon
/less /equal /greater /question /at
/A /B /C /D /E
/F /G /H /I /J
/K /L /M /N /O
/P /Q /R /S /T
/U /V /W /X /Y
/Z /bracketleft /backslash /bracketright /asciicircum
/underscore /quoteleft /a /b /c
/d /e /f /g /h
/i /j /k /l /m
/n /o /p /q /r
/s /t /u /v /w
/x /y /z /braceleft /bar
/braceright /asciitilde /bullet /Euro /bullet
/quotesinglbase /florin /quotedblbase /ellipsis /dagger
/daggerdbl /circumflex /perthousand /Scaron /guilsinglleft
/OE /bullet /Zcaron /bullet /bullet
/quoteleft /quoteright /quotedblleft /quotedblright /bullet
/endash /emdash /asciitilde /trademark /scaron
/guilsinglright /oe /bullet /zcaron /Ydieresis
/space /exclamdown /cent /sterling /currency
/yen /brokenbar /section /dieresis /copyright
/ordfeminine /guillemotleft /logicalnot /sfthyphen /registered
/macron /degree /plusminus /twosuperior /threesuperior
/acute /mu /paragraph /middot /cedilla
/onesuperior /ordmasculine /guillemotright /onequarter /onehalf
/threequarters /questiondown /Agrave /Aacute /Acircumflex
/Atilde /Adieresis /Aring /AE /Ccedilla
/Egrave /Eacute /Ecircumflex /Edieresis /Igrave
/Iacute /Icircumflex /Idieresis /Eth /Ntilde
/Ograve /Oacute /Ocircumflex /Otilde /Odieresis
/multiply /Oslash /Ugrave /Uacute /Ucircumflex
/Udieresis /Yacute /Thorn /germandbls /agrave
/aacute /acircumflex /atilde /adieresis /aring
/ae /ccedilla /egrave /eacute /ecircumflex
/edieresis /igrave /iacute /icircumflex /idieresis
/eth /ntilde /ograve /oacute /ocircumflex
/otilde /odieresis /divide /oslash /ugrave
/uacute /ucircumflex /udieresis /yacute /thorn
/ydieresis
] def
%%EndResource
%FOPBeginFontReencode
/Courier-Bold findfont
dup length dict begin
  {1 index /FID ne {def} {pop pop} ifelse} forall
  /Encoding WinAnsiEncoding def
  currentdict
end
/Courier-Bold exch definefont pop
/Helvetica findfont
dup length dict begin
  {1 index /FID ne {def} {pop pop} ifelse} forall
  /Encoding WinAnsiEncoding def
  currentdict
end
/Helvetica exch definefont pop
/Courier-BoldOblique findfont
dup length dict begin
  {1 index /FID ne {def} {pop pop} ifelse} forall
  /Encoding WinAnsiEncoding def
  currentdict
end
/Courier-BoldOblique exch definefont pop
/Courier-Oblique findfont
dup length dict begin
  {1 index /FID ne {def} {pop pop} ifelse} forall
  /Encoding WinAnsiEncoding def
  currentdict
end
/Courier-Oblique exch definefont pop
/Times-Roman findfont
dup length dict begin
  {1 index /FID ne {def} {pop pop} ifelse} forall
  /Encoding WinAnsiEncoding def
  currentdict
end
/Times-Roman exch definefont pop
/Helvetica-BoldOblique findfont
dup length dict begin
  {1 index /FID ne {def} {pop pop} ifelse} forall
  /Encoding WinAnsiEncoding def
  currentdict
end
/Helvetica-BoldOblique exch definefont pop
/Helvetica-Bold findfont
dup length dict begin
  {1 index /FID ne {def} {pop pop} ifelse} forall
  /Encoding WinAnsiEncoding def
  currentdict
end
/Helvetica-Bold exch definefont pop
/Helvetica-Oblique findfont
dup length dict begin
  {1 index /FID ne {def} {pop pop} ifelse} forall
  /Encoding WinAnsiEncoding def
  currentdict
end
/Helvetica-Oblique exch definefont pop
/Times-BoldItalic findfont
dup length dict begin
  {1 index /FID ne {def} {pop pop} ifelse} forall
  /Encoding WinAnsiEncoding def
  currentdict
end
/Times-BoldItalic exch definefont pop
/Courier findfont
dup length dict begin
  {1 index /FID ne {def} {pop pop} ifelse} forall
  /Encoding WinAnsiEncoding def
  currentdict
end
/Courier exch definefont pop
/Times-Italic findfont
dup length dict begin
  {1 index /FID ne {def} {pop pop} ifelse} forall
  /Encoding WinAnsiEncoding def
  currentdict
end
/Times-Italic exch definefont pop
/Times-Bold findfont
dup length dict begin
  {1 index /FID ne {def} {pop pop} ifelse} forall
  /Encoding WinAnsiEncoding def
  currentdict
end
/Times-Bold exch definefont pop
%FOPEndFontReencode
%%EndProlog
%%Page: 1 1
%%PageBoundingBox: 0 0 420 315
%%BeginPageSetup
[1 0 0 -1 0 315] CT
%%EndPageSetup
GS
[0.75 0 0 0.75 0 0] CT
1 GC
N
0 0 560 420 re
f
GR
GS
[0.75 0 0 0.75 0 0] CT
1 GC
N
0 0 560 420 re
f
GR
GS
[0.75 0 0 0.75 0 0] CT
1 GC
N
73 374 M
507 374 L
507 31 L
73 31 L
cp
f
GR
GS
[0.75 0 0 0.75 0 0] CT
0.873 GC
1 LJ
0.667 LW
N
73 374 M
73 31 L
S
GR
GS
[0.75 0 0 0.75 0 0] CT
0.873 GC
1 LJ
0.667 LW
N
116.4 374 M
116.4 31 L
S
GR
GS
[0.75 0 0 0.75 0 0] CT
0.873 GC
1 LJ
0.667 LW
N
159.8 374 M
159.8 31 L
S
GR
GS
[0.75 0 0 0.75 0 0] CT
0.873 GC
1 LJ
0.667 LW
N
203.2 374 M
203.2 31 L
S
GR
GS
[0.75 0 0 0.75 0 0] CT
0.873 GC
1 LJ
0.667 LW
N
246.6 374 M
246.6 31 L
S
GR
GS
[0.75 0 0 0.75 0 0] CT
0.873 GC
1 LJ
0.667 LW
N
290 374 M
290 31 L
S
GR
GS
[0.75 0 0 0.75 0 0] CT
0.873 GC
1 LJ
0.667 LW
N
333.4 374 M
333.4 31 L
S
GR
GS
[0.75 0 0 0.75 0 0] CT
0.873 GC
1 LJ
0.667 LW
N
376.8 374 M
376.8 31 L
S
GR
GS
[0.75 0 0 0.75 0 0] CT
0.873 GC
1 LJ
0.667 LW
N
420.2 374 M
420.2 31 L
S
GR
GS
[0.75 0 0 0.75 0 0] CT
0.873 GC
1 LJ
0.667 LW
N
463.6 374 M
463.6 31 L
S
GR
GS
[0.75 0 0 0.75 0 0] CT
0.873 GC
1 LJ
0.667 LW
N
507 374 M
507 31 L
S
GR
GS
[0.75 0 0 0.75 0 0] CT
0.873 GC
1 LJ
0.667 LW
N
507 374 M
73 374 L
S
GR
GS
[0.75 0 0 0.75 0 0] CT
0.873 GC
1 LJ
0.667 LW
N
507 339.7 M
73 339.7 L
S
GR
GS
[0.75 0 0 0.75 0 0] CT
0.873 GC
1 LJ
0.667 LW
N
507 305.4 M
73 305.4 L
S
GR
GS
[0.75 0 0 0.75 0 0] CT
0.873 GC
1 LJ
0.667 LW
N
507 271.1 M
73 271.1 L
S
GR
GS
[0.75 0 0 0.75 0 0] CT
0.873 GC
1 LJ
0.667 LW
N
507 236.8 M
73 236.8 L
S
GR
GS
[0.75 0 0 0.75 0 0] CT
0.873 GC
1 LJ
0.667 LW
N
507 202.5 M
73 202.5 L
S
GR
GS
[0.75 0 0 0.75 0 0] CT
0.873 GC
1 LJ
0.667 LW
N
507 168.2 M
73 168.2 L
S
GR
GS
[0.75 0 0 0.75 0 0] CT
0.873 GC
1 LJ
0.667 LW
N
507 133.9 M
73 133.9 L
S
GR
GS
[0.75 0 0 0.75 0 0] CT
0.873 GC
1 LJ
0.667 LW
N
507 99.6 M
73 99.6 L
S
GR
GS
[0.75 0 0 0.75 0 0] CT
0.873 GC
1 LJ
0.667 LW
N
507 65.3 M
73 65.3 L
S
GR
GS
[0.75 0 0 0.75 0 0] CT
0.873 GC
1 LJ
0.667 LW
N
507 31 M
73 31 L
S
GR
GS
[0.75 0 0 0.75 0 0] CT
0.149 GC
2 setlinecap
1 LJ
0.667 LW
N
73 374 M
507 374 L
S
GR
GS
[0.75 0 0 0.75 0 0] CT
0.149 GC
2 setlinecap
1 LJ
0.667 LW
N
73 374 M
73 369.66 L
S
GR
GS
[0.75 0 0 0.75 0 0] CT
0.149 GC
2 setlinecap
1 LJ
0.667 LW
N
116.4 374 M
116.4 369.66 L
S
GR
GS
[0.75 0 0 0.75 0 0] CT
0.149 GC
2 setlinecap
1 LJ
0.667 LW
N
159.8 374 M
159.8 369.66 L
S
GR
GS
[0.75 0 0 0.75 0 0] CT
0.149 GC
2 setlinecap
1 LJ
0.667 LW
N
203.2 374 M
203.2 369.66 L
S
GR
GS
[0.75 0 0 0.75 0 0] CT
0.149 GC
2 setlinecap
1 LJ
0.667 LW
N
246.6 374 M
246.6 369.66 L
S
GR
GS
[0.75 0 0 0.75 0 0] CT
0.149 GC
2 setlinecap
1 LJ
0.667 LW
N
290 374 M
290 369.66 L
S
GR
GS
[0.75 0 0 0.75 0 0] CT
0.149 GC
2 setlinecap
1 LJ
0.667 LW
N
333.4 374 M
333.4 369.66 L
S
GR
GS
[0.75 0 0 0.75 0 0] CT
0.149 GC
2 setlinecap
1 LJ
0.667 LW
N
376.8 374 M
376.8 369.66 L
S
GR
GS
[0.75 0 0 0.75 0 0] CT
0.149 GC
2 setlinecap
1 LJ
0.667 LW
N
420.2 374 M
420.2 369.66 L
S
GR
GS
[0.75 0 0 0.75 0 0] CT
0.149 GC
2 setlinecap
1 LJ
0.667 LW
N
463.6 374 M
463.6 369.66 L
S
GR
GS
[0.75 0 0 0.75 0 0] CT
0.149 GC
2 setlinecap
1 LJ
0.667 LW
N
507 374 M
507 369.66 L
S
GR
GS
[0.75 0 0 0.75 54.75 284.50001] CT
0.149 GC
/Helvetica 13.333 F
GS
[1 0 0 1 0 0] CT
-4 14 moveto 
1 -1 scale
(0) t 
GR
GR
GS
[0.75 0 0 0.75 87.3 284.50001] CT
0.149 GC
/Helvetica 13.333 F
GS
[1 0 0 1 0 0] CT
-7.5 14 moveto 
1 -1 scale
(50) t 
GR
GR
GS
[0.75 0 0 0.75 119.85 284.50001] CT
0.149 GC
/Helvetica 13.333 F
GS
[1 0 0 1 0 0] CT
-11 14 moveto 
1 -1 scale
(100) t 
GR
GR
GS
[0.75 0 0 0.75 152.4 284.50001] CT
0.149 GC
/Helvetica 13.333 F
GS
[1 0 0 1 0 0] CT
-11 14 moveto 
1 -1 scale
(150) t 
GR
GR
GS
[0.75 0 0 0.75 184.95 284.50001] CT
0.149 GC
/Helvetica 13.333 F
GS
[1 0 0 1 0 0] CT
-11 14 moveto 
1 -1 scale
(200) t 
GR
GR
GS
[0.75 0 0 0.75 217.5 284.50001] CT
0.149 GC
/Helvetica 13.333 F
GS
[1 0 0 1 0 0] CT
-11 14 moveto 
1 -1 scale
(250) t 
GR
GR
GS
[0.75 0 0 0.75 250.05 284.50001] CT
0.149 GC
/Helvetica 13.333 F
GS
[1 0 0 1 0 0] CT
-11 14 moveto 
1 -1 scale
(300) t 
GR
GR
GS
[0.75 0 0 0.75 282.59999 284.50001] CT
0.149 GC
/Helvetica 13.333 F
GS
[1 0 0 1 0 0] CT
-11 14 moveto 
1 -1 scale
(350) t 
GR
GR
GS
[0.75 0 0 0.75 315.15001 284.50001] CT
0.149 GC
/Helvetica 13.333 F
GS
[1 0 0 1 0 0] CT
-11 14 moveto 
1 -1 scale
(400) t 
GR
GR
GS
[0.75 0 0 0.75 347.7 284.50001] CT
0.149 GC
/Helvetica 13.333 F
GS
[1 0 0 1 0 0] CT
-11 14 moveto 
1 -1 scale
(450) t 
GR
GR
GS
[0.75 0 0 0.75 380.25 284.50001] CT
0.149 GC
/Helvetica 13.333 F
GS
[1 0 0 1 0 0] CT
-11 14 moveto 
1 -1 scale
(500) t 
GR
GR
GS
[0.75 0 0 0.75 217.50016 298.25002] CT
0.149 GC
/Helvetica 14.667 F
GS
[1 0 0 1 0 0] CT
-20.5 16 moveto 
1 -1 scale
(krok k) t 
GR
GR
GS
[0.75 0 0 0.75 0 0] CT
0.149 GC
2 setlinecap
1 LJ
0.667 LW
N
73 374 M
73 31 L
S
GR
GS
[0.75 0 0 0.75 0 0] CT
0.149 GC
2 setlinecap
1 LJ
0.667 LW
N
73 374 M
77.34 374 L
S
GR
GS
[0.75 0 0 0.75 0 0] CT
0.149 GC
2 setlinecap
1 LJ
0.667 LW
N
73 339.7 M
77.34 339.7 L
S
GR
GS
[0.75 0 0 0.75 0 0] CT
0.149 GC
2 setlinecap
1 LJ
0.667 LW
N
73 305.4 M
77.34 305.4 L
S
GR
GS
[0.75 0 0 0.75 0 0] CT
0.149 GC
2 setlinecap
1 LJ
0.667 LW
N
73 271.1 M
77.34 271.1 L
S
GR
GS
[0.75 0 0 0.75 0 0] CT
0.149 GC
2 setlinecap
1 LJ
0.667 LW
N
73 236.8 M
77.34 236.8 L
S
GR
GS
[0.75 0 0 0.75 0 0] CT
0.149 GC
2 setlinecap
1 LJ
0.667 LW
N
73 202.5 M
77.34 202.5 L
S
GR
GS
[0.75 0 0 0.75 0 0] CT
0.149 GC
2 setlinecap
1 LJ
0.667 LW
N
73 168.2 M
77.34 168.2 L
S
GR
GS
[0.75 0 0 0.75 0 0] CT
0.149 GC
2 setlinecap
1 LJ
0.667 LW
N
73 133.9 M
77.34 133.9 L
S
GR
GS
[0.75 0 0 0.75 0 0] CT
0.149 GC
2 setlinecap
1 LJ
0.667 LW
N
73 99.6 M
77.34 99.6 L
S
GR
GS
[0.75 0 0 0.75 0 0] CT
0.149 GC
2 setlinecap
1 LJ
0.667 LW
N
73 65.3 M
77.34 65.3 L
S
GR
GS
[0.75 0 0 0.75 0 0] CT
0.149 GC
2 setlinecap
1 LJ
0.667 LW
N
73 31 M
77.34 31 L
S
GR
GS
[0.75 0 0 0.75 50.75 280.5] CT
0.149 GC
/Helvetica 13.333 F
GS
[1 0 0 1 0 0] CT
-23 5.5 moveto 
1 -1 scale
(-0.1) t 
GR
GR
GS
[0.75 0 0 0.75 50.75 254.77499] CT
0.149 GC
/Helvetica 13.333 F
GS
[1 0 0 1 0 0] CT
-30 5.5 moveto 
1 -1 scale
(-0.08) t 
GR
GR
GS
[0.75 0 0 0.75 50.75 229.05] CT
0.149 GC
/Helvetica 13.333 F
GS
[1 0 0 1 0 0] CT
-30 5.5 moveto 
1 -1 scale
(-0.06) t 
GR
GR
GS
[0.75 0 0 0.75 50.75 203.325] CT
0.149 GC
/Helvetica 13.333 F
GS
[1 0 0 1 0 0] CT
-30 5.5 moveto 
1 -1 scale
(-0.04) t 
GR
GR
GS
[0.75 0 0 0.75 50.75 177.6] CT
0.149 GC
/Helvetica 13.333 F
GS
[1 0 0 1 0 0] CT
-30 5.5 moveto 
1 -1 scale
(-0.02) t 
GR
GR
GS
[0.75 0 0 0.75 50.75 151.875] CT
0.149 GC
/Helvetica 13.333 F
GS
[1 0 0 1 0 0] CT
-8 5.5 moveto 
1 -1 scale
(0) t 
GR
GR
GS
[0.75 0 0 0.75 50.75 126.15] CT
0.149 GC
/Helvetica 13.333 F
GS
[1 0 0 1 0 0] CT
-26 5.5 moveto 
1 -1 scale
(0.02) t 
GR
GR
GS
[0.75 0 0 0.75 50.75 100.42501] CT
0.149 GC
/Helvetica 13.333 F
GS
[1 0 0 1 0 0] CT
-26 5.5 moveto 
1 -1 scale
(0.04) t 
GR
GR
GS
[0.75 0 0 0.75 50.75 74.7] CT
0.149 GC
/Helvetica 13.333 F
GS
[1 0 0 1 0 0] CT
-26 5.5 moveto 
1 -1 scale
(0.06) t 
GR
GR
GS
[0.75 0 0 0.75 50.75 48.975] CT
0.149 GC
/Helvetica 13.333 F
GS
[1 0 0 1 0 0] CT
-26 5.5 moveto 
1 -1 scale
(0.08) t 
GR
GR
GS
[0.75 0 0 0.75 50.75 23.25] CT
0.149 GC
/Helvetica 13.333 F
GS
[1 0 0 1 0 0] CT
-19 5.5 moveto 
1 -1 scale
(0.1) t 
GR
GR
GS
[0 -0.75 0.75 0 25.25 151.87487] CT
0.149 GC
/Helvetica 14.667 F
GS
[1 0 0 1 0 0] CT
-47 -4 moveto 
1 -1 scale
(velikost chyby) t 
GR
GR
GS
[0.75 0 0 0.75 217.50021 21.1875] CT
/Helvetica-Bold 14.667 F
GS
[1 0 0 1 0 0] CT
-121 -4 moveto 
1 -1 scale
(V\375voj chyby odhadu a 3 sigma - Y) t 
GR
GR
GS
[0.75 0 0 0.75 0 0] CT
0 0 1 RC
1 LJ
0.667 LW
N
73.868 132.443 M
74.736 201.303 L
75.604 194.364 L
76.472 208.936 L
77.34 192.102 L
78.208 185.754 L
79.076 185.722 L
79.944 192.783 L
80.812 178.133 L
81.68 194.161 L
82.548 208.75 L
83.416 214.016 L
84.284 207.905 L
85.152 223.124 L
86.02 206.849 L
86.888 203.282 L
87.756 201.065 L
88.624 210.775 L
89.492 205.545 L
90.36 192.399 L
91.228 190.457 L
92.096 186.4 L
92.964 195.59 L
93.832 187.536 L
94.7 192.171 L
95.568 200.017 L
96.436 191.327 L
97.304 180.072 L
98.172 184.881 L
99.04 198.593 L
99.908 214.495 L
100.776 208.912 L
101.644 220.315 L
102.512 222.426 L
103.38 213.571 L
104.248 193.967 L
105.116 206.006 L
105.984 206.028 L
106.852 192.215 L
107.72 204.003 L
108.588 188.587 L
109.456 188.201 L
110.324 182.556 L
111.192 186.18 L
112.06 202.141 L
112.928 196.422 L
113.796 209.686 L
114.664 199.776 L
115.532 216.229 L
116.4 181.925 L
117.268 187.135 L
118.136 74.654 L
119.004 45.074 L
119.872 78.761 L
120.74 138.499 L
121.608 192.239 L
122.476 231.256 L
123.344 266.819 L
124.212 264.799 L
125.08 267.407 L
125.948 273.391 L
126.816 259.004 L
127.684 246.784 L
128.552 232.679 L
129.42 215.934 L
130.288 200.095 L
131.156 199.442 L
132.024 197.499 L
132.892 177.926 L
133.76 171.341 L
134.628 184.891 L
135.496 191.666 L
136.364 195.282 L
137.232 200.2 L
138.1 205.809 L
138.968 198.1 L
139.836 214.46 L
140.704 212.124 L
141.572 212.614 L
142.44 200.19 L
143.308 202.635 L
144.176 202.283 L
145.044 182.748 L
145.912 191.965 L
146.78 174.766 L
147.648 190.809 L
148.516 170.122 L
149.384 193.289 L
150.252 186.148 L
151.12 193.394 L
151.988 209.355 L
152.856 205.006 L
153.724 204.771 L
154.592 220.487 L
155.46 205.336 L
156.328 192.958 L
157.196 193.394 L
158.064 200.324 L
158.932 205.597 L
159.8 217.407 L
160.668 212.873 L
161.536 215.096 L
162.404 214.934 L
163.272 214.575 L
164.14 202.874 L
165.008 191.751 L
165.876 181.735 L
166.744 190.475 L
167.612 214.606 L
168.48 200.895 L
169.348 203.624 L
170.216 201.071 L
171.084 204.659 L
171.952 200.751 L
172.82 201.168 L
173.688 183.623 L
174.556 198.512 L
175.424 193.094 L
176.292 193.961 L
177.16 193.043 L
178.028 194.426 L
178.896 188.716 L
179.764 192.563 L
180.632 185.862 L
181.5 176.005 L
182.368 184.404 L
183.236 198.99 L
184.104 209.68 L
184.972 210.283 L
185.84 222.027 L
186.708 243.652 L
187.576 230.688 L
188.444 205.092 L
189.312 193.164 L
190.18 185.943 L
191.048 193.764 L
191.916 188.317 L
192.784 197.075 L
193.652 204.762 L
194.52 183.735 L
195.388 159.321 L
196.256 165.246 L
197.124 181.453 L
197.992 181.096 L
198.86 189.39 L
199.728 185.625 L
200.596 189.096 L
201.464 194.849 L
202.332 203.106 L
203.2 205.018 L
204.068 197.686 L
204.936 213.338 L
205.804 203.125 L
206.672 208.417 L
207.54 206.634 L
208.408 204.079 L
209.276 208.714 L
210.144 203.618 L
211.012 195.771 L
211.88 201.415 L
212.748 209.155 L
213.616 211.741 L
214.484 210.597 L
215.352 203.179 L
216.22 182.518 L
217.088 208.977 L
217.956 202.845 L
218.824 205.538 L
219.692 201.24 L
220.56 203.143 L
221.428 210.017 L
222.296 224.579 L
223.164 218.437 L
224.032 200.674 L
224.9 196.945 L
225.768 195.66 L
226.636 170.523 L
227.504 164.936 L
228.372 172.193 L
229.24 198.011 L
230.108 205.059 L
230.976 216.243 L
231.844 208.649 L
232.712 203.403 L
233.58 205.801 L
234.448 202.755 L
235.316 199.858 L
236.184 201.223 L
237.052 206.037 L
237.92 212.312 L
238.788 211.767 L
239.656 202.618 L
240.524 208.201 L
241.392 209.479 L
242.26 199.153 L
243.128 227.446 L
243.996 207.486 L
244.864 217.211 L
245.732 196.419 L
246.6 186.516 L
247.468 183.754 L
248.336 175.008 L
249.204 208.946 L
250.072 211.371 L
250.94 209.002 L
251.808 195.2 L
252.676 184.886 L
253.544 186.519 L
254.412 194.859 L
255.28 196.436 L
256.148 215.92 L
257.016 210.63 L
257.884 204.606 L
258.752 210.22 L
259.62 222.382 L
260.488 206.709 L
261.356 209.342 L
262.224 210.037 L
263.092 212.016 L
263.96 204.817 L
264.828 204.752 L
265.696 214.331 L
266.564 188.145 L
267.432 185.498 L
268.3 190.651 L
269.168 202.926 L
270.036 181.141 L
270.904 199.337 L
271.772 205.901 L
272.64 192.669 L
273.508 191.857 L
274.376 202.289 L
275.244 206.47 L
276.112 228.844 L
276.98 211.419 L
277.848 218.705 L
278.716 200.485 L
279.584 201.518 L
280.452 202.698 L
281.32 193.548 L
282.188 193.774 L
283.056 190.952 L
283.924 190.421 L
284.792 185.067 L
285.66 193.843 L
286.528 181.74 L
287.396 187.301 L
288.264 185.984 L
289.132 199.031 L
290 213.797 L
290.868 205.313 L
291.736 196.68 L
292.604 191.345 L
293.472 206.73 L
294.34 207.98 L
295.208 206.15 L
296.076 201.081 L
296.944 194.987 L
297.812 200.966 L
298.68 205.025 L
299.548 214.773 L
300.416 214.993 L
301.284 214.59 L
302.152 225.429 L
303.02 215.185 L
303.888 208.328 L
304.756 214.465 L
305.624 211.307 L
306.492 205.194 L
307.36 201.121 L
308.228 196.752 L
309.096 214.159 L
309.964 206.035 L
310.832 203.463 L
311.7 218.014 L
312.568 199.406 L
313.436 185.177 L
314.304 186.708 L
315.172 200.658 L
316.04 201.204 L
316.908 216.934 L
317.776 219.763 L
318.644 212.103 L
319.512 226.5 L
320.38 210.374 L
321.248 216.091 L
322.116 213.704 L
322.984 197.921 L
323.852 193.453 L
324.72 208 L
325.588 212.216 L
326.456 196 L
327.324 189.356 L
328.192 188.326 L
329.06 198.294 L
329.928 192.371 L
330.796 192.882 L
331.664 190.538 L
332.532 208.658 L
333.4 219.605 L
334.268 210.268 L
335.136 214.556 L
336.004 220.269 L
336.872 222.061 L
337.74 219.114 L
338.608 217.566 L
339.476 210.713 L
340.344 208.106 L
341.212 222.185 L
342.08 207.092 L
342.948 204.746 L
343.816 204.079 L
344.684 181.617 L
345.552 184.951 L
346.42 204.105 L
347.288 206.895 L
348.156 207.385 L
349.024 202.757 L
349.892 210.132 L
350.76 204.227 L
351.628 223.535 L
352.496 213.94 L
353.364 209.299 L
354.232 200.186 L
355.1 200.03 L
355.968 192.384 L
356.836 199.444 L
357.704 183.12 L
358.572 199.495 L
359.44 196.782 L
360.308 227.011 L
361.176 217.55 L
362.044 200.911 L
362.912 188.803 L
363.78 202.248 L
364.648 183.332 L
365.516 195.877 L
366.384 205.739 L
367.252 216.184 L
368.12 204.982 L
368.988 198.063 L
369.856 174.005 L
370.724 199.92 L
371.592 198.92 L
372.46 197.156 L
373.328 214.739 L
374.196 241.09 L
375.064 249.81 L
375.932 228.184 L
376.8 229.581 L
377.668 224.078 L
378.536 222.299 L
379.404 204.296 L
380.272 212.293 L
381.14 204.697 L
382.008 210.449 L
382.876 190.036 L
383.744 196.96 L
384.612 200.393 L
385.48 188.151 L
386.348 185.12 L
387.216 208.171 L
388.084 199.777 L
388.952 203.961 L
389.82 210.104 L
390.688 207.965 L
391.556 204.487 L
392.424 207.029 L
393.292 198.107 L
394.16 185.597 L
395.028 195.18 L
395.896 190.292 L
396.764 216.57 L
397.632 207.802 L
398.5 193.518 L
399.368 216.22 L
400.236 359.844 L
401.104 353.183 L
401.972 275.256 L
402.84 209.316 L
403.708 156.541 L
404.576 91.803 L
405.444 69.513 L
406.312 77.653 L
407.18 102.471 L
408.048 126.084 L
408.916 158.537 L
409.784 178.576 L
410.652 229.059 L
411.52 224.233 L
412.388 223.882 L
413.256 224.283 L
414.124 208.903 L
414.992 208.42 L
415.86 214.581 L
416.728 222.468 L
417.596 240.252 L
418.464 216.123 L
419.332 215.988 L
420.2 207.104 L
421.068 216.831 L
421.936 191.186 L
422.804 180.714 L
423.672 197.684 L
424.54 179.879 L
425.408 184.751 L
426.276 165.316 L
427.144 182.799 L
428.012 232.223 L
428.88 268.959 L
429.748 289.474 L
430.616 283.293 L
431.484 279.576 L
432.352 251.471 L
433.22 221.462 L
434.088 191.371 L
434.956 185.518 L
435.824 170.96 L
436.692 182.03 L
437.56 151.622 L
438.428 150.28 L
439.296 131.092 L
440.164 167.77 L
441.032 172.535 L
441.9 159.93 L
442.768 184.845 L
443.636 187.085 L
444.504 219.138 L
445.372 249.699 L
446.24 239.35 L
447.108 249.353 L
447.976 229.855 L
448.844 202.629 L
449.712 170.293 L
450.58 170.077 L
451.448 177.85 L
452.316 194.732 L
453.184 207.005 L
454.052 217.391 L
454.92 237.571 L
455.788 209.641 L
456.656 204.411 L
457.524 201.629 L
458.392 200.726 L
459.26 188.89 L
460.128 200.082 L
460.996 199.097 L
461.864 206.207 L
462.732 174.717 L
463.6 179.597 L
464.468 196.665 L
465.336 211.685 L
466.204 227.203 L
467.072 219.403 L
467.94 221.922 L
S
GR
GS
[0.75 0 0 0.75 0 0] CT
1 0 0 RC
1 LJ
0.667 LW
N
73.868 151.997 M
74.736 182.746 L
75.604 199.368 L
76.472 220.009 L
77.34 205.591 L
78.208 198.251 L
79.076 196.219 L
79.944 200.393 L
80.812 183.192 L
81.68 196.428 L
82.548 208.769 L
83.416 212.495 L
84.284 205.507 L
85.152 220.319 L
86.02 204.193 L
86.888 200.93 L
87.756 199.131 L
88.624 209.306 L
89.492 204.533 L
90.36 191.803 L
91.228 190.186 L
92.096 186.364 L
92.964 195.708 L
93.832 187.742 L
94.7 192.412 L
95.568 200.255 L
96.436 191.538 L
97.304 180.245 L
98.172 185.013 L
99.04 198.685 L
99.908 214.553 L
100.776 208.943 L
101.644 220.326 L
102.512 222.423 L
103.38 213.561 L
104.248 193.953 L
105.116 205.992 L
105.984 206.015 L
106.852 192.204 L
107.72 203.995 L
108.588 188.582 L
109.456 188.198 L
110.324 182.556 L
111.192 186.182 L
112.06 202.145 L
112.928 196.426 L
113.796 209.691 L
114.664 199.782 L
115.532 216.236 L
116.4 181.931 L
117.268 187.142 L
118.136 74.66 L
119.004 45.08 L
119.872 78.767 L
120.74 138.505 L
121.608 192.244 L
122.476 231.261 L
123.344 266.824 L
124.212 264.803 L
125.08 267.412 L
125.948 273.396 L
126.816 259.008 L
127.684 246.789 L
128.552 232.684 L
129.42 215.939 L
130.288 200.099 L
131.156 199.447 L
132.024 197.504 L
132.892 177.931 L
133.76 171.345 L
134.628 184.896 L
135.496 191.671 L
136.364 195.287 L
137.232 200.205 L
138.1 205.814 L
138.968 198.105 L
139.836 214.465 L
140.704 212.129 L
141.572 212.618 L
142.44 200.194 L
143.308 202.64 L
144.176 202.287 L
145.044 182.753 L
145.912 191.969 L
146.78 174.771 L
147.648 190.813 L
148.516 170.127 L
149.384 193.294 L
150.252 186.152 L
151.12 193.399 L
151.988 209.359 L
152.856 205.01 L
153.724 204.776 L
154.592 220.492 L
155.46 205.34 L
156.328 192.963 L
157.196 193.398 L
158.064 200.328 L
158.932 205.602 L
159.8 217.412 L
160.668 212.878 L
161.536 215.1 L
162.404 214.939 L
163.272 214.579 L
164.14 202.878 L
165.008 191.755 L
165.876 181.74 L
166.744 190.479 L
167.612 214.611 L
168.48 200.9 L
169.348 203.629 L
170.216 201.076 L
171.084 204.663 L
171.952 200.756 L
172.82 201.172 L
173.688 183.627 L
174.556 198.516 L
175.424 193.099 L
176.292 193.966 L
177.16 193.048 L
178.028 194.43 L
178.896 188.721 L
179.764 192.568 L
180.632 185.867 L
181.5 176.009 L
182.368 184.409 L
183.236 198.994 L
184.104 209.685 L
184.972 210.287 L
185.84 222.032 L
186.708 243.657 L
187.576 230.692 L
188.444 205.096 L
189.312 193.169 L
190.18 185.948 L
191.048 193.769 L
191.916 188.321 L
192.784 197.08 L
193.652 204.766 L
194.52 183.74 L
195.388 159.326 L
196.256 165.25 L
197.124 181.457 L
197.992 181.101 L
198.86 189.395 L
199.728 185.63 L
200.596 189.1 L
201.464 194.853 L
202.332 203.11 L
203.2 205.022 L
204.068 197.69 L
204.936 213.342 L
205.804 203.13 L
206.672 208.422 L
207.54 206.638 L
208.408 204.083 L
209.276 208.718 L
210.144 203.622 L
211.012 195.776 L
211.88 201.419 L
212.748 209.16 L
213.616 211.745 L
214.484 210.602 L
215.352 203.183 L
216.22 182.522 L
217.088 208.982 L
217.956 202.849 L
218.824 205.543 L
219.692 201.244 L
220.56 203.148 L
221.428 210.022 L
222.296 224.583 L
223.164 218.442 L
224.032 200.678 L
224.9 196.95 L
225.768 195.665 L
226.636 170.527 L
227.504 164.941 L
228.372 172.198 L
229.24 198.015 L
230.108 205.064 L
230.976 216.247 L
231.844 208.654 L
232.712 203.408 L
233.58 205.806 L
234.448 202.76 L
235.316 199.863 L
236.184 201.228 L
237.052 206.041 L
237.92 212.316 L
238.788 211.772 L
239.656 202.623 L
240.524 208.206 L
241.392 209.483 L
242.26 199.158 L
243.128 227.45 L
243.996 207.49 L
244.864 217.216 L
245.732 196.423 L
246.6 186.52 L
247.468 183.759 L
248.336 175.013 L
249.204 208.95 L
250.072 211.375 L
250.94 209.007 L
251.808 195.205 L
252.676 184.891 L
253.544 186.524 L
254.412 194.863 L
255.28 196.44 L
256.148 215.924 L
257.016 210.635 L
257.884 204.611 L
258.752 210.224 L
259.62 222.387 L
260.488 206.714 L
261.356 209.347 L
262.224 210.041 L
263.092 212.021 L
263.96 204.821 L
264.828 204.756 L
265.696 214.335 L
266.564 188.15 L
267.432 185.503 L
268.3 190.656 L
269.168 202.93 L
270.036 181.146 L
270.904 199.341 L
271.772 205.906 L
272.64 192.674 L
273.508 191.862 L
274.376 202.293 L
275.244 206.474 L
276.112 228.848 L
276.98 211.423 L
277.848 218.709 L
278.716 200.49 L
279.584 201.523 L
280.452 202.703 L
281.32 193.552 L
282.188 193.779 L
283.056 190.957 L
283.924 190.426 L
284.792 185.071 L
285.66 193.847 L
286.528 181.744 L
287.396 187.305 L
288.264 185.989 L
289.132 199.036 L
290 213.802 L
290.868 205.317 L
291.736 196.684 L
292.604 191.349 L
293.472 206.735 L
294.34 207.985 L
295.208 206.155 L
296.076 201.086 L
296.944 194.992 L
297.812 200.97 L
298.68 205.029 L
299.548 214.777 L
300.416 214.998 L
301.284 214.594 L
302.152 225.434 L
303.02 215.189 L
303.888 208.332 L
304.756 214.469 L
305.624 211.311 L
306.492 205.198 L
307.36 201.126 L
308.228 196.756 L
309.096 214.164 L
309.964 206.039 L
310.832 203.468 L
311.7 218.019 L
312.568 199.411 L
313.436 185.182 L
314.304 186.712 L
315.172 200.663 L
316.04 201.209 L
316.908 216.938 L
317.776 219.768 L
318.644 212.107 L
319.512 226.504 L
320.38 210.379 L
321.248 216.095 L
322.116 213.708 L
322.984 197.926 L
323.852 193.458 L
324.72 208.004 L
325.588 212.221 L
326.456 196.005 L
327.324 189.36 L
328.192 188.33 L
329.06 198.298 L
329.928 192.376 L
330.796 192.886 L
331.664 190.543 L
332.532 208.662 L
333.4 219.61 L
334.268 210.273 L
335.136 214.561 L
336.004 220.273 L
336.872 222.066 L
337.74 219.119 L
338.608 217.57 L
339.476 210.717 L
340.344 208.111 L
341.212 222.189 L
342.08 207.097 L
342.948 204.75 L
343.816 204.083 L
344.684 181.621 L
345.552 184.955 L
346.42 204.109 L
347.288 206.899 L
348.156 207.39 L
349.024 202.762 L
349.892 210.136 L
350.76 204.231 L
351.628 223.539 L
352.496 213.945 L
353.364 209.304 L
354.232 200.19 L
355.1 200.034 L
355.968 192.388 L
356.836 199.448 L
357.704 183.124 L
358.572 199.499 L
359.44 196.786 L
360.308 227.015 L
361.176 217.555 L
362.044 200.915 L
362.912 188.807 L
363.78 202.252 L
364.648 183.336 L
365.516 195.882 L
366.384 205.743 L
367.252 216.189 L
368.12 204.986 L
368.988 198.067 L
369.856 174.009 L
370.724 199.924 L
371.592 198.924 L
372.46 197.16 L
373.328 214.743 L
374.196 241.095 L
375.064 249.814 L
375.932 228.188 L
376.8 229.585 L
377.668 224.082 L
378.536 222.303 L
379.404 204.301 L
380.272 212.297 L
381.14 204.701 L
382.008 210.453 L
382.876 190.04 L
383.744 196.964 L
384.612 200.398 L
385.48 188.155 L
386.348 185.124 L
387.216 208.175 L
388.084 199.781 L
388.952 203.965 L
389.82 210.108 L
390.688 207.969 L
391.556 204.491 L
392.424 207.033 L
393.292 198.111 L
394.16 185.601 L
395.028 195.184 L
395.896 190.296 L
396.764 216.574 L
397.632 207.806 L
398.5 193.522 L
399.368 216.224 L
400.236 359.848 L
401.104 353.187 L
401.972 275.26 L
402.84 209.32 L
403.708 156.545 L
404.576 91.807 L
405.444 69.517 L
406.312 77.657 L
407.18 102.475 L
408.048 126.088 L
408.916 158.54 L
409.784 178.58 L
410.652 229.063 L
411.52 224.237 L
412.388 223.886 L
413.256 224.287 L
414.124 208.907 L
414.992 208.424 L
415.86 214.585 L
416.728 222.472 L
417.596 240.256 L
418.464 216.127 L
419.332 215.992 L
420.2 207.108 L
421.068 216.835 L
421.936 191.19 L
422.804 180.718 L
423.672 197.688 L
424.54 179.883 L
425.408 184.754 L
426.276 165.32 L
427.144 182.803 L
428.012 232.227 L
428.88 268.963 L
429.748 289.477 L
430.616 283.297 L
431.484 279.579 L
432.352 251.475 L
433.22 221.466 L
434.088 191.374 L
434.956 185.521 L
435.824 170.963 L
436.692 182.033 L
437.56 151.625 L
438.428 150.283 L
439.296 131.095 L
440.164 167.773 L
441.032 172.538 L
441.9 159.933 L
442.768 184.849 L
443.636 187.089 L
444.504 219.142 L
445.372 249.702 L
446.24 239.354 L
447.108 249.356 L
447.976 229.859 L
448.844 202.632 L
449.712 170.297 L
450.58 170.08 L
451.448 177.854 L
452.316 194.735 L
453.184 207.008 L
454.052 217.394 L
454.92 237.574 L
455.788 209.644 L
456.656 204.414 L
457.524 201.632 L
458.392 200.729 L
459.26 188.894 L
460.128 200.085 L
460.996 199.1 L
461.864 206.21 L
462.732 174.72 L
463.6 179.6 L
464.468 196.668 L
465.336 211.688 L
466.204 227.206 L
467.072 219.406 L
467.94 221.925 L
S
GR
GS
[0.75 0 0 0.75 0 0] CT
0 0 1 RC
[10 6] 0 setdash
2 LJ
0.667 LW
N
73.868 71.807 M
74.736 145.202 L
75.604 149.331 L
76.472 151.102 L
77.34 153.882 L
78.208 156.56 L
79.076 158.568 L
79.944 159.653 L
80.812 159.825 L
81.68 159.442 L
82.548 158.953 L
83.416 158.627 L
84.284 158.515 L
85.152 158.571 L
86.02 158.725 L
86.888 158.911 L
87.756 159.08 L
88.624 159.228 L
89.492 159.348 L
90.36 159.451 L
91.228 159.536 L
92.096 159.609 L
92.964 159.68 L
93.832 159.746 L
94.7 159.813 L
95.568 159.881 L
96.436 159.961 L
97.304 160.04 L
98.172 160.116 L
99.04 160.187 L
99.908 160.259 L
100.776 160.335 L
101.644 160.409 L
102.512 160.485 L
103.38 160.559 L
104.248 160.627 L
105.116 160.692 L
105.984 160.753 L
106.852 160.817 L
107.72 160.881 L
108.588 160.945 L
109.456 161.013 L
110.324 161.078 L
111.192 161.15 L
112.06 161.214 L
112.928 161.275 L
113.796 161.336 L
114.664 161.399 L
115.532 161.458 L
116.4 161.518 L
117.268 161.574 L
118.136 161.635 L
119.004 161.678 L
119.872 161.699 L
120.74 161.708 L
121.608 161.706 L
122.476 161.709 L
123.344 161.713 L
124.212 161.722 L
125.08 161.736 L
125.948 161.755 L
126.816 161.778 L
127.684 161.796 L
128.552 161.816 L
129.42 161.838 L
130.288 161.858 L
131.156 161.878 L
132.024 161.9 L
132.892 161.924 L
133.76 161.943 L
134.628 161.96 L
135.496 161.977 L
136.364 161.994 L
137.232 162.005 L
138.1 162.017 L
138.968 162.031 L
139.836 162.048 L
140.704 162.063 L
141.572 162.079 L
142.44 162.098 L
143.308 162.115 L
144.176 162.134 L
145.044 162.149 L
145.912 162.164 L
146.78 162.18 L
147.648 162.194 L
148.516 162.209 L
149.384 162.223 L
150.252 162.243 L
151.12 162.259 L
151.988 162.274 L
152.856 162.29 L
153.724 162.304 L
154.592 162.32 L
155.46 162.338 L
156.328 162.356 L
157.196 162.37 L
158.064 162.383 L
158.932 162.397 L
159.8 162.411 L
160.668 162.425 L
161.536 162.441 L
162.404 162.456 L
163.272 162.47 L
164.14 162.484 L
165.008 162.498 L
165.876 162.511 L
166.744 162.523 L
167.612 162.537 L
168.48 162.553 L
169.348 162.567 L
170.216 162.58 L
171.084 162.594 L
171.952 162.61 L
172.82 162.625 L
173.688 162.637 L
174.556 162.648 L
175.424 162.665 L
176.292 162.68 L
177.16 162.693 L
178.028 162.708 L
178.896 162.721 L
179.764 162.734 L
180.632 162.744 L
181.5 162.754 L
182.368 162.767 L
183.236 162.783 L
184.104 162.798 L
184.972 162.81 L
185.84 162.822 L
186.708 162.837 L
187.576 162.85 L
188.444 162.86 L
189.312 162.874 L
190.18 162.887 L
191.048 162.899 L
191.916 162.91 L
192.784 162.921 L
193.652 162.932 L
194.52 162.945 L
195.388 162.958 L
196.256 162.97 L
197.124 162.981 L
197.992 162.993 L
198.86 163.004 L
199.728 163.016 L
200.596 163.03 L
201.464 163.044 L
202.332 163.056 L
203.2 163.067 L
204.068 163.081 L
204.936 163.094 L
205.804 163.105 L
206.672 163.113 L
207.54 163.123 L
208.408 163.135 L
209.276 163.145 L
210.144 163.158 L
211.012 163.168 L
211.88 163.177 L
212.748 163.19 L
213.616 163.201 L
214.484 163.211 L
215.352 163.221 L
216.22 163.233 L
217.088 163.243 L
217.956 163.255 L
218.824 163.266 L
219.692 163.274 L
220.56 163.281 L
221.428 163.29 L
222.296 163.301 L
223.164 163.313 L
224.032 163.325 L
224.9 163.336 L
225.768 163.345 L
226.636 163.355 L
227.504 163.381 L
228.372 163.423 L
229.24 163.478 L
230.108 163.534 L
230.976 163.589 L
231.844 163.64 L
232.712 163.689 L
233.58 163.733 L
234.448 163.77 L
235.316 163.802 L
236.184 163.835 L
237.052 163.865 L
237.92 163.894 L
238.788 163.921 L
239.656 163.946 L
240.524 163.968 L
241.392 163.991 L
242.26 164.013 L
243.128 164.035 L
243.996 164.056 L
244.864 164.076 L
245.732 164.094 L
246.6 164.11 L
247.468 164.126 L
248.336 164.139 L
249.204 164.152 L
250.072 164.163 L
250.94 164.173 L
251.808 164.181 L
252.676 164.187 L
253.544 164.193 L
254.412 164.197 L
255.28 164.199 L
256.148 164.2 L
257.016 164.2 L
257.884 164.198 L
258.752 164.195 L
259.62 164.19 L
260.488 164.185 L
261.356 164.177 L
262.224 164.168 L
263.092 164.158 L
263.96 164.147 L
264.828 164.133 L
265.696 164.119 L
266.564 164.103 L
267.432 164.086 L
268.3 164.068 L
269.168 164.047 L
270.036 164.025 L
270.904 164.001 L
271.772 163.976 L
272.64 163.949 L
273.508 163.922 L
274.376 163.893 L
275.244 163.864 L
276.112 163.833 L
276.98 163.801 L
277.848 163.766 L
278.716 163.73 L
279.584 163.69 L
280.452 163.649 L
281.32 163.611 L
282.188 163.569 L
283.056 163.526 L
283.924 163.481 L
284.792 163.435 L
285.66 163.388 L
286.528 163.338 L
287.396 163.285 L
288.264 163.232 L
289.132 163.174 L
290 163.12 L
290.868 163.062 L
291.736 163.002 L
292.604 162.939 L
293.472 162.877 L
294.34 162.814 L
295.208 162.75 L
296.076 162.685 L
296.944 162.621 L
297.812 162.552 L
298.68 162.479 L
299.548 162.406 L
300.416 162.334 L
301.284 162.254 L
302.152 162.172 L
303.02 162.092 L
303.888 162.013 L
304.756 161.931 L
305.624 161.85 L
306.492 161.765 L
307.36 161.675 L
308.228 161.583 L
309.096 161.484 L
309.964 161.39 L
310.832 161.296 L
311.7 161.204 L
312.568 161.109 L
313.436 161.006 L
314.304 160.905 L
315.172 160.807 L
316.04 160.709 L
316.908 160.606 L
317.776 160.5 L
318.644 160.393 L
319.512 160.287 L
320.38 160.175 L
321.248 160.058 L
322.116 159.941 L
322.984 159.826 L
323.852 159.704 L
324.72 159.581 L
325.588 159.459 L
326.456 159.34 L
327.324 159.219 L
328.192 159.093 L
329.06 158.962 L
329.928 158.828 L
330.796 158.698 L
331.664 158.576 L
332.532 158.44 L
333.4 158.306 L
334.268 158.176 L
335.136 158.042 L
336.004 157.903 L
336.872 157.761 L
337.74 157.618 L
338.608 157.477 L
339.476 157.332 L
340.344 157.181 L
341.212 157.029 L
342.08 156.882 L
342.948 156.73 L
343.816 156.579 L
344.684 156.426 L
345.552 156.273 L
346.42 156.119 L
347.288 155.971 L
348.156 155.809 L
349.024 155.639 L
349.892 155.477 L
350.76 155.319 L
351.628 155.153 L
352.496 154.992 L
353.364 154.82 L
354.232 154.648 L
355.1 154.477 L
355.968 154.318 L
356.836 154.152 L
357.704 153.984 L
358.572 153.804 L
359.44 153.627 L
360.308 153.456 L
361.176 153.276 L
362.044 153.098 L
362.912 152.917 L
363.78 152.733 L
364.648 152.553 L
365.516 152.377 L
366.384 152.196 L
367.252 152.013 L
368.12 151.827 L
368.988 151.637 L
369.856 151.444 L
370.724 151.245 L
371.592 151.066 L
372.46 150.878 L
373.328 150.684 L
374.196 150.498 L
375.064 150.306 L
375.932 150.111 L
376.8 149.915 L
377.668 149.721 L
378.536 149.519 L
379.404 149.314 L
380.272 149.11 L
381.14 148.906 L
382.008 148.699 L
382.876 148.499 L
383.744 148.3 L
384.612 148.097 L
385.48 147.892 L
386.348 147.687 L
387.216 147.489 L
388.084 147.286 L
388.952 147.075 L
389.82 146.858 L
390.688 146.655 L
391.556 146.444 L
392.424 146.236 L
393.292 146.031 L
394.16 145.818 L
395.028 145.608 L
395.896 145.39 L
396.764 145.174 L
397.632 144.961 L
398.5 144.741 L
399.368 144.523 L
400.236 144.314 L
401.104 144.262 L
401.972 144.38 L
402.84 144.617 L
403.708 144.925 L
404.576 145.244 L
405.444 145.544 L
406.312 145.816 L
407.18 146.053 L
408.048 146.245 L
408.916 146.401 L
409.784 146.546 L
410.652 146.685 L
411.52 146.832 L
412.388 146.976 L
413.256 147.117 L
414.124 147.274 L
414.992 147.432 L
415.86 147.596 L
416.728 147.775 L
417.596 147.953 L
418.464 148.138 L
419.332 148.316 L
420.2 148.497 L
421.068 148.684 L
421.936 148.875 L
422.804 149.062 L
423.672 149.255 L
424.54 149.436 L
425.408 149.609 L
426.276 149.783 L
427.144 149.839 L
428.012 149.763 L
428.88 149.613 L
429.748 149.413 L
430.616 149.202 L
431.484 149.009 L
432.352 148.837 L
433.22 148.694 L
434.088 148.569 L
434.956 148.463 L
435.824 148.379 L
436.692 148.303 L
437.56 148.229 L
438.428 148.148 L
439.296 148.062 L
440.164 147.973 L
441.032 147.88 L
441.9 147.77 L
442.768 147.651 L
443.636 147.538 L
444.504 147.425 L
445.372 147.313 L
446.24 147.203 L
447.108 147.105 L
447.976 147 L
448.844 146.885 L
449.712 146.751 L
450.58 146.619 L
451.448 146.494 L
452.316 146.376 L
453.184 146.255 L
454.052 146.13 L
454.92 146.009 L
455.788 145.9 L
456.656 145.783 L
457.524 145.667 L
458.392 145.54 L
459.26 145.423 L
460.128 145.31 L
460.996 145.198 L
461.864 145.081 L
462.732 144.956 L
463.6 144.829 L
464.468 144.711 L
465.336 144.59 L
466.204 144.465 L
467.072 144.338 L
467.94 144.202 L
S
GR
GS
[0.75 0 0 0.75 0 0] CT
1 0 0 RC
[10 6] 0 setdash
2 LJ
0.667 LW
N
73.868 142.738 M
74.736 148.799 L
75.604 149.756 L
76.472 152.661 L
77.34 155.706 L
78.208 158.205 L
79.076 159.815 L
79.944 160.4 L
80.812 160.143 L
81.68 159.528 L
82.548 158.98 L
83.416 158.679 L
84.284 158.602 L
85.152 158.675 L
86.02 158.822 L
86.888 158.987 L
87.756 159.132 L
88.624 159.259 L
89.492 159.364 L
90.36 159.458 L
91.228 159.539 L
92.096 159.611 L
92.964 159.681 L
93.832 159.747 L
94.7 159.814 L
95.568 159.881 L
96.436 159.961 L
97.304 160.041 L
98.172 160.116 L
99.04 160.187 L
99.908 160.26 L
100.776 160.335 L
101.644 160.409 L
102.512 160.485 L
103.38 160.559 L
104.248 160.627 L
105.116 160.692 L
105.984 160.753 L
106.852 160.817 L
107.72 160.881 L
108.588 160.945 L
109.456 161.013 L
110.324 161.078 L
111.192 161.15 L
112.06 161.214 L
112.928 161.275 L
113.796 161.336 L
114.664 161.399 L
115.532 161.458 L
116.4 161.518 L
117.268 161.574 L
118.136 161.635 L
119.004 161.678 L
119.872 161.699 L
120.74 161.708 L
121.608 161.706 L
122.476 161.709 L
123.344 161.713 L
124.212 161.722 L
125.08 161.736 L
125.948 161.755 L
126.816 161.778 L
127.684 161.796 L
128.552 161.816 L
129.42 161.838 L
130.288 161.858 L
131.156 161.878 L
132.024 161.9 L
132.892 161.924 L
133.76 161.943 L
134.628 161.96 L
135.496 161.977 L
136.364 161.994 L
137.232 162.005 L
138.1 162.017 L
138.968 162.031 L
139.836 162.048 L
140.704 162.063 L
141.572 162.079 L
142.44 162.098 L
143.308 162.115 L
144.176 162.134 L
145.044 162.15 L
145.912 162.164 L
146.78 162.18 L
147.648 162.194 L
148.516 162.209 L
149.384 162.223 L
150.252 162.243 L
151.12 162.259 L
151.988 162.274 L
152.856 162.29 L
153.724 162.304 L
154.592 162.32 L
155.46 162.338 L
156.328 162.356 L
157.196 162.37 L
158.064 162.383 L
158.932 162.397 L
159.8 162.411 L
160.668 162.425 L
161.536 162.441 L
162.404 162.456 L
163.272 162.47 L
164.14 162.484 L
165.008 162.498 L
165.876 162.511 L
166.744 162.523 L
167.612 162.537 L
168.48 162.553 L
169.348 162.567 L
170.216 162.58 L
171.084 162.594 L
171.952 162.61 L
172.82 162.625 L
173.688 162.637 L
174.556 162.648 L
175.424 162.665 L
176.292 162.68 L
177.16 162.693 L
178.028 162.708 L
178.896 162.721 L
179.764 162.734 L
180.632 162.744 L
181.5 162.754 L
182.368 162.767 L
183.236 162.783 L
184.104 162.798 L
184.972 162.81 L
185.84 162.822 L
186.708 162.837 L
187.576 162.85 L
188.444 162.86 L
189.312 162.874 L
190.18 162.887 L
191.048 162.899 L
191.916 162.91 L
192.784 162.921 L
193.652 162.932 L
194.52 162.945 L
195.388 162.958 L
196.256 162.97 L
197.124 162.981 L
197.992 162.993 L
198.86 163.004 L
199.728 163.016 L
200.596 163.03 L
201.464 163.044 L
202.332 163.056 L
203.2 163.067 L
204.068 163.081 L
204.936 163.094 L
205.804 163.105 L
206.672 163.113 L
207.54 163.123 L
208.408 163.135 L
209.276 163.145 L
210.144 163.158 L
211.012 163.168 L
211.88 163.177 L
212.748 163.19 L
213.616 163.201 L
214.484 163.211 L
215.352 163.221 L
216.22 163.233 L
217.088 163.243 L
217.956 163.255 L
218.824 163.266 L
219.692 163.274 L
220.56 163.281 L
221.428 163.29 L
222.296 163.301 L
223.164 163.313 L
224.032 163.325 L
224.9 163.336 L
225.768 163.345 L
226.636 163.355 L
227.504 163.381 L
228.372 163.423 L
229.24 163.478 L
230.108 163.534 L
230.976 163.589 L
231.844 163.64 L
232.712 163.689 L
233.58 163.733 L
234.448 163.77 L
235.316 163.802 L
236.184 163.835 L
237.052 163.865 L
237.92 163.894 L
238.788 163.921 L
239.656 163.946 L
240.524 163.968 L
241.392 163.991 L
242.26 164.013 L
243.128 164.035 L
243.996 164.056 L
244.864 164.076 L
245.732 164.094 L
246.6 164.11 L
247.468 164.126 L
248.336 164.139 L
249.204 164.152 L
250.072 164.163 L
250.94 164.173 L
251.808 164.181 L
252.676 164.187 L
253.544 164.193 L
254.412 164.197 L
255.28 164.199 L
256.148 164.2 L
257.016 164.2 L
257.884 164.198 L
258.752 164.195 L
259.62 164.19 L
260.488 164.185 L
261.356 164.177 L
262.224 164.168 L
263.092 164.158 L
263.96 164.147 L
264.828 164.133 L
265.696 164.119 L
266.564 164.103 L
267.432 164.086 L
268.3 164.068 L
269.168 164.047 L
270.036 164.025 L
270.904 164.001 L
271.772 163.976 L
272.64 163.949 L
273.508 163.922 L
274.376 163.893 L
275.244 163.864 L
276.112 163.833 L
276.98 163.801 L
277.848 163.766 L
278.716 163.73 L
279.584 163.69 L
280.452 163.649 L
281.32 163.611 L
282.188 163.569 L
283.056 163.526 L
283.924 163.481 L
284.792 163.435 L
285.66 163.388 L
286.528 163.338 L
287.396 163.285 L
288.264 163.232 L
289.132 163.174 L
290 163.12 L
290.868 163.062 L
291.736 163.002 L
292.604 162.939 L
293.472 162.877 L
294.34 162.814 L
295.208 162.75 L
296.076 162.685 L
296.944 162.621 L
297.812 162.552 L
298.68 162.479 L
299.548 162.406 L
300.416 162.334 L
301.284 162.254 L
302.152 162.172 L
303.02 162.092 L
303.888 162.013 L
304.756 161.931 L
305.624 161.85 L
306.492 161.765 L
307.36 161.675 L
308.228 161.583 L
309.096 161.484 L
309.964 161.39 L
310.832 161.296 L
311.7 161.204 L
312.568 161.109 L
313.436 161.006 L
314.304 160.905 L
315.172 160.807 L
316.04 160.709 L
316.908 160.606 L
317.776 160.5 L
318.644 160.393 L
319.512 160.287 L
320.38 160.175 L
321.248 160.058 L
322.116 159.941 L
322.984 159.826 L
323.852 159.704 L
324.72 159.581 L
325.588 159.459 L
326.456 159.34 L
327.324 159.219 L
328.192 159.093 L
329.06 158.962 L
329.928 158.828 L
330.796 158.698 L
331.664 158.576 L
332.532 158.44 L
333.4 158.306 L
334.268 158.176 L
335.136 158.042 L
336.004 157.903 L
336.872 157.761 L
337.74 157.618 L
338.608 157.477 L
339.476 157.332 L
340.344 157.181 L
341.212 157.029 L
342.08 156.882 L
342.948 156.73 L
343.816 156.579 L
344.684 156.426 L
345.552 156.273 L
346.42 156.119 L
347.288 155.971 L
348.156 155.809 L
349.024 155.639 L
349.892 155.477 L
350.76 155.319 L
351.628 155.153 L
352.496 154.992 L
353.364 154.82 L
354.232 154.648 L
355.1 154.478 L
355.968 154.318 L
356.836 154.152 L
357.704 153.984 L
358.572 153.804 L
359.44 153.627 L
360.308 153.456 L
361.176 153.276 L
362.044 153.098 L
362.912 152.917 L
363.78 152.733 L
364.648 152.553 L
365.516 152.377 L
366.384 152.196 L
367.252 152.013 L
368.12 151.827 L
368.988 151.637 L
369.856 151.444 L
370.724 151.245 L
371.592 151.066 L
372.46 150.878 L
373.328 150.684 L
374.196 150.498 L
375.064 150.306 L
375.932 150.111 L
376.8 149.915 L
377.668 149.721 L
378.536 149.519 L
379.404 149.314 L
380.272 149.11 L
381.14 148.906 L
382.008 148.699 L
382.876 148.499 L
383.744 148.3 L
384.612 148.097 L
385.48 147.892 L
386.348 147.687 L
387.216 147.489 L
388.084 147.286 L
388.952 147.075 L
389.82 146.858 L
390.688 146.655 L
391.556 146.444 L
392.424 146.236 L
393.292 146.031 L
394.16 145.818 L
395.028 145.608 L
395.896 145.39 L
396.764 145.174 L
397.632 144.961 L
398.5 144.741 L
399.368 144.523 L
400.236 144.314 L
401.104 144.262 L
401.972 144.38 L
402.84 144.617 L
403.708 144.925 L
404.576 145.244 L
405.444 145.544 L
406.312 145.816 L
407.18 146.053 L
408.048 146.245 L
408.916 146.401 L
409.784 146.546 L
410.652 146.685 L
411.52 146.832 L
412.388 146.976 L
413.256 147.117 L
414.124 147.274 L
414.992 147.432 L
415.86 147.596 L
416.728 147.775 L
417.596 147.953 L
418.464 148.138 L
419.332 148.316 L
420.2 148.497 L
421.068 148.684 L
421.936 148.875 L
422.804 149.062 L
423.672 149.255 L
424.54 149.436 L
425.408 149.609 L
426.276 149.783 L
427.144 149.839 L
428.012 149.763 L
428.88 149.613 L
429.748 149.413 L
430.616 149.202 L
431.484 149.009 L
432.352 148.837 L
433.22 148.694 L
434.088 148.569 L
434.956 148.463 L
435.824 148.379 L
436.692 148.303 L
437.56 148.229 L
438.428 148.148 L
439.296 148.062 L
440.164 147.973 L
441.032 147.88 L
441.9 147.77 L
442.768 147.651 L
443.636 147.538 L
444.504 147.425 L
445.372 147.313 L
446.24 147.203 L
447.108 147.105 L
447.976 147 L
448.844 146.885 L
449.712 146.751 L
450.58 146.619 L
451.448 146.494 L
452.316 146.376 L
453.184 146.255 L
454.052 146.13 L
454.92 146.009 L
455.788 145.9 L
456.656 145.783 L
457.524 145.667 L
458.392 145.54 L
459.26 145.423 L
460.128 145.31 L
460.996 145.198 L
461.864 145.081 L
462.732 144.956 L
463.6 144.829 L
464.468 144.711 L
465.336 144.59 L
466.204 144.465 L
467.072 144.338 L
467.94 144.202 L
S
GR
GS
[0.75 0 0 0.75 0 0] CT
1 0 0 RC
[10 6] 0 setdash
2 LJ
0.667 LW
N
73.868 262.262 M
74.736 256.201 L
75.604 255.244 L
76.472 252.339 L
77.34 249.294 L
78.208 246.795 L
79.076 245.185 L
79.944 244.6 L
80.812 244.857 L
81.68 245.472 L
82.548 246.02 L
83.416 246.321 L
84.284 246.398 L
85.152 246.325 L
86.02 246.178 L
86.888 246.013 L
87.756 245.868 L
88.624 245.741 L
89.492 245.636 L
90.36 245.542 L
91.228 245.461 L
92.096 245.389 L
92.964 245.319 L
93.832 245.253 L
94.7 245.186 L
95.568 245.119 L
96.436 245.039 L
97.304 244.959 L
98.172 244.884 L
99.04 244.813 L
99.908 244.74 L
100.776 244.665 L
101.644 244.591 L
102.512 244.515 L
103.38 244.441 L
104.248 244.373 L
105.116 244.308 L
105.984 244.247 L
106.852 244.183 L
107.72 244.119 L
108.588 244.055 L
109.456 243.987 L
110.324 243.922 L
111.192 243.85 L
112.06 243.786 L
112.928 243.725 L
113.796 243.664 L
114.664 243.601 L
115.532 243.542 L
116.4 243.482 L
117.268 243.426 L
118.136 243.365 L
119.004 243.322 L
119.872 243.301 L
120.74 243.292 L
121.608 243.294 L
122.476 243.291 L
123.344 243.287 L
124.212 243.278 L
125.08 243.264 L
125.948 243.245 L
126.816 243.222 L
127.684 243.204 L
128.552 243.184 L
129.42 243.162 L
130.288 243.142 L
131.156 243.122 L
132.024 243.1 L
132.892 243.076 L
133.76 243.057 L
134.628 243.04 L
135.496 243.023 L
136.364 243.006 L
137.232 242.995 L
138.1 242.983 L
138.968 242.969 L
139.836 242.952 L
140.704 242.937 L
141.572 242.921 L
142.44 242.902 L
143.308 242.885 L
144.176 242.866 L
145.044 242.85 L
145.912 242.836 L
146.78 242.82 L
147.648 242.806 L
148.516 242.791 L
149.384 242.777 L
150.252 242.757 L
151.12 242.741 L
151.988 242.726 L
152.856 242.71 L
153.724 242.696 L
154.592 242.68 L
155.46 242.662 L
156.328 242.644 L
157.196 242.63 L
158.064 242.617 L
158.932 242.603 L
159.8 242.589 L
160.668 242.575 L
161.536 242.559 L
162.404 242.544 L
163.272 242.53 L
164.14 242.516 L
165.008 242.502 L
165.876 242.489 L
166.744 242.477 L
167.612 242.463 L
168.48 242.447 L
169.348 242.433 L
170.216 242.42 L
171.084 242.406 L
171.952 242.39 L
172.82 242.375 L
173.688 242.363 L
174.556 242.352 L
175.424 242.335 L
176.292 242.32 L
177.16 242.307 L
178.028 242.292 L
178.896 242.279 L
179.764 242.266 L
180.632 242.256 L
181.5 242.246 L
182.368 242.233 L
183.236 242.217 L
184.104 242.202 L
184.972 242.19 L
185.84 242.178 L
186.708 242.163 L
187.576 242.15 L
188.444 242.14 L
189.312 242.126 L
190.18 242.113 L
191.048 242.101 L
191.916 242.09 L
192.784 242.079 L
193.652 242.068 L
194.52 242.055 L
195.388 242.042 L
196.256 242.03 L
197.124 242.019 L
197.992 242.007 L
198.86 241.996 L
199.728 241.984 L
200.596 241.97 L
201.464 241.956 L
202.332 241.944 L
203.2 241.933 L
204.068 241.919 L
204.936 241.906 L
205.804 241.895 L
206.672 241.887 L
207.54 241.877 L
208.408 241.865 L
209.276 241.855 L
210.144 241.842 L
211.012 241.832 L
211.88 241.823 L
212.748 241.81 L
213.616 241.799 L
214.484 241.789 L
215.352 241.779 L
216.22 241.767 L
217.088 241.757 L
217.956 241.745 L
218.824 241.734 L
219.692 241.726 L
220.56 241.719 L
221.428 241.71 L
222.296 241.699 L
223.164 241.687 L
224.032 241.675 L
224.9 241.664 L
225.768 241.655 L
226.636 241.645 L
227.504 241.619 L
228.372 241.577 L
229.24 241.522 L
230.108 241.466 L
230.976 241.411 L
231.844 241.36 L
232.712 241.311 L
233.58 241.267 L
234.448 241.23 L
235.316 241.198 L
236.184 241.165 L
237.052 241.135 L
237.92 241.106 L
238.788 241.079 L
239.656 241.054 L
240.524 241.032 L
241.392 241.009 L
242.26 240.987 L
243.128 240.965 L
243.996 240.944 L
244.864 240.924 L
245.732 240.906 L
246.6 240.89 L
247.468 240.874 L
248.336 240.861 L
249.204 240.848 L
250.072 240.837 L
250.94 240.827 L
251.808 240.819 L
252.676 240.813 L
253.544 240.807 L
254.412 240.803 L
255.28 240.801 L
256.148 240.8 L
257.016 240.8 L
257.884 240.802 L
258.752 240.805 L
259.62 240.81 L
260.488 240.815 L
261.356 240.823 L
262.224 240.832 L
263.092 240.842 L
263.96 240.853 L
264.828 240.867 L
265.696 240.881 L
266.564 240.897 L
267.432 240.914 L
268.3 240.932 L
269.168 240.953 L
270.036 240.975 L
270.904 240.999 L
271.772 241.024 L
272.64 241.051 L
273.508 241.078 L
274.376 241.107 L
275.244 241.136 L
276.112 241.167 L
276.98 241.199 L
277.848 241.234 L
278.716 241.27 L
279.584 241.31 L
280.452 241.351 L
281.32 241.389 L
282.188 241.431 L
283.056 241.474 L
283.924 241.519 L
284.792 241.565 L
285.66 241.612 L
286.528 241.662 L
287.396 241.715 L
288.264 241.768 L
289.132 241.826 L
290 241.88 L
290.868 241.938 L
291.736 241.998 L
292.604 242.061 L
293.472 242.123 L
294.34 242.186 L
295.208 242.25 L
296.076 242.315 L
296.944 242.379 L
297.812 242.448 L
298.68 242.521 L
299.548 242.594 L
300.416 242.666 L
301.284 242.746 L
302.152 242.828 L
303.02 242.908 L
303.888 242.987 L
304.756 243.069 L
305.624 243.15 L
306.492 243.235 L
307.36 243.325 L
308.228 243.417 L
309.096 243.516 L
309.964 243.61 L
310.832 243.704 L
311.7 243.796 L
312.568 243.891 L
313.436 243.994 L
314.304 244.095 L
315.172 244.193 L
316.04 244.291 L
316.908 244.394 L
317.776 244.5 L
318.644 244.607 L
319.512 244.713 L
320.38 244.825 L
321.248 244.942 L
322.116 245.059 L
322.984 245.174 L
323.852 245.296 L
324.72 245.419 L
325.588 245.541 L
326.456 245.66 L
327.324 245.781 L
328.192 245.907 L
329.06 246.038 L
329.928 246.172 L
330.796 246.302 L
331.664 246.424 L
332.532 246.56 L
333.4 246.694 L
334.268 246.824 L
335.136 246.958 L
336.004 247.097 L
336.872 247.239 L
337.74 247.382 L
338.608 247.523 L
339.476 247.668 L
340.344 247.819 L
341.212 247.971 L
342.08 248.118 L
342.948 248.27 L
343.816 248.421 L
344.684 248.574 L
345.552 248.727 L
346.42 248.881 L
347.288 249.029 L
348.156 249.191 L
349.024 249.361 L
349.892 249.523 L
350.76 249.681 L
351.628 249.847 L
352.496 250.008 L
353.364 250.18 L
354.232 250.352 L
355.1 250.522 L
355.968 250.682 L
356.836 250.848 L
357.704 251.016 L
358.572 251.196 L
359.44 251.373 L
360.308 251.544 L
361.176 251.724 L
362.044 251.902 L
362.912 252.083 L
363.78 252.267 L
364.648 252.447 L
365.516 252.623 L
366.384 252.804 L
367.252 252.987 L
368.12 253.173 L
368.988 253.363 L
369.856 253.556 L
370.724 253.755 L
371.592 253.934 L
372.46 254.122 L
373.328 254.316 L
374.196 254.502 L
375.064 254.694 L
375.932 254.889 L
376.8 255.085 L
377.668 255.279 L
378.536 255.481 L
379.404 255.686 L
380.272 255.89 L
381.14 256.094 L
382.008 256.301 L
382.876 256.501 L
383.744 256.7 L
384.612 256.903 L
385.48 257.108 L
386.348 257.313 L
387.216 257.511 L
388.084 257.714 L
388.952 257.925 L
389.82 258.142 L
390.688 258.345 L
391.556 258.556 L
392.424 258.764 L
393.292 258.969 L
394.16 259.182 L
395.028 259.392 L
395.896 259.61 L
396.764 259.826 L
397.632 260.039 L
398.5 260.259 L
399.368 260.477 L
400.236 260.686 L
401.104 260.738 L
401.972 260.62 L
402.84 260.383 L
403.708 260.075 L
404.576 259.756 L
405.444 259.456 L
406.312 259.184 L
407.18 258.947 L
408.048 258.755 L
408.916 258.599 L
409.784 258.454 L
410.652 258.315 L
411.52 258.168 L
412.388 258.024 L
413.256 257.883 L
414.124 257.726 L
414.992 257.568 L
415.86 257.404 L
416.728 257.225 L
417.596 257.047 L
418.464 256.862 L
419.332 256.684 L
420.2 256.503 L
421.068 256.316 L
421.936 256.125 L
422.804 255.938 L
423.672 255.745 L
424.54 255.564 L
425.408 255.391 L
426.276 255.217 L
427.144 255.161 L
428.012 255.237 L
428.88 255.387 L
429.748 255.587 L
430.616 255.798 L
431.484 255.991 L
432.352 256.163 L
433.22 256.306 L
434.088 256.431 L
434.956 256.537 L
435.824 256.621 L
436.692 256.697 L
437.56 256.771 L
438.428 256.852 L
439.296 256.938 L
440.164 257.027 L
441.032 257.121 L
441.9 257.23 L
442.768 257.349 L
443.636 257.462 L
444.504 257.575 L
445.372 257.687 L
446.24 257.797 L
447.108 257.895 L
447.976 258 L
448.844 258.115 L
449.712 258.249 L
450.58 258.381 L
451.448 258.506 L
452.316 258.624 L
453.184 258.745 L
454.052 258.87 L
454.92 258.991 L
455.788 259.1 L
456.656 259.217 L
457.524 259.333 L
458.392 259.46 L
459.26 259.578 L
460.128 259.69 L
460.996 259.802 L
461.864 259.919 L
462.732 260.044 L
463.6 260.171 L
464.468 260.289 L
465.336 260.41 L
466.204 260.535 L
467.072 260.662 L
467.94 260.798 L
S
GR
GS
[0.75 0 0 0.75 0 0] CT
0 0 1 RC
[10 6] 0 setdash
2 LJ
0.667 LW
N
73.868 333.193 M
74.736 259.798 L
75.604 255.669 L
76.472 253.898 L
77.34 251.118 L
78.208 248.44 L
79.076 246.432 L
79.944 245.347 L
80.812 245.175 L
81.68 245.558 L
82.548 246.047 L
83.416 246.373 L
84.284 246.485 L
85.152 246.429 L
86.02 246.275 L
86.888 246.089 L
87.756 245.92 L
88.624 245.772 L
89.492 245.652 L
90.36 245.549 L
91.228 245.464 L
92.096 245.391 L
92.964 245.32 L
93.832 245.254 L
94.7 245.187 L
95.568 245.119 L
96.436 245.039 L
97.304 244.96 L
98.172 244.884 L
99.04 244.813 L
99.908 244.741 L
100.776 244.665 L
101.644 244.591 L
102.512 244.515 L
103.38 244.441 L
104.248 244.373 L
105.116 244.308 L
105.984 244.247 L
106.852 244.183 L
107.72 244.119 L
108.588 244.055 L
109.456 243.987 L
110.324 243.922 L
111.192 243.85 L
112.06 243.786 L
112.928 243.725 L
113.796 243.664 L
114.664 243.601 L
115.532 243.542 L
116.4 243.482 L
117.268 243.426 L
118.136 243.365 L
119.004 243.322 L
119.872 243.301 L
120.74 243.292 L
121.608 243.294 L
122.476 243.291 L
123.344 243.287 L
124.212 243.278 L
125.08 243.264 L
125.948 243.245 L
126.816 243.222 L
127.684 243.204 L
128.552 243.184 L
129.42 243.162 L
130.288 243.142 L
131.156 243.122 L
132.024 243.1 L
132.892 243.076 L
133.76 243.057 L
134.628 243.04 L
135.496 243.023 L
136.364 243.006 L
137.232 242.995 L
138.1 242.983 L
138.968 242.969 L
139.836 242.952 L
140.704 242.937 L
141.572 242.921 L
142.44 242.902 L
143.308 242.885 L
144.176 242.866 L
145.044 242.851 L
145.912 242.836 L
146.78 242.82 L
147.648 242.806 L
148.516 242.791 L
149.384 242.777 L
150.252 242.757 L
151.12 242.741 L
151.988 242.726 L
152.856 242.71 L
153.724 242.696 L
154.592 242.68 L
155.46 242.662 L
156.328 242.644 L
157.196 242.63 L
158.064 242.617 L
158.932 242.603 L
159.8 242.589 L
160.668 242.575 L
161.536 242.559 L
162.404 242.544 L
163.272 242.53 L
164.14 242.516 L
165.008 242.502 L
165.876 242.489 L
166.744 242.477 L
167.612 242.463 L
168.48 242.447 L
169.348 242.433 L
170.216 242.42 L
171.084 242.406 L
171.952 242.39 L
172.82 242.375 L
173.688 242.363 L
174.556 242.352 L
175.424 242.335 L
176.292 242.32 L
177.16 242.307 L
178.028 242.292 L
178.896 242.279 L
179.764 242.266 L
180.632 242.256 L
181.5 242.246 L
182.368 242.233 L
183.236 242.217 L
184.104 242.202 L
184.972 242.19 L
185.84 242.178 L
186.708 242.163 L
187.576 242.15 L
188.444 242.14 L
189.312 242.126 L
190.18 242.113 L
191.048 242.101 L
191.916 242.09 L
192.784 242.079 L
193.652 242.068 L
194.52 242.055 L
195.388 242.042 L
196.256 242.03 L
197.124 242.019 L
197.992 242.007 L
198.86 241.996 L
199.728 241.984 L
200.596 241.97 L
201.464 241.956 L
202.332 241.944 L
203.2 241.933 L
204.068 241.919 L
204.936 241.906 L
205.804 241.895 L
206.672 241.887 L
207.54 241.877 L
208.408 241.865 L
209.276 241.855 L
210.144 241.842 L
211.012 241.832 L
211.88 241.823 L
212.748 241.81 L
213.616 241.799 L
214.484 241.789 L
215.352 241.779 L
216.22 241.767 L
217.088 241.757 L
217.956 241.745 L
218.824 241.734 L
219.692 241.726 L
220.56 241.719 L
221.428 241.71 L
222.296 241.699 L
223.164 241.687 L
224.032 241.675 L
224.9 241.664 L
225.768 241.655 L
226.636 241.645 L
227.504 241.619 L
228.372 241.577 L
229.24 241.522 L
230.108 241.466 L
230.976 241.411 L
231.844 241.36 L
232.712 241.311 L
233.58 241.267 L
234.448 241.23 L
235.316 241.198 L
236.184 241.165 L
237.052 241.135 L
237.92 241.106 L
238.788 241.079 L
239.656 241.054 L
240.524 241.032 L
241.392 241.009 L
242.26 240.987 L
243.128 240.965 L
243.996 240.944 L
244.864 240.924 L
245.732 240.906 L
246.6 240.89 L
247.468 240.874 L
248.336 240.861 L
249.204 240.848 L
250.072 240.837 L
250.94 240.827 L
251.808 240.819 L
252.676 240.813 L
253.544 240.807 L
254.412 240.803 L
255.28 240.801 L
256.148 240.8 L
257.016 240.8 L
257.884 240.802 L
258.752 240.805 L
259.62 240.81 L
260.488 240.815 L
261.356 240.823 L
262.224 240.832 L
263.092 240.842 L
263.96 240.853 L
264.828 240.867 L
265.696 240.881 L
266.564 240.897 L
267.432 240.914 L
268.3 240.932 L
269.168 240.953 L
270.036 240.975 L
270.904 240.999 L
271.772 241.024 L
272.64 241.051 L
273.508 241.078 L
274.376 241.107 L
275.244 241.136 L
276.112 241.167 L
276.98 241.199 L
277.848 241.234 L
278.716 241.27 L
279.584 241.31 L
280.452 241.351 L
281.32 241.389 L
282.188 241.431 L
283.056 241.474 L
283.924 241.519 L
284.792 241.565 L
285.66 241.612 L
286.528 241.662 L
287.396 241.715 L
288.264 241.768 L
289.132 241.826 L
290 241.88 L
290.868 241.938 L
291.736 241.998 L
292.604 242.061 L
293.472 242.123 L
294.34 242.186 L
295.208 242.25 L
296.076 242.315 L
296.944 242.379 L
297.812 242.448 L
298.68 242.521 L
299.548 242.594 L
300.416 242.666 L
301.284 242.746 L
302.152 242.828 L
303.02 242.908 L
303.888 242.987 L
304.756 243.069 L
305.624 243.15 L
306.492 243.235 L
307.36 243.325 L
308.228 243.417 L
309.096 243.516 L
309.964 243.61 L
310.832 243.704 L
311.7 243.796 L
312.568 243.891 L
313.436 243.994 L
314.304 244.095 L
315.172 244.193 L
316.04 244.291 L
316.908 244.394 L
317.776 244.5 L
318.644 244.607 L
319.512 244.713 L
320.38 244.825 L
321.248 244.942 L
322.116 245.059 L
322.984 245.174 L
323.852 245.296 L
324.72 245.419 L
325.588 245.541 L
326.456 245.66 L
327.324 245.781 L
328.192 245.907 L
329.06 246.038 L
329.928 246.172 L
330.796 246.302 L
331.664 246.424 L
332.532 246.56 L
333.4 246.694 L
334.268 246.824 L
335.136 246.958 L
336.004 247.097 L
336.872 247.239 L
337.74 247.382 L
338.608 247.523 L
339.476 247.668 L
340.344 247.819 L
341.212 247.971 L
342.08 248.118 L
342.948 248.27 L
343.816 248.421 L
344.684 248.574 L
345.552 248.727 L
346.42 248.881 L
347.288 249.029 L
348.156 249.191 L
349.024 249.361 L
349.892 249.523 L
350.76 249.681 L
351.628 249.847 L
352.496 250.008 L
353.364 250.18 L
354.232 250.352 L
355.1 250.523 L
355.968 250.682 L
356.836 250.848 L
357.704 251.016 L
358.572 251.196 L
359.44 251.373 L
360.308 251.544 L
361.176 251.724 L
362.044 251.902 L
362.912 252.083 L
363.78 252.267 L
364.648 252.447 L
365.516 252.623 L
366.384 252.804 L
367.252 252.987 L
368.12 253.173 L
368.988 253.363 L
369.856 253.556 L
370.724 253.755 L
371.592 253.934 L
372.46 254.122 L
373.328 254.316 L
374.196 254.502 L
375.064 254.694 L
375.932 254.889 L
376.8 255.085 L
377.668 255.279 L
378.536 255.481 L
379.404 255.686 L
380.272 255.89 L
381.14 256.094 L
382.008 256.301 L
382.876 256.501 L
383.744 256.7 L
384.612 256.903 L
385.48 257.108 L
386.348 257.313 L
387.216 257.511 L
388.084 257.714 L
388.952 257.925 L
389.82 258.142 L
390.688 258.345 L
391.556 258.556 L
392.424 258.764 L
393.292 258.969 L
394.16 259.182 L
395.028 259.392 L
395.896 259.61 L
396.764 259.826 L
397.632 260.039 L
398.5 260.259 L
399.368 260.477 L
400.236 260.686 L
401.104 260.738 L
401.972 260.62 L
402.84 260.383 L
403.708 260.075 L
404.576 259.756 L
405.444 259.456 L
406.312 259.184 L
407.18 258.947 L
408.048 258.755 L
408.916 258.599 L
409.784 258.454 L
410.652 258.315 L
411.52 258.168 L
412.388 258.024 L
413.256 257.883 L
414.124 257.726 L
414.992 257.568 L
415.86 257.404 L
416.728 257.225 L
417.596 257.047 L
418.464 256.862 L
419.332 256.684 L
420.2 256.503 L
421.068 256.316 L
421.936 256.125 L
422.804 255.938 L
423.672 255.745 L
424.54 255.564 L
425.408 255.391 L
426.276 255.217 L
427.144 255.161 L
428.012 255.237 L
428.88 255.387 L
429.748 255.587 L
430.616 255.798 L
431.484 255.991 L
432.352 256.163 L
433.22 256.306 L
434.088 256.431 L
434.956 256.537 L
435.824 256.621 L
436.692 256.697 L
437.56 256.771 L
438.428 256.852 L
439.296 256.938 L
440.164 257.027 L
441.032 257.121 L
441.9 257.23 L
442.768 257.349 L
443.636 257.462 L
444.504 257.575 L
445.372 257.687 L
446.24 257.797 L
447.108 257.895 L
447.976 258 L
448.844 258.115 L
449.712 258.249 L
450.58 258.381 L
451.448 258.506 L
452.316 258.624 L
453.184 258.745 L
454.052 258.87 L
454.92 258.991 L
455.788 259.1 L
456.656 259.217 L
457.524 259.333 L
458.392 259.46 L
459.26 259.578 L
460.128 259.69 L
460.996 259.802 L
461.864 259.919 L
462.732 260.044 L
463.6 260.171 L
464.468 260.289 L
465.336 260.41 L
466.204 260.535 L
467.072 260.662 L
467.94 260.798 L
S
GR
GS
[0.75 0 0 0.75 0 0] CT
1 GC
N
390 124 M
390 44 L
494 44 L
494 124 L
cp
f
GR
GS
[0.75 0 0 0.75 320.25 40.54717] CT
/Helvetica 12 F
GS
[1 0 0 1 0 0] CT
0 5 moveto 
1 -1 scale
(ekf) t 
GR
GR
GS
[0.75 0 0 0.75 0 0] CT
0 0 1 RC
1 LJ
0.667 LW
N
394 54.063 M
424 54.063 L
S
GR
GS
[0.75 0 0 0.75 320.25 53] CT
/Helvetica 12 F
GS
[1 0 0 1 0 0] CT
0 5 moveto 
1 -1 scale
(ukf) t 
GR
GR
GS
[0.75 0 0 0.75 0 0] CT
1 0 0 RC
1 LJ
0.667 LW
N
394 70.667 M
424 70.667 L
S
GR
GS
[0.75 0 0 0.75 320.25 69.75] CT
/Helvetica 12 F
GS
[1 0 0 1 0 0] CT
0 0 moveto 
1 -1 scale
(ekf) t 
GR
GR
GS
[0.75 0 0 0.75 333 74.25] CT
/Helvetica 9.333 F
GS
[1 0 0 1 0 0] CT
0 0 moveto 
1 -1 scale
( ) t 
GR
GR
GS
[0.75 0 0 0.75 335.25 69.75] CT
/Helvetica 12 F
GS
[1 0 0 1 0 0] CT
0 0 moveto 
1 -1 scale
(3 sigma) t 
GR
GR
GS
[0.75 0 0 0.75 0 0] CT
0 0 1 RC
[10 6] 0 setdash
2 LJ
0.667 LW
N
394 89.786 M
424 89.786 L
S
GR
GS
[0.75 0 0 0.75 320.25 85.5] CT
/Helvetica 12 F
GS
[1 0 0 1 0 0] CT
0 0 moveto 
1 -1 scale
(ukf) t 
GR
GR
GS
[0.75 0 0 0.75 333 90] CT
/Helvetica 9.333 F
GS
[1 0 0 1 0 0] CT
0 0 moveto 
1 -1 scale
( ) t 
GR
GR
GS
[0.75 0 0 0.75 335.25 85.5] CT
/Helvetica 12 F
GS
[1 0 0 1 0 0] CT
0 0 moveto 
1 -1 scale
(3 sigma) t 
GR
GR
GS
[0.75 0 0 0.75 0 0] CT
1 0 0 RC
[10 6] 0 setdash
2 LJ
0.667 LW
N
394 111.421 M
424 111.421 L
S
GR
GS
[0.75 0 0 0.75 0 0] CT
0.149 GC
10.0 ML
0.667 LW
N
390 124 M
390 44 L
494 44 L
494 124 L
cp
S
GR
%%Trailer
%%Pages: 1
%%EOF
