%!PS-Adobe-3.0 EPSF-3.0
%%Creator: (MATLAB, The Mathworks, Inc. Version 9.0.0.341360 \(R2016a\). Operating System: Windows 8)
%%Title: C:/Users/Jan/Documents/JC.ISF/isf3/graf4.eps
%%CreationDate: 2017-06-11T16:00:51
%%Pages: (atend)
%%BoundingBox: 0 0 420 315
%%LanguageLevel: 3
%%EndComments
%%BeginProlog
%%BeginResource: procset (Apache XML Graphics Std ProcSet) 1.2 0
%%Version: 1.2 0
%%Copyright: (Copyright 2001-2003,2010 The Apache Software Foundation. License terms: http://www.apache.org/licenses/LICENSE-2.0)
/bd{bind def}bind def
/ld{load def}bd
/GR/grestore ld
/M/moveto ld
/LJ/setlinejoin ld
/C/curveto ld
/f/fill ld
/LW/setlinewidth ld
/GC/setgray ld
/t/show ld
/N/newpath ld
/CT/concat ld
/cp/closepath ld
/S/stroke ld
/L/lineto ld
/CC/setcmykcolor ld
/A/ashow ld
/GS/gsave ld
/RC/setrgbcolor ld
/RM/rmoveto ld
/ML/setmiterlimit ld
/re {4 2 roll M
1 index 0 rlineto
0 exch rlineto
neg 0 rlineto
cp } bd
/_ctm matrix def
/_tm matrix def
/BT { _ctm currentmatrix pop matrix _tm copy pop 0 0 moveto } bd
/ET { _ctm setmatrix } bd
/iTm { _ctm setmatrix _tm concat } bd
/Tm { _tm astore pop iTm 0 0 moveto } bd
/ux 0.0 def
/uy 0.0 def
/F {
  /Tp exch def
  /Tf exch def
  Tf findfont Tp scalefont setfont
  /cf Tf def  /cs Tp def
} bd
/ULS {currentpoint /uy exch def /ux exch def} bd
/ULE {
  /Tcx currentpoint pop def
  gsave
  newpath
  cf findfont cs scalefont dup
  /FontMatrix get 0 get /Ts exch def /FontInfo get dup
  /UnderlinePosition get Ts mul /To exch def
  /UnderlineThickness get Ts mul /Tt exch def
  ux uy To add moveto  Tcx uy To add lineto
  Tt setlinewidth stroke
  grestore
} bd
/OLE {
  /Tcx currentpoint pop def
  gsave
  newpath
  cf findfont cs scalefont dup
  /FontMatrix get 0 get /Ts exch def /FontInfo get dup
  /UnderlinePosition get Ts mul /To exch def
  /UnderlineThickness get Ts mul /Tt exch def
  ux uy To add cs add moveto Tcx uy To add cs add lineto
  Tt setlinewidth stroke
  grestore
} bd
/SOE {
  /Tcx currentpoint pop def
  gsave
  newpath
  cf findfont cs scalefont dup
  /FontMatrix get 0 get /Ts exch def /FontInfo get dup
  /UnderlinePosition get Ts mul /To exch def
  /UnderlineThickness get Ts mul /Tt exch def
  ux uy To add cs 10 mul 26 idiv add moveto Tcx uy To add cs 10 mul 26 idiv add lineto
  Tt setlinewidth stroke
  grestore
} bd
/QT {
/Y22 exch store
/X22 exch store
/Y21 exch store
/X21 exch store
currentpoint
/Y21 load 2 mul add 3 div exch
/X21 load 2 mul add 3 div exch
/X21 load 2 mul /X22 load add 3 div
/Y21 load 2 mul /Y22 load add 3 div
/X22 load /Y22 load curveto
} bd
/SSPD {
dup length /d exch dict def
{
/v exch def
/k exch def
currentpagedevice k known {
/cpdv currentpagedevice k get def
v cpdv ne {
/upd false def
/nullv v type /nulltype eq def
/nullcpdv cpdv type /nulltype eq def
nullv nullcpdv or
{
/upd true def
} {
/sametype v type cpdv type eq def
sametype {
v type /arraytype eq {
/vlen v length def
/cpdvlen cpdv length def
vlen cpdvlen eq {
0 1 vlen 1 sub {
/i exch def
/obj v i get def
/cpdobj cpdv i get def
obj cpdobj ne {
/upd true def
exit
} if
} for
} {
/upd true def
} ifelse
} {
v type /dicttype eq {
v {
/dv exch def
/dk exch def
/cpddv cpdv dk get def
dv cpddv ne {
/upd true def
exit
} if
} forall
} {
/upd true def
} ifelse
} ifelse
} if
} ifelse
upd true eq {
d k v put
} if
} if
} if
} forall
d length 0 gt {
d setpagedevice
} if
} bd
%%EndResource
%%BeginResource: procset (Apache XML Graphics EPS ProcSet) 1.0 0
%%Version: 1.0 0
%%Copyright: (Copyright 2002-2003 The Apache Software Foundation. License terms: http://www.apache.org/licenses/LICENSE-2.0)
/BeginEPSF { %def
/b4_Inc_state save def         % Save state for cleanup
/dict_count countdictstack def % Count objects on dict stack
/op_count count 1 sub def      % Count objects on operand stack
userdict begin                 % Push userdict on dict stack
/showpage { } def              % Redefine showpage, { } = null proc
0 setgray 0 setlinecap         % Prepare graphics state
1 setlinewidth 0 setlinejoin
10 setmiterlimit [ ] 0 setdash newpath
/languagelevel where           % If level not equal to 1 then
{pop languagelevel             % set strokeadjust and
1 ne                           % overprint to their defaults.
{false setstrokeadjust false setoverprint
} if
} if
} bd
/EndEPSF { %def
count op_count sub {pop} repeat            % Clean up stacks
countdictstack dict_count sub {end} repeat
b4_Inc_state restore
} bd
%%EndResource
%FOPBeginFontDict
%%IncludeResource: font Courier-Bold
%%IncludeResource: font Helvetica
%%IncludeResource: font Courier-BoldOblique
%%IncludeResource: font Courier-Oblique
%%IncludeResource: font Times-Roman
%%IncludeResource: font Helvetica-BoldOblique
%%IncludeResource: font Helvetica-Bold
%%IncludeResource: font Helvetica-Oblique
%%IncludeResource: font Times-BoldItalic
%%IncludeResource: font Courier
%%IncludeResource: font Times-Italic
%%IncludeResource: font Times-Bold
%%IncludeResource: font Symbol
%%IncludeResource: font ZapfDingbats
%FOPEndFontDict
%%BeginResource: encoding WinAnsiEncoding
/WinAnsiEncoding [
/.notdef /.notdef /.notdef /.notdef /.notdef
/.notdef /.notdef /.notdef /.notdef /.notdef
/.notdef /.notdef /.notdef /.notdef /.notdef
/.notdef /.notdef /.notdef /.notdef /.notdef
/.notdef /.notdef /.notdef /.notdef /.notdef
/.notdef /.notdef /.notdef /.notdef /.notdef
/.notdef /.notdef /space /exclam /quotedbl
/numbersign /dollar /percent /ampersand /quotesingle
/parenleft /parenright /asterisk /plus /comma
/hyphen /period /slash /zero /one
/two /three /four /five /six
/seven /eight /nine /colon /semicolon
/less /equal /greater /question /at
/A /B /C /D /E
/F /G /H /I /J
/K /L /M /N /O
/P /Q /R /S /T
/U /V /W /X /Y
/Z /bracketleft /backslash /bracketright /asciicircum
/underscore /quoteleft /a /b /c
/d /e /f /g /h
/i /j /k /l /m
/n /o /p /q /r
/s /t /u /v /w
/x /y /z /braceleft /bar
/braceright /asciitilde /bullet /Euro /bullet
/quotesinglbase /florin /quotedblbase /ellipsis /dagger
/daggerdbl /circumflex /perthousand /Scaron /guilsinglleft
/OE /bullet /Zcaron /bullet /bullet
/quoteleft /quoteright /quotedblleft /quotedblright /bullet
/endash /emdash /asciitilde /trademark /scaron
/guilsinglright /oe /bullet /zcaron /Ydieresis
/space /exclamdown /cent /sterling /currency
/yen /brokenbar /section /dieresis /copyright
/ordfeminine /guillemotleft /logicalnot /sfthyphen /registered
/macron /degree /plusminus /twosuperior /threesuperior
/acute /mu /paragraph /middot /cedilla
/onesuperior /ordmasculine /guillemotright /onequarter /onehalf
/threequarters /questiondown /Agrave /Aacute /Acircumflex
/Atilde /Adieresis /Aring /AE /Ccedilla
/Egrave /Eacute /Ecircumflex /Edieresis /Igrave
/Iacute /Icircumflex /Idieresis /Eth /Ntilde
/Ograve /Oacute /Ocircumflex /Otilde /Odieresis
/multiply /Oslash /Ugrave /Uacute /Ucircumflex
/Udieresis /Yacute /Thorn /germandbls /agrave
/aacute /acircumflex /atilde /adieresis /aring
/ae /ccedilla /egrave /eacute /ecircumflex
/edieresis /igrave /iacute /icircumflex /idieresis
/eth /ntilde /ograve /oacute /ocircumflex
/otilde /odieresis /divide /oslash /ugrave
/uacute /ucircumflex /udieresis /yacute /thorn
/ydieresis
] def
%%EndResource
%FOPBeginFontReencode
/Courier-Bold findfont
dup length dict begin
  {1 index /FID ne {def} {pop pop} ifelse} forall
  /Encoding WinAnsiEncoding def
  currentdict
end
/Courier-Bold exch definefont pop
/Helvetica findfont
dup length dict begin
  {1 index /FID ne {def} {pop pop} ifelse} forall
  /Encoding WinAnsiEncoding def
  currentdict
end
/Helvetica exch definefont pop
/Courier-BoldOblique findfont
dup length dict begin
  {1 index /FID ne {def} {pop pop} ifelse} forall
  /Encoding WinAnsiEncoding def
  currentdict
end
/Courier-BoldOblique exch definefont pop
/Courier-Oblique findfont
dup length dict begin
  {1 index /FID ne {def} {pop pop} ifelse} forall
  /Encoding WinAnsiEncoding def
  currentdict
end
/Courier-Oblique exch definefont pop
/Times-Roman findfont
dup length dict begin
  {1 index /FID ne {def} {pop pop} ifelse} forall
  /Encoding WinAnsiEncoding def
  currentdict
end
/Times-Roman exch definefont pop
/Helvetica-BoldOblique findfont
dup length dict begin
  {1 index /FID ne {def} {pop pop} ifelse} forall
  /Encoding WinAnsiEncoding def
  currentdict
end
/Helvetica-BoldOblique exch definefont pop
/Helvetica-Bold findfont
dup length dict begin
  {1 index /FID ne {def} {pop pop} ifelse} forall
  /Encoding WinAnsiEncoding def
  currentdict
end
/Helvetica-Bold exch definefont pop
/Helvetica-Oblique findfont
dup length dict begin
  {1 index /FID ne {def} {pop pop} ifelse} forall
  /Encoding WinAnsiEncoding def
  currentdict
end
/Helvetica-Oblique exch definefont pop
/Times-BoldItalic findfont
dup length dict begin
  {1 index /FID ne {def} {pop pop} ifelse} forall
  /Encoding WinAnsiEncoding def
  currentdict
end
/Times-BoldItalic exch definefont pop
/Courier findfont
dup length dict begin
  {1 index /FID ne {def} {pop pop} ifelse} forall
  /Encoding WinAnsiEncoding def
  currentdict
end
/Courier exch definefont pop
/Times-Italic findfont
dup length dict begin
  {1 index /FID ne {def} {pop pop} ifelse} forall
  /Encoding WinAnsiEncoding def
  currentdict
end
/Times-Italic exch definefont pop
/Times-Bold findfont
dup length dict begin
  {1 index /FID ne {def} {pop pop} ifelse} forall
  /Encoding WinAnsiEncoding def
  currentdict
end
/Times-Bold exch definefont pop
%FOPEndFontReencode
%%EndProlog
%%Page: 1 1
%%PageBoundingBox: 0 0 420 315
%%BeginPageSetup
[1 0 0 -1 0 315] CT
%%EndPageSetup
GS
[0.75 0 0 0.75 0 0] CT
1 GC
N
0 0 560 420 re
f
GR
GS
[0.75 0 0 0.75 0 0] CT
1 GC
N
0 0 560 420 re
f
GR
GS
[0.75 0 0 0.75 0 0] CT
1 GC
N
73 374 M
507 374 L
507 31 L
73 31 L
cp
f
GR
GS
[0.75 0 0 0.75 0 0] CT
0.873 GC
1 LJ
0.667 LW
N
73 374 M
73 31 L
S
GR
GS
[0.75 0 0 0.75 0 0] CT
0.873 GC
1 LJ
0.667 LW
N
116.4 374 M
116.4 31 L
S
GR
GS
[0.75 0 0 0.75 0 0] CT
0.873 GC
1 LJ
0.667 LW
N
159.8 374 M
159.8 31 L
S
GR
GS
[0.75 0 0 0.75 0 0] CT
0.873 GC
1 LJ
0.667 LW
N
203.2 374 M
203.2 31 L
S
GR
GS
[0.75 0 0 0.75 0 0] CT
0.873 GC
1 LJ
0.667 LW
N
246.6 374 M
246.6 31 L
S
GR
GS
[0.75 0 0 0.75 0 0] CT
0.873 GC
1 LJ
0.667 LW
N
290 374 M
290 31 L
S
GR
GS
[0.75 0 0 0.75 0 0] CT
0.873 GC
1 LJ
0.667 LW
N
333.4 374 M
333.4 31 L
S
GR
GS
[0.75 0 0 0.75 0 0] CT
0.873 GC
1 LJ
0.667 LW
N
376.8 374 M
376.8 31 L
S
GR
GS
[0.75 0 0 0.75 0 0] CT
0.873 GC
1 LJ
0.667 LW
N
420.2 374 M
420.2 31 L
S
GR
GS
[0.75 0 0 0.75 0 0] CT
0.873 GC
1 LJ
0.667 LW
N
463.6 374 M
463.6 31 L
S
GR
GS
[0.75 0 0 0.75 0 0] CT
0.873 GC
1 LJ
0.667 LW
N
507 374 M
507 31 L
S
GR
GS
[0.75 0 0 0.75 0 0] CT
0.873 GC
1 LJ
0.667 LW
N
507 374 M
73 374 L
S
GR
GS
[0.75 0 0 0.75 0 0] CT
0.873 GC
1 LJ
0.667 LW
N
507 339.7 M
73 339.7 L
S
GR
GS
[0.75 0 0 0.75 0 0] CT
0.873 GC
1 LJ
0.667 LW
N
507 305.4 M
73 305.4 L
S
GR
GS
[0.75 0 0 0.75 0 0] CT
0.873 GC
1 LJ
0.667 LW
N
507 271.1 M
73 271.1 L
S
GR
GS
[0.75 0 0 0.75 0 0] CT
0.873 GC
1 LJ
0.667 LW
N
507 236.8 M
73 236.8 L
S
GR
GS
[0.75 0 0 0.75 0 0] CT
0.873 GC
1 LJ
0.667 LW
N
507 202.5 M
73 202.5 L
S
GR
GS
[0.75 0 0 0.75 0 0] CT
0.873 GC
1 LJ
0.667 LW
N
507 168.2 M
73 168.2 L
S
GR
GS
[0.75 0 0 0.75 0 0] CT
0.873 GC
1 LJ
0.667 LW
N
507 133.9 M
73 133.9 L
S
GR
GS
[0.75 0 0 0.75 0 0] CT
0.873 GC
1 LJ
0.667 LW
N
507 99.6 M
73 99.6 L
S
GR
GS
[0.75 0 0 0.75 0 0] CT
0.873 GC
1 LJ
0.667 LW
N
507 65.3 M
73 65.3 L
S
GR
GS
[0.75 0 0 0.75 0 0] CT
0.873 GC
1 LJ
0.667 LW
N
507 31 M
73 31 L
S
GR
GS
[0.75 0 0 0.75 0 0] CT
0.149 GC
2 setlinecap
1 LJ
0.667 LW
N
73 374 M
507 374 L
S
GR
GS
[0.75 0 0 0.75 0 0] CT
0.149 GC
2 setlinecap
1 LJ
0.667 LW
N
73 374 M
73 369.66 L
S
GR
GS
[0.75 0 0 0.75 0 0] CT
0.149 GC
2 setlinecap
1 LJ
0.667 LW
N
116.4 374 M
116.4 369.66 L
S
GR
GS
[0.75 0 0 0.75 0 0] CT
0.149 GC
2 setlinecap
1 LJ
0.667 LW
N
159.8 374 M
159.8 369.66 L
S
GR
GS
[0.75 0 0 0.75 0 0] CT
0.149 GC
2 setlinecap
1 LJ
0.667 LW
N
203.2 374 M
203.2 369.66 L
S
GR
GS
[0.75 0 0 0.75 0 0] CT
0.149 GC
2 setlinecap
1 LJ
0.667 LW
N
246.6 374 M
246.6 369.66 L
S
GR
GS
[0.75 0 0 0.75 0 0] CT
0.149 GC
2 setlinecap
1 LJ
0.667 LW
N
290 374 M
290 369.66 L
S
GR
GS
[0.75 0 0 0.75 0 0] CT
0.149 GC
2 setlinecap
1 LJ
0.667 LW
N
333.4 374 M
333.4 369.66 L
S
GR
GS
[0.75 0 0 0.75 0 0] CT
0.149 GC
2 setlinecap
1 LJ
0.667 LW
N
376.8 374 M
376.8 369.66 L
S
GR
GS
[0.75 0 0 0.75 0 0] CT
0.149 GC
2 setlinecap
1 LJ
0.667 LW
N
420.2 374 M
420.2 369.66 L
S
GR
GS
[0.75 0 0 0.75 0 0] CT
0.149 GC
2 setlinecap
1 LJ
0.667 LW
N
463.6 374 M
463.6 369.66 L
S
GR
GS
[0.75 0 0 0.75 0 0] CT
0.149 GC
2 setlinecap
1 LJ
0.667 LW
N
507 374 M
507 369.66 L
S
GR
GS
[0.75 0 0 0.75 54.75 284.50001] CT
0.149 GC
/Helvetica 13.333 F
GS
[1 0 0 1 0 0] CT
-4 14 moveto 
1 -1 scale
(0) t 
GR
GR
GS
[0.75 0 0 0.75 87.3 284.50001] CT
0.149 GC
/Helvetica 13.333 F
GS
[1 0 0 1 0 0] CT
-7.5 14 moveto 
1 -1 scale
(50) t 
GR
GR
GS
[0.75 0 0 0.75 119.85 284.50001] CT
0.149 GC
/Helvetica 13.333 F
GS
[1 0 0 1 0 0] CT
-11 14 moveto 
1 -1 scale
(100) t 
GR
GR
GS
[0.75 0 0 0.75 152.4 284.50001] CT
0.149 GC
/Helvetica 13.333 F
GS
[1 0 0 1 0 0] CT
-11 14 moveto 
1 -1 scale
(150) t 
GR
GR
GS
[0.75 0 0 0.75 184.95 284.50001] CT
0.149 GC
/Helvetica 13.333 F
GS
[1 0 0 1 0 0] CT
-11 14 moveto 
1 -1 scale
(200) t 
GR
GR
GS
[0.75 0 0 0.75 217.5 284.50001] CT
0.149 GC
/Helvetica 13.333 F
GS
[1 0 0 1 0 0] CT
-11 14 moveto 
1 -1 scale
(250) t 
GR
GR
GS
[0.75 0 0 0.75 250.05 284.50001] CT
0.149 GC
/Helvetica 13.333 F
GS
[1 0 0 1 0 0] CT
-11 14 moveto 
1 -1 scale
(300) t 
GR
GR
GS
[0.75 0 0 0.75 282.59999 284.50001] CT
0.149 GC
/Helvetica 13.333 F
GS
[1 0 0 1 0 0] CT
-11 14 moveto 
1 -1 scale
(350) t 
GR
GR
GS
[0.75 0 0 0.75 315.15001 284.50001] CT
0.149 GC
/Helvetica 13.333 F
GS
[1 0 0 1 0 0] CT
-11 14 moveto 
1 -1 scale
(400) t 
GR
GR
GS
[0.75 0 0 0.75 347.7 284.50001] CT
0.149 GC
/Helvetica 13.333 F
GS
[1 0 0 1 0 0] CT
-11 14 moveto 
1 -1 scale
(450) t 
GR
GR
GS
[0.75 0 0 0.75 380.25 284.50001] CT
0.149 GC
/Helvetica 13.333 F
GS
[1 0 0 1 0 0] CT
-11 14 moveto 
1 -1 scale
(500) t 
GR
GR
GS
[0.75 0 0 0.75 217.50016 298.24999] CT
0.149 GC
/Helvetica 14.667 F
GS
[1 0 0 1 0 0] CT
-20.5 16 moveto 
1 -1 scale
(krok k) t 
GR
GR
GS
[0.75 0 0 0.75 0 0] CT
0.149 GC
2 setlinecap
1 LJ
0.667 LW
N
73 374 M
73 31 L
S
GR
GS
[0.75 0 0 0.75 0 0] CT
0.149 GC
2 setlinecap
1 LJ
0.667 LW
N
73 374 M
77.34 374 L
S
GR
GS
[0.75 0 0 0.75 0 0] CT
0.149 GC
2 setlinecap
1 LJ
0.667 LW
N
73 339.7 M
77.34 339.7 L
S
GR
GS
[0.75 0 0 0.75 0 0] CT
0.149 GC
2 setlinecap
1 LJ
0.667 LW
N
73 305.4 M
77.34 305.4 L
S
GR
GS
[0.75 0 0 0.75 0 0] CT
0.149 GC
2 setlinecap
1 LJ
0.667 LW
N
73 271.1 M
77.34 271.1 L
S
GR
GS
[0.75 0 0 0.75 0 0] CT
0.149 GC
2 setlinecap
1 LJ
0.667 LW
N
73 236.8 M
77.34 236.8 L
S
GR
GS
[0.75 0 0 0.75 0 0] CT
0.149 GC
2 setlinecap
1 LJ
0.667 LW
N
73 202.5 M
77.34 202.5 L
S
GR
GS
[0.75 0 0 0.75 0 0] CT
0.149 GC
2 setlinecap
1 LJ
0.667 LW
N
73 168.2 M
77.34 168.2 L
S
GR
GS
[0.75 0 0 0.75 0 0] CT
0.149 GC
2 setlinecap
1 LJ
0.667 LW
N
73 133.9 M
77.34 133.9 L
S
GR
GS
[0.75 0 0 0.75 0 0] CT
0.149 GC
2 setlinecap
1 LJ
0.667 LW
N
73 99.6 M
77.34 99.6 L
S
GR
GS
[0.75 0 0 0.75 0 0] CT
0.149 GC
2 setlinecap
1 LJ
0.667 LW
N
73 65.3 M
77.34 65.3 L
S
GR
GS
[0.75 0 0 0.75 0 0] CT
0.149 GC
2 setlinecap
1 LJ
0.667 LW
N
73 31 M
77.34 31 L
S
GR
GS
[0.75 0 0 0.75 50.75 280.5] CT
0.149 GC
/Helvetica 13.333 F
GS
[1 0 0 1 0 0] CT
-23 5.5 moveto 
1 -1 scale
(-0.2) t 
GR
GR
GS
[0.75 0 0 0.75 50.75 254.77501] CT
0.149 GC
/Helvetica 13.333 F
GS
[1 0 0 1 0 0] CT
-30 5.5 moveto 
1 -1 scale
(-0.15) t 
GR
GR
GS
[0.75 0 0 0.75 50.75 229.05] CT
0.149 GC
/Helvetica 13.333 F
GS
[1 0 0 1 0 0] CT
-23 5.5 moveto 
1 -1 scale
(-0.1) t 
GR
GR
GS
[0.75 0 0 0.75 50.75 203.325] CT
0.149 GC
/Helvetica 13.333 F
GS
[1 0 0 1 0 0] CT
-30 5.5 moveto 
1 -1 scale
(-0.05) t 
GR
GR
GS
[0.75 0 0 0.75 50.75 177.6] CT
0.149 GC
/Helvetica 13.333 F
GS
[1 0 0 1 0 0] CT
-8 5.5 moveto 
1 -1 scale
(0) t 
GR
GR
GS
[0.75 0 0 0.75 50.75 151.875] CT
0.149 GC
/Helvetica 13.333 F
GS
[1 0 0 1 0 0] CT
-26 5.5 moveto 
1 -1 scale
(0.05) t 
GR
GR
GS
[0.75 0 0 0.75 50.75 126.15] CT
0.149 GC
/Helvetica 13.333 F
GS
[1 0 0 1 0 0] CT
-19 5.5 moveto 
1 -1 scale
(0.1) t 
GR
GR
GS
[0.75 0 0 0.75 50.75 100.425] CT
0.149 GC
/Helvetica 13.333 F
GS
[1 0 0 1 0 0] CT
-26 5.5 moveto 
1 -1 scale
(0.15) t 
GR
GR
GS
[0.75 0 0 0.75 50.75 74.7] CT
0.149 GC
/Helvetica 13.333 F
GS
[1 0 0 1 0 0] CT
-19 5.5 moveto 
1 -1 scale
(0.2) t 
GR
GR
GS
[0.75 0 0 0.75 50.75 48.975] CT
0.149 GC
/Helvetica 13.333 F
GS
[1 0 0 1 0 0] CT
-26 5.5 moveto 
1 -1 scale
(0.25) t 
GR
GR
GS
[0.75 0 0 0.75 50.75 23.24999] CT
0.149 GC
/Helvetica 13.333 F
GS
[1 0 0 1 0 0] CT
-19 5.5 moveto 
1 -1 scale
(0.3) t 
GR
GR
GS
[0 -0.75 0.75 0 25.25 151.87487] CT
0.149 GC
/Helvetica 14.667 F
GS
[1 0 0 1 0 0] CT
-47 -4 moveto 
1 -1 scale
(velikost chyby) t 
GR
GR
GS
[0.75 0 0 0.75 217.50021 21.1875] CT
/Helvetica-Bold 14.667 F
GS
[1 0 0 1 0 0] CT
-121 -4 moveto 
1 -1 scale
(V\375voj chyby odhadu a 3 sigma - X) t 
GR
GR
GS
[0.75 0 0 0.75 0 0] CT
1 0 0 RC
1 LJ
0.667 LW
N
73.868 267.142 M
74.736 302.043 L
75.604 284.016 L
76.472 260.103 L
77.34 245.987 L
78.208 262.157 L
79.076 252.752 L
79.944 247.665 L
80.812 247.334 L
81.68 245.184 L
82.548 232.257 L
83.416 236.415 L
84.284 244.09 L
85.152 241.413 L
86.02 235.968 L
86.888 239.708 L
87.756 231.473 L
88.624 230.225 L
89.492 221.674 L
90.36 225.851 L
91.228 231.721 L
92.096 235.772 L
92.964 248.012 L
93.832 255.977 L
94.7 264.399 L
95.568 249.534 L
96.436 245.418 L
97.304 247.87 L
98.172 251.57 L
99.04 248.697 L
99.908 241.272 L
100.776 238.476 L
101.644 227.255 L
102.512 222.908 L
103.38 226.373 L
104.248 231.859 L
105.116 241.573 L
105.984 241.243 L
106.852 244.905 L
107.72 246.982 L
108.588 241.251 L
109.456 243.573 L
110.324 226.859 L
111.192 231.612 L
112.06 233.652 L
112.928 232.386 L
113.796 230.389 L
114.664 235.777 L
115.532 231.689 L
116.4 243.424 L
117.268 236.727 L
118.136 200.766 L
119.004 200.796 L
119.872 204.112 L
120.74 228.626 L
121.608 237.814 L
122.476 253.38 L
123.344 261.4 L
124.212 265.047 L
125.08 261.627 L
125.948 255.907 L
126.816 261.904 L
127.684 258.318 L
128.552 254.701 L
129.42 253.403 L
130.288 251.011 L
131.156 243.589 L
132.024 232.393 L
132.892 232.167 L
133.76 231.884 L
134.628 228.947 L
135.496 226.687 L
136.364 237.755 L
137.232 243.592 L
138.1 245.381 L
138.968 242.099 L
139.836 246.023 L
140.704 246.767 L
141.572 238.312 L
142.44 239.574 L
143.308 231.99 L
144.176 236.241 L
145.044 237.963 L
145.912 236.494 L
146.78 240.93 L
147.648 241.92 L
148.516 244.521 L
149.384 229.531 L
150.252 233.62 L
151.12 236.524 L
151.988 231.593 L
152.856 235.389 L
153.724 230.055 L
154.592 222.766 L
155.46 218.701 L
156.328 223.013 L
157.196 227.086 L
158.064 229.069 L
158.932 229.298 L
159.8 230.786 L
160.668 224.648 L
161.536 224.944 L
162.404 226.65 L
163.272 228.365 L
164.14 229.32 L
165.008 233.472 L
165.876 240.434 L
166.744 237.275 L
167.612 234.523 L
168.48 236.026 L
169.348 239.668 L
170.216 235.374 L
171.084 229.605 L
171.952 229.106 L
172.82 237.508 L
173.688 242.594 L
174.556 230.981 L
175.424 228.507 L
176.292 233.879 L
177.16 229.478 L
178.028 229.763 L
178.896 232.706 L
179.764 239.984 L
180.632 247.75 L
181.5 247.492 L
182.368 236.611 L
183.236 234.594 L
184.104 238.548 L
184.972 239.462 L
185.84 232.841 L
186.708 232.958 L
187.576 241.751 L
188.444 234.041 L
189.312 235.08 L
190.18 238.187 L
191.048 241.531 L
191.916 241.846 L
192.784 245.659 L
193.652 242.036 L
194.52 243.419 L
195.388 242.894 L
196.256 247.045 L
197.124 245.993 L
197.992 247.31 L
198.86 244.381 L
199.728 239.237 L
200.596 235.356 L
201.464 236.942 L
202.332 238.607 L
203.2 229.727 L
204.068 229.082 L
204.936 231.35 L
205.804 239.968 L
206.672 241.349 L
207.54 237.045 L
208.408 244.029 L
209.276 232.431 L
210.144 239.77 L
211.012 244.419 L
211.88 234 L
212.748 237.996 L
213.616 240.711 L
214.484 239.885 L
215.352 233.66 L
216.22 238.004 L
217.088 230.234 L
217.956 228.469 L
218.824 237.679 L
219.692 251.904 L
220.56 246.151 L
221.428 246.254 L
222.296 236.176 L
223.164 230.747 L
224.032 232.406 L
224.9 237.454 L
225.768 232.007 L
226.636 303.36 L
227.504 325.339 L
228.372 308.817 L
229.24 287.833 L
230.108 261.766 L
230.976 235.345 L
231.844 203.431 L
232.712 182.642 L
233.58 184.802 L
234.448 193.173 L
235.316 185.54 L
236.184 188.904 L
237.052 191.646 L
237.92 195.142 L
238.788 209.96 L
239.656 231.861 L
240.524 234.716 L
241.392 243.498 L
242.26 237.535 L
243.128 242.155 L
243.996 240.649 L
244.864 240.423 L
245.732 242.941 L
246.6 244.084 L
247.468 248.895 L
248.336 240.952 L
249.204 235.704 L
250.072 238.101 L
250.94 236.757 L
251.808 240.666 L
252.676 235.767 L
253.544 228.534 L
254.412 224.519 L
255.28 227.762 L
256.148 227.552 L
257.016 237.592 L
257.884 234.134 L
258.752 238.745 L
259.62 242.18 L
260.488 238.114 L
261.356 240.266 L
262.224 239.941 L
263.092 239.64 L
263.96 238.654 L
264.828 239.99 L
265.696 235.955 L
266.564 245.68 L
267.432 243.131 L
268.3 238.843 L
269.168 238.35 L
270.036 233.758 L
270.904 231.064 L
271.772 227.17 L
272.64 229.195 L
273.508 229.026 L
274.376 233.444 L
275.244 237.475 L
276.112 241.371 L
276.98 240.1 L
277.848 240.008 L
278.716 232.363 L
279.584 225.549 L
280.452 237.697 L
281.32 238.3 L
282.188 235.089 L
283.056 239.766 L
283.924 240.735 L
284.792 243.124 L
285.66 245.236 L
286.528 237.907 L
287.396 240.26 L
288.264 227.394 L
289.132 239.253 L
290 235.218 L
290.868 235.339 L
291.736 226.513 L
292.604 228.807 L
293.472 229.278 L
294.34 233.4 L
295.208 240.312 L
296.076 246.027 L
296.944 247.066 L
297.812 240.15 L
298.68 246.769 L
299.548 253.961 L
300.416 240.921 L
301.284 234.432 L
302.152 238.102 L
303.02 242.432 L
303.888 241.677 L
304.756 250.448 L
305.624 248.137 L
306.492 241.512 L
307.36 235.918 L
308.228 221.392 L
309.096 223.752 L
309.964 225.037 L
310.832 231.449 L
311.7 231.027 L
312.568 219.427 L
313.436 221.671 L
314.304 228.977 L
315.172 237.805 L
316.04 235.806 L
316.908 238.649 L
317.776 243.705 L
318.644 247.151 L
319.512 244.418 L
320.38 236.786 L
321.248 236.732 L
322.116 241.027 L
322.984 230.77 L
323.852 227.435 L
324.72 226.108 L
325.588 232.469 L
326.456 235.491 L
327.324 231.101 L
328.192 226.069 L
329.06 220.301 L
329.928 222.652 L
330.796 236.566 L
331.664 226.125 L
332.532 231.95 L
333.4 241.187 L
334.268 242.483 L
335.136 241.825 L
336.004 239.565 L
336.872 238.818 L
337.74 244.358 L
338.608 241.538 L
339.476 235.525 L
340.344 231.116 L
341.212 238.382 L
342.08 234.155 L
342.948 234.328 L
343.816 231.583 L
344.684 232.406 L
345.552 236.413 L
346.42 248.115 L
347.288 237.594 L
348.156 227.413 L
349.024 231.929 L
349.892 237.891 L
350.76 231.473 L
351.628 239.509 L
352.496 228.068 L
353.364 225.923 L
354.232 226.021 L
355.1 239.51 L
355.968 240.472 L
356.836 243.472 L
357.704 233.176 L
358.572 234.23 L
359.44 240.693 L
360.308 235.793 L
361.176 237.671 L
362.044 234.725 L
362.912 230.796 L
363.78 235.035 L
364.648 240.689 L
365.516 240.467 L
366.384 242.615 L
367.252 242.792 L
368.12 238.802 L
368.988 234.281 L
369.856 223.691 L
370.724 241.188 L
371.592 237.29 L
372.46 235.407 L
373.328 245.546 L
374.196 246.355 L
375.064 246.279 L
375.932 244.158 L
376.8 247.768 L
377.668 240.806 L
378.536 235.649 L
379.404 231.468 L
380.272 229.863 L
381.14 225.705 L
382.008 230.84 L
382.876 233.451 L
383.744 231.804 L
384.612 230.414 L
385.48 229.83 L
386.348 239.849 L
387.216 240.027 L
388.084 233.928 L
388.952 228.373 L
389.82 237.343 L
390.688 233.346 L
391.556 235.21 L
392.424 239.902 L
393.292 237.598 L
394.16 240.527 L
395.028 234.81 L
395.896 236.001 L
396.764 239.665 L
397.632 233.777 L
398.5 234.03 L
399.368 244.123 L
400.236 101.451 L
401.104 59.661 L
401.972 74.373 L
402.84 129.678 L
403.708 188.221 L
404.576 242.515 L
405.444 291.131 L
406.312 327.266 L
407.18 336.094 L
408.048 328.322 L
408.916 319.258 L
409.784 304.799 L
410.652 298.681 L
411.52 280.102 L
412.388 258.485 L
413.256 252.265 L
414.124 236.346 L
414.992 229.221 L
415.86 232.793 L
416.728 230.162 L
417.596 236.442 L
418.464 228.619 L
419.332 228.035 L
420.2 234.049 L
421.068 240.95 L
421.936 242.21 L
422.804 251.673 L
423.672 247.797 L
424.54 240.434 L
425.408 238.98 L
426.276 350.072 L
427.144 373.059 L
428.012 364.945 L
428.88 322.984 L
429.748 273.014 L
430.616 232.284 L
431.484 196.124 L
432.352 175.273 L
433.22 158.078 L
434.088 152.102 L
434.956 163.585 L
435.824 176.352 L
436.692 195.804 L
437.56 206.707 L
438.428 217.571 L
439.296 228.654 L
440.164 239.503 L
441.032 233.232 L
441.9 227.206 L
442.768 232.423 L
443.636 233.741 L
444.504 238.329 L
445.372 242.064 L
446.24 256.97 L
447.108 260.966 L
447.976 258.317 L
448.844 240.766 L
449.712 232.217 L
450.58 230.676 L
451.448 232.697 L
452.316 228.608 L
453.184 222.164 L
454.052 221.655 L
454.92 233.722 L
455.788 229.04 L
456.656 231.259 L
457.524 223.491 L
458.392 230.745 L
459.26 236.84 L
460.128 241.978 L
460.996 243.076 L
461.864 239.104 L
462.732 235.063 L
463.6 242.04 L
464.468 243.418 L
465.336 242.828 L
466.204 241.25 L
467.072 231.735 L
467.94 233.35 L
S
GR
GS
[0.75 0 0 0.75 0 0] CT
0 0 1 RC
1 LJ
0.667 LW
N
73.868 268.369 M
74.736 290.967 L
75.604 282.844 L
76.472 262.62 L
77.34 249.247 L
78.208 266.015 L
79.076 256.098 L
79.944 250.553 L
80.812 249.936 L
81.68 247.188 L
82.548 233.537 L
83.416 237.016 L
84.284 244.089 L
85.152 240.959 L
86.02 235.225 L
86.888 238.827 L
87.756 230.529 L
88.624 229.313 L
89.492 220.852 L
90.36 225.177 L
91.228 231.205 L
92.096 235.41 L
92.964 247.794 L
93.832 255.88 L
94.7 264.399 L
95.568 249.603 L
96.436 245.53 L
97.304 248.004 L
98.172 251.707 L
99.04 248.823 L
99.908 241.379 L
100.776 238.559 L
101.644 227.313 L
102.512 222.943 L
103.38 226.388 L
104.248 231.858 L
105.116 241.561 L
105.984 241.224 L
106.852 244.883 L
107.72 246.959 L
108.588 241.23 L
109.456 243.555 L
110.324 226.845 L
111.192 231.602 L
112.06 233.646 L
112.928 232.383 L
113.796 230.388 L
114.664 235.778 L
115.532 231.691 L
116.4 243.427 L
117.268 236.729 L
118.136 200.768 L
119.004 200.798 L
119.872 204.113 L
120.74 228.627 L
121.608 237.815 L
122.476 253.38 L
123.344 261.4 L
124.212 265.046 L
125.08 261.626 L
125.948 255.906 L
126.816 261.903 L
127.684 258.317 L
128.552 254.7 L
129.42 253.402 L
130.288 251.011 L
131.156 243.589 L
132.024 232.392 L
132.892 232.167 L
133.76 231.883 L
134.628 228.946 L
135.496 226.687 L
136.364 237.755 L
137.232 243.592 L
138.1 245.381 L
138.968 242.098 L
139.836 246.023 L
140.704 246.767 L
141.572 238.311 L
142.44 239.574 L
143.308 231.989 L
144.176 236.241 L
145.044 237.963 L
145.912 236.493 L
146.78 240.93 L
147.648 241.919 L
148.516 244.521 L
149.384 229.53 L
150.252 233.62 L
151.12 236.523 L
151.988 231.593 L
152.856 235.388 L
153.724 230.054 L
154.592 222.765 L
155.46 218.701 L
156.328 223.012 L
157.196 227.085 L
158.064 229.068 L
158.932 229.297 L
159.8 230.786 L
160.668 224.647 L
161.536 224.943 L
162.404 226.65 L
163.272 228.364 L
164.14 229.32 L
165.008 233.471 L
165.876 240.434 L
166.744 237.274 L
167.612 234.523 L
168.48 236.026 L
169.348 239.668 L
170.216 235.374 L
171.084 229.604 L
171.952 229.105 L
172.82 237.508 L
173.688 242.594 L
174.556 230.981 L
175.424 228.506 L
176.292 233.879 L
177.16 229.477 L
178.028 229.763 L
178.896 232.706 L
179.764 239.984 L
180.632 247.75 L
181.5 247.492 L
182.368 236.611 L
183.236 234.594 L
184.104 238.547 L
184.972 239.462 L
185.84 232.841 L
186.708 232.957 L
187.576 241.751 L
188.444 234.04 L
189.312 235.079 L
190.18 238.187 L
191.048 241.531 L
191.916 241.845 L
192.784 245.658 L
193.652 242.035 L
194.52 243.419 L
195.388 242.893 L
196.256 247.045 L
197.124 245.992 L
197.992 247.31 L
198.86 244.381 L
199.728 239.237 L
200.596 235.355 L
201.464 236.942 L
202.332 238.606 L
203.2 229.726 L
204.068 229.081 L
204.936 231.349 L
205.804 239.967 L
206.672 241.349 L
207.54 237.044 L
208.408 244.029 L
209.276 232.43 L
210.144 239.769 L
211.012 244.418 L
211.88 234 L
212.748 237.996 L
213.616 240.711 L
214.484 239.885 L
215.352 233.66 L
216.22 238.004 L
217.088 230.234 L
217.956 228.468 L
218.824 237.679 L
219.692 251.904 L
220.56 246.151 L
221.428 246.254 L
222.296 236.176 L
223.164 230.747 L
224.032 232.405 L
224.9 237.453 L
225.768 232.006 L
226.636 303.359 L
227.504 325.339 L
228.372 308.817 L
229.24 287.832 L
230.108 261.766 L
230.976 235.345 L
231.844 203.431 L
232.712 182.642 L
233.58 184.802 L
234.448 193.173 L
235.316 185.54 L
236.184 188.904 L
237.052 191.646 L
237.92 195.142 L
238.788 209.96 L
239.656 231.861 L
240.524 234.716 L
241.392 243.498 L
242.26 237.535 L
243.128 242.155 L
243.996 240.648 L
244.864 240.423 L
245.732 242.941 L
246.6 244.084 L
247.468 248.895 L
248.336 240.952 L
249.204 235.704 L
250.072 238.101 L
250.94 236.757 L
251.808 240.666 L
252.676 235.766 L
253.544 228.534 L
254.412 224.519 L
255.28 227.762 L
256.148 227.552 L
257.016 237.592 L
257.884 234.134 L
258.752 238.745 L
259.62 242.18 L
260.488 238.114 L
261.356 240.266 L
262.224 239.941 L
263.092 239.64 L
263.96 238.654 L
264.828 239.99 L
265.696 235.955 L
266.564 245.681 L
267.432 243.131 L
268.3 238.843 L
269.168 238.351 L
270.036 233.758 L
270.904 231.064 L
271.772 227.17 L
272.64 229.195 L
273.508 229.026 L
274.376 233.444 L
275.244 237.476 L
276.112 241.371 L
276.98 240.1 L
277.848 240.008 L
278.716 232.364 L
279.584 225.549 L
280.452 237.697 L
281.32 238.3 L
282.188 235.089 L
283.056 239.766 L
283.924 240.735 L
284.792 243.124 L
285.66 245.236 L
286.528 237.907 L
287.396 240.261 L
288.264 227.395 L
289.132 239.254 L
290 235.219 L
290.868 235.339 L
291.736 226.514 L
292.604 228.807 L
293.472 229.279 L
294.34 233.4 L
295.208 240.312 L
296.076 246.028 L
296.944 247.067 L
297.812 240.15 L
298.68 246.77 L
299.548 253.961 L
300.416 240.921 L
301.284 234.433 L
302.152 238.103 L
303.02 242.432 L
303.888 241.677 L
304.756 250.449 L
305.624 248.137 L
306.492 241.512 L
307.36 235.918 L
308.228 221.393 L
309.096 223.752 L
309.964 225.038 L
310.832 231.45 L
311.7 231.028 L
312.568 219.427 L
313.436 221.671 L
314.304 228.977 L
315.172 237.805 L
316.04 235.806 L
316.908 238.649 L
317.776 243.706 L
318.644 247.152 L
319.512 244.418 L
320.38 236.786 L
321.248 236.732 L
322.116 241.028 L
322.984 230.771 L
323.852 227.436 L
324.72 226.108 L
325.588 232.47 L
326.456 235.492 L
327.324 231.101 L
328.192 226.07 L
329.06 220.302 L
329.928 222.653 L
330.796 236.567 L
331.664 226.126 L
332.532 231.951 L
333.4 241.188 L
334.268 242.484 L
335.136 241.826 L
336.004 239.565 L
336.872 238.819 L
337.74 244.359 L
338.608 241.539 L
339.476 235.526 L
340.344 231.117 L
341.212 238.383 L
342.08 234.156 L
342.948 234.329 L
343.816 231.584 L
344.684 232.407 L
345.552 236.414 L
346.42 248.116 L
347.288 237.595 L
348.156 227.414 L
349.024 231.93 L
349.892 237.892 L
350.76 231.474 L
351.628 239.51 L
352.496 228.069 L
353.364 225.925 L
354.232 226.022 L
355.1 239.511 L
355.968 240.473 L
356.836 243.473 L
357.704 233.177 L
358.572 234.231 L
359.44 240.694 L
360.308 235.794 L
361.176 237.672 L
362.044 234.727 L
362.912 230.797 L
363.78 235.036 L
364.648 240.69 L
365.516 240.469 L
366.384 242.616 L
367.252 242.794 L
368.12 238.803 L
368.988 234.282 L
369.856 223.693 L
370.724 241.189 L
371.592 237.291 L
372.46 235.408 L
373.328 245.548 L
374.196 246.356 L
375.064 246.281 L
375.932 244.159 L
376.8 247.77 L
377.668 240.808 L
378.536 235.651 L
379.404 231.469 L
380.272 229.865 L
381.14 225.706 L
382.008 230.841 L
382.876 233.452 L
383.744 231.806 L
384.612 230.416 L
385.48 229.832 L
386.348 239.85 L
387.216 240.029 L
388.084 233.93 L
388.952 228.374 L
389.82 237.345 L
390.688 233.348 L
391.556 235.211 L
392.424 239.903 L
393.292 237.6 L
394.16 240.528 L
395.028 234.811 L
395.896 236.003 L
396.764 239.667 L
397.632 233.779 L
398.5 234.032 L
399.368 244.125 L
400.236 101.453 L
401.104 59.662 L
401.972 74.374 L
402.84 129.679 L
403.708 188.222 L
404.576 242.517 L
405.444 291.133 L
406.312 327.267 L
407.18 336.096 L
408.048 328.324 L
408.916 319.259 L
409.784 304.801 L
410.652 298.683 L
411.52 280.103 L
412.388 258.486 L
413.256 252.266 L
414.124 236.348 L
414.992 229.222 L
415.86 232.794 L
416.728 230.163 L
417.596 236.443 L
418.464 228.62 L
419.332 228.036 L
420.2 234.051 L
421.068 240.951 L
421.936 242.212 L
422.804 251.674 L
423.672 247.798 L
424.54 240.436 L
425.408 238.982 L
426.276 350.073 L
427.144 373.06 L
428.012 364.947 L
428.88 322.986 L
429.748 273.016 L
430.616 232.285 L
431.484 196.125 L
432.352 175.274 L
433.22 158.08 L
434.088 152.104 L
434.956 163.586 L
435.824 176.353 L
436.692 195.805 L
437.56 206.709 L
438.428 217.572 L
439.296 228.655 L
440.164 239.504 L
441.032 233.233 L
441.9 227.208 L
442.768 232.424 L
443.636 233.742 L
444.504 238.33 L
445.372 242.065 L
446.24 256.971 L
447.108 260.968 L
447.976 258.318 L
448.844 240.768 L
449.712 232.218 L
450.58 230.678 L
451.448 232.698 L
452.316 228.609 L
453.184 222.166 L
454.052 221.656 L
454.92 233.724 L
455.788 229.042 L
456.656 231.261 L
457.524 223.493 L
458.392 230.746 L
459.26 236.842 L
460.128 241.98 L
460.996 243.077 L
461.864 239.106 L
462.732 235.065 L
463.6 242.041 L
464.468 243.42 L
465.336 242.83 L
466.204 241.251 L
467.072 231.736 L
467.94 233.351 L
S
GR
GS
[0.75 0 0 0.75 0 0] CT
1 0 0 RC
[10 6] 0 setdash
2 LJ
0.667 LW
N
73.868 200.083 M
74.736 204.284 L
75.604 203.819 L
76.472 204.969 L
77.34 206.654 L
78.208 208.267 L
79.076 209.569 L
79.944 210.431 L
80.812 210.788 L
81.68 210.697 L
82.548 210.336 L
83.416 209.939 L
84.284 209.67 L
85.152 209.575 L
86.02 209.618 L
86.888 209.75 L
87.756 209.913 L
88.624 210.074 L
89.492 210.213 L
90.36 210.33 L
91.228 210.429 L
92.096 210.513 L
92.964 210.591 L
93.832 210.665 L
94.7 210.743 L
95.568 210.823 L
96.436 210.904 L
97.304 210.988 L
98.172 211.074 L
99.04 211.157 L
99.908 211.237 L
100.776 211.316 L
101.644 211.397 L
102.512 211.478 L
103.38 211.56 L
104.248 211.643 L
105.116 211.73 L
105.984 211.812 L
106.852 211.894 L
107.72 211.979 L
108.588 212.061 L
109.456 212.146 L
110.324 212.23 L
111.192 212.315 L
112.06 212.398 L
112.928 212.478 L
113.796 212.561 L
114.664 212.642 L
115.532 212.726 L
116.4 212.808 L
117.268 212.897 L
118.136 212.984 L
119.004 213.035 L
119.872 213.054 L
120.74 213.05 L
121.608 213.035 L
122.476 213.022 L
123.344 213.016 L
124.212 213.016 L
125.08 213.027 L
125.948 213.043 L
126.816 213.059 L
127.684 213.079 L
128.552 213.099 L
129.42 213.119 L
130.288 213.138 L
131.156 213.157 L
132.024 213.173 L
132.892 213.188 L
133.76 213.205 L
134.628 213.22 L
135.496 213.231 L
136.364 213.241 L
137.232 213.251 L
138.1 213.261 L
138.968 213.271 L
139.836 213.286 L
140.704 213.296 L
141.572 213.308 L
142.44 213.321 L
143.308 213.337 L
144.176 213.35 L
145.044 213.364 L
145.912 213.38 L
146.78 213.392 L
147.648 213.407 L
148.516 213.418 L
149.384 213.434 L
150.252 213.444 L
151.12 213.457 L
151.988 213.468 L
152.856 213.478 L
153.724 213.49 L
154.592 213.503 L
155.46 213.513 L
156.328 213.528 L
157.196 213.544 L
158.064 213.558 L
158.932 213.57 L
159.8 213.581 L
160.668 213.59 L
161.536 213.602 L
162.404 213.614 L
163.272 213.627 L
164.14 213.639 L
165.008 213.654 L
165.876 213.67 L
166.744 213.686 L
167.612 213.698 L
168.48 213.706 L
169.348 213.72 L
170.216 213.733 L
171.084 213.747 L
171.952 213.76 L
172.82 213.773 L
173.688 213.786 L
174.556 213.801 L
175.424 213.813 L
176.292 213.826 L
177.16 213.839 L
178.028 213.852 L
178.896 213.864 L
179.764 213.878 L
180.632 213.891 L
181.5 213.905 L
182.368 213.92 L
183.236 213.931 L
184.104 213.94 L
184.972 213.949 L
185.84 213.96 L
186.708 213.972 L
187.576 213.98 L
188.444 213.994 L
189.312 214.013 L
190.18 214.031 L
191.048 214.046 L
191.916 214.059 L
192.784 214.072 L
193.652 214.084 L
194.52 214.094 L
195.388 214.11 L
196.256 214.129 L
197.124 214.143 L
197.992 214.152 L
198.86 214.163 L
199.728 214.174 L
200.596 214.188 L
201.464 214.201 L
202.332 214.213 L
203.2 214.223 L
204.068 214.236 L
204.936 214.25 L
205.804 214.261 L
206.672 214.275 L
207.54 214.286 L
208.408 214.299 L
209.276 214.313 L
210.144 214.325 L
211.012 214.339 L
211.88 214.354 L
212.748 214.366 L
213.616 214.377 L
214.484 214.388 L
215.352 214.4 L
216.22 214.415 L
217.088 214.432 L
217.956 214.442 L
218.824 214.455 L
219.692 214.467 L
220.56 214.48 L
221.428 214.492 L
222.296 214.504 L
223.164 214.514 L
224.032 214.527 L
224.9 214.543 L
225.768 214.558 L
226.636 214.572 L
227.504 214.582 L
228.372 214.589 L
229.24 214.593 L
230.108 214.593 L
230.976 214.595 L
231.844 214.598 L
232.712 214.606 L
233.58 214.615 L
234.448 214.62 L
235.316 214.625 L
236.184 214.63 L
237.052 214.633 L
237.92 214.636 L
238.788 214.637 L
239.656 214.64 L
240.524 214.644 L
241.392 214.647 L
242.26 214.649 L
243.128 214.654 L
243.996 214.652 L
244.864 214.656 L
245.732 214.657 L
246.6 214.663 L
247.468 214.668 L
248.336 214.671 L
249.204 214.674 L
250.072 214.668 L
250.94 214.665 L
251.808 214.664 L
252.676 214.666 L
253.544 214.669 L
254.412 214.669 L
255.28 214.665 L
256.148 214.662 L
257.016 214.655 L
257.884 214.652 L
258.752 214.651 L
259.62 214.647 L
260.488 214.641 L
261.356 214.64 L
262.224 214.637 L
263.092 214.633 L
263.96 214.628 L
264.828 214.625 L
265.696 214.621 L
266.564 214.615 L
267.432 214.615 L
268.3 214.612 L
269.168 214.606 L
270.036 214.597 L
270.904 214.594 L
271.772 214.584 L
272.64 214.575 L
273.508 214.57 L
274.376 214.564 L
275.244 214.555 L
276.112 214.546 L
276.98 214.534 L
277.848 214.528 L
278.716 214.519 L
279.584 214.514 L
280.452 214.507 L
281.32 214.498 L
282.188 214.491 L
283.056 214.482 L
283.924 214.473 L
284.792 214.463 L
285.66 214.454 L
286.528 214.443 L
287.396 214.434 L
288.264 214.424 L
289.132 214.414 L
290 214.401 L
290.868 214.387 L
291.736 214.376 L
292.604 214.367 L
293.472 214.357 L
294.34 214.344 L
295.208 214.331 L
296.076 214.319 L
296.944 214.308 L
297.812 214.297 L
298.68 214.284 L
299.548 214.27 L
300.416 214.255 L
301.284 214.241 L
302.152 214.228 L
303.02 214.213 L
303.888 214.202 L
304.756 214.191 L
305.624 214.178 L
306.492 214.166 L
307.36 214.154 L
308.228 214.141 L
309.096 214.128 L
309.964 214.112 L
310.832 214.099 L
311.7 214.086 L
312.568 214.07 L
313.436 214.058 L
314.304 214.048 L
315.172 214.036 L
316.04 214.02 L
316.908 214.005 L
317.776 213.988 L
318.644 213.973 L
319.512 213.96 L
320.38 213.943 L
321.248 213.931 L
322.116 213.916 L
322.984 213.902 L
323.852 213.89 L
324.72 213.877 L
325.588 213.861 L
326.456 213.845 L
327.324 213.833 L
328.192 213.821 L
329.06 213.808 L
329.928 213.791 L
330.796 213.777 L
331.664 213.763 L
332.532 213.749 L
333.4 213.731 L
334.268 213.714 L
335.136 213.701 L
336.004 213.686 L
336.872 213.671 L
337.74 213.656 L
338.608 213.643 L
339.476 213.629 L
340.344 213.616 L
341.212 213.603 L
342.08 213.587 L
342.948 213.574 L
343.816 213.561 L
344.684 213.547 L
345.552 213.536 L
346.42 213.523 L
347.288 213.506 L
348.156 213.49 L
349.024 213.475 L
349.892 213.462 L
350.76 213.448 L
351.628 213.434 L
352.496 213.418 L
353.364 213.405 L
354.232 213.392 L
355.1 213.381 L
355.968 213.369 L
356.836 213.358 L
357.704 213.344 L
358.572 213.333 L
359.44 213.319 L
360.308 213.306 L
361.176 213.287 L
362.044 213.273 L
362.912 213.262 L
363.78 213.253 L
364.648 213.239 L
365.516 213.229 L
366.384 213.214 L
367.252 213.2 L
368.12 213.184 L
368.988 213.172 L
369.856 213.161 L
370.724 213.152 L
371.592 213.138 L
372.46 213.125 L
373.328 213.112 L
374.196 213.098 L
375.064 213.081 L
375.932 213.065 L
376.8 213.057 L
377.668 213.047 L
378.536 213.037 L
379.404 213.027 L
380.272 213.018 L
381.14 213.007 L
382.008 212.997 L
382.876 212.984 L
383.744 212.976 L
384.612 212.966 L
385.48 212.954 L
386.348 212.945 L
387.216 212.936 L
388.084 212.922 L
388.952 212.911 L
389.82 212.9 L
390.688 212.889 L
391.556 212.879 L
392.424 212.87 L
393.292 212.861 L
394.16 212.852 L
395.028 212.845 L
395.896 212.835 L
396.764 212.826 L
397.632 212.813 L
398.5 212.803 L
399.368 212.796 L
400.236 212.785 L
401.104 212.816 L
401.972 212.892 L
402.84 212.998 L
403.708 213.113 L
404.576 213.223 L
405.444 213.329 L
406.312 213.422 L
407.18 213.503 L
408.048 213.575 L
408.916 213.643 L
409.784 213.71 L
410.652 213.779 L
411.52 213.846 L
412.388 213.922 L
413.256 214 L
414.124 214.081 L
414.992 214.164 L
415.86 214.247 L
416.728 214.327 L
417.596 214.407 L
418.464 214.486 L
419.332 214.57 L
420.2 214.653 L
421.068 214.737 L
421.936 214.819 L
422.804 214.904 L
423.672 214.989 L
424.54 215.068 L
425.408 215.151 L
426.276 215.231 L
427.144 215.289 L
428.012 215.328 L
428.88 215.355 L
429.748 215.378 L
430.616 215.405 L
431.484 215.441 L
432.352 215.481 L
433.22 215.526 L
434.088 215.576 L
434.956 215.625 L
435.824 215.672 L
436.692 215.718 L
437.56 215.76 L
438.428 215.805 L
439.296 215.848 L
440.164 215.891 L
441.032 215.926 L
441.9 215.962 L
442.768 216.001 L
443.636 216.037 L
444.504 216.073 L
445.372 216.107 L
446.24 216.139 L
447.108 216.178 L
447.976 216.216 L
448.844 216.257 L
449.712 216.3 L
450.58 216.343 L
451.448 216.382 L
452.316 216.419 L
453.184 216.453 L
454.052 216.487 L
454.92 216.521 L
455.788 216.555 L
456.656 216.596 L
457.524 216.635 L
458.392 216.673 L
459.26 216.711 L
460.128 216.75 L
460.996 216.786 L
461.864 216.822 L
462.732 216.856 L
463.6 216.896 L
464.468 216.933 L
465.336 216.967 L
466.204 217 L
467.072 217.032 L
467.94 217.067 L
S
GR
GS
[0.75 0 0 0.75 0 0] CT
0 0 1 RC
[10 6] 0 setdash
2 LJ
0.667 LW
N
73.868 186.105 M
74.736 202.335 L
75.604 203.8 L
76.472 204.772 L
77.34 206.274 L
78.208 207.834 L
79.076 209.159 L
79.944 210.092 L
80.812 210.552 L
81.68 210.569 L
82.548 210.29 L
83.416 209.931 L
84.284 209.665 L
85.152 209.557 L
86.02 209.587 L
86.888 209.711 L
87.756 209.874 L
88.624 210.041 L
89.492 210.188 L
90.36 210.313 L
91.228 210.419 L
92.096 210.509 L
92.964 210.589 L
93.832 210.665 L
94.7 210.743 L
95.568 210.822 L
96.436 210.903 L
97.304 210.988 L
98.172 211.073 L
99.04 211.156 L
99.908 211.237 L
100.776 211.315 L
101.644 211.397 L
102.512 211.478 L
103.38 211.559 L
104.248 211.643 L
105.116 211.73 L
105.984 211.812 L
106.852 211.894 L
107.72 211.979 L
108.588 212.061 L
109.456 212.146 L
110.324 212.23 L
111.192 212.315 L
112.06 212.398 L
112.928 212.478 L
113.796 212.561 L
114.664 212.642 L
115.532 212.726 L
116.4 212.808 L
117.268 212.897 L
118.136 212.984 L
119.004 213.035 L
119.872 213.054 L
120.74 213.05 L
121.608 213.035 L
122.476 213.022 L
123.344 213.016 L
124.212 213.016 L
125.08 213.027 L
125.948 213.043 L
126.816 213.059 L
127.684 213.079 L
128.552 213.099 L
129.42 213.119 L
130.288 213.138 L
131.156 213.157 L
132.024 213.173 L
132.892 213.188 L
133.76 213.205 L
134.628 213.22 L
135.496 213.231 L
136.364 213.241 L
137.232 213.251 L
138.1 213.261 L
138.968 213.271 L
139.836 213.286 L
140.704 213.296 L
141.572 213.308 L
142.44 213.321 L
143.308 213.337 L
144.176 213.35 L
145.044 213.364 L
145.912 213.38 L
146.78 213.392 L
147.648 213.407 L
148.516 213.418 L
149.384 213.433 L
150.252 213.444 L
151.12 213.457 L
151.988 213.468 L
152.856 213.478 L
153.724 213.49 L
154.592 213.503 L
155.46 213.513 L
156.328 213.528 L
157.196 213.544 L
158.064 213.558 L
158.932 213.57 L
159.8 213.581 L
160.668 213.59 L
161.536 213.602 L
162.404 213.614 L
163.272 213.627 L
164.14 213.639 L
165.008 213.654 L
165.876 213.67 L
166.744 213.686 L
167.612 213.698 L
168.48 213.706 L
169.348 213.72 L
170.216 213.733 L
171.084 213.747 L
171.952 213.76 L
172.82 213.773 L
173.688 213.786 L
174.556 213.801 L
175.424 213.813 L
176.292 213.826 L
177.16 213.839 L
178.028 213.852 L
178.896 213.864 L
179.764 213.878 L
180.632 213.891 L
181.5 213.905 L
182.368 213.92 L
183.236 213.931 L
184.104 213.94 L
184.972 213.949 L
185.84 213.96 L
186.708 213.972 L
187.576 213.98 L
188.444 213.994 L
189.312 214.013 L
190.18 214.031 L
191.048 214.046 L
191.916 214.059 L
192.784 214.072 L
193.652 214.084 L
194.52 214.094 L
195.388 214.11 L
196.256 214.129 L
197.124 214.143 L
197.992 214.152 L
198.86 214.163 L
199.728 214.174 L
200.596 214.188 L
201.464 214.201 L
202.332 214.213 L
203.2 214.223 L
204.068 214.236 L
204.936 214.25 L
205.804 214.261 L
206.672 214.275 L
207.54 214.286 L
208.408 214.299 L
209.276 214.313 L
210.144 214.325 L
211.012 214.339 L
211.88 214.354 L
212.748 214.366 L
213.616 214.377 L
214.484 214.388 L
215.352 214.4 L
216.22 214.415 L
217.088 214.432 L
217.956 214.442 L
218.824 214.455 L
219.692 214.467 L
220.56 214.48 L
221.428 214.492 L
222.296 214.504 L
223.164 214.514 L
224.032 214.527 L
224.9 214.543 L
225.768 214.558 L
226.636 214.572 L
227.504 214.582 L
228.372 214.589 L
229.24 214.593 L
230.108 214.593 L
230.976 214.595 L
231.844 214.598 L
232.712 214.606 L
233.58 214.615 L
234.448 214.62 L
235.316 214.625 L
236.184 214.63 L
237.052 214.633 L
237.92 214.636 L
238.788 214.637 L
239.656 214.64 L
240.524 214.644 L
241.392 214.647 L
242.26 214.649 L
243.128 214.654 L
243.996 214.652 L
244.864 214.656 L
245.732 214.657 L
246.6 214.663 L
247.468 214.668 L
248.336 214.671 L
249.204 214.674 L
250.072 214.668 L
250.94 214.665 L
251.808 214.664 L
252.676 214.666 L
253.544 214.669 L
254.412 214.669 L
255.28 214.665 L
256.148 214.662 L
257.016 214.655 L
257.884 214.652 L
258.752 214.651 L
259.62 214.647 L
260.488 214.641 L
261.356 214.64 L
262.224 214.637 L
263.092 214.633 L
263.96 214.628 L
264.828 214.625 L
265.696 214.621 L
266.564 214.615 L
267.432 214.615 L
268.3 214.612 L
269.168 214.606 L
270.036 214.597 L
270.904 214.594 L
271.772 214.584 L
272.64 214.575 L
273.508 214.57 L
274.376 214.564 L
275.244 214.555 L
276.112 214.546 L
276.98 214.534 L
277.848 214.528 L
278.716 214.519 L
279.584 214.514 L
280.452 214.507 L
281.32 214.498 L
282.188 214.491 L
283.056 214.482 L
283.924 214.473 L
284.792 214.463 L
285.66 214.454 L
286.528 214.443 L
287.396 214.434 L
288.264 214.424 L
289.132 214.414 L
290 214.401 L
290.868 214.387 L
291.736 214.376 L
292.604 214.367 L
293.472 214.357 L
294.34 214.344 L
295.208 214.331 L
296.076 214.319 L
296.944 214.308 L
297.812 214.297 L
298.68 214.284 L
299.548 214.27 L
300.416 214.255 L
301.284 214.241 L
302.152 214.228 L
303.02 214.213 L
303.888 214.202 L
304.756 214.191 L
305.624 214.178 L
306.492 214.166 L
307.36 214.154 L
308.228 214.141 L
309.096 214.128 L
309.964 214.112 L
310.832 214.099 L
311.7 214.086 L
312.568 214.07 L
313.436 214.058 L
314.304 214.048 L
315.172 214.036 L
316.04 214.02 L
316.908 214.005 L
317.776 213.988 L
318.644 213.973 L
319.512 213.96 L
320.38 213.943 L
321.248 213.931 L
322.116 213.916 L
322.984 213.902 L
323.852 213.89 L
324.72 213.877 L
325.588 213.861 L
326.456 213.845 L
327.324 213.833 L
328.192 213.821 L
329.06 213.808 L
329.928 213.791 L
330.796 213.777 L
331.664 213.763 L
332.532 213.749 L
333.4 213.731 L
334.268 213.714 L
335.136 213.701 L
336.004 213.686 L
336.872 213.671 L
337.74 213.656 L
338.608 213.643 L
339.476 213.629 L
340.344 213.616 L
341.212 213.603 L
342.08 213.587 L
342.948 213.574 L
343.816 213.561 L
344.684 213.547 L
345.552 213.536 L
346.42 213.523 L
347.288 213.506 L
348.156 213.49 L
349.024 213.475 L
349.892 213.462 L
350.76 213.448 L
351.628 213.434 L
352.496 213.418 L
353.364 213.405 L
354.232 213.392 L
355.1 213.381 L
355.968 213.369 L
356.836 213.357 L
357.704 213.344 L
358.572 213.333 L
359.44 213.319 L
360.308 213.306 L
361.176 213.287 L
362.044 213.273 L
362.912 213.262 L
363.78 213.253 L
364.648 213.239 L
365.516 213.229 L
366.384 213.214 L
367.252 213.2 L
368.12 213.184 L
368.988 213.172 L
369.856 213.161 L
370.724 213.152 L
371.592 213.138 L
372.46 213.125 L
373.328 213.112 L
374.196 213.098 L
375.064 213.081 L
375.932 213.065 L
376.8 213.057 L
377.668 213.047 L
378.536 213.037 L
379.404 213.027 L
380.272 213.018 L
381.14 213.007 L
382.008 212.997 L
382.876 212.984 L
383.744 212.976 L
384.612 212.966 L
385.48 212.954 L
386.348 212.945 L
387.216 212.936 L
388.084 212.922 L
388.952 212.911 L
389.82 212.9 L
390.688 212.889 L
391.556 212.879 L
392.424 212.87 L
393.292 212.861 L
394.16 212.852 L
395.028 212.845 L
395.896 212.835 L
396.764 212.826 L
397.632 212.813 L
398.5 212.803 L
399.368 212.796 L
400.236 212.785 L
401.104 212.816 L
401.972 212.892 L
402.84 212.998 L
403.708 213.113 L
404.576 213.223 L
405.444 213.329 L
406.312 213.422 L
407.18 213.503 L
408.048 213.575 L
408.916 213.643 L
409.784 213.71 L
410.652 213.779 L
411.52 213.846 L
412.388 213.922 L
413.256 214 L
414.124 214.081 L
414.992 214.164 L
415.86 214.247 L
416.728 214.327 L
417.596 214.407 L
418.464 214.486 L
419.332 214.57 L
420.2 214.653 L
421.068 214.737 L
421.936 214.819 L
422.804 214.904 L
423.672 214.989 L
424.54 215.068 L
425.408 215.151 L
426.276 215.231 L
427.144 215.289 L
428.012 215.328 L
428.88 215.355 L
429.748 215.378 L
430.616 215.405 L
431.484 215.441 L
432.352 215.481 L
433.22 215.526 L
434.088 215.576 L
434.956 215.625 L
435.824 215.672 L
436.692 215.718 L
437.56 215.76 L
438.428 215.805 L
439.296 215.848 L
440.164 215.891 L
441.032 215.926 L
441.9 215.962 L
442.768 216.001 L
443.636 216.037 L
444.504 216.073 L
445.372 216.107 L
446.24 216.139 L
447.108 216.178 L
447.976 216.216 L
448.844 216.257 L
449.712 216.3 L
450.58 216.343 L
451.448 216.382 L
452.316 216.419 L
453.184 216.453 L
454.052 216.487 L
454.92 216.521 L
455.788 216.555 L
456.656 216.596 L
457.524 216.635 L
458.392 216.673 L
459.26 216.711 L
460.128 216.75 L
460.996 216.786 L
461.864 216.822 L
462.732 216.856 L
463.6 216.896 L
464.468 216.933 L
465.336 216.967 L
466.204 217 L
467.072 217.032 L
467.94 217.067 L
S
GR
GS
[0.75 0 0 0.75 0 0] CT
1 0 0 RC
[10 6] 0 setdash
2 LJ
0.667 LW
N
73.868 273.517 M
74.736 269.316 L
75.604 269.781 L
76.472 268.631 L
77.34 266.946 L
78.208 265.333 L
79.076 264.031 L
79.944 263.169 L
80.812 262.812 L
81.68 262.903 L
82.548 263.264 L
83.416 263.661 L
84.284 263.93 L
85.152 264.025 L
86.02 263.982 L
86.888 263.85 L
87.756 263.687 L
88.624 263.526 L
89.492 263.387 L
90.36 263.27 L
91.228 263.171 L
92.096 263.087 L
92.964 263.009 L
93.832 262.935 L
94.7 262.857 L
95.568 262.777 L
96.436 262.696 L
97.304 262.612 L
98.172 262.526 L
99.04 262.443 L
99.908 262.363 L
100.776 262.284 L
101.644 262.203 L
102.512 262.122 L
103.38 262.04 L
104.248 261.957 L
105.116 261.87 L
105.984 261.788 L
106.852 261.706 L
107.72 261.621 L
108.588 261.539 L
109.456 261.454 L
110.324 261.37 L
111.192 261.285 L
112.06 261.202 L
112.928 261.122 L
113.796 261.039 L
114.664 260.958 L
115.532 260.874 L
116.4 260.792 L
117.268 260.703 L
118.136 260.616 L
119.004 260.565 L
119.872 260.546 L
120.74 260.55 L
121.608 260.565 L
122.476 260.578 L
123.344 260.584 L
124.212 260.584 L
125.08 260.573 L
125.948 260.557 L
126.816 260.541 L
127.684 260.521 L
128.552 260.501 L
129.42 260.481 L
130.288 260.462 L
131.156 260.443 L
132.024 260.427 L
132.892 260.412 L
133.76 260.395 L
134.628 260.38 L
135.496 260.369 L
136.364 260.359 L
137.232 260.349 L
138.1 260.339 L
138.968 260.329 L
139.836 260.314 L
140.704 260.304 L
141.572 260.292 L
142.44 260.279 L
143.308 260.263 L
144.176 260.25 L
145.044 260.236 L
145.912 260.22 L
146.78 260.208 L
147.648 260.193 L
148.516 260.182 L
149.384 260.167 L
150.252 260.156 L
151.12 260.143 L
151.988 260.132 L
152.856 260.122 L
153.724 260.11 L
154.592 260.097 L
155.46 260.087 L
156.328 260.072 L
157.196 260.056 L
158.064 260.042 L
158.932 260.03 L
159.8 260.019 L
160.668 260.01 L
161.536 259.998 L
162.404 259.986 L
163.272 259.973 L
164.14 259.961 L
165.008 259.946 L
165.876 259.93 L
166.744 259.914 L
167.612 259.902 L
168.48 259.894 L
169.348 259.88 L
170.216 259.867 L
171.084 259.853 L
171.952 259.84 L
172.82 259.827 L
173.688 259.814 L
174.556 259.799 L
175.424 259.787 L
176.292 259.774 L
177.16 259.761 L
178.028 259.748 L
178.896 259.736 L
179.764 259.722 L
180.632 259.709 L
181.5 259.695 L
182.368 259.68 L
183.236 259.669 L
184.104 259.66 L
184.972 259.651 L
185.84 259.64 L
186.708 259.628 L
187.576 259.62 L
188.444 259.606 L
189.312 259.587 L
190.18 259.569 L
191.048 259.554 L
191.916 259.541 L
192.784 259.528 L
193.652 259.516 L
194.52 259.506 L
195.388 259.49 L
196.256 259.471 L
197.124 259.457 L
197.992 259.448 L
198.86 259.437 L
199.728 259.426 L
200.596 259.412 L
201.464 259.399 L
202.332 259.387 L
203.2 259.377 L
204.068 259.364 L
204.936 259.35 L
205.804 259.339 L
206.672 259.325 L
207.54 259.314 L
208.408 259.301 L
209.276 259.287 L
210.144 259.275 L
211.012 259.261 L
211.88 259.246 L
212.748 259.234 L
213.616 259.223 L
214.484 259.212 L
215.352 259.2 L
216.22 259.185 L
217.088 259.168 L
217.956 259.158 L
218.824 259.145 L
219.692 259.133 L
220.56 259.12 L
221.428 259.108 L
222.296 259.096 L
223.164 259.086 L
224.032 259.073 L
224.9 259.057 L
225.768 259.042 L
226.636 259.028 L
227.504 259.018 L
228.372 259.011 L
229.24 259.007 L
230.108 259.007 L
230.976 259.005 L
231.844 259.002 L
232.712 258.994 L
233.58 258.985 L
234.448 258.98 L
235.316 258.975 L
236.184 258.97 L
237.052 258.967 L
237.92 258.964 L
238.788 258.963 L
239.656 258.96 L
240.524 258.956 L
241.392 258.953 L
242.26 258.951 L
243.128 258.946 L
243.996 258.948 L
244.864 258.944 L
245.732 258.943 L
246.6 258.937 L
247.468 258.932 L
248.336 258.929 L
249.204 258.926 L
250.072 258.932 L
250.94 258.935 L
251.808 258.936 L
252.676 258.934 L
253.544 258.931 L
254.412 258.931 L
255.28 258.935 L
256.148 258.938 L
257.016 258.945 L
257.884 258.948 L
258.752 258.949 L
259.62 258.953 L
260.488 258.959 L
261.356 258.96 L
262.224 258.963 L
263.092 258.967 L
263.96 258.972 L
264.828 258.975 L
265.696 258.979 L
266.564 258.985 L
267.432 258.985 L
268.3 258.988 L
269.168 258.994 L
270.036 259.003 L
270.904 259.006 L
271.772 259.016 L
272.64 259.025 L
273.508 259.03 L
274.376 259.036 L
275.244 259.045 L
276.112 259.054 L
276.98 259.066 L
277.848 259.072 L
278.716 259.081 L
279.584 259.086 L
280.452 259.093 L
281.32 259.102 L
282.188 259.109 L
283.056 259.118 L
283.924 259.127 L
284.792 259.137 L
285.66 259.146 L
286.528 259.157 L
287.396 259.166 L
288.264 259.176 L
289.132 259.186 L
290 259.199 L
290.868 259.213 L
291.736 259.224 L
292.604 259.233 L
293.472 259.243 L
294.34 259.256 L
295.208 259.269 L
296.076 259.281 L
296.944 259.292 L
297.812 259.303 L
298.68 259.316 L
299.548 259.33 L
300.416 259.345 L
301.284 259.359 L
302.152 259.372 L
303.02 259.387 L
303.888 259.398 L
304.756 259.409 L
305.624 259.422 L
306.492 259.434 L
307.36 259.446 L
308.228 259.459 L
309.096 259.471 L
309.964 259.488 L
310.832 259.501 L
311.7 259.514 L
312.568 259.53 L
313.436 259.542 L
314.304 259.552 L
315.172 259.564 L
316.04 259.58 L
316.908 259.595 L
317.776 259.612 L
318.644 259.627 L
319.512 259.64 L
320.38 259.657 L
321.248 259.669 L
322.116 259.684 L
322.984 259.698 L
323.852 259.71 L
324.72 259.723 L
325.588 259.739 L
326.456 259.755 L
327.324 259.767 L
328.192 259.779 L
329.06 259.792 L
329.928 259.809 L
330.796 259.823 L
331.664 259.837 L
332.532 259.852 L
333.4 259.869 L
334.268 259.886 L
335.136 259.899 L
336.004 259.914 L
336.872 259.929 L
337.74 259.944 L
338.608 259.957 L
339.476 259.971 L
340.344 259.984 L
341.212 259.997 L
342.08 260.013 L
342.948 260.026 L
343.816 260.039 L
344.684 260.053 L
345.552 260.064 L
346.42 260.077 L
347.288 260.094 L
348.156 260.11 L
349.024 260.125 L
349.892 260.138 L
350.76 260.152 L
351.628 260.165 L
352.496 260.182 L
353.364 260.195 L
354.232 260.208 L
355.1 260.219 L
355.968 260.231 L
356.836 260.242 L
357.704 260.256 L
358.572 260.267 L
359.44 260.281 L
360.308 260.294 L
361.176 260.313 L
362.044 260.327 L
362.912 260.338 L
363.78 260.347 L
364.648 260.361 L
365.516 260.371 L
366.384 260.386 L
367.252 260.4 L
368.12 260.416 L
368.988 260.428 L
369.856 260.439 L
370.724 260.448 L
371.592 260.462 L
372.46 260.475 L
373.328 260.488 L
374.196 260.502 L
375.064 260.519 L
375.932 260.535 L
376.8 260.543 L
377.668 260.553 L
378.536 260.563 L
379.404 260.573 L
380.272 260.582 L
381.14 260.593 L
382.008 260.603 L
382.876 260.616 L
383.744 260.624 L
384.612 260.634 L
385.48 260.646 L
386.348 260.655 L
387.216 260.664 L
388.084 260.678 L
388.952 260.689 L
389.82 260.7 L
390.688 260.711 L
391.556 260.721 L
392.424 260.73 L
393.292 260.739 L
394.16 260.748 L
395.028 260.755 L
395.896 260.765 L
396.764 260.774 L
397.632 260.787 L
398.5 260.797 L
399.368 260.804 L
400.236 260.815 L
401.104 260.784 L
401.972 260.708 L
402.84 260.602 L
403.708 260.487 L
404.576 260.377 L
405.444 260.271 L
406.312 260.178 L
407.18 260.097 L
408.048 260.025 L
408.916 259.957 L
409.784 259.89 L
410.652 259.821 L
411.52 259.754 L
412.388 259.678 L
413.256 259.6 L
414.124 259.519 L
414.992 259.436 L
415.86 259.353 L
416.728 259.273 L
417.596 259.193 L
418.464 259.115 L
419.332 259.03 L
420.2 258.947 L
421.068 258.863 L
421.936 258.781 L
422.804 258.696 L
423.672 258.611 L
424.54 258.532 L
425.408 258.449 L
426.276 258.369 L
427.144 258.311 L
428.012 258.272 L
428.88 258.245 L
429.748 258.222 L
430.616 258.195 L
431.484 258.159 L
432.352 258.119 L
433.22 258.074 L
434.088 258.024 L
434.956 257.975 L
435.824 257.928 L
436.692 257.882 L
437.56 257.84 L
438.428 257.795 L
439.296 257.752 L
440.164 257.709 L
441.032 257.674 L
441.9 257.638 L
442.768 257.599 L
443.636 257.563 L
444.504 257.527 L
445.372 257.493 L
446.24 257.461 L
447.108 257.422 L
447.976 257.384 L
448.844 257.343 L
449.712 257.3 L
450.58 257.257 L
451.448 257.218 L
452.316 257.181 L
453.184 257.147 L
454.052 257.113 L
454.92 257.079 L
455.788 257.044 L
456.656 257.004 L
457.524 256.965 L
458.392 256.927 L
459.26 256.889 L
460.128 256.85 L
460.996 256.814 L
461.864 256.778 L
462.732 256.744 L
463.6 256.704 L
464.468 256.667 L
465.336 256.633 L
466.204 256.6 L
467.072 256.568 L
467.94 256.533 L
S
GR
GS
[0.75 0 0 0.75 0 0] CT
0 0 1 RC
[10 6] 0 setdash
2 LJ
0.667 LW
N
73.868 287.495 M
74.736 271.265 L
75.604 269.8 L
76.472 268.828 L
77.34 267.326 L
78.208 265.766 L
79.076 264.441 L
79.944 263.508 L
80.812 263.048 L
81.68 263.031 L
82.548 263.31 L
83.416 263.669 L
84.284 263.935 L
85.152 264.043 L
86.02 264.013 L
86.888 263.889 L
87.756 263.726 L
88.624 263.559 L
89.492 263.412 L
90.36 263.287 L
91.228 263.181 L
92.096 263.091 L
92.964 263.011 L
93.832 262.935 L
94.7 262.857 L
95.568 262.778 L
96.436 262.697 L
97.304 262.612 L
98.172 262.527 L
99.04 262.444 L
99.908 262.363 L
100.776 262.285 L
101.644 262.203 L
102.512 262.122 L
103.38 262.04 L
104.248 261.957 L
105.116 261.87 L
105.984 261.788 L
106.852 261.706 L
107.72 261.621 L
108.588 261.539 L
109.456 261.454 L
110.324 261.37 L
111.192 261.285 L
112.06 261.202 L
112.928 261.122 L
113.796 261.039 L
114.664 260.958 L
115.532 260.874 L
116.4 260.792 L
117.268 260.703 L
118.136 260.616 L
119.004 260.565 L
119.872 260.546 L
120.74 260.55 L
121.608 260.565 L
122.476 260.578 L
123.344 260.584 L
124.212 260.584 L
125.08 260.573 L
125.948 260.557 L
126.816 260.541 L
127.684 260.521 L
128.552 260.501 L
129.42 260.481 L
130.288 260.462 L
131.156 260.443 L
132.024 260.427 L
132.892 260.412 L
133.76 260.395 L
134.628 260.38 L
135.496 260.369 L
136.364 260.359 L
137.232 260.349 L
138.1 260.339 L
138.968 260.329 L
139.836 260.314 L
140.704 260.304 L
141.572 260.292 L
142.44 260.279 L
143.308 260.263 L
144.176 260.25 L
145.044 260.236 L
145.912 260.22 L
146.78 260.208 L
147.648 260.193 L
148.516 260.182 L
149.384 260.167 L
150.252 260.156 L
151.12 260.143 L
151.988 260.132 L
152.856 260.122 L
153.724 260.11 L
154.592 260.097 L
155.46 260.087 L
156.328 260.072 L
157.196 260.056 L
158.064 260.042 L
158.932 260.03 L
159.8 260.019 L
160.668 260.01 L
161.536 259.998 L
162.404 259.986 L
163.272 259.973 L
164.14 259.961 L
165.008 259.946 L
165.876 259.93 L
166.744 259.914 L
167.612 259.902 L
168.48 259.894 L
169.348 259.88 L
170.216 259.867 L
171.084 259.853 L
171.952 259.84 L
172.82 259.827 L
173.688 259.814 L
174.556 259.799 L
175.424 259.787 L
176.292 259.774 L
177.16 259.761 L
178.028 259.748 L
178.896 259.736 L
179.764 259.722 L
180.632 259.709 L
181.5 259.695 L
182.368 259.68 L
183.236 259.669 L
184.104 259.66 L
184.972 259.651 L
185.84 259.64 L
186.708 259.628 L
187.576 259.62 L
188.444 259.606 L
189.312 259.587 L
190.18 259.569 L
191.048 259.554 L
191.916 259.541 L
192.784 259.528 L
193.652 259.516 L
194.52 259.506 L
195.388 259.49 L
196.256 259.471 L
197.124 259.457 L
197.992 259.448 L
198.86 259.437 L
199.728 259.426 L
200.596 259.412 L
201.464 259.399 L
202.332 259.387 L
203.2 259.377 L
204.068 259.364 L
204.936 259.35 L
205.804 259.339 L
206.672 259.325 L
207.54 259.314 L
208.408 259.301 L
209.276 259.287 L
210.144 259.275 L
211.012 259.261 L
211.88 259.246 L
212.748 259.234 L
213.616 259.223 L
214.484 259.212 L
215.352 259.2 L
216.22 259.185 L
217.088 259.168 L
217.956 259.158 L
218.824 259.145 L
219.692 259.133 L
220.56 259.12 L
221.428 259.108 L
222.296 259.096 L
223.164 259.086 L
224.032 259.073 L
224.9 259.057 L
225.768 259.042 L
226.636 259.028 L
227.504 259.018 L
228.372 259.011 L
229.24 259.007 L
230.108 259.007 L
230.976 259.005 L
231.844 259.002 L
232.712 258.994 L
233.58 258.985 L
234.448 258.98 L
235.316 258.975 L
236.184 258.97 L
237.052 258.967 L
237.92 258.964 L
238.788 258.963 L
239.656 258.96 L
240.524 258.956 L
241.392 258.953 L
242.26 258.951 L
243.128 258.946 L
243.996 258.948 L
244.864 258.944 L
245.732 258.943 L
246.6 258.937 L
247.468 258.932 L
248.336 258.929 L
249.204 258.926 L
250.072 258.932 L
250.94 258.935 L
251.808 258.936 L
252.676 258.934 L
253.544 258.931 L
254.412 258.931 L
255.28 258.935 L
256.148 258.938 L
257.016 258.945 L
257.884 258.948 L
258.752 258.949 L
259.62 258.953 L
260.488 258.959 L
261.356 258.96 L
262.224 258.963 L
263.092 258.967 L
263.96 258.972 L
264.828 258.975 L
265.696 258.979 L
266.564 258.985 L
267.432 258.985 L
268.3 258.988 L
269.168 258.994 L
270.036 259.003 L
270.904 259.006 L
271.772 259.016 L
272.64 259.025 L
273.508 259.03 L
274.376 259.036 L
275.244 259.045 L
276.112 259.054 L
276.98 259.066 L
277.848 259.072 L
278.716 259.081 L
279.584 259.086 L
280.452 259.093 L
281.32 259.102 L
282.188 259.109 L
283.056 259.118 L
283.924 259.127 L
284.792 259.137 L
285.66 259.146 L
286.528 259.157 L
287.396 259.166 L
288.264 259.176 L
289.132 259.186 L
290 259.199 L
290.868 259.213 L
291.736 259.224 L
292.604 259.233 L
293.472 259.243 L
294.34 259.256 L
295.208 259.269 L
296.076 259.281 L
296.944 259.292 L
297.812 259.303 L
298.68 259.316 L
299.548 259.33 L
300.416 259.345 L
301.284 259.359 L
302.152 259.372 L
303.02 259.387 L
303.888 259.398 L
304.756 259.409 L
305.624 259.422 L
306.492 259.434 L
307.36 259.446 L
308.228 259.459 L
309.096 259.471 L
309.964 259.488 L
310.832 259.501 L
311.7 259.514 L
312.568 259.53 L
313.436 259.542 L
314.304 259.552 L
315.172 259.564 L
316.04 259.58 L
316.908 259.595 L
317.776 259.612 L
318.644 259.627 L
319.512 259.64 L
320.38 259.657 L
321.248 259.669 L
322.116 259.684 L
322.984 259.698 L
323.852 259.71 L
324.72 259.723 L
325.588 259.739 L
326.456 259.755 L
327.324 259.767 L
328.192 259.779 L
329.06 259.792 L
329.928 259.809 L
330.796 259.823 L
331.664 259.837 L
332.532 259.852 L
333.4 259.869 L
334.268 259.886 L
335.136 259.899 L
336.004 259.914 L
336.872 259.929 L
337.74 259.944 L
338.608 259.957 L
339.476 259.971 L
340.344 259.984 L
341.212 259.997 L
342.08 260.013 L
342.948 260.026 L
343.816 260.039 L
344.684 260.053 L
345.552 260.064 L
346.42 260.077 L
347.288 260.094 L
348.156 260.11 L
349.024 260.125 L
349.892 260.138 L
350.76 260.152 L
351.628 260.165 L
352.496 260.182 L
353.364 260.195 L
354.232 260.208 L
355.1 260.219 L
355.968 260.231 L
356.836 260.242 L
357.704 260.256 L
358.572 260.267 L
359.44 260.281 L
360.308 260.294 L
361.176 260.313 L
362.044 260.327 L
362.912 260.338 L
363.78 260.347 L
364.648 260.361 L
365.516 260.371 L
366.384 260.386 L
367.252 260.4 L
368.12 260.416 L
368.988 260.428 L
369.856 260.439 L
370.724 260.448 L
371.592 260.462 L
372.46 260.475 L
373.328 260.488 L
374.196 260.502 L
375.064 260.519 L
375.932 260.535 L
376.8 260.543 L
377.668 260.553 L
378.536 260.563 L
379.404 260.573 L
380.272 260.582 L
381.14 260.593 L
382.008 260.603 L
382.876 260.616 L
383.744 260.624 L
384.612 260.634 L
385.48 260.646 L
386.348 260.655 L
387.216 260.664 L
388.084 260.678 L
388.952 260.689 L
389.82 260.7 L
390.688 260.711 L
391.556 260.721 L
392.424 260.73 L
393.292 260.739 L
394.16 260.748 L
395.028 260.755 L
395.896 260.765 L
396.764 260.774 L
397.632 260.787 L
398.5 260.797 L
399.368 260.804 L
400.236 260.815 L
401.104 260.784 L
401.972 260.708 L
402.84 260.602 L
403.708 260.487 L
404.576 260.377 L
405.444 260.271 L
406.312 260.178 L
407.18 260.097 L
408.048 260.025 L
408.916 259.957 L
409.784 259.89 L
410.652 259.821 L
411.52 259.754 L
412.388 259.678 L
413.256 259.6 L
414.124 259.519 L
414.992 259.436 L
415.86 259.353 L
416.728 259.273 L
417.596 259.193 L
418.464 259.115 L
419.332 259.03 L
420.2 258.947 L
421.068 258.863 L
421.936 258.781 L
422.804 258.696 L
423.672 258.611 L
424.54 258.532 L
425.408 258.449 L
426.276 258.369 L
427.144 258.311 L
428.012 258.272 L
428.88 258.245 L
429.748 258.222 L
430.616 258.195 L
431.484 258.159 L
432.352 258.12 L
433.22 258.074 L
434.088 258.024 L
434.956 257.975 L
435.824 257.928 L
436.692 257.882 L
437.56 257.84 L
438.428 257.795 L
439.296 257.752 L
440.164 257.709 L
441.032 257.674 L
441.9 257.638 L
442.768 257.599 L
443.636 257.563 L
444.504 257.527 L
445.372 257.493 L
446.24 257.461 L
447.108 257.422 L
447.976 257.384 L
448.844 257.343 L
449.712 257.3 L
450.58 257.257 L
451.448 257.218 L
452.316 257.181 L
453.184 257.147 L
454.052 257.113 L
454.92 257.079 L
455.788 257.044 L
456.656 257.004 L
457.524 256.965 L
458.392 256.927 L
459.26 256.889 L
460.128 256.85 L
460.996 256.814 L
461.864 256.778 L
462.732 256.744 L
463.6 256.704 L
464.468 256.667 L
465.336 256.633 L
466.204 256.6 L
467.072 256.568 L
467.94 256.533 L
S
GR
GS
[0.75 0 0 0.75 0 0] CT
1 GC
N
390 124 M
390 44 L
494 44 L
494 124 L
cp
f
GR
GS
[0.75 0 0 0.75 320.25 40.54717] CT
/Helvetica 12 F
GS
[1 0 0 1 0 0] CT
0 5 moveto 
1 -1 scale
(ekf) t 
GR
GR
GS
[0.75 0 0 0.75 0 0] CT
1 0 0 RC
1 LJ
0.667 LW
N
394 54.063 M
424 54.063 L
S
GR
GS
[0.75 0 0 0.75 320.25 53] CT
/Helvetica 12 F
GS
[1 0 0 1 0 0] CT
0 5 moveto 
1 -1 scale
(ukf) t 
GR
GR
GS
[0.75 0 0 0.75 0 0] CT
0 0 1 RC
1 LJ
0.667 LW
N
394 70.667 M
424 70.667 L
S
GR
GS
[0.75 0 0 0.75 320.25 69.75] CT
/Helvetica 12 F
GS
[1 0 0 1 0 0] CT
0 0 moveto 
1 -1 scale
(ekf) t 
GR
GR
GS
[0.75 0 0 0.75 333 74.25] CT
/Helvetica 9.333 F
GS
[1 0 0 1 0 0] CT
0 0 moveto 
1 -1 scale
( ) t 
GR
GR
GS
[0.75 0 0 0.75 335.25 69.75] CT
/Helvetica 12 F
GS
[1 0 0 1 0 0] CT
0 0 moveto 
1 -1 scale
(3 sigma) t 
GR
GR
GS
[0.75 0 0 0.75 0 0] CT
1 0 0 RC
[10 6] 0 setdash
2 LJ
0.667 LW
N
394 89.786 M
424 89.786 L
S
GR
GS
[0.75 0 0 0.75 320.25 85.5] CT
/Helvetica 12 F
GS
[1 0 0 1 0 0] CT
0 0 moveto 
1 -1 scale
(ukf) t 
GR
GR
GS
[0.75 0 0 0.75 333 90] CT
/Helvetica 9.333 F
GS
[1 0 0 1 0 0] CT
0 0 moveto 
1 -1 scale
( ) t 
GR
GR
GS
[0.75 0 0 0.75 335.25 85.5] CT
/Helvetica 12 F
GS
[1 0 0 1 0 0] CT
0 0 moveto 
1 -1 scale
(3 sigma) t 
GR
GR
GS
[0.75 0 0 0.75 0 0] CT
0 0 1 RC
[10 6] 0 setdash
2 LJ
0.667 LW
N
394 111.421 M
424 111.421 L
S
GR
GS
[0.75 0 0 0.75 0 0] CT
0.149 GC
10.0 ML
0.667 LW
N
390 124 M
390 44 L
494 44 L
494 124 L
cp
S
GR
%%Trailer
%%Pages: 1
%%EOF
