%!PS-Adobe-3.0 EPSF-3.0
%%Creator: (MATLAB, The Mathworks, Inc. Version 9.0.0.341360 \(R2016a\). Operating System: Windows 8)
%%Title: C:/Users/Jan/Desktop/isf1/ioS2.eps
%%CreationDate: 2017-03-23T21:17:58
%%Pages: (atend)
%%BoundingBox: 0 0 420 315
%%LanguageLevel: 3
%%EndComments
%%BeginProlog
%%BeginResource: procset (Apache XML Graphics Std ProcSet) 1.2 0
%%Version: 1.2 0
%%Copyright: (Copyright 2001-2003,2010 The Apache Software Foundation. License terms: http://www.apache.org/licenses/LICENSE-2.0)
/bd{bind def}bind def
/ld{load def}bd
/GR/grestore ld
/M/moveto ld
/LJ/setlinejoin ld
/C/curveto ld
/f/fill ld
/LW/setlinewidth ld
/GC/setgray ld
/t/show ld
/N/newpath ld
/CT/concat ld
/cp/closepath ld
/S/stroke ld
/L/lineto ld
/CC/setcmykcolor ld
/A/ashow ld
/GS/gsave ld
/RC/setrgbcolor ld
/RM/rmoveto ld
/ML/setmiterlimit ld
/re {4 2 roll M
1 index 0 rlineto
0 exch rlineto
neg 0 rlineto
cp } bd
/_ctm matrix def
/_tm matrix def
/BT { _ctm currentmatrix pop matrix _tm copy pop 0 0 moveto } bd
/ET { _ctm setmatrix } bd
/iTm { _ctm setmatrix _tm concat } bd
/Tm { _tm astore pop iTm 0 0 moveto } bd
/ux 0.0 def
/uy 0.0 def
/F {
  /Tp exch def
  /Tf exch def
  Tf findfont Tp scalefont setfont
  /cf Tf def  /cs Tp def
} bd
/ULS {currentpoint /uy exch def /ux exch def} bd
/ULE {
  /Tcx currentpoint pop def
  gsave
  newpath
  cf findfont cs scalefont dup
  /FontMatrix get 0 get /Ts exch def /FontInfo get dup
  /UnderlinePosition get Ts mul /To exch def
  /UnderlineThickness get Ts mul /Tt exch def
  ux uy To add moveto  Tcx uy To add lineto
  Tt setlinewidth stroke
  grestore
} bd
/OLE {
  /Tcx currentpoint pop def
  gsave
  newpath
  cf findfont cs scalefont dup
  /FontMatrix get 0 get /Ts exch def /FontInfo get dup
  /UnderlinePosition get Ts mul /To exch def
  /UnderlineThickness get Ts mul /Tt exch def
  ux uy To add cs add moveto Tcx uy To add cs add lineto
  Tt setlinewidth stroke
  grestore
} bd
/SOE {
  /Tcx currentpoint pop def
  gsave
  newpath
  cf findfont cs scalefont dup
  /FontMatrix get 0 get /Ts exch def /FontInfo get dup
  /UnderlinePosition get Ts mul /To exch def
  /UnderlineThickness get Ts mul /Tt exch def
  ux uy To add cs 10 mul 26 idiv add moveto Tcx uy To add cs 10 mul 26 idiv add lineto
  Tt setlinewidth stroke
  grestore
} bd
/QT {
/Y22 exch store
/X22 exch store
/Y21 exch store
/X21 exch store
currentpoint
/Y21 load 2 mul add 3 div exch
/X21 load 2 mul add 3 div exch
/X21 load 2 mul /X22 load add 3 div
/Y21 load 2 mul /Y22 load add 3 div
/X22 load /Y22 load curveto
} bd
/SSPD {
dup length /d exch dict def
{
/v exch def
/k exch def
currentpagedevice k known {
/cpdv currentpagedevice k get def
v cpdv ne {
/upd false def
/nullv v type /nulltype eq def
/nullcpdv cpdv type /nulltype eq def
nullv nullcpdv or
{
/upd true def
} {
/sametype v type cpdv type eq def
sametype {
v type /arraytype eq {
/vlen v length def
/cpdvlen cpdv length def
vlen cpdvlen eq {
0 1 vlen 1 sub {
/i exch def
/obj v i get def
/cpdobj cpdv i get def
obj cpdobj ne {
/upd true def
exit
} if
} for
} {
/upd true def
} ifelse
} {
v type /dicttype eq {
v {
/dv exch def
/dk exch def
/cpddv cpdv dk get def
dv cpddv ne {
/upd true def
exit
} if
} forall
} {
/upd true def
} ifelse
} ifelse
} if
} ifelse
upd true eq {
d k v put
} if
} if
} if
} forall
d length 0 gt {
d setpagedevice
} if
} bd
%%EndResource
%%BeginResource: procset (Apache XML Graphics EPS ProcSet) 1.0 0
%%Version: 1.0 0
%%Copyright: (Copyright 2002-2003 The Apache Software Foundation. License terms: http://www.apache.org/licenses/LICENSE-2.0)
/BeginEPSF { %def
/b4_Inc_state save def         % Save state for cleanup
/dict_count countdictstack def % Count objects on dict stack
/op_count count 1 sub def      % Count objects on operand stack
userdict begin                 % Push userdict on dict stack
/showpage { } def              % Redefine showpage, { } = null proc
0 setgray 0 setlinecap         % Prepare graphics state
1 setlinewidth 0 setlinejoin
10 setmiterlimit [ ] 0 setdash newpath
/languagelevel where           % If level not equal to 1 then
{pop languagelevel             % set strokeadjust and
1 ne                           % overprint to their defaults.
{false setstrokeadjust false setoverprint
} if
} if
} bd
/EndEPSF { %def
count op_count sub {pop} repeat            % Clean up stacks
countdictstack dict_count sub {end} repeat
b4_Inc_state restore
} bd
%%EndResource
%FOPBeginFontDict
%%IncludeResource: font Courier-Bold
%%IncludeResource: font Helvetica
%%IncludeResource: font Courier-BoldOblique
%%IncludeResource: font Courier-Oblique
%%IncludeResource: font Times-Roman
%%IncludeResource: font Helvetica-BoldOblique
%%IncludeResource: font Helvetica-Bold
%%IncludeResource: font Helvetica-Oblique
%%IncludeResource: font Times-BoldItalic
%%IncludeResource: font Courier
%%IncludeResource: font Times-Italic
%%IncludeResource: font Times-Bold
%%IncludeResource: font Symbol
%%IncludeResource: font ZapfDingbats
%FOPEndFontDict
%%BeginResource: encoding WinAnsiEncoding
/WinAnsiEncoding [
/.notdef /.notdef /.notdef /.notdef /.notdef
/.notdef /.notdef /.notdef /.notdef /.notdef
/.notdef /.notdef /.notdef /.notdef /.notdef
/.notdef /.notdef /.notdef /.notdef /.notdef
/.notdef /.notdef /.notdef /.notdef /.notdef
/.notdef /.notdef /.notdef /.notdef /.notdef
/.notdef /.notdef /space /exclam /quotedbl
/numbersign /dollar /percent /ampersand /quotesingle
/parenleft /parenright /asterisk /plus /comma
/hyphen /period /slash /zero /one
/two /three /four /five /six
/seven /eight /nine /colon /semicolon
/less /equal /greater /question /at
/A /B /C /D /E
/F /G /H /I /J
/K /L /M /N /O
/P /Q /R /S /T
/U /V /W /X /Y
/Z /bracketleft /backslash /bracketright /asciicircum
/underscore /quoteleft /a /b /c
/d /e /f /g /h
/i /j /k /l /m
/n /o /p /q /r
/s /t /u /v /w
/x /y /z /braceleft /bar
/braceright /asciitilde /bullet /Euro /bullet
/quotesinglbase /florin /quotedblbase /ellipsis /dagger
/daggerdbl /circumflex /perthousand /Scaron /guilsinglleft
/OE /bullet /Zcaron /bullet /bullet
/quoteleft /quoteright /quotedblleft /quotedblright /bullet
/endash /emdash /asciitilde /trademark /scaron
/guilsinglright /oe /bullet /zcaron /Ydieresis
/space /exclamdown /cent /sterling /currency
/yen /brokenbar /section /dieresis /copyright
/ordfeminine /guillemotleft /logicalnot /sfthyphen /registered
/macron /degree /plusminus /twosuperior /threesuperior
/acute /mu /paragraph /middot /cedilla
/onesuperior /ordmasculine /guillemotright /onequarter /onehalf
/threequarters /questiondown /Agrave /Aacute /Acircumflex
/Atilde /Adieresis /Aring /AE /Ccedilla
/Egrave /Eacute /Ecircumflex /Edieresis /Igrave
/Iacute /Icircumflex /Idieresis /Eth /Ntilde
/Ograve /Oacute /Ocircumflex /Otilde /Odieresis
/multiply /Oslash /Ugrave /Uacute /Ucircumflex
/Udieresis /Yacute /Thorn /germandbls /agrave
/aacute /acircumflex /atilde /adieresis /aring
/ae /ccedilla /egrave /eacute /ecircumflex
/edieresis /igrave /iacute /icircumflex /idieresis
/eth /ntilde /ograve /oacute /ocircumflex
/otilde /odieresis /divide /oslash /ugrave
/uacute /ucircumflex /udieresis /yacute /thorn
/ydieresis
] def
%%EndResource
%FOPBeginFontReencode
/Courier-Bold findfont
dup length dict begin
  {1 index /FID ne {def} {pop pop} ifelse} forall
  /Encoding WinAnsiEncoding def
  currentdict
end
/Courier-Bold exch definefont pop
/Helvetica findfont
dup length dict begin
  {1 index /FID ne {def} {pop pop} ifelse} forall
  /Encoding WinAnsiEncoding def
  currentdict
end
/Helvetica exch definefont pop
/Courier-BoldOblique findfont
dup length dict begin
  {1 index /FID ne {def} {pop pop} ifelse} forall
  /Encoding WinAnsiEncoding def
  currentdict
end
/Courier-BoldOblique exch definefont pop
/Courier-Oblique findfont
dup length dict begin
  {1 index /FID ne {def} {pop pop} ifelse} forall
  /Encoding WinAnsiEncoding def
  currentdict
end
/Courier-Oblique exch definefont pop
/Times-Roman findfont
dup length dict begin
  {1 index /FID ne {def} {pop pop} ifelse} forall
  /Encoding WinAnsiEncoding def
  currentdict
end
/Times-Roman exch definefont pop
/Helvetica-BoldOblique findfont
dup length dict begin
  {1 index /FID ne {def} {pop pop} ifelse} forall
  /Encoding WinAnsiEncoding def
  currentdict
end
/Helvetica-BoldOblique exch definefont pop
/Helvetica-Bold findfont
dup length dict begin
  {1 index /FID ne {def} {pop pop} ifelse} forall
  /Encoding WinAnsiEncoding def
  currentdict
end
/Helvetica-Bold exch definefont pop
/Helvetica-Oblique findfont
dup length dict begin
  {1 index /FID ne {def} {pop pop} ifelse} forall
  /Encoding WinAnsiEncoding def
  currentdict
end
/Helvetica-Oblique exch definefont pop
/Times-BoldItalic findfont
dup length dict begin
  {1 index /FID ne {def} {pop pop} ifelse} forall
  /Encoding WinAnsiEncoding def
  currentdict
end
/Times-BoldItalic exch definefont pop
/Courier findfont
dup length dict begin
  {1 index /FID ne {def} {pop pop} ifelse} forall
  /Encoding WinAnsiEncoding def
  currentdict
end
/Courier exch definefont pop
/Times-Italic findfont
dup length dict begin
  {1 index /FID ne {def} {pop pop} ifelse} forall
  /Encoding WinAnsiEncoding def
  currentdict
end
/Times-Italic exch definefont pop
/Times-Bold findfont
dup length dict begin
  {1 index /FID ne {def} {pop pop} ifelse} forall
  /Encoding WinAnsiEncoding def
  currentdict
end
/Times-Bold exch definefont pop
%FOPEndFontReencode
%%EndProlog
%%Page: 1 1
%%PageBoundingBox: 0 0 420 315
%%BeginPageSetup
[1 0 0 -1 0 315] CT
%%EndPageSetup
GS
[0.75 0 0 0.75 0 0] CT
1 GC
N
0 0 560 420 re
f
GR
GS
[0.75 0 0 0.75 0 0] CT
1 GC
N
0 0 560 420 re
f
GR
GS
[0.75 0 0 0.75 0 0] CT
1 GC
N
73 101 M
259 101 L
259 31 L
73 31 L
cp
f
GR
GS
[0.75 0 0 0.75 0 0] CT
0.149 GC
2 setlinecap
1 LJ
0.667 LW
N
73 101 M
259 101 L
S
GR
GS
[0.75 0 0 0.75 0 0] CT
0.149 GC
2 setlinecap
1 LJ
0.667 LW
N
73 31 M
259 31 L
S
GR
GS
[0.75 0 0 0.75 0 0] CT
0.149 GC
2 setlinecap
1 LJ
0.667 LW
N
73 101 M
73 99.14 L
S
GR
GS
[0.75 0 0 0.75 0 0] CT
0.149 GC
2 setlinecap
1 LJ
0.667 LW
N
110.2 101 M
110.2 99.14 L
S
GR
GS
[0.75 0 0 0.75 0 0] CT
0.149 GC
2 setlinecap
1 LJ
0.667 LW
N
147.4 101 M
147.4 99.14 L
S
GR
GS
[0.75 0 0 0.75 0 0] CT
0.149 GC
2 setlinecap
1 LJ
0.667 LW
N
184.6 101 M
184.6 99.14 L
S
GR
GS
[0.75 0 0 0.75 0 0] CT
0.149 GC
2 setlinecap
1 LJ
0.667 LW
N
221.8 101 M
221.8 99.14 L
S
GR
GS
[0.75 0 0 0.75 0 0] CT
0.149 GC
2 setlinecap
1 LJ
0.667 LW
N
259 101 M
259 99.14 L
S
GR
GS
[0.75 0 0 0.75 0 0] CT
0.149 GC
2 setlinecap
1 LJ
0.667 LW
N
73 31 M
73 32.86 L
S
GR
GS
[0.75 0 0 0.75 0 0] CT
0.149 GC
2 setlinecap
1 LJ
0.667 LW
N
110.2 31 M
110.2 32.86 L
S
GR
GS
[0.75 0 0 0.75 0 0] CT
0.149 GC
2 setlinecap
1 LJ
0.667 LW
N
147.4 31 M
147.4 32.86 L
S
GR
GS
[0.75 0 0 0.75 0 0] CT
0.149 GC
2 setlinecap
1 LJ
0.667 LW
N
184.6 31 M
184.6 32.86 L
S
GR
GS
[0.75 0 0 0.75 0 0] CT
0.149 GC
2 setlinecap
1 LJ
0.667 LW
N
221.8 31 M
221.8 32.86 L
S
GR
GS
[0.75 0 0 0.75 0 0] CT
0.149 GC
2 setlinecap
1 LJ
0.667 LW
N
259 31 M
259 32.86 L
S
GR
GS
[0.75 0 0 0.75 54.75 79.75] CT
0.149 GC
/Helvetica 13.333 F
GS
[1 0 0 1 0 0] CT
-4 14 moveto 
1 -1 scale
(0) t 
GR
GR
GS
[0.75 0 0 0.75 82.65 79.75] CT
0.149 GC
/Helvetica 13.333 F
GS
[1 0 0 1 0 0] CT
-11 14 moveto 
1 -1 scale
(100) t 
GR
GR
GS
[0.75 0 0 0.75 110.55 79.75] CT
0.149 GC
/Helvetica 13.333 F
GS
[1 0 0 1 0 0] CT
-11 14 moveto 
1 -1 scale
(200) t 
GR
GR
GS
[0.75 0 0 0.75 138.45 79.75] CT
0.149 GC
/Helvetica 13.333 F
GS
[1 0 0 1 0 0] CT
-11 14 moveto 
1 -1 scale
(300) t 
GR
GR
GS
[0.75 0 0 0.75 166.35 79.75] CT
0.149 GC
/Helvetica 13.333 F
GS
[1 0 0 1 0 0] CT
-11 14 moveto 
1 -1 scale
(400) t 
GR
GR
GS
[0.75 0 0 0.75 194.25 79.75] CT
0.149 GC
/Helvetica 13.333 F
GS
[1 0 0 1 0 0] CT
-11 14 moveto 
1 -1 scale
(500) t 
GR
GR
GS
[0.75 0 0 0.75 124.50007 93.5] CT
0.149 GC
/Helvetica 14.667 F
GS
[1 0 0 1 0 0] CT
-4 16 moveto 
1 -1 scale
(k) t 
GR
GR
GS
[0.75 0 0 0.75 0 0] CT
0.149 GC
2 setlinecap
1 LJ
0.667 LW
N
73 101 M
73 31 L
S
GR
GS
[0.75 0 0 0.75 0 0] CT
0.149 GC
2 setlinecap
1 LJ
0.667 LW
N
259 101 M
259 31 L
S
GR
GS
[0.75 0 0 0.75 0 0] CT
0.149 GC
2 setlinecap
1 LJ
0.667 LW
N
73 101 M
74.86 101 L
S
GR
GS
[0.75 0 0 0.75 0 0] CT
0.149 GC
2 setlinecap
1 LJ
0.667 LW
N
73 66 M
74.86 66 L
S
GR
GS
[0.75 0 0 0.75 0 0] CT
0.149 GC
2 setlinecap
1 LJ
0.667 LW
N
73 31 M
74.86 31 L
S
GR
GS
[0.75 0 0 0.75 0 0] CT
0.149 GC
2 setlinecap
1 LJ
0.667 LW
N
259 101 M
257.14 101 L
S
GR
GS
[0.75 0 0 0.75 0 0] CT
0.149 GC
2 setlinecap
1 LJ
0.667 LW
N
259 66 M
257.14 66 L
S
GR
GS
[0.75 0 0 0.75 0 0] CT
0.149 GC
2 setlinecap
1 LJ
0.667 LW
N
259 31 M
257.14 31 L
S
GR
GS
[0.75 0 0 0.75 50.75 75.75] CT
0.149 GC
/Helvetica 13.333 F
GS
[1 0 0 1 0 0] CT
-8 5.5 moveto 
1 -1 scale
(0) t 
GR
GR
GS
[0.75 0 0 0.75 50.75 49.5] CT
0.149 GC
/Helvetica 13.333 F
GS
[1 0 0 1 0 0] CT
-19 5.5 moveto 
1 -1 scale
(0.5) t 
GR
GR
GS
[0.75 0 0 0.75 50.75 23.25] CT
0.149 GC
/Helvetica 13.333 F
GS
[1 0 0 1 0 0] CT
-8 5.5 moveto 
1 -1 scale
(1) t 
GR
GR
GS
[0 -0.75 0.75 0 33.5 49.49998] CT
0.149 GC
/Helvetica 14.667 F
GS
[1 0 0 1 0 0] CT
-4 -4 moveto 
1 -1 scale
(y) t 
GR
GR
GS
[0.75 0 0 0.75 124.50011 21.1875] CT
/Helvetica-Bold 14.667 F
GS
[1 0 0 1 0 0] CT
-25.5 -4 moveto 
1 -1 scale
(Vstupy) t 
GR
GR
GS
[0.75 0 0 0.75 0 0] CT
0 0.447 0.741 RC
1 LJ
0.667 LW
N
73.372 31 M
73.744 101 L
74.116 101 L
74.488 101 L
74.86 101 L
75.232 101 L
75.604 101 L
75.976 101 L
76.348 101 L
76.72 101 L
77.092 101 L
77.464 101 L
77.836 101 L
78.208 101 L
78.58 101 L
78.952 101 L
79.324 101 L
79.696 101 L
80.068 101 L
80.44 101 L
80.812 101 L
81.184 101 L
81.556 101 L
81.928 101 L
82.3 101 L
82.672 101 L
83.044 101 L
83.416 101 L
83.788 101 L
84.16 101 L
84.532 101 L
84.904 101 L
85.276 101 L
85.648 101 L
86.02 101 L
86.392 101 L
86.764 101 L
87.136 101 L
87.508 101 L
87.88 101 L
88.252 101 L
88.624 101 L
88.996 101 L
89.368 101 L
89.74 101 L
90.112 101 L
90.484 101 L
90.856 101 L
91.228 101 L
91.6 101 L
91.972 101 L
92.344 101 L
92.716 101 L
93.088 101 L
93.46 101 L
93.832 101 L
94.204 101 L
94.576 101 L
94.948 101 L
95.32 101 L
95.692 101 L
96.064 101 L
96.436 101 L
96.808 101 L
97.18 101 L
97.552 101 L
97.924 101 L
98.296 101 L
98.668 101 L
99.04 101 L
99.412 101 L
99.784 101 L
100.156 101 L
100.528 101 L
100.9 101 L
101.272 101 L
101.644 101 L
102.016 101 L
102.388 101 L
102.76 101 L
103.132 101 L
103.504 101 L
103.876 101 L
104.248 101 L
104.62 101 L
104.992 101 L
105.364 101 L
105.736 101 L
106.108 101 L
106.48 101 L
106.852 101 L
107.224 101 L
107.596 101 L
107.968 101 L
108.34 101 L
108.712 101 L
109.084 101 L
109.456 101 L
109.828 101 L
110.2 101 L
110.572 101 L
110.944 101 L
111.316 101 L
111.688 101 L
112.06 101 L
112.432 101 L
112.804 101 L
113.176 101 L
113.548 101 L
113.92 101 L
114.292 101 L
114.664 101 L
115.036 101 L
115.408 101 L
115.78 101 L
116.152 101 L
116.524 101 L
116.896 101 L
117.268 101 L
117.64 101 L
118.012 101 L
118.384 101 L
118.756 101 L
119.128 101 L
119.5 101 L
119.872 101 L
120.244 101 L
120.616 101 L
120.988 101 L
121.36 101 L
121.732 101 L
122.104 101 L
122.476 101 L
122.848 101 L
123.22 101 L
123.592 101 L
123.964 101 L
124.336 101 L
124.708 101 L
125.08 101 L
125.452 101 L
125.824 101 L
126.196 101 L
126.568 101 L
126.94 101 L
127.312 101 L
127.684 101 L
128.056 101 L
128.428 101 L
128.8 101 L
129.172 101 L
129.544 101 L
129.916 101 L
130.288 101 L
130.66 101 L
131.032 101 L
131.404 101 L
131.776 101 L
132.148 101 L
132.52 101 L
132.892 101 L
133.264 101 L
133.636 101 L
134.008 101 L
134.38 101 L
134.752 101 L
135.124 101 L
135.496 101 L
135.868 101 L
136.24 101 L
136.612 101 L
136.984 101 L
137.356 101 L
137.728 101 L
138.1 101 L
138.472 101 L
138.844 101 L
139.216 101 L
139.588 101 L
139.96 101 L
140.332 101 L
140.704 101 L
141.076 101 L
141.448 101 L
141.82 101 L
142.192 101 L
142.564 101 L
142.936 101 L
143.308 101 L
143.68 101 L
144.052 101 L
144.424 101 L
144.796 101 L
145.168 101 L
145.54 101 L
145.912 101 L
146.284 101 L
146.656 101 L
147.028 101 L
147.4 101 L
147.772 101 L
148.144 101 L
148.516 101 L
148.888 101 L
149.26 101 L
149.632 101 L
150.004 101 L
150.376 101 L
150.748 101 L
151.12 101 L
151.492 101 L
151.864 101 L
152.236 101 L
152.608 101 L
152.98 101 L
153.352 101 L
153.724 101 L
154.096 101 L
154.468 101 L
154.84 101 L
155.212 101 L
155.584 101 L
155.956 101 L
156.328 101 L
156.7 101 L
157.072 101 L
157.444 101 L
157.816 101 L
158.188 101 L
158.56 101 L
158.932 101 L
159.304 101 L
159.676 101 L
160.048 101 L
160.42 101 L
160.792 101 L
161.164 101 L
161.536 101 L
161.908 101 L
162.28 101 L
162.652 101 L
163.024 101 L
163.396 101 L
163.768 101 L
164.14 101 L
164.512 101 L
164.884 101 L
165.256 101 L
165.628 101 L
166 101 L
166.372 101 L
166.744 101 L
167.116 101 L
167.488 101 L
167.86 101 L
168.232 101 L
168.604 101 L
168.976 101 L
169.348 101 L
169.72 101 L
170.092 101 L
170.464 101 L
170.836 101 L
171.208 101 L
171.58 101 L
171.952 101 L
172.324 101 L
172.696 101 L
173.068 101 L
173.44 101 L
173.812 101 L
174.184 101 L
174.556 101 L
174.928 101 L
175.3 101 L
175.672 101 L
176.044 101 L
176.416 101 L
176.788 101 L
177.16 101 L
177.532 101 L
177.904 101 L
178.276 101 L
178.648 101 L
179.02 101 L
179.392 101 L
179.764 101 L
180.136 101 L
180.508 101 L
180.88 101 L
181.252 101 L
181.624 101 L
181.996 101 L
182.368 101 L
182.74 101 L
183.112 101 L
183.484 101 L
183.856 101 L
184.228 101 L
184.6 101 L
184.972 101 L
185.344 101 L
185.716 101 L
186.088 101 L
186.46 101 L
186.832 101 L
187.204 101 L
187.576 101 L
187.948 101 L
188.32 101 L
188.692 101 L
189.064 101 L
189.436 101 L
189.808 101 L
190.18 101 L
190.552 101 L
190.924 101 L
191.296 101 L
191.668 101 L
192.04 101 L
192.412 101 L
192.784 101 L
193.156 101 L
193.528 101 L
193.9 101 L
194.272 101 L
194.644 101 L
195.016 101 L
195.388 101 L
195.76 101 L
196.132 101 L
196.504 101 L
196.876 101 L
197.248 101 L
197.62 101 L
197.992 101 L
198.364 101 L
198.736 101 L
199.108 101 L
199.48 101 L
199.852 101 L
200.224 101 L
200.596 101 L
200.968 101 L
201.34 101 L
201.712 101 L
202.084 101 L
202.456 101 L
202.828 101 L
203.2 101 L
203.572 101 L
203.944 101 L
204.316 101 L
204.688 101 L
205.06 101 L
205.432 101 L
205.804 101 L
206.176 101 L
206.548 101 L
206.92 101 L
207.292 101 L
207.664 101 L
208.036 101 L
208.408 101 L
208.78 101 L
209.152 101 L
209.524 101 L
209.896 101 L
210.268 101 L
210.64 101 L
211.012 101 L
211.384 101 L
211.756 101 L
212.128 101 L
212.5 101 L
212.872 101 L
213.244 101 L
213.616 101 L
213.988 101 L
214.36 101 L
214.732 101 L
215.104 101 L
215.476 101 L
215.848 101 L
216.22 101 L
216.592 101 L
216.964 101 L
217.336 101 L
217.708 101 L
218.08 101 L
218.452 101 L
218.824 101 L
219.196 101 L
219.568 101 L
219.94 101 L
220.312 101 L
220.684 101 L
221.056 101 L
221.428 101 L
221.8 101 L
222.172 101 L
222.544 101 L
222.916 101 L
223.288 101 L
223.66 101 L
224.032 101 L
224.404 101 L
224.776 101 L
225.148 101 L
225.52 101 L
225.892 101 L
226.264 101 L
226.636 101 L
227.008 101 L
227.38 101 L
227.752 101 L
228.124 101 L
228.496 101 L
228.868 101 L
229.24 101 L
229.612 101 L
229.984 101 L
230.356 101 L
230.728 101 L
231.1 101 L
231.472 101 L
231.844 101 L
232.216 101 L
232.588 101 L
232.96 101 L
233.332 101 L
233.704 101 L
234.076 101 L
234.448 101 L
234.82 101 L
235.192 101 L
235.564 101 L
235.936 101 L
236.308 101 L
236.68 101 L
237.052 101 L
237.424 101 L
237.796 101 L
238.168 101 L
238.54 101 L
238.912 101 L
239.284 101 L
239.656 101 L
240.028 101 L
240.4 101 L
240.772 101 L
241.144 101 L
241.516 101 L
241.888 101 L
242.26 101 L
242.632 101 L
243.004 101 L
243.376 101 L
243.748 101 L
244.12 101 L
244.492 101 L
244.864 101 L
245.236 101 L
245.608 101 L
245.98 101 L
246.352 101 L
246.724 101 L
247.096 101 L
247.468 101 L
247.84 101 L
248.212 101 L
248.584 101 L
248.956 101 L
249.328 101 L
249.7 101 L
250.072 101 L
250.444 101 L
250.816 101 L
251.188 101 L
251.56 101 L
251.932 101 L
252.304 101 L
252.676 101 L
253.048 101 L
253.42 101 L
253.792 101 L
254.164 101 L
254.536 101 L
254.908 101 L
255.28 101 L
255.652 101 L
256.024 101 L
256.396 101 L
256.768 101 L
257.14 101 L
257.512 101 L
257.884 101 L
258.256 101 L
258.628 101 L
259 101 L
S
GR
GS
[0.75 0 0 0.75 0 0] CT
1 GC
N
73 227 M
259 227 L
259 157 L
73 157 L
cp
f
GR
GS
[0.75 0 0 0.75 0 0] CT
0.149 GC
2 setlinecap
1 LJ
0.667 LW
N
73 227 M
259 227 L
S
GR
GS
[0.75 0 0 0.75 0 0] CT
0.149 GC
2 setlinecap
1 LJ
0.667 LW
N
73 157 M
259 157 L
S
GR
GS
[0.75 0 0 0.75 0 0] CT
0.149 GC
2 setlinecap
1 LJ
0.667 LW
N
73 227 M
73 225.14 L
S
GR
GS
[0.75 0 0 0.75 0 0] CT
0.149 GC
2 setlinecap
1 LJ
0.667 LW
N
110.2 227 M
110.2 225.14 L
S
GR
GS
[0.75 0 0 0.75 0 0] CT
0.149 GC
2 setlinecap
1 LJ
0.667 LW
N
147.4 227 M
147.4 225.14 L
S
GR
GS
[0.75 0 0 0.75 0 0] CT
0.149 GC
2 setlinecap
1 LJ
0.667 LW
N
184.6 227 M
184.6 225.14 L
S
GR
GS
[0.75 0 0 0.75 0 0] CT
0.149 GC
2 setlinecap
1 LJ
0.667 LW
N
221.8 227 M
221.8 225.14 L
S
GR
GS
[0.75 0 0 0.75 0 0] CT
0.149 GC
2 setlinecap
1 LJ
0.667 LW
N
259 227 M
259 225.14 L
S
GR
GS
[0.75 0 0 0.75 0 0] CT
0.149 GC
2 setlinecap
1 LJ
0.667 LW
N
73 157 M
73 158.86 L
S
GR
GS
[0.75 0 0 0.75 0 0] CT
0.149 GC
2 setlinecap
1 LJ
0.667 LW
N
110.2 157 M
110.2 158.86 L
S
GR
GS
[0.75 0 0 0.75 0 0] CT
0.149 GC
2 setlinecap
1 LJ
0.667 LW
N
147.4 157 M
147.4 158.86 L
S
GR
GS
[0.75 0 0 0.75 0 0] CT
0.149 GC
2 setlinecap
1 LJ
0.667 LW
N
184.6 157 M
184.6 158.86 L
S
GR
GS
[0.75 0 0 0.75 0 0] CT
0.149 GC
2 setlinecap
1 LJ
0.667 LW
N
221.8 157 M
221.8 158.86 L
S
GR
GS
[0.75 0 0 0.75 0 0] CT
0.149 GC
2 setlinecap
1 LJ
0.667 LW
N
259 157 M
259 158.86 L
S
GR
GS
[0.75 0 0 0.75 54.75 174.25] CT
0.149 GC
/Helvetica 13.333 F
GS
[1 0 0 1 0 0] CT
-4 14 moveto 
1 -1 scale
(0) t 
GR
GR
GS
[0.75 0 0 0.75 82.65 174.25] CT
0.149 GC
/Helvetica 13.333 F
GS
[1 0 0 1 0 0] CT
-11 14 moveto 
1 -1 scale
(100) t 
GR
GR
GS
[0.75 0 0 0.75 110.55 174.25] CT
0.149 GC
/Helvetica 13.333 F
GS
[1 0 0 1 0 0] CT
-11 14 moveto 
1 -1 scale
(200) t 
GR
GR
GS
[0.75 0 0 0.75 138.45 174.25] CT
0.149 GC
/Helvetica 13.333 F
GS
[1 0 0 1 0 0] CT
-11 14 moveto 
1 -1 scale
(300) t 
GR
GR
GS
[0.75 0 0 0.75 166.35 174.25] CT
0.149 GC
/Helvetica 13.333 F
GS
[1 0 0 1 0 0] CT
-11 14 moveto 
1 -1 scale
(400) t 
GR
GR
GS
[0.75 0 0 0.75 194.25 174.25] CT
0.149 GC
/Helvetica 13.333 F
GS
[1 0 0 1 0 0] CT
-11 14 moveto 
1 -1 scale
(500) t 
GR
GR
GS
[0.75 0 0 0.75 124.50007 188] CT
0.149 GC
/Helvetica 14.667 F
GS
[1 0 0 1 0 0] CT
-4 16 moveto 
1 -1 scale
(k) t 
GR
GR
GS
[0.75 0 0 0.75 0 0] CT
0.149 GC
2 setlinecap
1 LJ
0.667 LW
N
73 227 M
73 157 L
S
GR
GS
[0.75 0 0 0.75 0 0] CT
0.149 GC
2 setlinecap
1 LJ
0.667 LW
N
259 227 M
259 157 L
S
GR
GS
[0.75 0 0 0.75 0 0] CT
0.149 GC
2 setlinecap
1 LJ
0.667 LW
N
73 227 M
74.86 227 L
S
GR
GS
[0.75 0 0 0.75 0 0] CT
0.149 GC
2 setlinecap
1 LJ
0.667 LW
N
73 192 M
74.86 192 L
S
GR
GS
[0.75 0 0 0.75 0 0] CT
0.149 GC
2 setlinecap
1 LJ
0.667 LW
N
73 157 M
74.86 157 L
S
GR
GS
[0.75 0 0 0.75 0 0] CT
0.149 GC
2 setlinecap
1 LJ
0.667 LW
N
259 227 M
257.14 227 L
S
GR
GS
[0.75 0 0 0.75 0 0] CT
0.149 GC
2 setlinecap
1 LJ
0.667 LW
N
259 192 M
257.14 192 L
S
GR
GS
[0.75 0 0 0.75 0 0] CT
0.149 GC
2 setlinecap
1 LJ
0.667 LW
N
259 157 M
257.14 157 L
S
GR
GS
[0.75 0 0 0.75 50.75 170.25] CT
0.149 GC
/Helvetica 13.333 F
GS
[1 0 0 1 0 0] CT
-8 5.5 moveto 
1 -1 scale
(0) t 
GR
GR
GS
[0.75 0 0 0.75 50.75 144] CT
0.149 GC
/Helvetica 13.333 F
GS
[1 0 0 1 0 0] CT
-8 5.5 moveto 
1 -1 scale
(1) t 
GR
GR
GS
[0.75 0 0 0.75 50.75 117.75] CT
0.149 GC
/Helvetica 13.333 F
GS
[1 0 0 1 0 0] CT
-8 5.5 moveto 
1 -1 scale
(2) t 
GR
GR
GS
[0 -0.75 0.75 0 41.75 143.99998] CT
0.149 GC
/Helvetica 14.667 F
GS
[1 0 0 1 0 0] CT
-4 -4 moveto 
1 -1 scale
(y) t 
GR
GR
GS
[0.75 0 0 0.75 0 0] CT
0 0.447 0.741 RC
1 LJ
0.667 LW
N
73.372 192 M
73.744 192 L
74.116 192 L
74.488 192 L
74.86 192 L
75.232 192 L
75.604 192 L
75.976 192 L
76.348 192 L
76.72 192 L
77.092 192 L
77.464 192 L
77.836 192 L
78.208 192 L
78.58 192 L
78.952 192 L
79.324 192 L
79.696 192 L
80.068 192 L
80.44 192 L
80.812 192 L
81.184 192 L
81.556 192 L
81.928 192 L
82.3 192 L
82.672 192 L
83.044 192 L
83.416 192 L
83.788 192 L
84.16 192 L
84.532 192 L
84.904 192 L
85.276 192 L
85.648 192 L
86.02 192 L
86.392 192 L
86.764 192 L
87.136 192 L
87.508 192 L
87.88 192 L
88.252 192 L
88.624 192 L
88.996 192 L
89.368 192 L
89.74 192 L
90.112 192 L
90.484 192 L
90.856 192 L
91.228 192 L
91.6 192 L
91.972 192 L
92.344 192 L
92.716 192 L
93.088 192 L
93.46 192 L
93.832 192 L
94.204 192 L
94.576 192 L
94.948 192 L
95.32 192 L
95.692 192 L
96.064 192 L
96.436 192 L
96.808 192 L
97.18 192 L
97.552 192 L
97.924 192 L
98.296 192 L
98.668 192 L
99.04 192 L
99.412 192 L
99.784 192 L
100.156 192 L
100.528 192 L
100.9 192 L
101.272 192 L
101.644 192 L
102.016 192 L
102.388 192 L
102.76 192 L
103.132 192 L
103.504 192 L
103.876 192 L
104.248 192 L
104.62 192 L
104.992 192 L
105.364 192 L
105.736 192 L
106.108 192 L
106.48 192 L
106.852 192 L
107.224 192 L
107.596 192 L
107.968 192 L
108.34 192 L
108.712 192 L
109.084 192 L
109.456 192 L
109.828 192 L
110.2 192 L
110.572 192 L
110.944 192 L
111.316 192 L
111.688 192 L
112.06 192 L
112.432 192 L
112.804 192 L
113.176 192 L
113.548 192 L
113.92 192 L
114.292 192 L
114.664 192 L
115.036 192 L
115.408 192 L
115.78 192 L
116.152 192 L
116.524 192 L
116.896 192 L
117.268 192 L
117.64 192 L
118.012 192 L
118.384 192 L
118.756 192 L
119.128 192 L
119.5 192 L
119.872 192 L
120.244 192 L
120.616 192 L
120.988 192 L
121.36 192 L
121.732 192 L
122.104 192 L
122.476 192 L
122.848 192 L
123.22 192 L
123.592 192 L
123.964 192 L
124.336 192 L
124.708 192 L
125.08 192 L
125.452 192 L
125.824 192 L
126.196 192 L
126.568 192 L
126.94 192 L
127.312 192 L
127.684 192 L
128.056 192 L
128.428 192 L
128.8 192 L
129.172 192 L
129.544 192 L
129.916 192 L
130.288 192 L
130.66 192 L
131.032 192 L
131.404 192 L
131.776 192 L
132.148 192 L
132.52 192 L
132.892 192 L
133.264 192 L
133.636 192 L
134.008 192 L
134.38 192 L
134.752 192 L
135.124 192 L
135.496 192 L
135.868 192 L
136.24 192 L
136.612 192 L
136.984 192 L
137.356 192 L
137.728 192 L
138.1 192 L
138.472 192 L
138.844 192 L
139.216 192 L
139.588 192 L
139.96 192 L
140.332 192 L
140.704 192 L
141.076 192 L
141.448 192 L
141.82 192 L
142.192 192 L
142.564 192 L
142.936 192 L
143.308 192 L
143.68 192 L
144.052 192 L
144.424 192 L
144.796 192 L
145.168 192 L
145.54 192 L
145.912 192 L
146.284 192 L
146.656 192 L
147.028 192 L
147.4 192 L
147.772 192 L
148.144 192 L
148.516 192 L
148.888 192 L
149.26 192 L
149.632 192 L
150.004 192 L
150.376 192 L
150.748 192 L
151.12 192 L
151.492 192 L
151.864 192 L
152.236 192 L
152.608 192 L
152.98 192 L
153.352 192 L
153.724 192 L
154.096 192 L
154.468 192 L
154.84 192 L
155.212 192 L
155.584 192 L
155.956 192 L
156.328 192 L
156.7 192 L
157.072 192 L
157.444 192 L
157.816 192 L
158.188 192 L
158.56 192 L
158.932 192 L
159.304 192 L
159.676 192 L
160.048 192 L
160.42 192 L
160.792 192 L
161.164 192 L
161.536 192 L
161.908 192 L
162.28 192 L
162.652 192 L
163.024 192 L
163.396 192 L
163.768 192 L
164.14 192 L
164.512 192 L
164.884 192 L
165.256 192 L
165.628 192 L
166 192 L
166.372 192 L
166.744 192 L
167.116 192 L
167.488 192 L
167.86 192 L
168.232 192 L
168.604 192 L
168.976 192 L
169.348 192 L
169.72 192 L
170.092 192 L
170.464 192 L
170.836 192 L
171.208 192 L
171.58 192 L
171.952 192 L
172.324 192 L
172.696 192 L
173.068 192 L
173.44 192 L
173.812 192 L
174.184 192 L
174.556 192 L
174.928 192 L
175.3 192 L
175.672 192 L
176.044 192 L
176.416 192 L
176.788 192 L
177.16 192 L
177.532 192 L
177.904 192 L
178.276 192 L
178.648 192 L
179.02 192 L
179.392 192 L
179.764 192 L
180.136 192 L
180.508 192 L
180.88 192 L
181.252 192 L
181.624 192 L
181.996 192 L
182.368 192 L
182.74 192 L
183.112 192 L
183.484 192 L
183.856 192 L
184.228 192 L
184.6 192 L
184.972 192 L
185.344 192 L
185.716 192 L
186.088 192 L
186.46 192 L
186.832 192 L
187.204 192 L
187.576 192 L
187.948 192 L
188.32 192 L
188.692 192 L
189.064 192 L
189.436 192 L
189.808 192 L
190.18 192 L
190.552 192 L
190.924 192 L
191.296 192 L
191.668 192 L
192.04 192 L
192.412 192 L
192.784 192 L
193.156 192 L
193.528 192 L
193.9 192 L
194.272 192 L
194.644 192 L
195.016 192 L
195.388 192 L
195.76 192 L
196.132 192 L
196.504 192 L
196.876 192 L
197.248 192 L
197.62 192 L
197.992 192 L
198.364 192 L
198.736 192 L
199.108 192 L
199.48 192 L
199.852 192 L
200.224 192 L
200.596 192 L
200.968 192 L
201.34 192 L
201.712 192 L
202.084 192 L
202.456 192 L
202.828 192 L
203.2 192 L
203.572 192 L
203.944 192 L
204.316 192 L
204.688 192 L
205.06 192 L
205.432 192 L
205.804 192 L
206.176 192 L
206.548 192 L
206.92 192 L
207.292 192 L
207.664 192 L
208.036 192 L
208.408 192 L
208.78 192 L
209.152 192 L
209.524 192 L
209.896 192 L
210.268 192 L
210.64 192 L
211.012 192 L
211.384 192 L
211.756 192 L
212.128 192 L
212.5 192 L
212.872 192 L
213.244 192 L
213.616 192 L
213.988 192 L
214.36 192 L
214.732 192 L
215.104 192 L
215.476 192 L
215.848 192 L
216.22 192 L
216.592 192 L
216.964 192 L
217.336 192 L
217.708 192 L
218.08 192 L
218.452 192 L
218.824 192 L
219.196 192 L
219.568 192 L
219.94 192 L
220.312 192 L
220.684 192 L
221.056 192 L
221.428 192 L
221.8 192 L
222.172 192 L
222.544 192 L
222.916 192 L
223.288 192 L
223.66 192 L
224.032 192 L
224.404 192 L
224.776 192 L
225.148 192 L
225.52 192 L
225.892 192 L
226.264 192 L
226.636 192 L
227.008 192 L
227.38 192 L
227.752 192 L
228.124 192 L
228.496 192 L
228.868 192 L
229.24 192 L
229.612 192 L
229.984 192 L
230.356 192 L
230.728 192 L
231.1 192 L
231.472 192 L
231.844 192 L
232.216 192 L
232.588 192 L
232.96 192 L
233.332 192 L
233.704 192 L
234.076 192 L
234.448 192 L
234.82 192 L
235.192 192 L
235.564 192 L
235.936 192 L
236.308 192 L
236.68 192 L
237.052 192 L
237.424 192 L
237.796 192 L
238.168 192 L
238.54 192 L
238.912 192 L
239.284 192 L
239.656 192 L
240.028 192 L
240.4 192 L
240.772 192 L
241.144 192 L
241.516 192 L
241.888 192 L
242.26 192 L
242.632 192 L
243.004 192 L
243.376 192 L
243.748 192 L
244.12 192 L
244.492 192 L
244.864 192 L
245.236 192 L
245.608 192 L
245.98 192 L
246.352 192 L
246.724 192 L
247.096 192 L
247.468 192 L
247.84 192 L
248.212 192 L
248.584 192 L
248.956 192 L
249.328 192 L
249.7 192 L
250.072 192 L
250.444 192 L
250.816 192 L
251.188 192 L
251.56 192 L
251.932 192 L
252.304 192 L
252.676 192 L
253.048 192 L
253.42 192 L
253.792 192 L
254.164 192 L
254.536 192 L
254.908 192 L
255.28 192 L
255.652 192 L
256.024 192 L
256.396 192 L
256.768 192 L
257.14 192 L
257.512 192 L
257.884 192 L
258.256 192 L
258.628 192 L
259 192 L
S
GR
GS
[0.75 0 0 0.75 0 0] CT
1 GC
N
73 353 M
259 353 L
259 283 L
73 283 L
cp
f
GR
GS
[0.75 0 0 0.75 0 0] CT
0.149 GC
2 setlinecap
1 LJ
0.667 LW
N
73 353 M
259 353 L
S
GR
GS
[0.75 0 0 0.75 0 0] CT
0.149 GC
2 setlinecap
1 LJ
0.667 LW
N
73 283 M
259 283 L
S
GR
GS
[0.75 0 0 0.75 0 0] CT
0.149 GC
2 setlinecap
1 LJ
0.667 LW
N
73 353 M
73 351.14 L
S
GR
GS
[0.75 0 0 0.75 0 0] CT
0.149 GC
2 setlinecap
1 LJ
0.667 LW
N
110.2 353 M
110.2 351.14 L
S
GR
GS
[0.75 0 0 0.75 0 0] CT
0.149 GC
2 setlinecap
1 LJ
0.667 LW
N
147.4 353 M
147.4 351.14 L
S
GR
GS
[0.75 0 0 0.75 0 0] CT
0.149 GC
2 setlinecap
1 LJ
0.667 LW
N
184.6 353 M
184.6 351.14 L
S
GR
GS
[0.75 0 0 0.75 0 0] CT
0.149 GC
2 setlinecap
1 LJ
0.667 LW
N
221.8 353 M
221.8 351.14 L
S
GR
GS
[0.75 0 0 0.75 0 0] CT
0.149 GC
2 setlinecap
1 LJ
0.667 LW
N
259 353 M
259 351.14 L
S
GR
GS
[0.75 0 0 0.75 0 0] CT
0.149 GC
2 setlinecap
1 LJ
0.667 LW
N
73 283 M
73 284.86 L
S
GR
GS
[0.75 0 0 0.75 0 0] CT
0.149 GC
2 setlinecap
1 LJ
0.667 LW
N
110.2 283 M
110.2 284.86 L
S
GR
GS
[0.75 0 0 0.75 0 0] CT
0.149 GC
2 setlinecap
1 LJ
0.667 LW
N
147.4 283 M
147.4 284.86 L
S
GR
GS
[0.75 0 0 0.75 0 0] CT
0.149 GC
2 setlinecap
1 LJ
0.667 LW
N
184.6 283 M
184.6 284.86 L
S
GR
GS
[0.75 0 0 0.75 0 0] CT
0.149 GC
2 setlinecap
1 LJ
0.667 LW
N
221.8 283 M
221.8 284.86 L
S
GR
GS
[0.75 0 0 0.75 0 0] CT
0.149 GC
2 setlinecap
1 LJ
0.667 LW
N
259 283 M
259 284.86 L
S
GR
GS
[0.75 0 0 0.75 54.75 268.75001] CT
0.149 GC
/Helvetica 13.333 F
GS
[1 0 0 1 0 0] CT
-4 14 moveto 
1 -1 scale
(0) t 
GR
GR
GS
[0.75 0 0 0.75 82.65 268.75001] CT
0.149 GC
/Helvetica 13.333 F
GS
[1 0 0 1 0 0] CT
-11 14 moveto 
1 -1 scale
(100) t 
GR
GR
GS
[0.75 0 0 0.75 110.55 268.75001] CT
0.149 GC
/Helvetica 13.333 F
GS
[1 0 0 1 0 0] CT
-11 14 moveto 
1 -1 scale
(200) t 
GR
GR
GS
[0.75 0 0 0.75 138.45 268.75001] CT
0.149 GC
/Helvetica 13.333 F
GS
[1 0 0 1 0 0] CT
-11 14 moveto 
1 -1 scale
(300) t 
GR
GR
GS
[0.75 0 0 0.75 166.35 268.75001] CT
0.149 GC
/Helvetica 13.333 F
GS
[1 0 0 1 0 0] CT
-11 14 moveto 
1 -1 scale
(400) t 
GR
GR
GS
[0.75 0 0 0.75 194.25 268.75001] CT
0.149 GC
/Helvetica 13.333 F
GS
[1 0 0 1 0 0] CT
-11 14 moveto 
1 -1 scale
(500) t 
GR
GR
GS
[0.75 0 0 0.75 124.50007 282.49999] CT
0.149 GC
/Helvetica 14.667 F
GS
[1 0 0 1 0 0] CT
-4 16 moveto 
1 -1 scale
(k) t 
GR
GR
GS
[0.75 0 0 0.75 0 0] CT
0.149 GC
2 setlinecap
1 LJ
0.667 LW
N
73 353 M
73 283 L
S
GR
GS
[0.75 0 0 0.75 0 0] CT
0.149 GC
2 setlinecap
1 LJ
0.667 LW
N
259 353 M
259 283 L
S
GR
GS
[0.75 0 0 0.75 0 0] CT
0.149 GC
2 setlinecap
1 LJ
0.667 LW
N
73 353 M
74.86 353 L
S
GR
GS
[0.75 0 0 0.75 0 0] CT
0.149 GC
2 setlinecap
1 LJ
0.667 LW
N
73 318 M
74.86 318 L
S
GR
GS
[0.75 0 0 0.75 0 0] CT
0.149 GC
2 setlinecap
1 LJ
0.667 LW
N
73 283 M
74.86 283 L
S
GR
GS
[0.75 0 0 0.75 0 0] CT
0.149 GC
2 setlinecap
1 LJ
0.667 LW
N
259 353 M
257.14 353 L
S
GR
GS
[0.75 0 0 0.75 0 0] CT
0.149 GC
2 setlinecap
1 LJ
0.667 LW
N
259 318 M
257.14 318 L
S
GR
GS
[0.75 0 0 0.75 0 0] CT
0.149 GC
2 setlinecap
1 LJ
0.667 LW
N
259 283 M
257.14 283 L
S
GR
GS
[0.75 0 0 0.75 50.75 264.75] CT
0.149 GC
/Helvetica 13.333 F
GS
[1 0 0 1 0 0] CT
-12 5.5 moveto 
1 -1 scale
(-5) t 
GR
GR
GS
[0.75 0 0 0.75 50.75 238.5] CT
0.149 GC
/Helvetica 13.333 F
GS
[1 0 0 1 0 0] CT
-8 5.5 moveto 
1 -1 scale
(0) t 
GR
GR
GS
[0.75 0 0 0.75 50.75 212.25] CT
0.149 GC
/Helvetica 13.333 F
GS
[1 0 0 1 0 0] CT
-8 5.5 moveto 
1 -1 scale
(5) t 
GR
GR
GS
[0 -0.75 0.75 0 38.75 238.49998] CT
0.149 GC
/Helvetica 14.667 F
GS
[1 0 0 1 0 0] CT
-4 -4 moveto 
1 -1 scale
(y) t 
GR
GR
GS
[0.75 0 0 0.75 0 0] CT
0 0.447 0.741 RC
1 LJ
0.667 LW
N
73.372 329.793 M
73.744 315.108 L
74.116 314.488 L
74.488 317.419 L
74.86 316.895 L
75.232 321.696 L
75.604 312.939 L
75.976 323.95 L
76.348 323.575 L
76.72 312.923 L
77.092 306.194 L
77.464 320.705 L
77.836 321.536 L
78.208 315.143 L
78.58 310.493 L
78.952 311.224 L
79.324 316.109 L
79.696 322.441 L
80.068 313.592 L
80.44 318.555 L
80.812 308.361 L
81.184 327.857 L
81.556 317.011 L
81.928 308.972 L
82.3 321.465 L
82.672 322.374 L
83.044 324.535 L
83.416 319.951 L
83.788 319.404 L
84.16 317.043 L
84.532 324.183 L
84.904 317.422 L
85.276 322.227 L
85.648 320.581 L
86.02 323.867 L
86.392 319.977 L
86.764 293.011 L
87.136 294.147 L
87.508 309.972 L
87.88 312.489 L
88.252 326.947 L
88.624 322.092 L
88.996 322.336 L
89.368 314.253 L
89.74 314.619 L
90.112 317.241 L
90.484 320.382 L
90.856 324.481 L
91.228 317.963 L
91.6 310.026 L
91.972 315.008 L
92.344 316.733 L
92.716 313.398 L
93.088 313.91 L
93.46 329.315 L
93.832 317.869 L
94.204 320.982 L
94.576 332.238 L
94.948 327.3 L
95.32 320.239 L
95.692 312.222 L
96.064 319.605 L
96.436 316.164 L
96.808 324.286 L
97.18 333.101 L
97.552 317.343 L
97.924 324.658 L
98.296 309.792 L
98.668 305.854 L
99.04 320.602 L
99.412 309.65 L
99.784 311.324 L
100.156 327.905 L
100.528 318.233 L
100.9 316.172 L
101.272 314.339 L
101.644 313.262 L
102.016 313.279 L
102.388 313.251 L
102.76 320.188 L
103.132 315.345 L
103.504 333.77 L
103.876 326.178 L
104.248 309.586 L
104.62 322.625 L
104.992 315.707 L
105.364 307.443 L
105.736 324.222 L
106.108 324.715 L
106.48 321.449 L
106.852 314.913 L
107.224 319.433 L
107.596 324.845 L
107.968 329.011 L
108.34 320.592 L
108.712 319.548 L
109.084 321.746 L
109.456 319.834 L
109.828 325.668 L
110.2 314.155 L
110.572 333.222 L
110.944 316.988 L
111.316 313.317 L
111.688 323.942 L
112.06 318.4 L
112.432 315.957 L
112.804 322.302 L
113.176 318.095 L
113.548 315.115 L
113.92 324.56 L
114.292 312.154 L
114.664 310.338 L
115.036 315.752 L
115.408 317.894 L
115.78 326.151 L
116.152 314.536 L
116.524 326.511 L
116.896 306.864 L
117.268 314.315 L
117.64 316.146 L
118.012 320.755 L
118.384 333.234 L
118.756 326.37 L
119.128 315.443 L
119.5 301.113 L
119.872 312.818 L
120.244 315.832 L
120.616 321.794 L
120.988 317.144 L
121.36 311.264 L
121.732 319.778 L
122.104 304.758 L
122.476 326.542 L
122.848 320.634 L
123.22 317.633 L
123.592 331.678 L
123.964 314.042 L
124.336 317.455 L
124.708 317.435 L
125.08 312.437 L
125.452 310.694 L
125.824 312.385 L
126.196 321.282 L
126.568 318.326 L
126.94 315.526 L
127.312 326.798 L
127.684 325.252 L
128.056 320.989 L
128.428 317.456 L
128.8 305.464 L
129.172 312.419 L
129.544 321.098 L
129.916 322.404 L
130.288 307.263 L
130.66 298.865 L
131.032 316.828 L
131.404 321.352 L
131.776 327.889 L
132.148 311.175 L
132.52 315.972 L
132.892 309.842 L
133.264 324.361 L
133.636 316.316 L
134.008 322.578 L
134.38 309.075 L
134.752 321.858 L
135.124 318.612 L
135.496 320.435 L
135.868 311.042 L
136.24 315.001 L
136.612 325.029 L
136.984 322.429 L
137.356 325.32 L
137.728 314.46 L
138.1 315.676 L
138.472 329.448 L
138.844 331.348 L
139.216 318.283 L
139.588 313.12 L
139.96 316.818 L
140.332 328.807 L
140.704 328.863 L
141.076 311.93 L
141.448 319.018 L
141.82 320.704 L
142.192 308.787 L
142.564 323.575 L
142.936 317.052 L
143.308 315.075 L
143.68 312.261 L
144.052 323.98 L
144.424 315.499 L
144.796 298.761 L
145.168 328.591 L
145.54 314.962 L
145.912 319.608 L
146.284 323.79 L
146.656 323.824 L
147.028 314.515 L
147.4 301.791 L
147.772 323.557 L
148.144 314.213 L
148.516 321.913 L
148.888 304.164 L
149.26 314.187 L
149.632 318.965 L
150.004 313.661 L
150.376 318.039 L
150.748 310.25 L
151.12 319.299 L
151.492 325.85 L
151.864 316.275 L
152.236 307.073 L
152.608 326.376 L
152.98 319.696 L
153.352 310.966 L
153.724 331.441 L
154.096 313.622 L
154.468 312.729 L
154.84 316.506 L
155.212 323.392 L
155.584 318.05 L
155.956 317.348 L
156.328 311.453 L
156.7 313.355 L
157.072 320.452 L
157.444 306.661 L
157.816 318.356 L
158.188 323.689 L
158.56 321.069 L
158.932 311.99 L
159.304 316.633 L
159.676 311.778 L
160.048 317.515 L
160.42 300.592 L
160.792 329.66 L
161.164 320.911 L
161.536 318.59 L
161.908 317.375 L
162.28 307.807 L
162.652 316.464 L
163.024 318.804 L
163.396 317.52 L
163.768 312.74 L
164.14 322.826 L
164.512 314.844 L
164.884 328.955 L
165.256 318.552 L
165.628 324.593 L
166 322.57 L
166.372 316.022 L
166.744 325.876 L
167.116 324.923 L
167.488 328.611 L
167.86 333.6 L
168.232 319.061 L
168.604 309.861 L
168.976 319.274 L
169.348 319.638 L
169.72 325.327 L
170.092 306.917 L
170.464 319.746 L
170.836 308.942 L
171.208 315.466 L
171.58 319.841 L
171.952 310.425 L
172.324 311.123 L
172.696 318.78 L
173.068 308.928 L
173.44 305.531 L
173.812 318.459 L
174.184 319.79 L
174.556 315.168 L
174.928 315.538 L
175.3 312.347 L
175.672 319.789 L
176.044 312.994 L
176.416 310.66 L
176.788 316.757 L
177.16 316.927 L
177.532 326.78 L
177.904 326.21 L
178.276 328.23 L
178.648 326.71 L
179.02 319.086 L
179.392 329.304 L
179.764 302.278 L
180.136 312.825 L
180.508 332.474 L
180.88 326.082 L
181.252 318.75 L
181.624 329.99 L
181.996 321.219 L
182.368 310.363 L
182.74 319.147 L
183.112 318.471 L
183.484 325.011 L
183.856 321.89 L
184.228 327.461 L
184.6 315.451 L
184.972 321.165 L
185.344 312.516 L
185.716 309.339 L
186.088 310.46 L
186.46 318.244 L
186.832 321.528 L
187.204 326.568 L
187.576 317.17 L
187.948 311.284 L
188.32 320.387 L
188.692 319.213 L
189.064 313.686 L
189.436 311.953 L
189.808 327.918 L
190.18 316.6 L
190.552 316.629 L
190.924 319.058 L
191.296 311.751 L
191.668 320.549 L
192.04 323.783 L
192.412 316.068 L
192.784 314.781 L
193.156 319.523 L
193.528 312.427 L
193.9 328.626 L
194.272 325.524 L
194.644 339.505 L
195.016 314.35 L
195.388 324.937 L
195.76 319.772 L
196.132 310.935 L
196.504 317.643 L
196.876 321.083 L
197.248 323.939 L
197.62 319.683 L
197.992 313.779 L
198.364 328.614 L
198.736 318.478 L
199.108 312.523 L
199.48 327.945 L
199.852 313.314 L
200.224 313.217 L
200.596 324.175 L
200.968 328.532 L
201.34 314.968 L
201.712 312.342 L
202.084 313.947 L
202.456 312.66 L
202.828 326.275 L
203.2 313.913 L
203.572 322.06 L
203.944 321.93 L
204.316 328.891 L
204.688 310.299 L
205.06 316.775 L
205.432 310.975 L
205.804 307.423 L
206.176 325.961 L
206.548 313.499 L
206.92 318.089 L
207.292 311.6 L
207.664 310.246 L
208.036 312.257 L
208.408 323.723 L
208.78 318.885 L
209.152 316.151 L
209.524 295.89 L
209.896 309.414 L
210.268 301.756 L
210.64 315.099 L
211.012 316.517 L
211.384 313.708 L
211.756 321.694 L
212.128 309.309 L
212.5 319.103 L
212.872 327.615 L
213.244 311.904 L
213.616 328.98 L
213.988 330.91 L
214.36 315.981 L
214.732 324.656 L
215.104 324.375 L
215.476 319.134 L
215.848 321.422 L
216.22 319.559 L
216.592 316.096 L
216.964 326.18 L
217.336 326.57 L
217.708 332.696 L
218.08 320.732 L
218.452 313.35 L
218.824 322.916 L
219.196 314.491 L
219.568 314.218 L
219.94 311.065 L
220.312 311.074 L
220.684 322.822 L
221.056 323.998 L
221.428 317.661 L
221.8 322.654 L
222.172 307.831 L
222.544 308.341 L
222.916 317.334 L
223.288 320.99 L
223.66 314.424 L
224.032 322.594 L
224.404 318.875 L
224.776 321.713 L
225.148 317.261 L
225.52 310.102 L
225.892 312.803 L
226.264 309.995 L
226.636 324.403 L
227.008 316.741 L
227.38 324.883 L
227.752 315.306 L
228.124 315.72 L
228.496 308.926 L
228.868 310.305 L
229.24 313.427 L
229.612 321.536 L
229.984 321.332 L
230.356 332.361 L
230.728 321.138 L
231.1 328.858 L
231.472 311.491 L
231.844 311.686 L
232.216 317.032 L
232.588 320.649 L
232.96 316.999 L
233.332 306.765 L
233.704 308.556 L
234.076 321.139 L
234.448 316.821 L
234.82 325.843 L
235.192 315.195 L
235.564 312.827 L
235.936 311.7 L
236.308 328.719 L
236.68 314.468 L
237.052 324.049 L
237.424 320.636 L
237.796 312.484 L
238.168 315.913 L
238.54 319.146 L
238.912 313.753 L
239.284 306.559 L
239.656 322.364 L
240.028 327.451 L
240.4 326.136 L
240.772 324.61 L
241.144 322.698 L
241.516 313.963 L
241.888 332.6 L
242.26 316.348 L
242.632 323.449 L
243.004 310.303 L
243.376 323.989 L
243.748 317.947 L
244.12 324.563 L
244.492 322.771 L
244.864 319.821 L
245.236 319.602 L
245.608 321.674 L
245.98 310.102 L
246.352 314.149 L
246.724 305.014 L
247.096 319.941 L
247.468 310.534 L
247.84 332.695 L
248.212 313.531 L
248.584 315.4 L
248.956 320.619 L
249.328 313.133 L
249.7 311.857 L
250.072 310.765 L
250.444 315.061 L
250.816 313.793 L
251.188 322.718 L
251.56 325.666 L
251.932 319.873 L
252.304 316.694 L
252.676 311.343 L
253.048 323.534 L
253.42 321.426 L
253.792 297.179 L
254.164 322.358 L
254.536 304.558 L
254.908 311.272 L
255.28 321.905 L
255.652 318.746 L
256.024 319.506 L
256.396 314.686 L
256.768 308.441 L
257.14 329.465 L
257.512 303.834 L
257.884 312.555 L
258.256 321.842 L
258.628 318.882 L
259 315.903 L
S
GR
GS
[0.75 0 0 0.75 0 0] CT
1 GC
N
319 101 M
506 101 L
506 31 L
319 31 L
cp
f
GR
GS
[0.75 0 0 0.75 0 0] CT
0.149 GC
2 setlinecap
1 LJ
0.667 LW
N
319 101 M
506 101 L
S
GR
GS
[0.75 0 0 0.75 0 0] CT
0.149 GC
2 setlinecap
1 LJ
0.667 LW
N
319 31 M
506 31 L
S
GR
GS
[0.75 0 0 0.75 0 0] CT
0.149 GC
2 setlinecap
1 LJ
0.667 LW
N
319 101 M
319 99.13 L
S
GR
GS
[0.75 0 0 0.75 0 0] CT
0.149 GC
2 setlinecap
1 LJ
0.667 LW
N
356.4 101 M
356.4 99.13 L
S
GR
GS
[0.75 0 0 0.75 0 0] CT
0.149 GC
2 setlinecap
1 LJ
0.667 LW
N
393.8 101 M
393.8 99.13 L
S
GR
GS
[0.75 0 0 0.75 0 0] CT
0.149 GC
2 setlinecap
1 LJ
0.667 LW
N
431.2 101 M
431.2 99.13 L
S
GR
GS
[0.75 0 0 0.75 0 0] CT
0.149 GC
2 setlinecap
1 LJ
0.667 LW
N
468.6 101 M
468.6 99.13 L
S
GR
GS
[0.75 0 0 0.75 0 0] CT
0.149 GC
2 setlinecap
1 LJ
0.667 LW
N
506 101 M
506 99.13 L
S
GR
GS
[0.75 0 0 0.75 0 0] CT
0.149 GC
2 setlinecap
1 LJ
0.667 LW
N
319 31 M
319 32.87 L
S
GR
GS
[0.75 0 0 0.75 0 0] CT
0.149 GC
2 setlinecap
1 LJ
0.667 LW
N
356.4 31 M
356.4 32.87 L
S
GR
GS
[0.75 0 0 0.75 0 0] CT
0.149 GC
2 setlinecap
1 LJ
0.667 LW
N
393.8 31 M
393.8 32.87 L
S
GR
GS
[0.75 0 0 0.75 0 0] CT
0.149 GC
2 setlinecap
1 LJ
0.667 LW
N
431.2 31 M
431.2 32.87 L
S
GR
GS
[0.75 0 0 0.75 0 0] CT
0.149 GC
2 setlinecap
1 LJ
0.667 LW
N
468.6 31 M
468.6 32.87 L
S
GR
GS
[0.75 0 0 0.75 0 0] CT
0.149 GC
2 setlinecap
1 LJ
0.667 LW
N
506 31 M
506 32.87 L
S
GR
GS
[0.75 0 0 0.75 239.25 79.75] CT
0.149 GC
/Helvetica 13.333 F
GS
[1 0 0 1 0 0] CT
-4 14 moveto 
1 -1 scale
(0) t 
GR
GR
GS
[0.75 0 0 0.75 267.3 79.75] CT
0.149 GC
/Helvetica 13.333 F
GS
[1 0 0 1 0 0] CT
-11 14 moveto 
1 -1 scale
(100) t 
GR
GR
GS
[0.75 0 0 0.75 295.34999 79.75] CT
0.149 GC
/Helvetica 13.333 F
GS
[1 0 0 1 0 0] CT
-11 14 moveto 
1 -1 scale
(200) t 
GR
GR
GS
[0.75 0 0 0.75 323.40001 79.75] CT
0.149 GC
/Helvetica 13.333 F
GS
[1 0 0 1 0 0] CT
-11 14 moveto 
1 -1 scale
(300) t 
GR
GR
GS
[0.75 0 0 0.75 351.45 79.75] CT
0.149 GC
/Helvetica 13.333 F
GS
[1 0 0 1 0 0] CT
-11 14 moveto 
1 -1 scale
(400) t 
GR
GR
GS
[0.75 0 0 0.75 379.5 79.75] CT
0.149 GC
/Helvetica 13.333 F
GS
[1 0 0 1 0 0] CT
-11 14 moveto 
1 -1 scale
(500) t 
GR
GR
GS
[0.75 0 0 0.75 309.37507 93.5] CT
0.149 GC
/Helvetica 14.667 F
GS
[1 0 0 1 0 0] CT
-4 16 moveto 
1 -1 scale
(k) t 
GR
GR
GS
[0.75 0 0 0.75 0 0] CT
0.149 GC
2 setlinecap
1 LJ
0.667 LW
N
319 101 M
319 31 L
S
GR
GS
[0.75 0 0 0.75 0 0] CT
0.149 GC
2 setlinecap
1 LJ
0.667 LW
N
506 101 M
506 31 L
S
GR
GS
[0.75 0 0 0.75 0 0] CT
0.149 GC
2 setlinecap
1 LJ
0.667 LW
N
319 101 M
320.87 101 L
S
GR
GS
[0.75 0 0 0.75 0 0] CT
0.149 GC
2 setlinecap
1 LJ
0.667 LW
N
319 66 M
320.87 66 L
S
GR
GS
[0.75 0 0 0.75 0 0] CT
0.149 GC
2 setlinecap
1 LJ
0.667 LW
N
319 31 M
320.87 31 L
S
GR
GS
[0.75 0 0 0.75 0 0] CT
0.149 GC
2 setlinecap
1 LJ
0.667 LW
N
506 101 M
504.13 101 L
S
GR
GS
[0.75 0 0 0.75 0 0] CT
0.149 GC
2 setlinecap
1 LJ
0.667 LW
N
506 66 M
504.13 66 L
S
GR
GS
[0.75 0 0 0.75 0 0] CT
0.149 GC
2 setlinecap
1 LJ
0.667 LW
N
506 31 M
504.13 31 L
S
GR
GS
[0.75 0 0 0.75 235.24999 75.75] CT
0.149 GC
/Helvetica 13.333 F
GS
[1 0 0 1 0 0] CT
-12 5.5 moveto 
1 -1 scale
(-5) t 
GR
GR
GS
[0.75 0 0 0.75 235.24999 49.5] CT
0.149 GC
/Helvetica 13.333 F
GS
[1 0 0 1 0 0] CT
-8 5.5 moveto 
1 -1 scale
(0) t 
GR
GR
GS
[0.75 0 0 0.75 235.24999 23.25] CT
0.149 GC
/Helvetica 13.333 F
GS
[1 0 0 1 0 0] CT
-8 5.5 moveto 
1 -1 scale
(5) t 
GR
GR
GS
[0 -0.75 0.75 0 223.24999 49.49998] CT
0.149 GC
/Helvetica 14.667 F
GS
[1 0 0 1 0 0] CT
-4 -4 moveto 
1 -1 scale
(y) t 
GR
GR
GS
[0.75 0 0 0.75 309.3753 21.1875] CT
/Helvetica-Bold 14.667 F
GS
[1 0 0 1 0 0] CT
-29.5 -4 moveto 
1 -1 scale
(V\375stupy) t 
GR
GR
GS
[0.75 0 0 0.75 0 0] CT
0 0.447 0.741 RC
1 LJ
0.667 LW
N
319.374 66 M
319.748 52.124 L
320.122 54.378 L
320.496 64.071 L
320.87 63.415 L
321.244 59.71 L
321.618 64.249 L
321.992 56.48 L
322.366 69.061 L
322.74 60.715 L
323.114 63.621 L
323.488 55.215 L
323.862 73.519 L
324.236 64.038 L
324.61 66.531 L
324.984 82.807 L
325.358 59.035 L
325.732 49.626 L
326.106 65.557 L
326.48 59.186 L
326.854 66.974 L
327.228 62.094 L
327.602 68.432 L
327.976 66.327 L
328.35 55.083 L
328.724 71.146 L
329.098 67.966 L
329.472 67.088 L
329.846 68.065 L
330.22 56.693 L
330.594 51.343 L
330.968 69.191 L
331.342 66.5 L
331.716 62.181 L
332.09 69.11 L
332.464 51.811 L
332.838 53.567 L
333.212 57.661 L
333.586 57.16 L
333.96 64.744 L
334.334 58.29 L
334.708 56.865 L
335.082 62.529 L
335.456 49.586 L
335.83 58.299 L
336.204 62.099 L
336.578 60.205 L
336.952 56.619 L
337.326 66.648 L
337.7 64.272 L
338.074 48.841 L
338.448 67.503 L
338.822 55.477 L
339.196 58.325 L
339.57 52.006 L
339.944 58.624 L
340.318 78.817 L
340.692 70.737 L
341.066 65.851 L
341.44 66.747 L
341.814 52.642 L
342.188 54.611 L
342.562 58.018 L
342.936 60.851 L
343.31 73.801 L
343.684 52.407 L
344.058 65.65 L
344.432 74.414 L
344.806 62.658 L
345.18 66.986 L
345.554 70.167 L
345.928 62.891 L
346.302 71.577 L
346.676 75.553 L
347.05 80.273 L
347.424 72.658 L
347.798 75.156 L
348.172 66.25 L
348.546 78.754 L
348.92 69.011 L
349.294 79.562 L
349.668 56.19 L
350.042 69.088 L
350.416 56.1 L
350.79 61.182 L
351.164 56.9 L
351.538 71.381 L
351.912 55.384 L
352.286 55.661 L
352.66 77.675 L
353.034 65.224 L
353.408 72.59 L
353.782 66.621 L
354.156 73.613 L
354.53 65.253 L
354.904 63.419 L
355.278 64.278 L
355.652 65.816 L
356.026 74.26 L
356.4 66.282 L
356.774 71.754 L
357.148 76.291 L
357.522 68.687 L
357.896 70.445 L
358.27 66.369 L
358.644 60.07 L
359.018 61.511 L
359.392 54.839 L
359.766 68.374 L
360.14 69.369 L
360.514 66.949 L
360.888 57.737 L
361.262 56.748 L
361.636 63.969 L
362.01 66.985 L
362.384 75.642 L
362.758 62.696 L
363.132 68.198 L
363.506 74.467 L
363.88 69.246 L
364.254 81.141 L
364.628 65.907 L
365.002 70.936 L
365.376 55.96 L
365.75 75.307 L
366.124 57.77 L
366.498 65.5 L
366.872 64.215 L
367.246 60.121 L
367.62 56.597 L
367.994 71.134 L
368.368 54.665 L
368.742 73.995 L
369.116 72.282 L
369.49 72.535 L
369.864 63.733 L
370.238 75.36 L
370.612 64.31 L
370.986 64.707 L
371.36 64.959 L
371.734 61.453 L
372.108 73.273 L
372.482 58.523 L
372.856 65.93 L
373.23 59.762 L
373.604 71.651 L
373.978 64.685 L
374.352 60.722 L
374.726 58.646 L
375.1 64.525 L
375.474 76.581 L
375.848 73.896 L
376.222 67.942 L
376.596 63.559 L
376.97 63.455 L
377.344 69.201 L
377.718 49.526 L
378.092 64.399 L
378.466 56.201 L
378.84 66.333 L
379.214 71.595 L
379.588 61.461 L
379.962 59.946 L
380.336 52.164 L
380.71 66.434 L
381.084 73.581 L
381.458 54.651 L
381.832 65.284 L
382.206 72.008 L
382.58 69.392 L
382.954 73.37 L
383.328 60.076 L
383.702 63.277 L
384.076 62.972 L
384.45 62.653 L
384.824 70.411 L
385.198 58.617 L
385.572 63.814 L
385.946 66.315 L
386.32 66.234 L
386.694 66.678 L
387.068 72.522 L
387.442 61.73 L
387.816 57.437 L
388.19 47.262 L
388.564 58.081 L
388.938 65.745 L
389.312 61.457 L
389.686 72.492 L
390.06 70.437 L
390.434 72.524 L
390.808 74.108 L
391.182 65.996 L
391.556 76.031 L
391.93 62.692 L
392.304 62.209 L
392.678 58.135 L
393.052 64.002 L
393.426 59.159 L
393.8 51.72 L
394.174 62.671 L
394.548 63.205 L
394.922 51.623 L
395.296 81.585 L
395.67 67.482 L
396.044 51.962 L
396.418 69.726 L
396.792 67.063 L
397.166 74.208 L
397.54 61.904 L
397.914 82.659 L
398.288 72.907 L
398.662 66.2 L
399.036 68.817 L
399.41 62.243 L
399.784 64.986 L
400.158 60.207 L
400.532 73.845 L
400.906 63.838 L
401.28 78.298 L
401.654 61.974 L
402.028 70.548 L
402.402 61.72 L
402.776 69.892 L
403.15 63.223 L
403.524 58.906 L
403.898 78.802 L
404.272 78.454 L
404.646 82.596 L
405.02 65.842 L
405.394 68.026 L
405.768 71.877 L
406.142 55.911 L
406.516 65.172 L
406.89 74.981 L
407.264 72.988 L
407.638 78.559 L
408.012 63.143 L
408.386 73.393 L
408.76 74.88 L
409.134 72.04 L
409.508 74.9 L
409.882 62.945 L
410.256 64.69 L
410.63 63.371 L
411.004 61.953 L
411.378 64.417 L
411.752 71.389 L
412.126 62.186 L
412.5 72.686 L
412.874 73.789 L
413.248 75.561 L
413.622 63.187 L
413.996 61.665 L
414.37 77.674 L
414.744 66.575 L
415.118 66.572 L
415.492 71.471 L
415.866 61.347 L
416.24 64.878 L
416.614 66.156 L
416.988 69.196 L
417.362 61.512 L
417.736 60.487 L
418.11 61.389 L
418.484 65.498 L
418.858 57.974 L
419.232 71.249 L
419.606 63.785 L
419.98 56.792 L
420.354 66.431 L
420.728 69.636 L
421.102 52.117 L
421.476 67.41 L
421.85 60.201 L
422.224 70.308 L
422.598 63.272 L
422.972 63.297 L
423.346 65.522 L
423.72 62.837 L
424.094 56.893 L
424.468 74.192 L
424.842 63.039 L
425.216 80.999 L
425.59 67.438 L
425.964 56.072 L
426.338 59.814 L
426.712 62.888 L
427.086 65.475 L
427.46 61.102 L
427.834 58.105 L
428.208 64.169 L
428.582 52.343 L
428.956 69.383 L
429.33 77.131 L
429.704 72.351 L
430.078 71.273 L
430.452 71.735 L
430.826 74.034 L
431.2 58.806 L
431.574 78.648 L
431.948 69.369 L
432.322 75.355 L
432.696 71.971 L
433.07 73.678 L
433.444 65.289 L
433.818 75.204 L
434.192 72.762 L
434.566 67.833 L
434.94 60.761 L
435.314 79.256 L
435.688 53.319 L
436.062 73.444 L
436.436 60.209 L
436.81 58.801 L
437.184 55.171 L
437.558 66.442 L
437.932 62.75 L
438.306 66.304 L
438.68 69.903 L
439.054 64.581 L
439.428 64.389 L
439.802 68.284 L
440.176 64.727 L
440.55 47.512 L
440.924 64.11 L
441.298 56.319 L
441.672 66.397 L
442.046 67.604 L
442.42 68.392 L
442.794 63.015 L
443.168 72.183 L
443.542 79.027 L
443.916 68.075 L
444.29 72.836 L
444.664 66.161 L
445.038 66.883 L
445.412 61.183 L
445.786 59.209 L
446.16 73.385 L
446.534 75.392 L
446.908 64.766 L
447.282 66.779 L
447.656 73.118 L
448.03 57.839 L
448.404 66.468 L
448.778 63.729 L
449.152 63.247 L
449.526 59.938 L
449.9 54.026 L
450.274 65.059 L
450.648 74.777 L
451.022 58.815 L
451.396 74.162 L
451.77 57.359 L
452.144 70.587 L
452.518 54.461 L
452.892 70.874 L
453.266 71.88 L
453.64 60.255 L
454.014 76.906 L
454.388 61.533 L
454.762 64.515 L
455.136 66.534 L
455.51 67.643 L
455.884 51.661 L
456.258 67.692 L
456.632 64.248 L
457.006 71.687 L
457.38 72.176 L
457.754 72.21 L
458.128 56.643 L
458.502 69.658 L
458.876 69.173 L
459.25 69.338 L
459.624 62.38 L
459.998 76.028 L
460.372 61.94 L
460.746 76.887 L
461.12 67.754 L
461.494 81.163 L
461.868 64.898 L
462.242 64.657 L
462.616 71.331 L
462.99 63.547 L
463.364 65.486 L
463.738 57.64 L
464.112 63.939 L
464.486 56.43 L
464.86 64.763 L
465.234 68.137 L
465.608 65.683 L
465.982 68.038 L
466.356 60.342 L
466.73 66.312 L
467.104 70.653 L
467.478 67.134 L
467.852 58.991 L
468.226 68.945 L
468.6 69.257 L
468.974 59.477 L
469.348 65.707 L
469.722 67.298 L
470.096 70.664 L
470.47 77.13 L
470.844 67.382 L
471.218 71.411 L
471.592 65.371 L
471.966 77.218 L
472.34 57.831 L
472.714 64.246 L
473.088 75.603 L
473.462 58.333 L
473.836 71.433 L
474.21 63.476 L
474.584 64.87 L
474.958 71.774 L
475.332 86.151 L
475.706 65.544 L
476.08 73.672 L
476.454 72.313 L
476.828 65.029 L
477.202 72.352 L
477.576 61.96 L
477.95 65.769 L
478.324 72.306 L
478.698 60.308 L
479.072 63.564 L
479.446 56.174 L
479.82 70.177 L
480.194 70.103 L
480.568 64.601 L
480.942 62.762 L
481.316 60.013 L
481.69 64.346 L
482.064 65.683 L
482.438 60.602 L
482.812 51.708 L
483.186 57.248 L
483.56 60.759 L
483.934 66.399 L
484.308 60.974 L
484.682 69.08 L
485.056 63.816 L
485.43 60.805 L
485.804 58.778 L
486.178 59.77 L
486.552 53.593 L
486.926 49.873 L
487.3 74.474 L
487.674 74.783 L
488.048 74.526 L
488.422 84.155 L
488.796 73.275 L
489.17 73.789 L
489.544 67.7 L
489.918 66.019 L
490.292 71.263 L
490.666 72.003 L
491.04 62.131 L
491.414 70.099 L
491.788 75.468 L
492.162 67.357 L
492.536 67.198 L
492.91 70.033 L
493.284 61.935 L
493.658 64.82 L
494.032 66.603 L
494.406 65.698 L
494.78 62.816 L
495.154 68.843 L
495.528 72.929 L
495.902 68.217 L
496.276 67.246 L
496.65 63.636 L
497.024 66.275 L
497.398 68.541 L
497.772 61.858 L
498.146 67.034 L
498.52 59.715 L
498.894 65.905 L
499.268 64.615 L
499.642 66.059 L
500.016 72.23 L
500.39 73.153 L
500.764 74.999 L
501.138 56.612 L
501.512 69.051 L
501.886 57.883 L
502.26 62.411 L
502.634 50.852 L
503.008 56.653 L
503.382 69.908 L
503.756 65.511 L
504.13 60.316 L
504.504 64.095 L
504.878 48.75 L
505.252 63.649 L
505.626 72.382 L
506 61.804 L
S
GR
GS
[0.75 0 0 0.75 0 0] CT
1 GC
N
319 227 M
506 227 L
506 157 L
319 157 L
cp
f
GR
GS
[0.75 0 0 0.75 0 0] CT
0.149 GC
2 setlinecap
1 LJ
0.667 LW
N
319 227 M
506 227 L
S
GR
GS
[0.75 0 0 0.75 0 0] CT
0.149 GC
2 setlinecap
1 LJ
0.667 LW
N
319 157 M
506 157 L
S
GR
GS
[0.75 0 0 0.75 0 0] CT
0.149 GC
2 setlinecap
1 LJ
0.667 LW
N
319 227 M
319 225.13 L
S
GR
GS
[0.75 0 0 0.75 0 0] CT
0.149 GC
2 setlinecap
1 LJ
0.667 LW
N
356.4 227 M
356.4 225.13 L
S
GR
GS
[0.75 0 0 0.75 0 0] CT
0.149 GC
2 setlinecap
1 LJ
0.667 LW
N
393.8 227 M
393.8 225.13 L
S
GR
GS
[0.75 0 0 0.75 0 0] CT
0.149 GC
2 setlinecap
1 LJ
0.667 LW
N
431.2 227 M
431.2 225.13 L
S
GR
GS
[0.75 0 0 0.75 0 0] CT
0.149 GC
2 setlinecap
1 LJ
0.667 LW
N
468.6 227 M
468.6 225.13 L
S
GR
GS
[0.75 0 0 0.75 0 0] CT
0.149 GC
2 setlinecap
1 LJ
0.667 LW
N
506 227 M
506 225.13 L
S
GR
GS
[0.75 0 0 0.75 0 0] CT
0.149 GC
2 setlinecap
1 LJ
0.667 LW
N
319 157 M
319 158.87 L
S
GR
GS
[0.75 0 0 0.75 0 0] CT
0.149 GC
2 setlinecap
1 LJ
0.667 LW
N
356.4 157 M
356.4 158.87 L
S
GR
GS
[0.75 0 0 0.75 0 0] CT
0.149 GC
2 setlinecap
1 LJ
0.667 LW
N
393.8 157 M
393.8 158.87 L
S
GR
GS
[0.75 0 0 0.75 0 0] CT
0.149 GC
2 setlinecap
1 LJ
0.667 LW
N
431.2 157 M
431.2 158.87 L
S
GR
GS
[0.75 0 0 0.75 0 0] CT
0.149 GC
2 setlinecap
1 LJ
0.667 LW
N
468.6 157 M
468.6 158.87 L
S
GR
GS
[0.75 0 0 0.75 0 0] CT
0.149 GC
2 setlinecap
1 LJ
0.667 LW
N
506 157 M
506 158.87 L
S
GR
GS
[0.75 0 0 0.75 239.25 174.25] CT
0.149 GC
/Helvetica 13.333 F
GS
[1 0 0 1 0 0] CT
-4 14 moveto 
1 -1 scale
(0) t 
GR
GR
GS
[0.75 0 0 0.75 267.3 174.25] CT
0.149 GC
/Helvetica 13.333 F
GS
[1 0 0 1 0 0] CT
-11 14 moveto 
1 -1 scale
(100) t 
GR
GR
GS
[0.75 0 0 0.75 295.34999 174.25] CT
0.149 GC
/Helvetica 13.333 F
GS
[1 0 0 1 0 0] CT
-11 14 moveto 
1 -1 scale
(200) t 
GR
GR
GS
[0.75 0 0 0.75 323.40001 174.25] CT
0.149 GC
/Helvetica 13.333 F
GS
[1 0 0 1 0 0] CT
-11 14 moveto 
1 -1 scale
(300) t 
GR
GR
GS
[0.75 0 0 0.75 351.45 174.25] CT
0.149 GC
/Helvetica 13.333 F
GS
[1 0 0 1 0 0] CT
-11 14 moveto 
1 -1 scale
(400) t 
GR
GR
GS
[0.75 0 0 0.75 379.5 174.25] CT
0.149 GC
/Helvetica 13.333 F
GS
[1 0 0 1 0 0] CT
-11 14 moveto 
1 -1 scale
(500) t 
GR
GR
GS
[0.75 0 0 0.75 309.37507 187.99999] CT
0.149 GC
/Helvetica 14.667 F
GS
[1 0 0 1 0 0] CT
-4 16 moveto 
1 -1 scale
(k) t 
GR
GR
GS
[0.75 0 0 0.75 0 0] CT
0.149 GC
2 setlinecap
1 LJ
0.667 LW
N
319 227 M
319 157 L
S
GR
GS
[0.75 0 0 0.75 0 0] CT
0.149 GC
2 setlinecap
1 LJ
0.667 LW
N
506 227 M
506 157 L
S
GR
GS
[0.75 0 0 0.75 0 0] CT
0.149 GC
2 setlinecap
1 LJ
0.667 LW
N
319 227 M
320.87 227 L
S
GR
GS
[0.75 0 0 0.75 0 0] CT
0.149 GC
2 setlinecap
1 LJ
0.667 LW
N
319 192 M
320.87 192 L
S
GR
GS
[0.75 0 0 0.75 0 0] CT
0.149 GC
2 setlinecap
1 LJ
0.667 LW
N
319 157 M
320.87 157 L
S
GR
GS
[0.75 0 0 0.75 0 0] CT
0.149 GC
2 setlinecap
1 LJ
0.667 LW
N
506 227 M
504.13 227 L
S
GR
GS
[0.75 0 0 0.75 0 0] CT
0.149 GC
2 setlinecap
1 LJ
0.667 LW
N
506 192 M
504.13 192 L
S
GR
GS
[0.75 0 0 0.75 0 0] CT
0.149 GC
2 setlinecap
1 LJ
0.667 LW
N
506 157 M
504.13 157 L
S
GR
GS
[0.75 0 0 0.75 235.24999 170.25] CT
0.149 GC
/Helvetica 13.333 F
GS
[1 0 0 1 0 0] CT
-12 5.5 moveto 
1 -1 scale
(-5) t 
GR
GR
GS
[0.75 0 0 0.75 235.24999 144] CT
0.149 GC
/Helvetica 13.333 F
GS
[1 0 0 1 0 0] CT
-8 5.5 moveto 
1 -1 scale
(0) t 
GR
GR
GS
[0.75 0 0 0.75 235.24999 117.75] CT
0.149 GC
/Helvetica 13.333 F
GS
[1 0 0 1 0 0] CT
-8 5.5 moveto 
1 -1 scale
(5) t 
GR
GR
GS
[0 -0.75 0.75 0 223.24999 143.99998] CT
0.149 GC
/Helvetica 14.667 F
GS
[1 0 0 1 0 0] CT
-4 -4 moveto 
1 -1 scale
(y) t 
GR
GR
GS
[0.75 0 0 0.75 0 0] CT
0 0.447 0.741 RC
1 LJ
0.667 LW
N
319.374 192 M
319.748 178.124 L
320.122 174.078 L
320.496 180.621 L
320.87 178.39 L
321.244 173.897 L
321.618 178.043 L
321.992 170.077 L
322.366 182.559 L
322.74 174.164 L
323.114 177.046 L
323.488 168.627 L
323.862 186.925 L
324.236 177.441 L
324.61 179.932 L
324.984 196.208 L
325.358 172.435 L
325.732 163.026 L
326.106 178.957 L
326.48 172.586 L
326.854 180.374 L
327.228 175.494 L
327.602 181.832 L
327.976 179.727 L
328.35 168.483 L
328.724 184.546 L
329.098 181.366 L
329.472 180.488 L
329.846 181.465 L
330.22 170.093 L
330.594 164.743 L
330.968 182.591 L
331.342 179.9 L
331.716 175.581 L
332.09 182.51 L
332.464 165.211 L
332.838 166.967 L
333.212 171.061 L
333.586 170.56 L
333.96 178.144 L
334.334 171.69 L
334.708 170.265 L
335.082 175.929 L
335.456 162.986 L
335.83 171.699 L
336.204 175.499 L
336.578 173.605 L
336.952 170.019 L
337.326 180.048 L
337.7 177.672 L
338.074 162.241 L
338.448 180.903 L
338.822 168.877 L
339.196 171.725 L
339.57 165.406 L
339.944 172.024 L
340.318 192.217 L
340.692 184.137 L
341.066 179.251 L
341.44 180.147 L
341.814 166.042 L
342.188 168.011 L
342.562 171.418 L
342.936 174.251 L
343.31 187.201 L
343.684 165.807 L
344.058 179.05 L
344.432 187.814 L
344.806 176.058 L
345.18 180.386 L
345.554 183.567 L
345.928 176.291 L
346.302 184.977 L
346.676 188.953 L
347.05 193.673 L
347.424 186.058 L
347.798 188.556 L
348.172 179.65 L
348.546 192.154 L
348.92 182.411 L
349.294 192.962 L
349.668 169.59 L
350.042 182.488 L
350.416 169.5 L
350.79 174.582 L
351.164 170.3 L
351.538 184.781 L
351.912 168.784 L
352.286 169.061 L
352.66 191.075 L
353.034 178.624 L
353.408 185.99 L
353.782 180.021 L
354.156 187.013 L
354.53 178.653 L
354.904 176.819 L
355.278 177.678 L
355.652 179.216 L
356.026 187.66 L
356.4 179.682 L
356.774 185.154 L
357.148 189.691 L
357.522 182.087 L
357.896 183.845 L
358.27 179.769 L
358.644 173.47 L
359.018 174.911 L
359.392 168.239 L
359.766 181.774 L
360.14 182.769 L
360.514 180.349 L
360.888 171.137 L
361.262 170.148 L
361.636 177.369 L
362.01 180.385 L
362.384 189.042 L
362.758 176.096 L
363.132 181.598 L
363.506 187.867 L
363.88 182.646 L
364.254 194.541 L
364.628 179.307 L
365.002 184.336 L
365.376 169.36 L
365.75 188.707 L
366.124 171.17 L
366.498 178.9 L
366.872 177.615 L
367.246 173.521 L
367.62 169.997 L
367.994 184.534 L
368.368 168.065 L
368.742 187.395 L
369.116 185.682 L
369.49 185.935 L
369.864 177.133 L
370.238 188.76 L
370.612 177.71 L
370.986 178.107 L
371.36 178.359 L
371.734 174.853 L
372.108 186.673 L
372.482 171.923 L
372.856 179.33 L
373.23 173.162 L
373.604 185.051 L
373.978 178.085 L
374.352 174.122 L
374.726 172.046 L
375.1 177.925 L
375.474 189.981 L
375.848 187.296 L
376.222 181.342 L
376.596 176.959 L
376.97 176.855 L
377.344 182.601 L
377.718 162.926 L
378.092 177.799 L
378.466 169.601 L
378.84 179.733 L
379.214 184.995 L
379.588 174.861 L
379.962 173.346 L
380.336 165.564 L
380.71 179.834 L
381.084 186.981 L
381.458 168.051 L
381.832 178.684 L
382.206 185.408 L
382.58 182.792 L
382.954 186.77 L
383.328 173.476 L
383.702 176.677 L
384.076 176.372 L
384.45 176.053 L
384.824 183.811 L
385.198 172.017 L
385.572 177.214 L
385.946 179.715 L
386.32 179.634 L
386.694 180.078 L
387.068 185.922 L
387.442 175.13 L
387.816 170.837 L
388.19 160.662 L
388.564 171.481 L
388.938 179.145 L
389.312 174.857 L
389.686 185.892 L
390.06 183.837 L
390.434 185.924 L
390.808 187.508 L
391.182 179.396 L
391.556 189.431 L
391.93 176.092 L
392.304 175.609 L
392.678 171.535 L
393.052 177.402 L
393.426 172.559 L
393.8 165.12 L
394.174 176.071 L
394.548 176.605 L
394.922 165.023 L
395.296 194.985 L
395.67 180.882 L
396.044 165.362 L
396.418 183.126 L
396.792 180.463 L
397.166 187.608 L
397.54 175.304 L
397.914 196.059 L
398.288 186.307 L
398.662 179.6 L
399.036 182.217 L
399.41 175.643 L
399.784 178.386 L
400.158 173.607 L
400.532 187.245 L
400.906 177.238 L
401.28 191.698 L
401.654 175.374 L
402.028 183.948 L
402.402 175.12 L
402.776 183.292 L
403.15 176.623 L
403.524 172.306 L
403.898 192.202 L
404.272 191.854 L
404.646 195.996 L
405.02 179.242 L
405.394 181.426 L
405.768 185.277 L
406.142 169.311 L
406.516 178.572 L
406.89 188.381 L
407.264 186.388 L
407.638 191.959 L
408.012 176.543 L
408.386 186.793 L
408.76 188.28 L
409.134 185.44 L
409.508 188.3 L
409.882 176.345 L
410.256 178.09 L
410.63 176.771 L
411.004 175.353 L
411.378 177.817 L
411.752 184.789 L
412.126 175.586 L
412.5 186.086 L
412.874 187.189 L
413.248 188.961 L
413.622 176.587 L
413.996 175.065 L
414.37 191.074 L
414.744 179.975 L
415.118 179.972 L
415.492 184.871 L
415.866 174.747 L
416.24 178.278 L
416.614 179.556 L
416.988 182.596 L
417.362 174.912 L
417.736 173.887 L
418.11 174.788 L
418.484 178.898 L
418.858 171.374 L
419.232 184.649 L
419.606 177.185 L
419.98 170.192 L
420.354 179.831 L
420.728 183.036 L
421.102 165.517 L
421.476 180.81 L
421.85 173.601 L
422.224 183.708 L
422.598 176.672 L
422.972 176.697 L
423.346 178.922 L
423.72 176.237 L
424.094 170.293 L
424.468 187.592 L
424.842 176.439 L
425.216 194.399 L
425.59 180.838 L
425.964 169.472 L
426.338 173.214 L
426.712 176.288 L
427.086 178.875 L
427.46 174.502 L
427.834 171.505 L
428.208 177.569 L
428.582 165.743 L
428.956 182.783 L
429.33 190.531 L
429.704 185.751 L
430.078 184.673 L
430.452 185.135 L
430.826 187.434 L
431.2 172.206 L
431.574 192.048 L
431.948 182.769 L
432.322 188.755 L
432.696 185.371 L
433.07 187.078 L
433.444 178.689 L
433.818 188.604 L
434.192 186.162 L
434.566 181.233 L
434.94 174.161 L
435.314 192.656 L
435.688 166.719 L
436.062 186.844 L
436.436 173.609 L
436.81 172.201 L
437.184 168.571 L
437.558 179.842 L
437.932 176.15 L
438.306 179.704 L
438.68 183.303 L
439.054 177.981 L
439.428 177.789 L
439.802 181.684 L
440.176 178.127 L
440.55 160.912 L
440.924 177.51 L
441.298 169.719 L
441.672 179.797 L
442.046 181.004 L
442.42 181.792 L
442.794 176.415 L
443.168 185.583 L
443.542 192.427 L
443.916 181.475 L
444.29 186.236 L
444.664 179.561 L
445.038 180.283 L
445.412 174.583 L
445.786 172.609 L
446.16 186.785 L
446.534 188.792 L
446.908 178.166 L
447.282 180.179 L
447.656 186.518 L
448.03 171.239 L
448.404 179.868 L
448.778 177.129 L
449.152 176.647 L
449.526 173.338 L
449.9 167.426 L
450.274 178.459 L
450.648 188.177 L
451.022 172.215 L
451.396 187.562 L
451.77 170.759 L
452.144 183.987 L
452.518 167.861 L
452.892 184.274 L
453.266 185.28 L
453.64 173.655 L
454.014 190.306 L
454.388 174.933 L
454.762 177.915 L
455.136 179.934 L
455.51 181.043 L
455.884 165.061 L
456.258 181.092 L
456.632 177.648 L
457.006 185.087 L
457.38 185.576 L
457.754 185.61 L
458.128 170.043 L
458.502 183.058 L
458.876 182.573 L
459.25 182.738 L
459.624 175.78 L
459.998 189.428 L
460.372 175.34 L
460.746 190.287 L
461.12 181.154 L
461.494 194.563 L
461.868 178.298 L
462.242 178.057 L
462.616 184.731 L
462.99 176.947 L
463.364 178.886 L
463.738 171.04 L
464.112 177.339 L
464.486 169.83 L
464.86 178.163 L
465.234 181.537 L
465.608 179.083 L
465.982 181.438 L
466.356 173.742 L
466.73 179.712 L
467.104 184.053 L
467.478 180.534 L
467.852 172.391 L
468.226 182.345 L
468.6 182.657 L
468.974 172.877 L
469.348 179.107 L
469.722 180.698 L
470.096 184.064 L
470.47 190.53 L
470.844 180.782 L
471.218 184.811 L
471.592 178.771 L
471.966 190.618 L
472.34 171.231 L
472.714 177.646 L
473.088 189.003 L
473.462 171.733 L
473.836 184.833 L
474.21 176.876 L
474.584 178.27 L
474.958 185.174 L
475.332 199.551 L
475.706 178.944 L
476.08 187.072 L
476.454 185.713 L
476.828 178.429 L
477.202 185.752 L
477.576 175.36 L
477.95 179.169 L
478.324 185.706 L
478.698 173.708 L
479.072 176.964 L
479.446 169.574 L
479.82 183.577 L
480.194 183.503 L
480.568 178.001 L
480.942 176.162 L
481.316 173.413 L
481.69 177.746 L
482.064 179.083 L
482.438 174.002 L
482.812 165.108 L
483.186 170.648 L
483.56 174.159 L
483.934 179.799 L
484.308 174.374 L
484.682 182.48 L
485.056 177.216 L
485.43 174.205 L
485.804 172.178 L
486.178 173.17 L
486.552 166.993 L
486.926 163.273 L
487.3 187.874 L
487.674 188.183 L
488.048 187.926 L
488.422 197.555 L
488.796 186.675 L
489.17 187.189 L
489.544 181.1 L
489.918 179.419 L
490.292 184.663 L
490.666 185.403 L
491.04 175.531 L
491.414 183.499 L
491.788 188.868 L
492.162 180.757 L
492.536 180.598 L
492.91 183.433 L
493.284 175.335 L
493.658 178.22 L
494.032 180.003 L
494.406 179.098 L
494.78 176.216 L
495.154 182.243 L
495.528 186.329 L
495.902 181.617 L
496.276 180.646 L
496.65 177.036 L
497.024 179.675 L
497.398 181.941 L
497.772 175.258 L
498.146 180.434 L
498.52 173.115 L
498.894 179.305 L
499.268 178.015 L
499.642 179.459 L
500.016 185.63 L
500.39 186.553 L
500.764 188.399 L
501.138 170.012 L
501.512 182.451 L
501.886 171.283 L
502.26 175.811 L
502.634 164.252 L
503.008 170.053 L
503.382 183.308 L
503.756 178.911 L
504.13 173.716 L
504.504 177.495 L
504.878 162.15 L
505.252 177.049 L
505.626 185.782 L
506 175.204 L
S
GR
GS
[0.75 0 0 0.75 0 0] CT
1 GC
N
319 353 M
506 353 L
506 283 L
319 283 L
cp
f
GR
GS
[0.75 0 0 0.75 0 0] CT
0.149 GC
2 setlinecap
1 LJ
0.667 LW
N
319 353 M
506 353 L
S
GR
GS
[0.75 0 0 0.75 0 0] CT
0.149 GC
2 setlinecap
1 LJ
0.667 LW
N
319 283 M
506 283 L
S
GR
GS
[0.75 0 0 0.75 0 0] CT
0.149 GC
2 setlinecap
1 LJ
0.667 LW
N
319 353 M
319 351.13 L
S
GR
GS
[0.75 0 0 0.75 0 0] CT
0.149 GC
2 setlinecap
1 LJ
0.667 LW
N
356.4 353 M
356.4 351.13 L
S
GR
GS
[0.75 0 0 0.75 0 0] CT
0.149 GC
2 setlinecap
1 LJ
0.667 LW
N
393.8 353 M
393.8 351.13 L
S
GR
GS
[0.75 0 0 0.75 0 0] CT
0.149 GC
2 setlinecap
1 LJ
0.667 LW
N
431.2 353 M
431.2 351.13 L
S
GR
GS
[0.75 0 0 0.75 0 0] CT
0.149 GC
2 setlinecap
1 LJ
0.667 LW
N
468.6 353 M
468.6 351.13 L
S
GR
GS
[0.75 0 0 0.75 0 0] CT
0.149 GC
2 setlinecap
1 LJ
0.667 LW
N
506 353 M
506 351.13 L
S
GR
GS
[0.75 0 0 0.75 0 0] CT
0.149 GC
2 setlinecap
1 LJ
0.667 LW
N
319 283 M
319 284.87 L
S
GR
GS
[0.75 0 0 0.75 0 0] CT
0.149 GC
2 setlinecap
1 LJ
0.667 LW
N
356.4 283 M
356.4 284.87 L
S
GR
GS
[0.75 0 0 0.75 0 0] CT
0.149 GC
2 setlinecap
1 LJ
0.667 LW
N
393.8 283 M
393.8 284.87 L
S
GR
GS
[0.75 0 0 0.75 0 0] CT
0.149 GC
2 setlinecap
1 LJ
0.667 LW
N
431.2 283 M
431.2 284.87 L
S
GR
GS
[0.75 0 0 0.75 0 0] CT
0.149 GC
2 setlinecap
1 LJ
0.667 LW
N
468.6 283 M
468.6 284.87 L
S
GR
GS
[0.75 0 0 0.75 0 0] CT
0.149 GC
2 setlinecap
1 LJ
0.667 LW
N
506 283 M
506 284.87 L
S
GR
GS
[0.75 0 0 0.75 239.25 268.75001] CT
0.149 GC
/Helvetica 13.333 F
GS
[1 0 0 1 0 0] CT
-4 14 moveto 
1 -1 scale
(0) t 
GR
GR
GS
[0.75 0 0 0.75 267.3 268.75001] CT
0.149 GC
/Helvetica 13.333 F
GS
[1 0 0 1 0 0] CT
-11 14 moveto 
1 -1 scale
(100) t 
GR
GR
GS
[0.75 0 0 0.75 295.34999 268.75001] CT
0.149 GC
/Helvetica 13.333 F
GS
[1 0 0 1 0 0] CT
-11 14 moveto 
1 -1 scale
(200) t 
GR
GR
GS
[0.75 0 0 0.75 323.40001 268.75001] CT
0.149 GC
/Helvetica 13.333 F
GS
[1 0 0 1 0 0] CT
-11 14 moveto 
1 -1 scale
(300) t 
GR
GR
GS
[0.75 0 0 0.75 351.45 268.75001] CT
0.149 GC
/Helvetica 13.333 F
GS
[1 0 0 1 0 0] CT
-11 14 moveto 
1 -1 scale
(400) t 
GR
GR
GS
[0.75 0 0 0.75 379.5 268.75001] CT
0.149 GC
/Helvetica 13.333 F
GS
[1 0 0 1 0 0] CT
-11 14 moveto 
1 -1 scale
(500) t 
GR
GR
GS
[0.75 0 0 0.75 309.37507 282.49999] CT
0.149 GC
/Helvetica 14.667 F
GS
[1 0 0 1 0 0] CT
-4 16 moveto 
1 -1 scale
(k) t 
GR
GR
GS
[0.75 0 0 0.75 0 0] CT
0.149 GC
2 setlinecap
1 LJ
0.667 LW
N
319 353 M
319 283 L
S
GR
GS
[0.75 0 0 0.75 0 0] CT
0.149 GC
2 setlinecap
1 LJ
0.667 LW
N
506 353 M
506 283 L
S
GR
GS
[0.75 0 0 0.75 0 0] CT
0.149 GC
2 setlinecap
1 LJ
0.667 LW
N
319 353 M
320.87 353 L
S
GR
GS
[0.75 0 0 0.75 0 0] CT
0.149 GC
2 setlinecap
1 LJ
0.667 LW
N
319 318 M
320.87 318 L
S
GR
GS
[0.75 0 0 0.75 0 0] CT
0.149 GC
2 setlinecap
1 LJ
0.667 LW
N
319 283 M
320.87 283 L
S
GR
GS
[0.75 0 0 0.75 0 0] CT
0.149 GC
2 setlinecap
1 LJ
0.667 LW
N
506 353 M
504.13 353 L
S
GR
GS
[0.75 0 0 0.75 0 0] CT
0.149 GC
2 setlinecap
1 LJ
0.667 LW
N
506 318 M
504.13 318 L
S
GR
GS
[0.75 0 0 0.75 0 0] CT
0.149 GC
2 setlinecap
1 LJ
0.667 LW
N
506 283 M
504.13 283 L
S
GR
GS
[0.75 0 0 0.75 235.24999 264.75] CT
0.149 GC
/Helvetica 13.333 F
GS
[1 0 0 1 0 0] CT
-19 5.5 moveto 
1 -1 scale
(-10) t 
GR
GR
GS
[0.75 0 0 0.75 235.24999 238.5] CT
0.149 GC
/Helvetica 13.333 F
GS
[1 0 0 1 0 0] CT
-8 5.5 moveto 
1 -1 scale
(0) t 
GR
GR
GS
[0.75 0 0 0.75 235.24999 212.25] CT
0.149 GC
/Helvetica 13.333 F
GS
[1 0 0 1 0 0] CT
-15 5.5 moveto 
1 -1 scale
(10) t 
GR
GR
GS
[0 -0.75 0.75 0 217.99999 238.49998] CT
0.149 GC
/Helvetica 14.667 F
GS
[1 0 0 1 0 0] CT
-4 -4 moveto 
1 -1 scale
(y) t 
GR
GR
GS
[0.75 0 0 0.75 0 0] CT
0 0.447 0.741 RC
1 LJ
0.667 LW
N
319.374 318 M
319.748 319.519 L
320.122 315.116 L
320.496 316.919 L
320.87 316.387 L
321.244 314.198 L
321.618 318.459 L
321.992 311.629 L
322.366 321.402 L
322.74 318.802 L
323.114 316.248 L
323.488 307.013 L
323.862 320.18 L
324.236 317.82 L
324.61 317.38 L
324.984 322.583 L
325.358 309.558 L
325.732 306.482 L
326.106 318.112 L
326.48 312.776 L
326.854 317.828 L
327.228 311.38 L
327.602 321.319 L
327.976 318.77 L
328.35 308.782 L
328.724 320.252 L
329.098 320.791 L
329.472 322.389 L
329.846 321.833 L
330.22 315.378 L
330.594 311.257 L
330.968 322.671 L
331.342 319.528 L
331.716 318.632 L
332.09 321.987 L
332.464 314.762 L
332.838 314.602 L
333.212 303.994 L
333.586 297.928 L
333.96 305.933 L
334.334 305.946 L
334.708 313.359 L
335.082 318.069 L
335.456 312.646 L
335.83 313.89 L
336.204 314.398 L
336.578 313.935 L
336.952 313.798 L
337.326 321.485 L
337.7 318.7 L
338.074 306.614 L
338.448 316.002 L
338.822 310.794 L
339.196 311.119 L
339.57 307.641 L
339.944 317.723 L
340.318 326.055 L
340.692 322.533 L
341.066 325.415 L
341.44 326.303 L
341.814 316.293 L
342.188 312.191 L
342.562 314.674 L
342.936 314.932 L
343.31 324.483 L
343.684 319.29 L
344.058 321.572 L
344.432 327.077 L
344.806 315.07 L
345.18 312.398 L
345.554 318.207 L
345.928 311.75 L
346.302 315.437 L
346.676 324.558 L
347.05 326.132 L
347.424 321.005 L
347.798 320.768 L
348.172 315.089 L
348.546 320.734 L
348.92 315.547 L
349.294 323.786 L
349.668 311.403 L
350.042 325.795 L
350.416 319.855 L
350.79 315.208 L
351.164 315.34 L
351.538 320.603 L
351.912 307.898 L
352.286 313.234 L
352.66 327.061 L
353.034 320.776 L
353.408 321.488 L
353.782 319.052 L
354.156 325.257 L
354.53 324.307 L
354.904 321.216 L
355.278 320.089 L
355.652 321.069 L
356.026 324.536 L
356.4 322.795 L
356.774 321.474 L
357.148 330.294 L
357.522 322.462 L
357.896 319.674 L
358.27 320.584 L
358.644 316.415 L
359.018 315.526 L
359.392 314.241 L
359.766 320.141 L
360.14 318.863 L
360.514 321.016 L
360.888 312.508 L
361.262 309.246 L
361.636 313.909 L
362.01 316.907 L
362.384 325.696 L
362.758 316.227 L
363.132 322.868 L
363.506 319.107 L
363.88 316.401 L
364.254 323.126 L
364.628 317.971 L
365.002 327.332 L
365.376 320.179 L
365.75 325.102 L
366.124 307.51 L
366.498 312.231 L
366.872 313.372 L
367.246 314.9 L
367.62 312.833 L
367.994 317.303 L
368.368 311.501 L
368.742 315.622 L
369.116 321.797 L
369.49 322.781 L
369.864 317.458 L
370.238 329.131 L
370.612 318.599 L
370.986 317.831 L
371.36 317.464 L
371.734 313.215 L
372.108 317.093 L
372.482 309.463 L
372.856 317.043 L
373.23 314.567 L
373.604 319.555 L
373.978 320.666 L
374.352 320.286 L
374.726 318.131 L
375.1 318.921 L
375.474 318.479 L
375.848 317.031 L
376.222 317.906 L
376.596 318.229 L
376.97 312.621 L
377.344 308.936 L
377.718 303.903 L
378.092 315.778 L
378.466 316.84 L
378.84 316.965 L
379.214 319.284 L
379.588 311.303 L
379.962 315.622 L
380.336 310.648 L
380.71 320.061 L
381.084 318.696 L
381.458 312.515 L
381.832 318.012 L
382.206 322.284 L
382.58 317.205 L
382.954 319.09 L
383.328 316.904 L
383.702 319.564 L
384.076 321.243 L
384.45 317.112 L
384.824 319.552 L
385.198 319.133 L
385.572 325.326 L
385.946 322.494 L
386.32 318.089 L
386.694 317.793 L
387.068 325.851 L
387.442 323.048 L
387.816 314.579 L
388.19 309.519 L
388.564 315.701 L
388.938 314.557 L
389.312 316.58 L
389.686 321.245 L
390.06 318.902 L
390.434 318.021 L
390.808 323.125 L
391.182 317.408 L
391.556 314.063 L
391.93 316.636 L
392.304 314.882 L
392.678 314.18 L
393.052 319.663 L
393.426 318.531 L
393.8 311.267 L
394.174 309.245 L
394.548 315.558 L
394.922 308.585 L
395.296 326.44 L
395.67 312.839 L
396.044 306.314 L
396.418 317.964 L
396.792 315.629 L
397.166 320.67 L
397.54 311.747 L
397.914 324.812 L
398.288 324.227 L
398.662 318.711 L
399.036 314.796 L
399.41 317.585 L
399.784 318.988 L
400.158 312.686 L
400.532 326.762 L
400.906 317.369 L
401.28 322.002 L
401.654 314.241 L
402.028 321.827 L
402.402 316.659 L
402.776 320.052 L
403.15 313.719 L
403.524 310.916 L
403.898 323.736 L
404.272 318.792 L
404.646 323.741 L
405.02 319.202 L
405.394 321.035 L
405.768 319.245 L
406.142 311.494 L
406.516 314.055 L
406.89 320.507 L
407.264 312.669 L
407.638 325.114 L
408.012 318.299 L
408.386 322.825 L
408.76 322.723 L
409.134 316.575 L
409.508 319.536 L
409.882 315.377 L
410.256 316.582 L
410.63 313.937 L
411.004 316.774 L
411.378 316.187 L
411.752 325.113 L
412.126 318.551 L
412.5 325.538 L
412.874 326.049 L
413.248 323.968 L
413.622 320.731 L
413.996 321.016 L
414.37 331.204 L
414.744 328.991 L
415.118 324.115 L
415.492 319.987 L
415.866 315.873 L
416.24 318.275 L
416.614 321.793 L
416.988 316.468 L
417.362 314.977 L
417.736 310.778 L
418.11 312.321 L
418.484 316.891 L
418.858 310.149 L
419.232 315.611 L
419.606 314.737 L
419.98 308.236 L
420.354 310.025 L
420.728 315.929 L
421.102 309.919 L
421.476 316.861 L
421.85 313.071 L
422.224 316.595 L
422.598 315.662 L
422.972 313.909 L
423.346 313.088 L
423.72 313.523 L
424.094 311.516 L
424.468 325.082 L
424.842 321.707 L
425.216 332.697 L
425.59 326.237 L
425.964 317.284 L
426.338 322.118 L
426.712 312.974 L
427.086 313.674 L
427.46 320.032 L
427.834 319.93 L
428.208 320.361 L
428.582 318.205 L
428.956 324.657 L
429.33 322.612 L
429.704 321.215 L
430.078 320.868 L
430.452 324.138 L
430.826 325.403 L
431.2 320.353 L
431.574 326.152 L
431.948 322.023 L
432.322 321.379 L
432.696 316.439 L
433.07 316.173 L
433.444 314.921 L
433.818 322.828 L
434.192 325.35 L
434.566 320.527 L
434.94 313.163 L
435.314 324.593 L
435.688 312.188 L
436.062 320.045 L
436.436 311.545 L
436.81 317.084 L
437.184 313.297 L
437.558 317.96 L
437.932 316.721 L
438.306 315.512 L
438.68 319.779 L
439.054 319.807 L
439.428 317.583 L
439.802 317.888 L
440.176 317.422 L
440.55 306.277 L
440.924 320.597 L
441.298 318.316 L
441.672 330.454 L
442.046 323.287 L
442.42 324.56 L
442.794 319.987 L
443.168 319.652 L
443.542 323.633 L
443.916 319.985 L
444.29 324.564 L
444.664 320.411 L
445.038 317.708 L
445.412 320.001 L
445.786 317.024 L
446.16 320.438 L
446.534 326.544 L
446.908 317.198 L
447.282 316.145 L
447.656 323.216 L
448.03 319.487 L
448.404 319.653 L
448.778 315.028 L
449.152 313.882 L
449.526 311.195 L
449.9 313.85 L
450.274 316.609 L
450.648 323.755 L
451.022 316.859 L
451.396 328.208 L
451.77 313.277 L
452.144 319.541 L
452.518 308.693 L
452.892 313.908 L
453.266 321.258 L
453.64 313.261 L
454.014 322.56 L
454.388 312.44 L
454.762 312.105 L
455.136 313.106 L
455.51 318.817 L
455.884 311.227 L
456.258 318.212 L
456.632 306.858 L
457.006 311.846 L
457.38 309.279 L
457.754 313.895 L
458.128 309.049 L
458.502 315.761 L
458.876 319.215 L
459.25 315.573 L
459.624 314.638 L
459.998 326.565 L
460.372 315.002 L
460.746 327.901 L
461.12 326.915 L
461.494 328.692 L
461.868 321.999 L
462.242 322.473 L
462.616 323.748 L
462.99 319.855 L
463.364 319.985 L
463.738 314.084 L
464.112 320.782 L
464.486 318.978 L
464.86 326.876 L
465.234 325.045 L
465.608 318.737 L
465.982 321.679 L
466.356 314.922 L
466.73 316.329 L
467.104 316.292 L
467.478 313.433 L
467.852 314.098 L
468.226 321.973 L
468.6 320.726 L
468.974 317.382 L
469.348 314.599 L
469.722 312.675 L
470.096 317.045 L
470.47 323.267 L
470.844 316.933 L
471.218 321.894 L
471.592 318.673 L
471.966 325.774 L
472.34 314.666 L
472.714 313.943 L
473.088 318.873 L
473.462 308.6 L
473.836 320.814 L
474.21 316.221 L
474.584 320.274 L
474.958 321.094 L
475.332 327.153 L
475.706 313.227 L
476.08 316.101 L
476.454 316.232 L
476.828 316.643 L
477.202 322.24 L
477.576 322.974 L
477.95 322.794 L
478.324 328.494 L
478.698 315.896 L
479.072 314.311 L
479.446 311.416 L
479.82 320.445 L
480.194 319.779 L
480.568 312.109 L
480.942 309.535 L
481.316 312.996 L
481.69 315.637 L
482.064 320.603 L
482.438 315.42 L
482.812 308.585 L
483.186 309.655 L
483.56 318.218 L
483.934 318.029 L
484.308 318.124 L
484.682 322.044 L
485.056 315.678 L
485.43 313.848 L
485.804 314.128 L
486.178 312.843 L
486.552 305.627 L
486.926 308.816 L
487.3 325.93 L
487.674 327.899 L
488.048 327.991 L
488.422 332.056 L
488.796 322.31 L
489.17 328.801 L
489.544 321.56 L
489.918 321.816 L
490.292 319.072 L
490.666 322.916 L
491.04 316.999 L
491.414 323.47 L
491.788 326.591 L
492.162 321.427 L
492.536 320.694 L
492.91 322.717 L
493.284 313.764 L
493.658 314.575 L
494.032 311.04 L
494.406 315.092 L
494.78 311.67 L
495.154 323.665 L
495.528 321.575 L
495.902 317.994 L
496.276 319.244 L
496.65 314.938 L
497.024 314.433 L
497.398 314.163 L
497.772 312.053 L
498.146 314.685 L
498.52 315.065 L
498.894 321.506 L
499.268 319.927 L
499.642 318.752 L
500.016 318.48 L
500.39 322.749 L
500.764 324.628 L
501.138 305.001 L
501.512 317.334 L
501.886 306.797 L
502.26 309.605 L
502.634 308.883 L
503.008 312.891 L
503.382 320.414 L
503.756 316.494 L
504.13 310.225 L
504.504 319.74 L
504.878 304.347 L
505.252 311.86 L
505.626 320.438 L
506 315.923 L
S
GR
%%Trailer
%%Pages: 1
%%EOF
