%!PS-Adobe-3.0 EPSF-3.0
%%Creator: (MATLAB, The Mathworks, Inc. Version 9.0.0.341360 \(R2016a\). Operating System: Windows 8)
%%Title: C:/Users/Jan/Documents/JC.ISF/isf2/rmpp3.eps
%%CreationDate: 2017-04-11T12:57:25
%%Pages: (atend)
%%BoundingBox: 0 0 420 315
%%LanguageLevel: 3
%%EndComments
%%BeginProlog
%%BeginResource: procset (Apache XML Graphics Std ProcSet) 1.2 0
%%Version: 1.2 0
%%Copyright: (Copyright 2001-2003,2010 The Apache Software Foundation. License terms: http://www.apache.org/licenses/LICENSE-2.0)
/bd{bind def}bind def
/ld{load def}bd
/GR/grestore ld
/M/moveto ld
/LJ/setlinejoin ld
/C/curveto ld
/f/fill ld
/LW/setlinewidth ld
/GC/setgray ld
/t/show ld
/N/newpath ld
/CT/concat ld
/cp/closepath ld
/S/stroke ld
/L/lineto ld
/CC/setcmykcolor ld
/A/ashow ld
/GS/gsave ld
/RC/setrgbcolor ld
/RM/rmoveto ld
/ML/setmiterlimit ld
/re {4 2 roll M
1 index 0 rlineto
0 exch rlineto
neg 0 rlineto
cp } bd
/_ctm matrix def
/_tm matrix def
/BT { _ctm currentmatrix pop matrix _tm copy pop 0 0 moveto } bd
/ET { _ctm setmatrix } bd
/iTm { _ctm setmatrix _tm concat } bd
/Tm { _tm astore pop iTm 0 0 moveto } bd
/ux 0.0 def
/uy 0.0 def
/F {
  /Tp exch def
  /Tf exch def
  Tf findfont Tp scalefont setfont
  /cf Tf def  /cs Tp def
} bd
/ULS {currentpoint /uy exch def /ux exch def} bd
/ULE {
  /Tcx currentpoint pop def
  gsave
  newpath
  cf findfont cs scalefont dup
  /FontMatrix get 0 get /Ts exch def /FontInfo get dup
  /UnderlinePosition get Ts mul /To exch def
  /UnderlineThickness get Ts mul /Tt exch def
  ux uy To add moveto  Tcx uy To add lineto
  Tt setlinewidth stroke
  grestore
} bd
/OLE {
  /Tcx currentpoint pop def
  gsave
  newpath
  cf findfont cs scalefont dup
  /FontMatrix get 0 get /Ts exch def /FontInfo get dup
  /UnderlinePosition get Ts mul /To exch def
  /UnderlineThickness get Ts mul /Tt exch def
  ux uy To add cs add moveto Tcx uy To add cs add lineto
  Tt setlinewidth stroke
  grestore
} bd
/SOE {
  /Tcx currentpoint pop def
  gsave
  newpath
  cf findfont cs scalefont dup
  /FontMatrix get 0 get /Ts exch def /FontInfo get dup
  /UnderlinePosition get Ts mul /To exch def
  /UnderlineThickness get Ts mul /Tt exch def
  ux uy To add cs 10 mul 26 idiv add moveto Tcx uy To add cs 10 mul 26 idiv add lineto
  Tt setlinewidth stroke
  grestore
} bd
/QT {
/Y22 exch store
/X22 exch store
/Y21 exch store
/X21 exch store
currentpoint
/Y21 load 2 mul add 3 div exch
/X21 load 2 mul add 3 div exch
/X21 load 2 mul /X22 load add 3 div
/Y21 load 2 mul /Y22 load add 3 div
/X22 load /Y22 load curveto
} bd
/SSPD {
dup length /d exch dict def
{
/v exch def
/k exch def
currentpagedevice k known {
/cpdv currentpagedevice k get def
v cpdv ne {
/upd false def
/nullv v type /nulltype eq def
/nullcpdv cpdv type /nulltype eq def
nullv nullcpdv or
{
/upd true def
} {
/sametype v type cpdv type eq def
sametype {
v type /arraytype eq {
/vlen v length def
/cpdvlen cpdv length def
vlen cpdvlen eq {
0 1 vlen 1 sub {
/i exch def
/obj v i get def
/cpdobj cpdv i get def
obj cpdobj ne {
/upd true def
exit
} if
} for
} {
/upd true def
} ifelse
} {
v type /dicttype eq {
v {
/dv exch def
/dk exch def
/cpddv cpdv dk get def
dv cpddv ne {
/upd true def
exit
} if
} forall
} {
/upd true def
} ifelse
} ifelse
} if
} ifelse
upd true eq {
d k v put
} if
} if
} if
} forall
d length 0 gt {
d setpagedevice
} if
} bd
%%EndResource
%%BeginResource: procset (Apache XML Graphics EPS ProcSet) 1.0 0
%%Version: 1.0 0
%%Copyright: (Copyright 2002-2003 The Apache Software Foundation. License terms: http://www.apache.org/licenses/LICENSE-2.0)
/BeginEPSF { %def
/b4_Inc_state save def         % Save state for cleanup
/dict_count countdictstack def % Count objects on dict stack
/op_count count 1 sub def      % Count objects on operand stack
userdict begin                 % Push userdict on dict stack
/showpage { } def              % Redefine showpage, { } = null proc
0 setgray 0 setlinecap         % Prepare graphics state
1 setlinewidth 0 setlinejoin
10 setmiterlimit [ ] 0 setdash newpath
/languagelevel where           % If level not equal to 1 then
{pop languagelevel             % set strokeadjust and
1 ne                           % overprint to their defaults.
{false setstrokeadjust false setoverprint
} if
} if
} bd
/EndEPSF { %def
count op_count sub {pop} repeat            % Clean up stacks
countdictstack dict_count sub {end} repeat
b4_Inc_state restore
} bd
%%EndResource
%FOPBeginFontDict
%%IncludeResource: font Courier-Bold
%%IncludeResource: font Helvetica
%%IncludeResource: font Courier-BoldOblique
%%IncludeResource: font Courier-Oblique
%%IncludeResource: font Times-Roman
%%IncludeResource: font Helvetica-BoldOblique
%%IncludeResource: font Helvetica-Bold
%%IncludeResource: font Helvetica-Oblique
%%IncludeResource: font Times-BoldItalic
%%IncludeResource: font Courier
%%IncludeResource: font Times-Italic
%%IncludeResource: font Times-Bold
%%IncludeResource: font Symbol
%%IncludeResource: font ZapfDingbats
%FOPEndFontDict
%%BeginResource: encoding WinAnsiEncoding
/WinAnsiEncoding [
/.notdef /.notdef /.notdef /.notdef /.notdef
/.notdef /.notdef /.notdef /.notdef /.notdef
/.notdef /.notdef /.notdef /.notdef /.notdef
/.notdef /.notdef /.notdef /.notdef /.notdef
/.notdef /.notdef /.notdef /.notdef /.notdef
/.notdef /.notdef /.notdef /.notdef /.notdef
/.notdef /.notdef /space /exclam /quotedbl
/numbersign /dollar /percent /ampersand /quotesingle
/parenleft /parenright /asterisk /plus /comma
/hyphen /period /slash /zero /one
/two /three /four /five /six
/seven /eight /nine /colon /semicolon
/less /equal /greater /question /at
/A /B /C /D /E
/F /G /H /I /J
/K /L /M /N /O
/P /Q /R /S /T
/U /V /W /X /Y
/Z /bracketleft /backslash /bracketright /asciicircum
/underscore /quoteleft /a /b /c
/d /e /f /g /h
/i /j /k /l /m
/n /o /p /q /r
/s /t /u /v /w
/x /y /z /braceleft /bar
/braceright /asciitilde /bullet /Euro /bullet
/quotesinglbase /florin /quotedblbase /ellipsis /dagger
/daggerdbl /circumflex /perthousand /Scaron /guilsinglleft
/OE /bullet /Zcaron /bullet /bullet
/quoteleft /quoteright /quotedblleft /quotedblright /bullet
/endash /emdash /asciitilde /trademark /scaron
/guilsinglright /oe /bullet /zcaron /Ydieresis
/space /exclamdown /cent /sterling /currency
/yen /brokenbar /section /dieresis /copyright
/ordfeminine /guillemotleft /logicalnot /sfthyphen /registered
/macron /degree /plusminus /twosuperior /threesuperior
/acute /mu /paragraph /middot /cedilla
/onesuperior /ordmasculine /guillemotright /onequarter /onehalf
/threequarters /questiondown /Agrave /Aacute /Acircumflex
/Atilde /Adieresis /Aring /AE /Ccedilla
/Egrave /Eacute /Ecircumflex /Edieresis /Igrave
/Iacute /Icircumflex /Idieresis /Eth /Ntilde
/Ograve /Oacute /Ocircumflex /Otilde /Odieresis
/multiply /Oslash /Ugrave /Uacute /Ucircumflex
/Udieresis /Yacute /Thorn /germandbls /agrave
/aacute /acircumflex /atilde /adieresis /aring
/ae /ccedilla /egrave /eacute /ecircumflex
/edieresis /igrave /iacute /icircumflex /idieresis
/eth /ntilde /ograve /oacute /ocircumflex
/otilde /odieresis /divide /oslash /ugrave
/uacute /ucircumflex /udieresis /yacute /thorn
/ydieresis
] def
%%EndResource
%FOPBeginFontReencode
/Courier-Bold findfont
dup length dict begin
  {1 index /FID ne {def} {pop pop} ifelse} forall
  /Encoding WinAnsiEncoding def
  currentdict
end
/Courier-Bold exch definefont pop
/Helvetica findfont
dup length dict begin
  {1 index /FID ne {def} {pop pop} ifelse} forall
  /Encoding WinAnsiEncoding def
  currentdict
end
/Helvetica exch definefont pop
/Courier-BoldOblique findfont
dup length dict begin
  {1 index /FID ne {def} {pop pop} ifelse} forall
  /Encoding WinAnsiEncoding def
  currentdict
end
/Courier-BoldOblique exch definefont pop
/Courier-Oblique findfont
dup length dict begin
  {1 index /FID ne {def} {pop pop} ifelse} forall
  /Encoding WinAnsiEncoding def
  currentdict
end
/Courier-Oblique exch definefont pop
/Times-Roman findfont
dup length dict begin
  {1 index /FID ne {def} {pop pop} ifelse} forall
  /Encoding WinAnsiEncoding def
  currentdict
end
/Times-Roman exch definefont pop
/Helvetica-BoldOblique findfont
dup length dict begin
  {1 index /FID ne {def} {pop pop} ifelse} forall
  /Encoding WinAnsiEncoding def
  currentdict
end
/Helvetica-BoldOblique exch definefont pop
/Helvetica-Bold findfont
dup length dict begin
  {1 index /FID ne {def} {pop pop} ifelse} forall
  /Encoding WinAnsiEncoding def
  currentdict
end
/Helvetica-Bold exch definefont pop
/Helvetica-Oblique findfont
dup length dict begin
  {1 index /FID ne {def} {pop pop} ifelse} forall
  /Encoding WinAnsiEncoding def
  currentdict
end
/Helvetica-Oblique exch definefont pop
/Times-BoldItalic findfont
dup length dict begin
  {1 index /FID ne {def} {pop pop} ifelse} forall
  /Encoding WinAnsiEncoding def
  currentdict
end
/Times-BoldItalic exch definefont pop
/Courier findfont
dup length dict begin
  {1 index /FID ne {def} {pop pop} ifelse} forall
  /Encoding WinAnsiEncoding def
  currentdict
end
/Courier exch definefont pop
/Times-Italic findfont
dup length dict begin
  {1 index /FID ne {def} {pop pop} ifelse} forall
  /Encoding WinAnsiEncoding def
  currentdict
end
/Times-Italic exch definefont pop
/Times-Bold findfont
dup length dict begin
  {1 index /FID ne {def} {pop pop} ifelse} forall
  /Encoding WinAnsiEncoding def
  currentdict
end
/Times-Bold exch definefont pop
%FOPEndFontReencode
%%EndProlog
%%Page: 1 1
%%PageBoundingBox: 0 0 420 315
%%BeginPageSetup
[1 0 0 -1 0 315] CT
%%EndPageSetup
GS
[0.75 0 0 0.75 0 0] CT
1 GC
N
0 0 560 420 re
f
GR
GS
[0.75 0 0 0.75 0 0] CT
1 GC
N
0 0 560 420 re
f
GR
GS
[0.75 0 0 0.75 0 0] CT
1 GC
N
73 374 M
507 374 L
507 31 L
73 31 L
cp
f
GR
GS
[0.75 0 0 0.75 0 0] CT
0.873 GC
1 LJ
0.667 LW
N
73 374 M
73 31 L
S
GR
GS
[0.75 0 0 0.75 0 0] CT
0.873 GC
1 LJ
0.667 LW
N
116.4 374 M
116.4 31 L
S
GR
GS
[0.75 0 0 0.75 0 0] CT
0.873 GC
1 LJ
0.667 LW
N
159.8 374 M
159.8 31 L
S
GR
GS
[0.75 0 0 0.75 0 0] CT
0.873 GC
1 LJ
0.667 LW
N
203.2 374 M
203.2 31 L
S
GR
GS
[0.75 0 0 0.75 0 0] CT
0.873 GC
1 LJ
0.667 LW
N
246.6 374 M
246.6 31 L
S
GR
GS
[0.75 0 0 0.75 0 0] CT
0.873 GC
1 LJ
0.667 LW
N
290 374 M
290 31 L
S
GR
GS
[0.75 0 0 0.75 0 0] CT
0.873 GC
1 LJ
0.667 LW
N
333.4 374 M
333.4 31 L
S
GR
GS
[0.75 0 0 0.75 0 0] CT
0.873 GC
1 LJ
0.667 LW
N
376.8 374 M
376.8 31 L
S
GR
GS
[0.75 0 0 0.75 0 0] CT
0.873 GC
1 LJ
0.667 LW
N
420.2 374 M
420.2 31 L
S
GR
GS
[0.75 0 0 0.75 0 0] CT
0.873 GC
1 LJ
0.667 LW
N
463.6 374 M
463.6 31 L
S
GR
GS
[0.75 0 0 0.75 0 0] CT
0.873 GC
1 LJ
0.667 LW
N
507 374 M
507 31 L
S
GR
GS
[0.75 0 0 0.75 0 0] CT
0.873 GC
1 LJ
0.667 LW
N
507 374 M
73 374 L
S
GR
GS
[0.75 0 0 0.75 0 0] CT
0.873 GC
1 LJ
0.667 LW
N
507 325 M
73 325 L
S
GR
GS
[0.75 0 0 0.75 0 0] CT
0.873 GC
1 LJ
0.667 LW
N
507 276 M
73 276 L
S
GR
GS
[0.75 0 0 0.75 0 0] CT
0.873 GC
1 LJ
0.667 LW
N
507 227 M
73 227 L
S
GR
GS
[0.75 0 0 0.75 0 0] CT
0.873 GC
1 LJ
0.667 LW
N
507 178 M
73 178 L
S
GR
GS
[0.75 0 0 0.75 0 0] CT
0.873 GC
1 LJ
0.667 LW
N
507 129 M
73 129 L
S
GR
GS
[0.75 0 0 0.75 0 0] CT
0.873 GC
1 LJ
0.667 LW
N
507 80 M
73 80 L
S
GR
GS
[0.75 0 0 0.75 0 0] CT
0.873 GC
1 LJ
0.667 LW
N
507 31 M
73 31 L
S
GR
GS
[0.75 0 0 0.75 0 0] CT
0.149 GC
2 setlinecap
1 LJ
0.667 LW
N
73 374 M
507 374 L
S
GR
GS
[0.75 0 0 0.75 0 0] CT
0.149 GC
2 setlinecap
1 LJ
0.667 LW
N
73 374 M
73 369.66 L
S
GR
GS
[0.75 0 0 0.75 0 0] CT
0.149 GC
2 setlinecap
1 LJ
0.667 LW
N
116.4 374 M
116.4 369.66 L
S
GR
GS
[0.75 0 0 0.75 0 0] CT
0.149 GC
2 setlinecap
1 LJ
0.667 LW
N
159.8 374 M
159.8 369.66 L
S
GR
GS
[0.75 0 0 0.75 0 0] CT
0.149 GC
2 setlinecap
1 LJ
0.667 LW
N
203.2 374 M
203.2 369.66 L
S
GR
GS
[0.75 0 0 0.75 0 0] CT
0.149 GC
2 setlinecap
1 LJ
0.667 LW
N
246.6 374 M
246.6 369.66 L
S
GR
GS
[0.75 0 0 0.75 0 0] CT
0.149 GC
2 setlinecap
1 LJ
0.667 LW
N
290 374 M
290 369.66 L
S
GR
GS
[0.75 0 0 0.75 0 0] CT
0.149 GC
2 setlinecap
1 LJ
0.667 LW
N
333.4 374 M
333.4 369.66 L
S
GR
GS
[0.75 0 0 0.75 0 0] CT
0.149 GC
2 setlinecap
1 LJ
0.667 LW
N
376.8 374 M
376.8 369.66 L
S
GR
GS
[0.75 0 0 0.75 0 0] CT
0.149 GC
2 setlinecap
1 LJ
0.667 LW
N
420.2 374 M
420.2 369.66 L
S
GR
GS
[0.75 0 0 0.75 0 0] CT
0.149 GC
2 setlinecap
1 LJ
0.667 LW
N
463.6 374 M
463.6 369.66 L
S
GR
GS
[0.75 0 0 0.75 0 0] CT
0.149 GC
2 setlinecap
1 LJ
0.667 LW
N
507 374 M
507 369.66 L
S
GR
GS
[0.75 0 0 0.75 54.75 284.50001] CT
0.149 GC
/Helvetica 13.333 F
GS
[1 0 0 1 0 0] CT
-4 14 moveto 
1 -1 scale
(0) t 
GR
GR
GS
[0.75 0 0 0.75 87.3 284.50001] CT
0.149 GC
/Helvetica 13.333 F
GS
[1 0 0 1 0 0] CT
-11 14 moveto 
1 -1 scale
(200) t 
GR
GR
GS
[0.75 0 0 0.75 119.85 284.50001] CT
0.149 GC
/Helvetica 13.333 F
GS
[1 0 0 1 0 0] CT
-11 14 moveto 
1 -1 scale
(400) t 
GR
GR
GS
[0.75 0 0 0.75 152.4 284.50001] CT
0.149 GC
/Helvetica 13.333 F
GS
[1 0 0 1 0 0] CT
-11 14 moveto 
1 -1 scale
(600) t 
GR
GR
GS
[0.75 0 0 0.75 184.95 284.50001] CT
0.149 GC
/Helvetica 13.333 F
GS
[1 0 0 1 0 0] CT
-11 14 moveto 
1 -1 scale
(800) t 
GR
GR
GS
[0.75 0 0 0.75 217.5 284.50001] CT
0.149 GC
/Helvetica 13.333 F
GS
[1 0 0 1 0 0] CT
-14.5 14 moveto 
1 -1 scale
(1000) t 
GR
GR
GS
[0.75 0 0 0.75 250.05 284.50001] CT
0.149 GC
/Helvetica 13.333 F
GS
[1 0 0 1 0 0] CT
-14.5 14 moveto 
1 -1 scale
(1200) t 
GR
GR
GS
[0.75 0 0 0.75 282.59999 284.50001] CT
0.149 GC
/Helvetica 13.333 F
GS
[1 0 0 1 0 0] CT
-14.5 14 moveto 
1 -1 scale
(1400) t 
GR
GR
GS
[0.75 0 0 0.75 315.15001 284.50001] CT
0.149 GC
/Helvetica 13.333 F
GS
[1 0 0 1 0 0] CT
-14.5 14 moveto 
1 -1 scale
(1600) t 
GR
GR
GS
[0.75 0 0 0.75 347.7 284.50001] CT
0.149 GC
/Helvetica 13.333 F
GS
[1 0 0 1 0 0] CT
-14.5 14 moveto 
1 -1 scale
(1800) t 
GR
GR
GS
[0.75 0 0 0.75 380.25 284.50001] CT
0.149 GC
/Helvetica 13.333 F
GS
[1 0 0 1 0 0] CT
-14.5 14 moveto 
1 -1 scale
(2000) t 
GR
GR
GS
[0.75 0 0 0.75 0 0] CT
0.149 GC
2 setlinecap
1 LJ
0.667 LW
N
73 374 M
73 31 L
S
GR
GS
[0.75 0 0 0.75 0 0] CT
0.149 GC
2 setlinecap
1 LJ
0.667 LW
N
73 374 M
77.34 374 L
S
GR
GS
[0.75 0 0 0.75 0 0] CT
0.149 GC
2 setlinecap
1 LJ
0.667 LW
N
73 325 M
77.34 325 L
S
GR
GS
[0.75 0 0 0.75 0 0] CT
0.149 GC
2 setlinecap
1 LJ
0.667 LW
N
73 276 M
77.34 276 L
S
GR
GS
[0.75 0 0 0.75 0 0] CT
0.149 GC
2 setlinecap
1 LJ
0.667 LW
N
73 227 M
77.34 227 L
S
GR
GS
[0.75 0 0 0.75 0 0] CT
0.149 GC
2 setlinecap
1 LJ
0.667 LW
N
73 178 M
77.34 178 L
S
GR
GS
[0.75 0 0 0.75 0 0] CT
0.149 GC
2 setlinecap
1 LJ
0.667 LW
N
73 129 M
77.34 129 L
S
GR
GS
[0.75 0 0 0.75 0 0] CT
0.149 GC
2 setlinecap
1 LJ
0.667 LW
N
73 80 M
77.34 80 L
S
GR
GS
[0.75 0 0 0.75 0 0] CT
0.149 GC
2 setlinecap
1 LJ
0.667 LW
N
73 31 M
77.34 31 L
S
GR
GS
[0.75 0 0 0.75 50.75 280.5] CT
0.149 GC
/Helvetica 13.333 F
GS
[1 0 0 1 0 0] CT
-23 5.5 moveto 
1 -1 scale
(-1.5) t 
GR
GR
GS
[0.75 0 0 0.75 50.75 243.75] CT
0.149 GC
/Helvetica 13.333 F
GS
[1 0 0 1 0 0] CT
-12 5.5 moveto 
1 -1 scale
(-1) t 
GR
GR
GS
[0.75 0 0 0.75 50.75 207] CT
0.149 GC
/Helvetica 13.333 F
GS
[1 0 0 1 0 0] CT
-23 5.5 moveto 
1 -1 scale
(-0.5) t 
GR
GR
GS
[0.75 0 0 0.75 50.75 170.25] CT
0.149 GC
/Helvetica 13.333 F
GS
[1 0 0 1 0 0] CT
-8 5.5 moveto 
1 -1 scale
(0) t 
GR
GR
GS
[0.75 0 0 0.75 50.75 133.5] CT
0.149 GC
/Helvetica 13.333 F
GS
[1 0 0 1 0 0] CT
-19 5.5 moveto 
1 -1 scale
(0.5) t 
GR
GR
GS
[0.75 0 0 0.75 50.75 96.75] CT
0.149 GC
/Helvetica 13.333 F
GS
[1 0 0 1 0 0] CT
-8 5.5 moveto 
1 -1 scale
(1) t 
GR
GR
GS
[0.75 0 0 0.75 50.75 60] CT
0.149 GC
/Helvetica 13.333 F
GS
[1 0 0 1 0 0] CT
-19 5.5 moveto 
1 -1 scale
(1.5) t 
GR
GR
GS
[0.75 0 0 0.75 50.75 23.25] CT
0.149 GC
/Helvetica 13.333 F
GS
[1 0 0 1 0 0] CT
-8 5.5 moveto 
1 -1 scale
(2) t 
GR
GR
GS
[0.75 0 0 0.75 217.50021 21.18751] CT
/Helvetica-Bold 14.667 F
GS
[1 0 0 1 0 0] CT
-136 -4 moveto 
1 -1 scale
(rekurzivni metoda pridavne promenne) t 
GR
GR
GS
[0.75 0 0 0.75 0 0] CT
1 0 0 RC
1 LJ
0.667 LW
N
73.434 129 M
73.651 179.978 L
73.868 136.252 L
74.085 170.204 L
74.302 178.217 L
74.519 255.699 L
74.736 232.896 L
74.953 228.003 L
75.17 230.715 L
75.387 230.708 L
75.604 230.508 L
75.821 229.909 L
76.038 229.885 L
76.255 229.738 L
76.472 230.276 L
76.689 230.132 L
76.906 229.434 L
77.123 229.687 L
77.34 228.651 L
77.557 228.681 L
77.774 228.676 L
77.991 228.074 L
78.208 228.395 L
78.425 228.545 L
78.642 228.505 L
78.859 228.465 L
79.076 228.442 L
79.293 228.105 L
79.51 228.129 L
79.727 228.049 L
79.944 227.693 L
80.161 227.52 L
80.378 227.532 L
80.595 227.532 L
80.812 227.525 L
81.029 227.527 L
81.246 227.499 L
81.463 227.489 L
81.68 227.487 L
81.897 227.52 L
82.114 227.411 L
82.331 227.53 L
82.548 227.308 L
82.765 227.272 L
82.982 227.204 L
83.199 227.287 L
83.416 227.265 L
83.633 227.265 L
83.85 227.25 L
84.067 227.202 L
84.284 227.2 L
84.501 227.193 L
84.718 227.211 L
84.935 227.199 L
85.152 227.197 L
85.369 227.193 L
85.586 227.199 L
85.803 227.176 L
86.02 227.155 L
86.237 227.137 L
86.454 227.152 L
86.671 227.144 L
86.888 227.146 L
87.105 227.142 L
87.322 227.106 L
87.539 227.057 L
87.756 227.057 L
87.973 227.056 L
88.19 227.049 L
88.407 227.071 L
88.624 227.084 L
88.841 227.075 L
89.058 227.05 L
89.275 227.029 L
89.492 227.035 L
89.709 227.033 L
89.926 227.028 L
90.143 227.032 L
90.36 227.029 L
90.577 227.042 L
90.794 227.026 L
91.011 227.032 L
91.228 227.041 L
91.445 227.049 L
91.662 227.053 L
91.879 227.083 L
92.096 227.075 L
92.313 227.075 L
92.53 227.075 L
92.747 227.079 L
92.964 227.069 L
93.181 227.053 L
93.398 227.068 L
93.615 227.059 L
93.832 227.062 L
94.049 227.058 L
94.266 227.051 L
94.483 227.024 L
94.7 227.022 L
94.917 227.02 L
95.134 226.999 L
95.351 227.026 L
95.568 227.004 L
95.785 227.003 L
96.002 227.002 L
96.219 227.015 L
96.436 227.016 L
96.653 227.017 L
96.87 227.007 L
97.087 227.012 L
97.304 227.018 L
97.521 227.018 L
97.738 227.017 L
97.955 226.995 L
98.172 226.993 L
98.389 226.994 L
98.606 226.992 L
98.823 226.997 L
99.04 226.997 L
99.257 226.997 L
99.474 226.997 L
99.691 227 L
99.908 227.011 L
100.125 227.017 L
100.342 227.017 L
100.559 227.018 L
100.776 227.004 L
100.993 226.99 L
101.21 226.982 L
101.427 226.985 L
101.644 226.987 L
101.861 226.982 L
102.078 226.991 L
102.295 226.993 L
102.512 226.993 L
102.729 226.993 L
102.946 226.99 L
103.163 226.988 L
103.38 226.974 L
103.597 226.967 L
103.814 226.972 L
104.031 226.973 L
104.248 226.973 L
104.465 226.979 L
104.682 226.978 L
104.899 226.98 L
105.116 226.989 L
105.333 226.99 L
105.55 226.99 L
105.767 226.99 L
105.984 226.991 L
106.201 226.99 L
106.418 226.99 L
106.635 226.99 L
106.852 226.99 L
107.069 226.991 L
107.286 226.99 L
107.503 226.989 L
107.72 226.999 L
107.937 226.994 L
108.154 226.995 L
108.371 226.996 L
108.588 226.994 L
108.805 226.995 L
109.022 226.996 L
109.239 227 L
109.456 227.002 L
109.673 227 L
109.89 227.005 L
110.107 227.007 L
110.324 227.005 L
110.541 227.003 L
110.758 227.004 L
110.975 227.004 L
111.192 227.005 L
111.409 227.004 L
111.626 227.003 L
111.843 227.003 L
112.06 227.003 L
112.277 227.002 L
112.494 227.007 L
112.711 227.002 L
112.928 227.006 L
113.145 227.009 L
113.362 227.009 L
113.579 227.008 L
113.796 227.009 L
114.013 227.009 L
114.23 227.009 L
114.447 227.007 L
114.664 227.008 L
114.881 227.008 L
115.098 227.008 L
115.315 227.011 L
115.532 227.009 L
115.749 227.01 L
115.966 227.01 L
116.183 227.01 L
116.4 227.011 L
116.617 227.013 L
116.834 227.009 L
117.051 227.008 L
117.268 227.01 L
117.485 227.016 L
117.702 227.014 L
117.919 227.015 L
118.136 227.011 L
118.353 227.002 L
118.57 227.003 L
118.787 227.004 L
119.004 227.006 L
119.221 227.008 L
119.438 227.008 L
119.655 227.008 L
119.872 227.008 L
120.089 227.008 L
120.306 227.008 L
120.523 227.01 L
120.74 227.01 L
120.957 227.01 L
121.174 227.008 L
121.391 227.009 L
121.608 227.008 L
121.825 227.007 L
122.042 227.008 L
122.259 227.009 L
122.476 227.006 L
122.693 227 L
122.91 226.996 L
123.127 226.996 L
123.344 226.996 L
123.561 226.996 L
123.778 226.994 L
123.995 226.994 L
124.212 226.994 L
124.429 226.995 L
124.646 226.992 L
124.863 226.989 L
125.08 226.989 L
125.297 226.989 L
125.514 226.988 L
125.731 226.992 L
125.948 226.993 L
126.165 226.994 L
126.382 226.993 L
126.599 226.994 L
126.816 226.994 L
127.033 226.993 L
127.25 226.991 L
127.467 226.992 L
127.684 226.991 L
127.901 226.992 L
128.118 226.992 L
128.335 226.992 L
128.552 226.993 L
128.769 226.991 L
128.986 226.99 L
129.203 226.99 L
129.42 226.99 L
129.637 226.991 L
129.854 226.991 L
130.071 226.99 L
130.288 226.991 L
130.505 226.993 L
130.722 226.997 L
130.939 226.998 L
131.156 226.996 L
131.373 226.997 L
131.59 226.998 L
131.807 226.999 L
132.024 226.998 L
132.241 226.998 L
132.458 226.997 L
132.675 226.997 L
132.892 226.999 L
133.109 226.999 L
133.326 226.999 L
133.543 226.997 L
133.76 226.994 L
133.977 226.995 L
134.194 226.995 L
134.411 226.994 L
134.628 226.992 L
134.845 226.993 L
135.062 226.995 L
135.279 226.994 L
135.496 226.993 L
135.713 226.989 L
135.93 226.991 L
136.147 226.991 L
136.364 226.991 L
136.581 226.99 L
136.798 226.991 L
137.015 226.99 L
137.232 226.989 L
137.449 226.988 L
137.666 226.988 L
137.883 226.988 L
138.1 226.988 L
138.317 226.987 L
138.534 226.987 L
138.751 226.986 L
138.968 226.988 L
139.185 226.989 L
139.402 226.989 L
139.619 226.989 L
139.836 226.99 L
140.053 226.989 L
140.27 226.988 L
140.487 226.99 L
140.704 226.991 L
140.921 226.993 L
141.138 226.993 L
141.355 226.993 L
141.572 226.991 L
141.789 226.992 L
142.006 226.992 L
142.223 226.992 L
142.44 226.994 L
142.657 226.994 L
142.874 226.993 L
143.091 226.993 L
143.308 226.995 L
143.525 226.996 L
143.742 226.995 L
143.959 226.994 L
144.176 226.995 L
144.393 226.996 L
144.61 226.997 L
144.827 226.996 L
145.044 226.995 L
145.261 226.995 L
145.478 226.995 L
145.695 226.996 L
145.912 226.995 L
146.129 226.995 L
146.346 226.995 L
146.563 226.994 L
146.78 226.995 L
146.997 226.994 L
147.214 226.994 L
147.431 226.994 L
147.648 226.994 L
147.865 226.994 L
148.082 226.994 L
148.299 226.994 L
148.516 226.994 L
148.733 226.993 L
148.95 226.995 L
149.167 226.994 L
149.384 226.996 L
149.601 226.995 L
149.818 226.995 L
150.035 226.995 L
150.252 226.995 L
150.469 226.995 L
150.686 226.994 L
150.903 226.994 L
151.12 226.992 L
151.337 226.993 L
151.554 226.992 L
151.771 226.991 L
151.988 226.991 L
152.205 226.991 L
152.422 226.992 L
152.639 226.992 L
152.856 226.992 L
153.073 226.992 L
153.29 226.992 L
153.507 226.992 L
153.724 226.992 L
153.941 226.992 L
154.158 226.992 L
154.375 226.992 L
154.592 226.992 L
154.809 226.992 L
155.026 226.993 L
155.243 226.992 L
155.46 226.992 L
155.677 226.992 L
155.894 226.991 L
156.111 226.991 L
156.328 226.99 L
156.545 226.99 L
156.762 226.99 L
156.979 226.991 L
157.196 226.993 L
157.413 226.992 L
157.63 226.992 L
157.847 226.992 L
158.064 226.992 L
158.281 226.992 L
158.498 226.991 L
158.715 226.992 L
158.932 226.991 L
159.149 226.991 L
159.366 226.991 L
159.583 226.99 L
159.8 226.99 L
160.017 226.99 L
160.234 226.99 L
160.451 226.99 L
160.668 226.99 L
160.885 226.99 L
161.102 226.99 L
161.319 226.99 L
161.536 226.99 L
161.753 226.99 L
161.97 226.99 L
162.187 226.992 L
162.404 226.994 L
162.621 226.994 L
162.838 226.994 L
163.055 226.995 L
163.272 226.996 L
163.489 226.995 L
163.706 226.994 L
163.923 226.994 L
164.14 226.994 L
164.357 226.994 L
164.574 226.995 L
164.791 226.994 L
165.008 226.995 L
165.225 226.994 L
165.442 226.992 L
165.659 226.993 L
165.876 226.992 L
166.093 226.992 L
166.31 226.991 L
166.527 226.991 L
166.744 226.992 L
166.961 226.992 L
167.178 226.992 L
167.395 226.991 L
167.612 226.991 L
167.829 226.991 L
168.046 226.991 L
168.263 226.991 L
168.48 226.991 L
168.697 226.991 L
168.914 226.991 L
169.131 226.991 L
169.348 226.991 L
169.565 226.991 L
169.782 226.991 L
169.999 226.992 L
170.216 226.992 L
170.433 226.991 L
170.65 226.991 L
170.867 226.991 L
171.084 226.991 L
171.301 226.992 L
171.518 226.992 L
171.735 226.993 L
171.952 226.992 L
172.169 226.992 L
172.386 226.992 L
172.603 226.992 L
172.82 226.992 L
173.037 226.991 L
173.254 226.992 L
173.471 226.992 L
173.688 226.992 L
173.905 226.992 L
174.122 226.992 L
174.339 226.992 L
174.556 226.992 L
174.773 226.991 L
174.99 226.991 L
175.207 226.991 L
175.424 226.991 L
175.641 226.991 L
175.858 226.991 L
176.075 226.991 L
176.292 226.991 L
176.509 226.991 L
176.726 226.991 L
176.943 226.991 L
177.16 226.99 L
177.377 226.991 L
177.594 226.99 L
177.811 226.99 L
178.028 226.99 L
178.245 226.99 L
178.462 226.99 L
178.679 226.99 L
178.896 226.99 L
179.113 226.99 L
179.33 226.99 L
179.547 226.989 L
179.764 226.989 L
179.981 226.988 L
180.198 226.989 L
180.415 226.989 L
180.632 226.988 L
180.849 226.988 L
181.066 226.988 L
181.283 226.988 L
181.5 226.988 L
181.717 226.988 L
181.934 226.988 L
182.151 226.988 L
182.368 226.989 L
182.585 226.989 L
182.802 226.989 L
183.019 226.989 L
183.236 226.99 L
183.453 226.991 L
183.67 226.991 L
183.887 226.991 L
184.104 226.992 L
184.321 226.992 L
184.538 226.992 L
184.755 226.992 L
184.972 226.992 L
185.189 226.992 L
185.406 226.992 L
185.623 226.992 L
185.84 226.992 L
186.057 226.992 L
186.274 226.992 L
186.491 226.992 L
186.708 226.992 L
186.925 226.992 L
187.142 226.991 L
187.359 226.99 L
187.576 226.99 L
187.793 226.99 L
188.01 226.991 L
188.227 226.991 L
188.444 226.99 L
188.661 226.991 L
188.878 226.99 L
189.095 226.99 L
189.312 226.99 L
189.529 226.99 L
189.746 226.99 L
189.963 226.991 L
190.18 226.992 L
190.397 226.992 L
190.614 226.992 L
190.831 226.992 L
191.048 226.992 L
191.265 226.992 L
191.482 226.992 L
191.699 226.992 L
191.916 226.992 L
192.133 226.992 L
192.35 226.992 L
192.567 226.992 L
192.784 226.992 L
193.001 226.992 L
193.218 226.992 L
193.435 226.993 L
193.652 226.993 L
193.869 226.993 L
194.086 226.993 L
194.303 226.993 L
194.52 226.993 L
194.737 226.993 L
194.954 226.993 L
195.171 226.993 L
195.388 226.993 L
195.605 226.993 L
195.822 226.993 L
196.039 226.994 L
196.256 226.994 L
196.473 226.994 L
196.69 226.994 L
196.907 226.994 L
197.124 226.994 L
197.341 226.994 L
197.558 226.994 L
197.775 226.994 L
197.992 226.994 L
198.209 226.994 L
198.426 226.994 L
198.643 226.994 L
198.86 226.993 L
199.077 226.993 L
199.294 226.993 L
199.511 226.993 L
199.728 226.993 L
199.945 226.993 L
200.162 226.993 L
200.379 226.993 L
200.596 226.993 L
200.813 226.993 L
201.03 226.993 L
201.247 226.993 L
201.464 226.993 L
201.681 226.993 L
201.898 226.992 L
202.115 226.992 L
202.332 226.992 L
202.549 226.992 L
202.766 226.992 L
202.983 226.992 L
203.2 226.992 L
203.417 226.992 L
203.634 226.992 L
203.851 226.991 L
204.068 226.992 L
204.285 226.992 L
204.502 226.991 L
204.719 226.992 L
204.936 226.992 L
205.153 226.992 L
205.37 226.992 L
205.587 226.992 L
205.804 226.992 L
206.021 226.992 L
206.238 226.991 L
206.455 226.991 L
206.672 226.991 L
206.889 226.992 L
207.106 226.991 L
207.323 226.992 L
207.54 226.992 L
207.757 226.993 L
207.974 226.993 L
208.191 226.993 L
208.408 226.993 L
208.625 226.993 L
208.842 226.993 L
209.059 226.993 L
209.276 226.993 L
209.493 226.994 L
209.71 226.994 L
209.927 226.994 L
210.144 226.994 L
210.361 226.994 L
210.578 226.994 L
210.795 226.994 L
211.012 226.994 L
211.229 226.993 L
211.446 226.993 L
211.663 226.993 L
211.88 226.993 L
212.097 226.993 L
212.314 226.993 L
212.531 226.993 L
212.748 226.993 L
212.965 226.993 L
213.182 226.994 L
213.399 226.994 L
213.616 226.994 L
213.833 226.994 L
214.05 226.994 L
214.267 226.994 L
214.484 226.994 L
214.701 226.994 L
214.918 226.994 L
215.135 226.994 L
215.352 226.994 L
215.569 226.994 L
215.786 226.995 L
216.003 226.995 L
216.22 226.995 L
216.437 226.995 L
216.654 226.995 L
216.871 226.995 L
217.088 226.995 L
217.305 226.995 L
217.522 226.995 L
217.739 226.995 L
217.956 226.995 L
218.173 226.995 L
218.39 226.995 L
218.607 226.995 L
218.824 226.995 L
219.041 226.995 L
219.258 226.995 L
219.475 226.995 L
219.692 226.995 L
219.909 226.995 L
220.126 226.995 L
220.343 226.995 L
220.56 226.995 L
220.777 226.995 L
220.994 226.995 L
221.211 226.995 L
221.428 226.994 L
221.645 226.993 L
221.862 226.994 L
222.079 226.994 L
222.296 226.994 L
222.513 226.995 L
222.73 226.995 L
222.947 226.994 L
223.164 226.994 L
223.381 226.994 L
223.598 226.994 L
223.815 226.994 L
224.032 226.994 L
224.249 226.994 L
224.466 226.994 L
224.683 226.994 L
224.9 226.994 L
225.117 226.994 L
225.334 226.994 L
225.551 226.994 L
225.768 226.994 L
225.985 226.993 L
226.202 226.993 L
226.419 226.993 L
226.636 226.993 L
226.853 226.993 L
227.07 226.993 L
227.287 226.993 L
227.504 226.993 L
227.721 226.994 L
227.938 226.994 L
228.155 226.994 L
228.372 226.994 L
228.589 226.994 L
228.806 226.994 L
229.023 226.994 L
229.24 226.994 L
229.457 226.994 L
229.674 226.994 L
229.891 226.995 L
230.108 226.995 L
230.325 226.995 L
230.542 226.995 L
230.759 226.995 L
230.976 226.995 L
231.193 226.995 L
231.41 226.995 L
231.627 226.995 L
231.844 226.995 L
232.061 226.994 L
232.278 226.994 L
232.495 226.994 L
232.712 226.994 L
232.929 226.994 L
233.146 226.994 L
233.363 226.994 L
233.58 226.994 L
233.797 226.994 L
234.014 226.994 L
234.231 226.994 L
234.448 226.994 L
234.665 226.994 L
234.882 226.994 L
235.099 226.995 L
235.316 226.995 L
235.533 226.995 L
235.75 226.995 L
235.967 226.995 L
236.184 226.995 L
236.401 226.995 L
236.618 226.995 L
236.835 226.995 L
237.052 226.995 L
237.269 226.995 L
237.486 226.995 L
237.703 226.995 L
237.92 226.994 L
238.137 226.995 L
238.354 226.995 L
238.571 226.995 L
238.788 226.995 L
239.005 226.995 L
239.222 226.995 L
239.439 226.995 L
239.656 226.995 L
239.873 226.995 L
240.09 226.995 L
240.307 226.995 L
240.524 226.995 L
240.741 226.995 L
240.958 226.995 L
241.175 226.995 L
241.392 226.995 L
241.609 226.996 L
241.826 226.996 L
242.043 226.996 L
242.26 226.996 L
242.477 226.996 L
242.694 226.996 L
242.911 226.996 L
243.128 226.996 L
243.345 226.995 L
243.562 226.996 L
243.779 226.996 L
243.996 226.996 L
244.213 226.995 L
244.43 226.995 L
244.647 226.995 L
244.864 226.996 L
245.081 226.996 L
245.298 226.996 L
245.515 226.996 L
245.732 226.996 L
245.949 226.996 L
246.166 226.996 L
246.383 226.996 L
246.6 226.996 L
246.817 226.996 L
247.034 226.996 L
247.251 226.996 L
247.468 226.996 L
247.685 226.996 L
247.902 226.996 L
248.119 226.996 L
248.336 226.996 L
248.553 226.996 L
248.77 226.996 L
248.987 226.997 L
249.204 226.997 L
249.421 226.997 L
249.638 226.997 L
249.855 226.997 L
250.072 226.997 L
250.289 226.997 L
250.506 226.997 L
250.723 226.997 L
250.94 226.997 L
251.157 226.997 L
251.374 226.997 L
251.591 226.997 L
251.808 226.997 L
252.025 226.997 L
252.242 226.997 L
252.459 226.997 L
252.676 226.997 L
252.893 226.996 L
253.11 226.996 L
253.327 226.996 L
253.544 226.996 L
253.761 226.996 L
253.978 226.996 L
254.195 226.996 L
254.412 226.996 L
254.629 226.996 L
254.846 226.996 L
255.063 226.996 L
255.28 226.996 L
255.497 226.996 L
255.714 226.996 L
255.931 226.996 L
256.148 226.996 L
256.365 226.996 L
256.582 226.996 L
256.799 226.996 L
257.016 226.997 L
257.233 226.996 L
257.45 226.996 L
257.667 226.996 L
257.884 226.996 L
258.101 226.996 L
258.318 226.996 L
258.535 226.996 L
258.752 226.996 L
258.969 226.996 L
259.186 226.996 L
259.403 226.996 L
259.62 226.996 L
259.837 226.996 L
260.054 226.996 L
260.271 226.996 L
260.488 226.996 L
260.705 226.996 L
260.922 226.996 L
261.139 226.996 L
261.356 226.996 L
261.573 226.996 L
261.79 226.996 L
262.007 226.996 L
262.224 226.996 L
262.441 226.996 L
262.658 226.996 L
262.875 226.996 L
263.092 226.996 L
263.309 226.996 L
263.526 226.996 L
263.743 226.996 L
263.96 226.996 L
264.177 226.996 L
264.394 226.996 L
264.611 226.996 L
264.828 226.996 L
265.045 226.996 L
265.262 226.996 L
265.479 226.996 L
265.696 226.996 L
265.913 226.996 L
266.13 226.996 L
266.347 226.996 L
266.564 226.996 L
266.781 226.996 L
266.998 226.996 L
267.215 226.996 L
267.432 226.996 L
267.649 226.996 L
267.866 226.996 L
268.083 226.996 L
268.3 226.996 L
268.517 226.996 L
268.734 226.996 L
268.951 226.996 L
269.168 226.996 L
269.385 226.996 L
269.602 226.996 L
269.819 226.996 L
270.036 226.996 L
270.253 226.996 L
270.47 226.996 L
270.687 226.997 L
270.904 226.997 L
271.121 226.997 L
271.338 226.996 L
271.555 226.996 L
271.772 226.996 L
271.989 226.996 L
272.206 226.996 L
272.423 226.996 L
272.64 226.996 L
272.857 226.996 L
273.074 226.996 L
273.291 226.996 L
273.508 226.996 L
273.725 226.996 L
273.942 226.996 L
274.159 226.996 L
274.376 226.996 L
274.593 226.996 L
274.81 226.996 L
275.027 226.996 L
275.244 226.996 L
275.461 226.996 L
275.678 226.996 L
275.895 226.996 L
276.112 226.996 L
276.329 226.996 L
276.546 226.996 L
276.763 226.996 L
276.98 226.996 L
277.197 226.996 L
277.414 226.996 L
277.631 226.996 L
277.848 226.996 L
278.065 226.996 L
278.282 226.996 L
278.499 226.996 L
278.716 226.996 L
278.933 226.996 L
279.15 226.996 L
279.367 226.996 L
279.584 226.996 L
279.801 226.996 L
280.018 226.996 L
280.235 226.996 L
280.452 226.996 L
280.669 226.996 L
280.886 226.996 L
281.103 226.996 L
281.32 226.996 L
281.537 226.996 L
281.754 226.996 L
281.971 226.996 L
282.188 226.995 L
282.405 226.996 L
282.622 226.996 L
282.839 226.996 L
283.056 226.996 L
283.273 226.996 L
283.49 226.996 L
283.707 226.996 L
283.924 226.995 L
284.141 226.996 L
284.358 226.996 L
284.575 226.996 L
284.792 226.996 L
285.009 226.996 L
285.226 226.995 L
285.443 226.995 L
285.66 226.995 L
285.877 226.995 L
286.094 226.995 L
286.311 226.995 L
286.528 226.995 L
286.745 226.995 L
286.962 226.995 L
287.179 226.996 L
287.396 226.996 L
287.613 226.996 L
287.83 226.996 L
288.047 226.996 L
288.264 226.996 L
288.481 226.996 L
288.698 226.996 L
288.915 226.996 L
289.132 226.996 L
289.349 226.996 L
289.566 226.996 L
289.783 226.996 L
290 226.996 L
290.217 226.996 L
290.434 226.996 L
290.651 226.996 L
290.868 226.996 L
291.085 226.996 L
291.302 226.996 L
291.519 226.995 L
291.736 226.995 L
291.953 226.995 L
292.17 226.995 L
292.387 226.995 L
292.604 226.995 L
292.821 226.995 L
293.038 226.995 L
293.255 226.996 L
293.472 226.996 L
293.689 226.996 L
293.906 226.996 L
294.123 226.996 L
294.34 226.996 L
294.557 226.996 L
294.774 226.996 L
294.991 226.996 L
295.208 226.996 L
295.425 226.996 L
295.642 226.996 L
295.859 226.996 L
296.076 226.996 L
296.293 226.996 L
296.51 226.996 L
296.727 226.996 L
296.944 226.996 L
297.161 226.996 L
297.378 226.996 L
297.595 226.996 L
297.812 226.996 L
298.029 226.996 L
298.246 226.996 L
298.463 226.996 L
298.68 226.996 L
298.897 226.996 L
299.114 226.996 L
299.331 226.996 L
299.548 226.996 L
299.765 226.996 L
299.982 226.996 L
300.199 226.996 L
300.416 226.996 L
300.633 226.996 L
300.85 226.996 L
301.067 226.996 L
301.284 226.996 L
301.501 226.996 L
301.718 226.996 L
301.935 226.996 L
302.152 226.996 L
302.369 226.996 L
302.586 226.996 L
302.803 226.996 L
303.02 226.996 L
303.237 226.996 L
303.454 226.996 L
303.671 226.996 L
303.888 226.996 L
304.105 226.997 L
304.322 226.997 L
304.539 226.997 L
304.756 226.997 L
304.973 226.997 L
305.19 226.997 L
305.407 226.997 L
305.624 226.997 L
305.841 226.997 L
306.058 226.997 L
306.275 226.997 L
306.492 226.997 L
306.709 226.997 L
306.926 226.997 L
307.143 226.997 L
307.36 226.997 L
307.577 226.997 L
307.794 226.997 L
308.011 226.997 L
308.228 226.997 L
308.445 226.997 L
308.662 226.997 L
308.879 226.997 L
309.096 226.997 L
309.313 226.997 L
309.53 226.997 L
309.747 226.997 L
309.964 226.997 L
310.181 226.997 L
310.398 226.997 L
310.615 226.997 L
310.832 226.997 L
311.049 226.997 L
311.266 226.997 L
311.483 226.997 L
311.7 226.997 L
311.917 226.997 L
312.134 226.997 L
312.351 226.997 L
312.568 226.997 L
312.785 226.997 L
313.002 226.997 L
313.219 226.997 L
313.436 226.997 L
313.653 226.997 L
313.87 226.997 L
314.087 226.997 L
314.304 226.997 L
314.521 226.997 L
314.738 226.997 L
314.955 226.997 L
315.172 226.997 L
315.389 226.997 L
315.606 226.997 L
315.823 226.997 L
316.04 226.997 L
316.257 226.997 L
316.474 226.997 L
316.691 226.997 L
316.908 226.997 L
317.125 226.997 L
317.342 226.997 L
317.559 226.997 L
317.776 226.997 L
317.993 226.997 L
318.21 226.997 L
318.427 226.997 L
318.644 226.997 L
318.861 226.997 L
319.078 226.997 L
319.295 226.997 L
319.512 226.997 L
319.729 226.997 L
319.946 226.997 L
320.163 226.997 L
320.38 226.997 L
320.597 226.997 L
320.814 226.997 L
321.031 226.997 L
321.248 226.997 L
321.465 226.997 L
321.682 226.997 L
321.899 226.997 L
322.116 226.997 L
322.333 226.997 L
322.55 226.997 L
322.767 226.997 L
322.984 226.997 L
323.201 226.997 L
323.418 226.997 L
323.635 226.997 L
323.852 226.997 L
324.069 226.998 L
324.286 226.998 L
324.503 226.998 L
324.72 226.998 L
324.937 226.998 L
325.154 226.998 L
325.371 226.997 L
325.588 226.997 L
325.805 226.997 L
326.022 226.997 L
326.239 226.997 L
326.456 226.997 L
326.673 226.997 L
326.89 226.997 L
327.107 226.997 L
327.324 226.997 L
327.541 226.997 L
327.758 226.998 L
327.975 226.997 L
328.192 226.998 L
328.409 226.997 L
328.626 226.998 L
328.843 226.998 L
329.06 226.998 L
329.277 226.998 L
329.494 226.998 L
329.711 226.998 L
329.928 226.998 L
330.145 226.998 L
330.362 226.998 L
330.579 226.998 L
330.796 226.998 L
331.013 226.998 L
331.23 226.998 L
331.447 226.998 L
331.664 226.998 L
331.881 226.998 L
332.098 226.998 L
332.315 226.998 L
332.532 226.998 L
332.749 226.998 L
332.966 226.998 L
333.183 226.998 L
333.4 226.998 L
333.617 226.998 L
333.834 226.998 L
334.051 226.998 L
334.268 226.998 L
334.485 226.998 L
334.702 226.998 L
334.919 226.998 L
335.136 226.998 L
335.353 226.998 L
335.57 226.998 L
335.787 226.998 L
336.004 226.998 L
336.221 226.998 L
336.438 226.998 L
336.655 226.998 L
336.872 226.998 L
337.089 226.998 L
337.306 226.998 L
337.523 226.998 L
337.74 226.998 L
337.957 226.998 L
338.174 226.998 L
338.391 226.998 L
338.608 226.998 L
338.825 226.998 L
339.042 226.998 L
339.259 226.998 L
339.476 226.998 L
339.693 226.998 L
339.91 226.998 L
340.127 226.998 L
340.344 226.998 L
340.561 226.998 L
340.778 226.998 L
340.995 226.998 L
341.212 226.998 L
341.429 226.998 L
341.646 226.998 L
341.863 226.998 L
342.08 226.998 L
342.297 226.998 L
342.514 226.998 L
342.731 226.998 L
342.948 226.998 L
343.165 226.998 L
343.382 226.998 L
343.599 226.998 L
343.816 226.998 L
344.033 226.998 L
344.25 226.998 L
344.467 226.998 L
344.684 226.998 L
344.901 226.998 L
345.118 226.998 L
345.335 226.998 L
345.552 226.998 L
345.769 226.998 L
345.986 226.998 L
346.203 226.998 L
346.42 226.998 L
346.637 226.998 L
346.854 226.998 L
347.071 226.998 L
347.288 226.998 L
347.505 226.998 L
347.722 226.998 L
347.939 226.998 L
348.156 226.998 L
348.373 226.998 L
348.59 226.998 L
348.807 226.998 L
349.024 226.998 L
349.241 226.998 L
349.458 226.998 L
349.675 226.998 L
349.892 226.998 L
350.109 226.998 L
350.326 226.998 L
350.543 226.998 L
350.76 226.998 L
350.977 226.998 L
351.194 226.998 L
351.411 226.998 L
351.628 226.999 L
351.845 226.999 L
352.062 226.999 L
352.279 226.998 L
352.496 226.998 L
352.713 226.998 L
352.93 226.998 L
353.147 226.998 L
353.364 226.998 L
353.581 226.998 L
353.798 226.998 L
354.015 226.998 L
354.232 226.998 L
354.449 226.998 L
354.666 226.998 L
354.883 226.999 L
355.1 226.998 L
355.317 226.998 L
355.534 226.998 L
355.751 226.998 L
355.968 226.998 L
356.185 226.998 L
356.402 226.998 L
356.619 226.998 L
356.836 226.998 L
357.053 226.998 L
357.27 226.998 L
357.487 226.998 L
357.704 226.998 L
357.921 226.998 L
358.138 226.998 L
358.355 226.998 L
358.572 226.998 L
358.789 226.998 L
359.006 226.998 L
359.223 226.998 L
359.44 226.998 L
359.657 226.998 L
359.874 226.998 L
360.091 226.998 L
360.308 226.998 L
360.525 226.998 L
360.742 226.998 L
360.959 226.998 L
361.176 226.998 L
361.393 226.998 L
361.61 226.998 L
361.827 226.998 L
362.044 226.999 L
362.261 226.998 L
362.478 226.998 L
362.695 226.999 L
362.912 226.999 L
363.129 226.999 L
363.346 226.999 L
363.563 226.999 L
363.78 226.999 L
363.997 226.998 L
364.214 226.999 L
364.431 226.999 L
364.648 226.999 L
364.865 226.999 L
365.082 226.999 L
365.299 226.999 L
365.516 226.999 L
365.733 226.999 L
365.95 226.999 L
366.167 226.999 L
366.384 226.999 L
366.601 226.999 L
366.818 226.999 L
367.035 226.999 L
367.252 226.999 L
367.469 226.999 L
367.686 226.999 L
367.903 226.999 L
368.12 226.999 L
368.337 226.999 L
368.554 226.999 L
368.771 226.999 L
368.988 226.999 L
369.205 226.999 L
369.422 226.999 L
369.639 226.999 L
369.856 226.999 L
370.073 226.999 L
370.29 226.999 L
370.507 226.999 L
370.724 226.999 L
370.941 226.999 L
371.158 226.999 L
371.375 226.999 L
371.592 226.999 L
371.809 226.999 L
372.026 226.999 L
372.243 226.999 L
372.46 226.999 L
372.677 226.999 L
372.894 226.999 L
373.111 226.999 L
373.328 226.999 L
373.545 226.999 L
373.762 226.999 L
373.979 226.999 L
374.196 226.999 L
374.413 226.999 L
374.63 226.999 L
374.847 226.999 L
375.064 226.999 L
375.281 226.999 L
375.498 226.999 L
375.715 226.999 L
375.932 226.999 L
376.149 226.999 L
376.366 226.999 L
376.583 226.999 L
376.8 226.999 L
377.017 226.999 L
377.234 226.999 L
377.451 226.999 L
377.668 226.999 L
377.885 226.999 L
378.102 226.999 L
378.319 226.999 L
378.536 226.999 L
378.753 226.999 L
378.97 226.999 L
379.187 226.999 L
379.404 226.999 L
379.621 226.999 L
379.838 226.999 L
380.055 226.999 L
380.272 226.999 L
380.489 226.999 L
380.706 226.999 L
380.923 226.999 L
381.14 226.999 L
381.357 226.999 L
381.574 226.999 L
381.791 226.999 L
382.008 226.999 L
382.225 226.999 L
382.442 226.999 L
382.659 226.999 L
382.876 226.999 L
383.093 226.999 L
383.31 226.999 L
383.527 226.999 L
383.744 226.999 L
383.961 226.999 L
384.178 226.999 L
384.395 226.999 L
384.612 226.999 L
384.829 226.999 L
385.046 226.999 L
385.263 226.999 L
385.48 226.999 L
385.697 226.999 L
385.914 226.999 L
386.131 226.999 L
386.348 226.999 L
386.565 226.999 L
386.782 226.999 L
386.999 226.999 L
387.216 226.999 L
387.433 226.999 L
387.65 226.999 L
387.867 226.999 L
388.084 226.999 L
388.301 226.999 L
388.518 226.999 L
388.735 226.999 L
388.952 226.999 L
389.169 226.999 L
389.386 226.999 L
389.603 226.999 L
389.82 226.999 L
390.037 226.999 L
390.254 226.999 L
390.471 226.999 L
390.688 226.999 L
390.905 226.999 L
391.122 226.999 L
391.339 226.999 L
391.556 226.999 L
391.773 226.999 L
391.99 226.999 L
392.207 226.999 L
392.424 226.999 L
392.641 226.999 L
392.858 226.999 L
393.075 226.999 L
393.292 226.999 L
393.509 226.999 L
393.726 226.999 L
393.943 226.999 L
394.16 226.999 L
394.377 226.999 L
394.594 226.999 L
394.811 226.999 L
395.028 226.999 L
395.245 226.999 L
395.462 226.999 L
395.679 226.999 L
395.896 226.999 L
396.113 226.999 L
396.33 226.999 L
396.547 226.999 L
396.764 226.999 L
396.981 226.999 L
397.198 226.999 L
397.415 226.999 L
397.632 226.999 L
397.849 226.999 L
398.066 226.999 L
398.283 226.999 L
398.5 226.999 L
398.717 226.999 L
398.934 226.999 L
399.151 226.999 L
399.368 226.999 L
399.585 226.999 L
399.802 226.999 L
400.019 226.999 L
400.236 226.999 L
400.453 226.999 L
400.67 226.999 L
400.887 226.999 L
401.104 226.999 L
401.321 226.999 L
401.538 226.999 L
401.755 226.999 L
401.972 226.999 L
402.189 226.999 L
402.406 226.999 L
402.623 226.999 L
402.84 226.999 L
403.057 226.999 L
403.274 226.999 L
403.491 226.999 L
403.708 226.999 L
403.925 226.999 L
404.142 226.999 L
404.359 226.999 L
404.576 226.999 L
404.793 226.999 L
405.01 226.999 L
405.227 226.999 L
405.444 226.999 L
405.661 226.999 L
405.878 226.999 L
406.095 226.999 L
406.312 226.999 L
406.529 226.999 L
406.746 226.999 L
406.963 226.999 L
407.18 226.999 L
407.397 226.999 L
407.614 226.999 L
407.831 226.999 L
408.048 226.999 L
408.265 226.999 L
408.482 226.999 L
408.699 226.999 L
408.916 226.999 L
409.133 226.999 L
409.35 226.999 L
409.567 226.999 L
409.784 226.999 L
410.001 226.999 L
410.218 226.999 L
410.435 226.999 L
410.652 226.999 L
410.869 226.999 L
411.086 226.999 L
411.303 226.999 L
411.52 226.999 L
411.737 226.999 L
411.954 226.999 L
412.171 226.999 L
412.388 226.999 L
412.605 226.999 L
412.822 226.999 L
413.039 226.999 L
413.256 226.999 L
413.473 226.999 L
413.69 226.999 L
413.907 226.999 L
414.124 226.999 L
414.341 226.999 L
414.558 226.999 L
414.775 227 L
414.992 227 L
415.209 227 L
415.426 227 L
415.643 227 L
415.86 227 L
416.077 227 L
416.294 227 L
416.511 227 L
416.728 227 L
416.945 227 L
417.162 227 L
417.379 227 L
417.596 227 L
417.813 226.999 L
418.03 226.999 L
418.247 226.999 L
418.464 226.999 L
418.681 226.999 L
418.898 226.999 L
419.115 226.999 L
419.332 226.999 L
419.549 226.999 L
419.766 226.999 L
419.983 226.999 L
420.2 226.999 L
420.417 226.999 L
420.634 226.999 L
420.851 226.999 L
421.068 226.999 L
421.285 226.999 L
421.502 226.999 L
421.719 226.999 L
421.936 226.999 L
422.153 226.999 L
422.37 226.999 L
422.587 226.999 L
422.804 226.999 L
423.021 226.999 L
423.238 226.999 L
423.455 226.999 L
423.672 226.999 L
423.889 226.999 L
424.106 226.999 L
424.323 226.999 L
424.54 226.999 L
424.757 226.999 L
424.974 226.999 L
425.191 226.999 L
425.408 226.999 L
425.625 226.999 L
425.842 226.999 L
426.059 226.999 L
426.276 226.999 L
426.493 226.999 L
426.71 226.999 L
426.927 226.999 L
427.144 226.999 L
427.361 226.999 L
427.578 226.999 L
427.795 226.999 L
428.012 226.999 L
428.229 226.999 L
428.446 226.999 L
428.663 226.999 L
428.88 226.999 L
429.097 226.999 L
429.314 226.999 L
429.531 226.999 L
429.748 226.999 L
429.965 226.999 L
430.182 226.999 L
430.399 226.999 L
430.616 226.999 L
430.833 226.999 L
431.05 226.999 L
431.267 226.999 L
431.484 226.999 L
431.701 226.999 L
431.918 226.999 L
432.135 226.999 L
432.352 226.999 L
432.569 226.999 L
432.786 226.999 L
433.003 226.999 L
433.22 226.999 L
433.437 226.999 L
433.654 226.999 L
433.871 226.999 L
434.088 226.999 L
434.305 226.999 L
434.522 226.999 L
434.739 226.999 L
434.956 226.999 L
435.173 226.999 L
435.39 226.999 L
435.607 226.999 L
435.824 226.999 L
436.041 226.999 L
436.258 227 L
436.475 226.999 L
436.692 227 L
436.909 227 L
437.126 227 L
437.343 227 L
437.56 227 L
437.777 227 L
437.994 227 L
438.211 227 L
438.428 227 L
438.645 227 L
438.862 227 L
439.079 227 L
439.296 227 L
439.513 227 L
439.73 227 L
439.947 227 L
440.164 227 L
440.381 226.999 L
440.598 226.999 L
440.815 226.999 L
441.032 226.999 L
441.249 226.999 L
441.466 226.999 L
441.683 226.999 L
441.9 226.999 L
442.117 226.999 L
442.334 226.999 L
442.551 226.999 L
442.768 226.999 L
442.985 226.999 L
443.202 226.999 L
443.419 226.999 L
443.636 226.999 L
443.853 226.999 L
444.07 226.999 L
444.287 226.999 L
444.504 226.999 L
444.721 226.999 L
444.938 226.999 L
445.155 226.999 L
445.372 226.999 L
445.589 226.999 L
445.806 226.999 L
446.023 226.999 L
446.24 226.999 L
446.457 226.999 L
446.674 226.999 L
446.891 226.999 L
447.108 226.999 L
447.325 226.999 L
447.542 226.999 L
447.759 226.999 L
447.976 226.999 L
448.193 226.999 L
448.41 226.999 L
448.627 226.999 L
448.844 226.999 L
449.061 226.999 L
449.278 226.999 L
449.495 226.999 L
449.712 226.999 L
449.929 226.999 L
450.146 226.999 L
450.363 226.999 L
450.58 226.999 L
450.797 226.999 L
451.014 226.999 L
451.231 226.999 L
451.448 226.999 L
451.665 226.999 L
451.882 226.999 L
452.099 226.999 L
452.316 226.999 L
452.533 226.999 L
452.75 226.999 L
452.967 226.999 L
453.184 226.999 L
453.401 226.999 L
453.618 226.999 L
453.835 226.999 L
454.052 226.999 L
454.269 226.999 L
454.486 226.999 L
454.703 226.999 L
454.92 226.999 L
455.137 226.999 L
455.354 226.999 L
455.571 226.999 L
455.788 226.999 L
456.005 226.999 L
456.222 226.999 L
456.439 226.999 L
456.656 226.999 L
456.873 226.999 L
457.09 226.999 L
457.307 226.999 L
457.524 226.999 L
457.741 226.999 L
457.958 226.999 L
458.175 226.999 L
458.392 226.999 L
458.609 226.999 L
458.826 226.999 L
459.043 226.999 L
459.26 226.999 L
459.477 226.999 L
459.694 226.999 L
459.911 226.999 L
460.128 226.999 L
460.345 226.999 L
460.562 226.999 L
460.779 226.999 L
460.996 226.999 L
461.213 226.999 L
461.43 226.999 L
461.647 226.999 L
461.864 226.999 L
462.081 226.999 L
462.298 226.999 L
462.515 226.999 L
462.732 226.999 L
462.949 226.999 L
463.166 226.999 L
463.383 226.999 L
463.6 226.999 L
463.817 226.999 L
464.034 226.999 L
464.251 226.999 L
464.468 226.999 L
464.685 226.999 L
464.902 226.999 L
465.119 226.999 L
465.336 226.999 L
465.553 226.999 L
465.77 226.999 L
465.987 226.999 L
466.204 226.999 L
466.421 226.999 L
466.638 226.999 L
466.855 226.999 L
467.072 226.999 L
467.289 226.999 L
467.506 226.999 L
467.723 226.999 L
467.94 226.999 L
468.157 226.999 L
468.374 226.999 L
468.591 226.999 L
468.808 226.999 L
469.025 226.999 L
469.242 226.999 L
469.459 226.999 L
469.676 226.999 L
469.893 226.999 L
470.11 226.999 L
470.327 226.999 L
470.544 226.999 L
470.761 226.999 L
470.978 226.999 L
471.195 226.999 L
471.412 226.999 L
471.629 226.999 L
471.846 226.999 L
472.063 226.999 L
472.28 226.999 L
472.497 226.999 L
472.714 226.999 L
472.931 226.999 L
473.148 226.999 L
473.365 226.999 L
473.582 226.999 L
473.799 226.999 L
474.016 226.999 L
474.233 226.999 L
474.45 226.999 L
474.667 227 L
474.884 227 L
475.101 227 L
475.318 227 L
475.535 227 L
475.752 226.999 L
475.969 226.999 L
476.186 226.999 L
476.403 226.999 L
476.62 226.999 L
476.837 226.999 L
477.054 226.999 L
477.271 226.999 L
477.488 226.999 L
477.705 226.999 L
477.922 226.999 L
478.139 226.999 L
478.356 226.999 L
478.573 226.999 L
478.79 226.999 L
479.007 226.999 L
479.224 226.999 L
479.441 226.999 L
479.658 226.999 L
479.875 226.999 L
480.092 226.999 L
480.309 226.999 L
480.526 226.999 L
480.743 226.999 L
480.96 226.999 L
481.177 226.999 L
481.394 226.999 L
481.611 226.999 L
481.828 226.999 L
482.045 226.999 L
482.262 226.999 L
482.479 226.999 L
482.696 226.999 L
482.913 226.999 L
483.13 226.999 L
483.347 226.999 L
483.564 226.999 L
483.781 226.999 L
483.998 226.999 L
484.215 226.999 L
484.432 226.999 L
484.649 226.999 L
484.866 226.999 L
485.083 226.999 L
485.3 226.999 L
485.517 226.999 L
485.734 226.999 L
485.951 226.999 L
486.168 226.999 L
486.385 226.999 L
486.602 226.999 L
486.819 226.999 L
487.036 226.999 L
487.253 226.999 L
487.47 226.999 L
487.687 226.999 L
487.904 226.999 L
488.121 226.999 L
488.338 226.999 L
488.555 226.999 L
488.772 226.999 L
488.989 226.999 L
489.206 226.999 L
489.423 226.999 L
489.64 226.999 L
489.857 226.999 L
490.074 226.999 L
490.291 226.999 L
490.508 226.999 L
490.725 226.999 L
490.942 226.999 L
491.159 226.999 L
491.376 226.999 L
491.593 227 L
491.81 226.999 L
492.027 226.999 L
492.244 226.999 L
492.461 226.999 L
492.678 226.999 L
492.895 227 L
493.112 227 L
493.329 227 L
493.546 227 L
493.763 226.999 L
493.98 227 L
494.197 227 L
494.414 227 L
494.631 227 L
494.848 227 L
495.065 227 L
495.282 227 L
495.499 227 L
495.716 227 L
495.933 226.999 L
496.15 226.999 L
496.367 226.999 L
496.584 226.999 L
496.801 226.999 L
497.018 226.999 L
497.235 226.999 L
497.452 226.999 L
497.669 226.999 L
497.886 226.999 L
498.103 226.999 L
498.32 226.999 L
498.537 226.999 L
498.754 226.999 L
498.971 226.999 L
499.188 226.999 L
499.405 226.999 L
499.622 226.999 L
499.839 226.999 L
500.056 226.999 L
500.273 226.999 L
500.49 226.999 L
500.707 226.999 L
500.924 226.999 L
501.141 226.999 L
501.358 226.999 L
501.575 226.999 L
501.792 226.999 L
502.009 226.999 L
502.226 226.999 L
502.443 226.999 L
502.66 226.999 L
502.877 226.999 L
503.094 226.999 L
503.311 226.999 L
503.528 226.999 L
503.745 226.999 L
503.962 226.999 L
504.179 226.999 L
504.396 226.999 L
504.613 226.999 L
504.83 226.999 L
505.047 226.999 L
505.264 226.999 L
505.481 226.999 L
505.698 226.999 L
505.915 226.999 L
506.132 226.999 L
506.349 226.999 L
506.566 226.999 L
506.783 226.999 L
507 226.999 L
S
GR
GS
[0.75 0 0 0.75 0 0] CT
0 1 0 RC
1 LJ
0.667 LW
N
73.434 129 M
73.651 133.156 L
73.868 75.82 L
74.085 72.549 L
74.302 32.319 L
74.519 327.472 L
74.736 245.425 L
74.953 240.436 L
75.17 235.637 L
75.387 233.37 L
75.604 233.559 L
75.821 232.194 L
76.038 232.252 L
76.255 231.456 L
76.472 231.156 L
76.689 230.985 L
76.906 229.883 L
77.123 230.233 L
77.34 228.741 L
77.557 229.089 L
77.774 229.534 L
77.991 228.23 L
78.208 228.043 L
78.425 227.901 L
78.642 227.899 L
78.859 228.351 L
79.076 228.833 L
79.293 228.316 L
79.51 228.308 L
79.727 228.102 L
79.944 228.03 L
80.161 227.735 L
80.378 227.638 L
80.595 227.647 L
80.812 227.601 L
81.029 227.633 L
81.246 227.563 L
81.463 227.558 L
81.68 227.479 L
81.897 227.453 L
82.114 227.376 L
82.331 227.528 L
82.548 227.104 L
82.765 227.161 L
82.982 227.137 L
83.199 227.194 L
83.416 227.176 L
83.633 227.183 L
83.85 227.135 L
84.067 227.114 L
84.284 227.113 L
84.501 227.139 L
84.718 227.225 L
84.935 227.216 L
85.152 227.179 L
85.369 227.195 L
85.586 227.191 L
85.803 227.24 L
86.02 227.199 L
86.237 227.265 L
86.454 227.272 L
86.671 227.245 L
86.888 227.245 L
87.105 227.231 L
87.322 227.224 L
87.539 227.167 L
87.756 227.165 L
87.973 227.156 L
88.19 227.17 L
88.407 227.214 L
88.624 227.229 L
88.841 227.205 L
89.058 227.226 L
89.275 227.181 L
89.492 227.175 L
89.709 227.175 L
89.926 227.154 L
90.143 227.156 L
90.36 227.135 L
90.577 227.108 L
90.794 227.087 L
91.011 227.073 L
91.228 227.048 L
91.445 227.044 L
91.662 227.026 L
91.879 227.064 L
92.096 227.061 L
92.313 227.066 L
92.53 227.094 L
92.747 227.11 L
92.964 227.117 L
93.181 227.091 L
93.398 227.092 L
93.615 227.077 L
93.832 227.075 L
94.049 227.049 L
94.266 227.092 L
94.483 227.013 L
94.7 227.014 L
94.917 227.026 L
95.134 226.999 L
95.351 227.057 L
95.568 227.011 L
95.785 227.014 L
96.002 226.988 L
96.219 226.969 L
96.436 226.97 L
96.653 226.987 L
96.87 226.971 L
97.087 226.975 L
97.304 226.981 L
97.521 226.982 L
97.738 226.96 L
97.955 226.939 L
98.172 226.938 L
98.389 226.933 L
98.606 226.939 L
98.823 226.96 L
99.04 226.961 L
99.257 226.957 L
99.474 226.955 L
99.691 226.919 L
99.908 226.915 L
100.125 226.911 L
100.342 226.911 L
100.559 226.906 L
100.776 226.89 L
100.993 226.921 L
101.21 226.896 L
101.427 226.895 L
101.644 226.904 L
101.861 226.898 L
102.078 226.9 L
102.295 226.907 L
102.512 226.907 L
102.729 226.912 L
102.946 226.912 L
103.163 226.917 L
103.38 226.898 L
103.597 226.899 L
103.814 226.916 L
104.031 226.92 L
104.248 226.908 L
104.465 226.911 L
104.682 226.91 L
104.899 226.892 L
105.116 226.893 L
105.333 226.896 L
105.55 226.894 L
105.767 226.894 L
105.984 226.905 L
106.201 226.907 L
106.418 226.907 L
106.635 226.907 L
106.852 226.907 L
107.069 226.909 L
107.286 226.908 L
107.503 226.925 L
107.72 226.94 L
107.937 226.929 L
108.154 226.926 L
108.371 226.921 L
108.588 226.921 L
108.805 226.924 L
109.022 226.929 L
109.239 226.931 L
109.456 226.931 L
109.673 226.924 L
109.89 226.921 L
110.107 226.924 L
110.324 226.916 L
110.541 226.918 L
110.758 226.917 L
110.975 226.915 L
111.192 226.916 L
111.409 226.915 L
111.626 226.916 L
111.843 226.915 L
112.06 226.916 L
112.277 226.911 L
112.494 226.912 L
112.711 226.911 L
112.928 226.923 L
113.145 226.935 L
113.362 226.934 L
113.579 226.936 L
113.796 226.937 L
114.013 226.937 L
114.23 226.937 L
114.447 226.929 L
114.664 226.93 L
114.881 226.93 L
115.098 226.935 L
115.315 226.947 L
115.532 226.945 L
115.749 226.943 L
115.966 226.942 L
116.183 226.943 L
116.4 226.946 L
116.617 226.952 L
116.834 226.944 L
117.051 226.944 L
117.268 226.94 L
117.485 226.946 L
117.702 226.942 L
117.919 226.941 L
118.136 226.941 L
118.353 226.937 L
118.57 226.939 L
118.787 226.941 L
119.004 226.947 L
119.221 226.957 L
119.438 226.959 L
119.655 226.963 L
119.872 226.96 L
120.089 226.96 L
120.306 226.959 L
120.523 226.95 L
120.74 226.951 L
120.957 226.95 L
121.174 226.949 L
121.391 226.949 L
121.608 226.949 L
121.825 226.948 L
122.042 226.943 L
122.259 226.939 L
122.476 226.961 L
122.693 226.953 L
122.91 226.955 L
123.127 226.958 L
123.344 226.957 L
123.561 226.956 L
123.778 226.955 L
123.995 226.955 L
124.212 226.955 L
124.429 226.955 L
124.646 226.954 L
124.863 226.949 L
125.08 226.948 L
125.297 226.946 L
125.514 226.949 L
125.731 226.959 L
125.948 226.963 L
126.165 226.965 L
126.382 226.96 L
126.599 226.958 L
126.816 226.958 L
127.033 226.958 L
127.25 226.957 L
127.467 226.958 L
127.684 226.957 L
127.901 226.958 L
128.118 226.956 L
128.335 226.955 L
128.552 226.957 L
128.769 226.953 L
128.986 226.955 L
129.203 226.956 L
129.42 226.953 L
129.637 226.954 L
129.854 226.954 L
130.071 226.959 L
130.288 226.962 L
130.505 226.974 L
130.722 226.98 L
130.939 226.984 L
131.156 226.977 L
131.373 226.976 L
131.59 226.978 L
131.807 226.978 L
132.024 226.98 L
132.241 226.977 L
132.458 226.977 L
132.675 226.977 L
132.892 226.981 L
133.109 226.981 L
133.326 226.985 L
133.543 226.981 L
133.76 226.981 L
133.977 226.982 L
134.194 226.983 L
134.411 226.979 L
134.628 226.979 L
134.845 226.977 L
135.062 226.968 L
135.279 226.968 L
135.496 226.979 L
135.713 226.971 L
135.93 226.967 L
136.147 226.966 L
136.364 226.966 L
136.581 226.965 L
136.798 226.964 L
137.015 226.965 L
137.232 226.964 L
137.449 226.964 L
137.666 226.963 L
137.883 226.963 L
138.1 226.965 L
138.317 226.963 L
138.534 226.964 L
138.751 226.961 L
138.968 226.957 L
139.185 226.956 L
139.402 226.956 L
139.619 226.957 L
139.836 226.958 L
140.053 226.957 L
140.27 226.959 L
140.487 226.964 L
140.704 226.969 L
140.921 226.974 L
141.138 226.974 L
141.355 226.976 L
141.572 226.973 L
141.789 226.973 L
142.006 226.974 L
142.223 226.976 L
142.44 226.982 L
142.657 226.981 L
142.874 226.983 L
143.091 226.979 L
143.308 226.972 L
143.525 226.972 L
143.742 226.974 L
143.959 226.968 L
144.176 226.968 L
144.393 226.968 L
144.61 226.97 L
144.827 226.968 L
145.044 226.969 L
145.261 226.969 L
145.478 226.969 L
145.695 226.97 L
145.912 226.97 L
146.129 226.969 L
146.346 226.969 L
146.563 226.968 L
146.78 226.969 L
146.997 226.967 L
147.214 226.967 L
147.431 226.966 L
147.648 226.971 L
147.865 226.973 L
148.082 226.976 L
148.299 226.975 L
148.516 226.973 L
148.733 226.976 L
148.95 226.979 L
149.167 226.976 L
149.384 226.976 L
149.601 226.976 L
149.818 226.976 L
150.035 226.977 L
150.252 226.977 L
150.469 226.977 L
150.686 226.977 L
150.903 226.979 L
151.12 226.975 L
151.337 226.974 L
151.554 226.976 L
151.771 226.974 L
151.988 226.973 L
152.205 226.973 L
152.422 226.973 L
152.639 226.973 L
152.856 226.973 L
153.073 226.973 L
153.29 226.973 L
153.507 226.975 L
153.724 226.975 L
153.941 226.976 L
154.158 226.976 L
154.375 226.976 L
154.592 226.976 L
154.809 226.975 L
155.026 226.976 L
155.243 226.974 L
155.46 226.975 L
155.677 226.974 L
155.894 226.973 L
156.111 226.973 L
156.328 226.97 L
156.545 226.97 L
156.762 226.97 L
156.979 226.972 L
157.196 226.974 L
157.413 226.973 L
157.63 226.973 L
157.847 226.974 L
158.064 226.974 L
158.281 226.975 L
158.498 226.974 L
158.715 226.975 L
158.932 226.975 L
159.149 226.975 L
159.366 226.974 L
159.583 226.972 L
159.8 226.973 L
160.017 226.975 L
160.234 226.974 L
160.451 226.974 L
160.668 226.974 L
160.885 226.974 L
161.102 226.974 L
161.319 226.975 L
161.536 226.975 L
161.753 226.974 L
161.97 226.973 L
162.187 226.975 L
162.404 226.981 L
162.621 226.98 L
162.838 226.978 L
163.055 226.977 L
163.272 226.978 L
163.489 226.976 L
163.706 226.976 L
163.923 226.978 L
164.14 226.977 L
164.357 226.979 L
164.574 226.983 L
164.791 226.981 L
165.008 226.981 L
165.225 226.98 L
165.442 226.98 L
165.659 226.981 L
165.876 226.98 L
166.093 226.98 L
166.31 226.979 L
166.527 226.979 L
166.744 226.98 L
166.961 226.981 L
167.178 226.979 L
167.395 226.979 L
167.612 226.979 L
167.829 226.979 L
168.046 226.979 L
168.263 226.98 L
168.48 226.98 L
168.697 226.981 L
168.914 226.982 L
169.131 226.981 L
169.348 226.981 L
169.565 226.98 L
169.782 226.98 L
169.999 226.981 L
170.216 226.981 L
170.433 226.981 L
170.65 226.98 L
170.867 226.98 L
171.084 226.982 L
171.301 226.983 L
171.518 226.983 L
171.735 226.983 L
171.952 226.983 L
172.169 226.983 L
172.386 226.983 L
172.603 226.984 L
172.82 226.982 L
173.037 226.982 L
173.254 226.983 L
173.471 226.984 L
173.688 226.981 L
173.905 226.981 L
174.122 226.981 L
174.339 226.981 L
174.556 226.982 L
174.773 226.98 L
174.99 226.98 L
175.207 226.98 L
175.424 226.981 L
175.641 226.981 L
175.858 226.981 L
176.075 226.98 L
176.292 226.98 L
176.509 226.98 L
176.726 226.98 L
176.943 226.981 L
177.16 226.98 L
177.377 226.98 L
177.594 226.981 L
177.811 226.98 L
178.028 226.979 L
178.245 226.979 L
178.462 226.979 L
178.679 226.979 L
178.896 226.979 L
179.113 226.979 L
179.33 226.98 L
179.547 226.977 L
179.764 226.977 L
179.981 226.976 L
180.198 226.976 L
180.415 226.976 L
180.632 226.976 L
180.849 226.976 L
181.066 226.976 L
181.283 226.977 L
181.5 226.977 L
181.717 226.977 L
181.934 226.977 L
182.151 226.978 L
182.368 226.979 L
182.585 226.98 L
182.802 226.98 L
183.019 226.98 L
183.236 226.981 L
183.453 226.982 L
183.67 226.981 L
183.887 226.982 L
184.104 226.982 L
184.321 226.982 L
184.538 226.982 L
184.755 226.982 L
184.972 226.983 L
185.189 226.983 L
185.406 226.982 L
185.623 226.982 L
185.84 226.982 L
186.057 226.982 L
186.274 226.982 L
186.491 226.982 L
186.708 226.983 L
186.925 226.981 L
187.142 226.981 L
187.359 226.98 L
187.576 226.981 L
187.793 226.983 L
188.01 226.983 L
188.227 226.981 L
188.444 226.982 L
188.661 226.983 L
188.878 226.982 L
189.095 226.982 L
189.312 226.982 L
189.529 226.982 L
189.746 226.983 L
189.963 226.984 L
190.18 226.985 L
190.397 226.987 L
190.614 226.986 L
190.831 226.986 L
191.048 226.986 L
191.265 226.986 L
191.482 226.986 L
191.699 226.986 L
191.916 226.986 L
192.133 226.986 L
192.35 226.986 L
192.567 226.986 L
192.784 226.986 L
193.001 226.986 L
193.218 226.987 L
193.435 226.988 L
193.652 226.988 L
193.869 226.986 L
194.086 226.986 L
194.303 226.986 L
194.52 226.986 L
194.737 226.986 L
194.954 226.986 L
195.171 226.986 L
195.388 226.986 L
195.605 226.986 L
195.822 226.986 L
196.039 226.988 L
196.256 226.988 L
196.473 226.988 L
196.69 226.988 L
196.907 226.989 L
197.124 226.988 L
197.341 226.988 L
197.558 226.988 L
197.775 226.989 L
197.992 226.989 L
198.209 226.989 L
198.426 226.989 L
198.643 226.988 L
198.86 226.99 L
199.077 226.988 L
199.294 226.988 L
199.511 226.987 L
199.728 226.988 L
199.945 226.987 L
200.162 226.987 L
200.379 226.987 L
200.596 226.987 L
200.813 226.987 L
201.03 226.987 L
201.247 226.987 L
201.464 226.987 L
201.681 226.987 L
201.898 226.987 L
202.115 226.987 L
202.332 226.987 L
202.549 226.987 L
202.766 226.987 L
202.983 226.987 L
203.2 226.988 L
203.417 226.988 L
203.634 226.988 L
203.851 226.988 L
204.068 226.988 L
204.285 226.987 L
204.502 226.988 L
204.719 226.988 L
204.936 226.989 L
205.153 226.989 L
205.37 226.988 L
205.587 226.989 L
205.804 226.989 L
206.021 226.989 L
206.238 226.989 L
206.455 226.989 L
206.672 226.989 L
206.889 226.989 L
207.106 226.988 L
207.323 226.988 L
207.54 226.988 L
207.757 226.988 L
207.974 226.988 L
208.191 226.988 L
208.408 226.989 L
208.625 226.989 L
208.842 226.988 L
209.059 226.988 L
209.276 226.989 L
209.493 226.991 L
209.71 226.99 L
209.927 226.989 L
210.144 226.989 L
210.361 226.989 L
210.578 226.989 L
210.795 226.988 L
211.012 226.988 L
211.229 226.988 L
211.446 226.988 L
211.663 226.988 L
211.88 226.988 L
212.097 226.988 L
212.314 226.987 L
212.531 226.987 L
212.748 226.987 L
212.965 226.987 L
213.182 226.986 L
213.399 226.986 L
213.616 226.986 L
213.833 226.986 L
214.05 226.987 L
214.267 226.987 L
214.484 226.987 L
214.701 226.987 L
214.918 226.987 L
215.135 226.987 L
215.352 226.987 L
215.569 226.986 L
215.786 226.987 L
216.003 226.987 L
216.22 226.987 L
216.437 226.988 L
216.654 226.988 L
216.871 226.988 L
217.088 226.988 L
217.305 226.987 L
217.522 226.987 L
217.739 226.987 L
217.956 226.987 L
218.173 226.987 L
218.39 226.987 L
218.607 226.987 L
218.824 226.987 L
219.041 226.987 L
219.258 226.987 L
219.475 226.987 L
219.692 226.988 L
219.909 226.987 L
220.126 226.987 L
220.343 226.988 L
220.56 226.989 L
220.777 226.988 L
220.994 226.988 L
221.211 226.988 L
221.428 226.988 L
221.645 226.987 L
221.862 226.988 L
222.079 226.988 L
222.296 226.989 L
222.513 226.989 L
222.73 226.99 L
222.947 226.989 L
223.164 226.989 L
223.381 226.988 L
223.598 226.988 L
223.815 226.988 L
224.032 226.988 L
224.249 226.988 L
224.466 226.988 L
224.683 226.988 L
224.9 226.988 L
225.117 226.988 L
225.334 226.988 L
225.551 226.987 L
225.768 226.987 L
225.985 226.987 L
226.202 226.987 L
226.419 226.987 L
226.636 226.987 L
226.853 226.987 L
227.07 226.987 L
227.287 226.987 L
227.504 226.986 L
227.721 226.987 L
227.938 226.987 L
228.155 226.988 L
228.372 226.988 L
228.589 226.988 L
228.806 226.988 L
229.023 226.988 L
229.24 226.988 L
229.457 226.988 L
229.674 226.987 L
229.891 226.987 L
230.108 226.988 L
230.325 226.988 L
230.542 226.988 L
230.759 226.987 L
230.976 226.987 L
231.193 226.987 L
231.41 226.987 L
231.627 226.987 L
231.844 226.987 L
232.061 226.987 L
232.278 226.987 L
232.495 226.987 L
232.712 226.987 L
232.929 226.987 L
233.146 226.987 L
233.363 226.987 L
233.58 226.987 L
233.797 226.987 L
234.014 226.986 L
234.231 226.987 L
234.448 226.987 L
234.665 226.986 L
234.882 226.987 L
235.099 226.987 L
235.316 226.987 L
235.533 226.986 L
235.75 226.987 L
235.967 226.986 L
236.184 226.986 L
236.401 226.986 L
236.618 226.986 L
236.835 226.986 L
237.052 226.986 L
237.269 226.986 L
237.486 226.986 L
237.703 226.985 L
237.92 226.985 L
238.137 226.986 L
238.354 226.986 L
238.571 226.986 L
238.788 226.986 L
239.005 226.986 L
239.222 226.986 L
239.439 226.986 L
239.656 226.986 L
239.873 226.986 L
240.09 226.986 L
240.307 226.986 L
240.524 226.986 L
240.741 226.986 L
240.958 226.986 L
241.175 226.985 L
241.392 226.985 L
241.609 226.985 L
241.826 226.986 L
242.043 226.985 L
242.26 226.985 L
242.477 226.985 L
242.694 226.985 L
242.911 226.985 L
243.128 226.985 L
243.345 226.985 L
243.562 226.985 L
243.779 226.985 L
243.996 226.985 L
244.213 226.985 L
244.43 226.985 L
244.647 226.985 L
244.864 226.986 L
245.081 226.986 L
245.298 226.986 L
245.515 226.985 L
245.732 226.986 L
245.949 226.986 L
246.166 226.986 L
246.383 226.986 L
246.6 226.986 L
246.817 226.986 L
247.034 226.987 L
247.251 226.987 L
247.468 226.986 L
247.685 226.986 L
247.902 226.987 L
248.119 226.986 L
248.336 226.986 L
248.553 226.986 L
248.77 226.986 L
248.987 226.987 L
249.204 226.987 L
249.421 226.986 L
249.638 226.986 L
249.855 226.986 L
250.072 226.986 L
250.289 226.986 L
250.506 226.986 L
250.723 226.986 L
250.94 226.986 L
251.157 226.986 L
251.374 226.986 L
251.591 226.986 L
251.808 226.986 L
252.025 226.986 L
252.242 226.986 L
252.459 226.986 L
252.676 226.986 L
252.893 226.986 L
253.11 226.986 L
253.327 226.986 L
253.544 226.986 L
253.761 226.985 L
253.978 226.985 L
254.195 226.985 L
254.412 226.985 L
254.629 226.985 L
254.846 226.986 L
255.063 226.985 L
255.28 226.985 L
255.497 226.985 L
255.714 226.985 L
255.931 226.985 L
256.148 226.985 L
256.365 226.986 L
256.582 226.986 L
256.799 226.985 L
257.016 226.987 L
257.233 226.986 L
257.45 226.986 L
257.667 226.986 L
257.884 226.985 L
258.101 226.985 L
258.318 226.986 L
258.535 226.985 L
258.752 226.985 L
258.969 226.985 L
259.186 226.985 L
259.403 226.985 L
259.62 226.985 L
259.837 226.985 L
260.054 226.985 L
260.271 226.985 L
260.488 226.985 L
260.705 226.985 L
260.922 226.986 L
261.139 226.985 L
261.356 226.986 L
261.573 226.986 L
261.79 226.986 L
262.007 226.986 L
262.224 226.986 L
262.441 226.986 L
262.658 226.986 L
262.875 226.986 L
263.092 226.986 L
263.309 226.986 L
263.526 226.986 L
263.743 226.986 L
263.96 226.987 L
264.177 226.987 L
264.394 226.989 L
264.611 226.99 L
264.828 226.989 L
265.045 226.989 L
265.262 226.99 L
265.479 226.989 L
265.696 226.989 L
265.913 226.989 L
266.13 226.99 L
266.347 226.989 L
266.564 226.989 L
266.781 226.989 L
266.998 226.989 L
267.215 226.989 L
267.432 226.989 L
267.649 226.989 L
267.866 226.989 L
268.083 226.989 L
268.3 226.989 L
268.517 226.989 L
268.734 226.989 L
268.951 226.989 L
269.168 226.989 L
269.385 226.989 L
269.602 226.989 L
269.819 226.989 L
270.036 226.99 L
270.253 226.99 L
270.47 226.991 L
270.687 226.992 L
270.904 226.992 L
271.121 226.991 L
271.338 226.991 L
271.555 226.991 L
271.772 226.991 L
271.989 226.991 L
272.206 226.991 L
272.423 226.991 L
272.64 226.99 L
272.857 226.99 L
273.074 226.99 L
273.291 226.99 L
273.508 226.99 L
273.725 226.99 L
273.942 226.99 L
274.159 226.99 L
274.376 226.99 L
274.593 226.989 L
274.81 226.99 L
275.027 226.99 L
275.244 226.99 L
275.461 226.99 L
275.678 226.99 L
275.895 226.989 L
276.112 226.99 L
276.329 226.99 L
276.546 226.99 L
276.763 226.99 L
276.98 226.99 L
277.197 226.99 L
277.414 226.99 L
277.631 226.99 L
277.848 226.99 L
278.065 226.99 L
278.282 226.99 L
278.499 226.99 L
278.716 226.99 L
278.933 226.99 L
279.15 226.99 L
279.367 226.99 L
279.584 226.99 L
279.801 226.99 L
280.018 226.99 L
280.235 226.99 L
280.452 226.99 L
280.669 226.99 L
280.886 226.99 L
281.103 226.99 L
281.32 226.99 L
281.537 226.99 L
281.754 226.99 L
281.971 226.99 L
282.188 226.99 L
282.405 226.99 L
282.622 226.99 L
282.839 226.99 L
283.056 226.99 L
283.273 226.99 L
283.49 226.99 L
283.707 226.99 L
283.924 226.99 L
284.141 226.99 L
284.358 226.99 L
284.575 226.99 L
284.792 226.989 L
285.009 226.989 L
285.226 226.989 L
285.443 226.989 L
285.66 226.989 L
285.877 226.989 L
286.094 226.989 L
286.311 226.989 L
286.528 226.989 L
286.745 226.989 L
286.962 226.989 L
287.179 226.989 L
287.396 226.99 L
287.613 226.99 L
287.83 226.99 L
288.047 226.99 L
288.264 226.99 L
288.481 226.99 L
288.698 226.99 L
288.915 226.99 L
289.132 226.99 L
289.349 226.99 L
289.566 226.99 L
289.783 226.99 L
290 226.99 L
290.217 226.99 L
290.434 226.99 L
290.651 226.99 L
290.868 226.99 L
291.085 226.99 L
291.302 226.99 L
291.519 226.99 L
291.736 226.99 L
291.953 226.99 L
292.17 226.99 L
292.387 226.99 L
292.604 226.99 L
292.821 226.99 L
293.038 226.99 L
293.255 226.991 L
293.472 226.991 L
293.689 226.992 L
293.906 226.992 L
294.123 226.992 L
294.34 226.992 L
294.557 226.992 L
294.774 226.992 L
294.991 226.992 L
295.208 226.992 L
295.425 226.992 L
295.642 226.992 L
295.859 226.991 L
296.076 226.991 L
296.293 226.991 L
296.51 226.992 L
296.727 226.992 L
296.944 226.992 L
297.161 226.992 L
297.378 226.992 L
297.595 226.992 L
297.812 226.992 L
298.029 226.992 L
298.246 226.992 L
298.463 226.992 L
298.68 226.992 L
298.897 226.992 L
299.114 226.992 L
299.331 226.992 L
299.548 226.992 L
299.765 226.992 L
299.982 226.992 L
300.199 226.992 L
300.416 226.992 L
300.633 226.992 L
300.85 226.992 L
301.067 226.992 L
301.284 226.993 L
301.501 226.993 L
301.718 226.993 L
301.935 226.993 L
302.152 226.992 L
302.369 226.992 L
302.586 226.992 L
302.803 226.993 L
303.02 226.992 L
303.237 226.992 L
303.454 226.992 L
303.671 226.992 L
303.888 226.992 L
304.105 226.992 L
304.322 226.993 L
304.539 226.992 L
304.756 226.992 L
304.973 226.992 L
305.19 226.992 L
305.407 226.992 L
305.624 226.992 L
305.841 226.992 L
306.058 226.992 L
306.275 226.992 L
306.492 226.992 L
306.709 226.992 L
306.926 226.993 L
307.143 226.993 L
307.36 226.993 L
307.577 226.993 L
307.794 226.993 L
308.011 226.993 L
308.228 226.993 L
308.445 226.992 L
308.662 226.992 L
308.879 226.992 L
309.096 226.993 L
309.313 226.993 L
309.53 226.992 L
309.747 226.992 L
309.964 226.992 L
310.181 226.992 L
310.398 226.992 L
310.615 226.992 L
310.832 226.992 L
311.049 226.992 L
311.266 226.992 L
311.483 226.992 L
311.7 226.992 L
311.917 226.992 L
312.134 226.992 L
312.351 226.992 L
312.568 226.993 L
312.785 226.993 L
313.002 226.993 L
313.219 226.993 L
313.436 226.993 L
313.653 226.993 L
313.87 226.993 L
314.087 226.993 L
314.304 226.993 L
314.521 226.993 L
314.738 226.993 L
314.955 226.993 L
315.172 226.993 L
315.389 226.993 L
315.606 226.993 L
315.823 226.993 L
316.04 226.993 L
316.257 226.993 L
316.474 226.993 L
316.691 226.993 L
316.908 226.993 L
317.125 226.993 L
317.342 226.993 L
317.559 226.993 L
317.776 226.993 L
317.993 226.993 L
318.21 226.992 L
318.427 226.992 L
318.644 226.992 L
318.861 226.992 L
319.078 226.992 L
319.295 226.992 L
319.512 226.993 L
319.729 226.993 L
319.946 226.993 L
320.163 226.993 L
320.38 226.993 L
320.597 226.993 L
320.814 226.993 L
321.031 226.993 L
321.248 226.993 L
321.465 226.994 L
321.682 226.994 L
321.899 226.993 L
322.116 226.993 L
322.333 226.993 L
322.55 226.993 L
322.767 226.993 L
322.984 226.993 L
323.201 226.993 L
323.418 226.993 L
323.635 226.993 L
323.852 226.993 L
324.069 226.993 L
324.286 226.993 L
324.503 226.993 L
324.72 226.993 L
324.937 226.993 L
325.154 226.993 L
325.371 226.993 L
325.588 226.993 L
325.805 226.993 L
326.022 226.993 L
326.239 226.993 L
326.456 226.993 L
326.673 226.993 L
326.89 226.993 L
327.107 226.993 L
327.324 226.993 L
327.541 226.993 L
327.758 226.993 L
327.975 226.993 L
328.192 226.993 L
328.409 226.993 L
328.626 226.993 L
328.843 226.993 L
329.06 226.993 L
329.277 226.993 L
329.494 226.993 L
329.711 226.993 L
329.928 226.993 L
330.145 226.993 L
330.362 226.993 L
330.579 226.993 L
330.796 226.994 L
331.013 226.994 L
331.23 226.994 L
331.447 226.994 L
331.664 226.994 L
331.881 226.994 L
332.098 226.994 L
332.315 226.994 L
332.532 226.994 L
332.749 226.994 L
332.966 226.994 L
333.183 226.994 L
333.4 226.994 L
333.617 226.994 L
333.834 226.994 L
334.051 226.994 L
334.268 226.994 L
334.485 226.994 L
334.702 226.994 L
334.919 226.994 L
335.136 226.994 L
335.353 226.993 L
335.57 226.994 L
335.787 226.994 L
336.004 226.994 L
336.221 226.994 L
336.438 226.994 L
336.655 226.994 L
336.872 226.994 L
337.089 226.994 L
337.306 226.994 L
337.523 226.994 L
337.74 226.994 L
337.957 226.994 L
338.174 226.994 L
338.391 226.994 L
338.608 226.994 L
338.825 226.994 L
339.042 226.995 L
339.259 226.994 L
339.476 226.995 L
339.693 226.995 L
339.91 226.994 L
340.127 226.995 L
340.344 226.995 L
340.561 226.994 L
340.778 226.994 L
340.995 226.994 L
341.212 226.994 L
341.429 226.994 L
341.646 226.994 L
341.863 226.994 L
342.08 226.994 L
342.297 226.995 L
342.514 226.994 L
342.731 226.994 L
342.948 226.995 L
343.165 226.995 L
343.382 226.994 L
343.599 226.994 L
343.816 226.994 L
344.033 226.995 L
344.25 226.994 L
344.467 226.995 L
344.684 226.995 L
344.901 226.995 L
345.118 226.995 L
345.335 226.994 L
345.552 226.995 L
345.769 226.994 L
345.986 226.994 L
346.203 226.995 L
346.42 226.994 L
346.637 226.995 L
346.854 226.995 L
347.071 226.995 L
347.288 226.995 L
347.505 226.995 L
347.722 226.995 L
347.939 226.995 L
348.156 226.995 L
348.373 226.995 L
348.59 226.995 L
348.807 226.995 L
349.024 226.995 L
349.241 226.995 L
349.458 226.994 L
349.675 226.995 L
349.892 226.994 L
350.109 226.994 L
350.326 226.994 L
350.543 226.994 L
350.76 226.994 L
350.977 226.994 L
351.194 226.994 L
351.411 226.994 L
351.628 226.994 L
351.845 226.993 L
352.062 226.993 L
352.279 226.993 L
352.496 226.993 L
352.713 226.993 L
352.93 226.993 L
353.147 226.993 L
353.364 226.993 L
353.581 226.993 L
353.798 226.993 L
354.015 226.993 L
354.232 226.993 L
354.449 226.993 L
354.666 226.993 L
354.883 226.993 L
355.1 226.993 L
355.317 226.993 L
355.534 226.993 L
355.751 226.993 L
355.968 226.993 L
356.185 226.993 L
356.402 226.993 L
356.619 226.993 L
356.836 226.993 L
357.053 226.993 L
357.27 226.993 L
357.487 226.993 L
357.704 226.993 L
357.921 226.993 L
358.138 226.993 L
358.355 226.993 L
358.572 226.993 L
358.789 226.993 L
359.006 226.993 L
359.223 226.993 L
359.44 226.993 L
359.657 226.993 L
359.874 226.993 L
360.091 226.993 L
360.308 226.992 L
360.525 226.992 L
360.742 226.992 L
360.959 226.992 L
361.176 226.993 L
361.393 226.993 L
361.61 226.993 L
361.827 226.993 L
362.044 226.993 L
362.261 226.993 L
362.478 226.993 L
362.695 226.993 L
362.912 226.994 L
363.129 226.994 L
363.346 226.994 L
363.563 226.994 L
363.78 226.994 L
363.997 226.994 L
364.214 226.994 L
364.431 226.994 L
364.648 226.994 L
364.865 226.994 L
365.082 226.994 L
365.299 226.994 L
365.516 226.994 L
365.733 226.994 L
365.95 226.994 L
366.167 226.994 L
366.384 226.994 L
366.601 226.994 L
366.818 226.994 L
367.035 226.994 L
367.252 226.994 L
367.469 226.994 L
367.686 226.994 L
367.903 226.994 L
368.12 226.994 L
368.337 226.994 L
368.554 226.994 L
368.771 226.994 L
368.988 226.994 L
369.205 226.994 L
369.422 226.994 L
369.639 226.994 L
369.856 226.994 L
370.073 226.994 L
370.29 226.994 L
370.507 226.994 L
370.724 226.994 L
370.941 226.994 L
371.158 226.994 L
371.375 226.994 L
371.592 226.994 L
371.809 226.994 L
372.026 226.994 L
372.243 226.994 L
372.46 226.994 L
372.677 226.994 L
372.894 226.994 L
373.111 226.994 L
373.328 226.994 L
373.545 226.994 L
373.762 226.994 L
373.979 226.994 L
374.196 226.994 L
374.413 226.994 L
374.63 226.994 L
374.847 226.994 L
375.064 226.994 L
375.281 226.994 L
375.498 226.994 L
375.715 226.994 L
375.932 226.994 L
376.149 226.994 L
376.366 226.994 L
376.583 226.994 L
376.8 226.994 L
377.017 226.994 L
377.234 226.994 L
377.451 226.994 L
377.668 226.994 L
377.885 226.994 L
378.102 226.994 L
378.319 226.994 L
378.536 226.994 L
378.753 226.994 L
378.97 226.994 L
379.187 226.994 L
379.404 226.994 L
379.621 226.994 L
379.838 226.995 L
380.055 226.994 L
380.272 226.995 L
380.489 226.995 L
380.706 226.994 L
380.923 226.995 L
381.14 226.995 L
381.357 226.995 L
381.574 226.995 L
381.791 226.995 L
382.008 226.995 L
382.225 226.994 L
382.442 226.995 L
382.659 226.994 L
382.876 226.995 L
383.093 226.995 L
383.31 226.995 L
383.527 226.995 L
383.744 226.995 L
383.961 226.995 L
384.178 226.995 L
384.395 226.995 L
384.612 226.995 L
384.829 226.995 L
385.046 226.995 L
385.263 226.995 L
385.48 226.995 L
385.697 226.995 L
385.914 226.995 L
386.131 226.995 L
386.348 226.995 L
386.565 226.995 L
386.782 226.995 L
386.999 226.995 L
387.216 226.995 L
387.433 226.995 L
387.65 226.995 L
387.867 226.995 L
388.084 226.995 L
388.301 226.995 L
388.518 226.995 L
388.735 226.995 L
388.952 226.995 L
389.169 226.995 L
389.386 226.995 L
389.603 226.995 L
389.82 226.995 L
390.037 226.995 L
390.254 226.995 L
390.471 226.995 L
390.688 226.995 L
390.905 226.995 L
391.122 226.995 L
391.339 226.995 L
391.556 226.995 L
391.773 226.995 L
391.99 226.995 L
392.207 226.995 L
392.424 226.995 L
392.641 226.995 L
392.858 226.995 L
393.075 226.995 L
393.292 226.995 L
393.509 226.995 L
393.726 226.995 L
393.943 226.995 L
394.16 226.995 L
394.377 226.995 L
394.594 226.995 L
394.811 226.995 L
395.028 226.995 L
395.245 226.995 L
395.462 226.995 L
395.679 226.995 L
395.896 226.995 L
396.113 226.995 L
396.33 226.995 L
396.547 226.995 L
396.764 226.995 L
396.981 226.995 L
397.198 226.995 L
397.415 226.995 L
397.632 226.995 L
397.849 226.995 L
398.066 226.995 L
398.283 226.995 L
398.5 226.995 L
398.717 226.995 L
398.934 226.995 L
399.151 226.995 L
399.368 226.995 L
399.585 226.995 L
399.802 226.995 L
400.019 226.995 L
400.236 226.995 L
400.453 226.995 L
400.67 226.995 L
400.887 226.995 L
401.104 226.995 L
401.321 226.995 L
401.538 226.995 L
401.755 226.995 L
401.972 226.995 L
402.189 226.995 L
402.406 226.996 L
402.623 226.996 L
402.84 226.996 L
403.057 226.996 L
403.274 226.996 L
403.491 226.996 L
403.708 226.996 L
403.925 226.996 L
404.142 226.996 L
404.359 226.996 L
404.576 226.996 L
404.793 226.996 L
405.01 226.996 L
405.227 226.996 L
405.444 226.996 L
405.661 226.996 L
405.878 226.996 L
406.095 226.996 L
406.312 226.996 L
406.529 226.996 L
406.746 226.996 L
406.963 226.995 L
407.18 226.995 L
407.397 226.995 L
407.614 226.995 L
407.831 226.995 L
408.048 226.995 L
408.265 226.995 L
408.482 226.996 L
408.699 226.996 L
408.916 226.995 L
409.133 226.995 L
409.35 226.995 L
409.567 226.995 L
409.784 226.995 L
410.001 226.995 L
410.218 226.995 L
410.435 226.995 L
410.652 226.995 L
410.869 226.995 L
411.086 226.995 L
411.303 226.995 L
411.52 226.995 L
411.737 226.995 L
411.954 226.995 L
412.171 226.995 L
412.388 226.995 L
412.605 226.996 L
412.822 226.996 L
413.039 226.996 L
413.256 226.996 L
413.473 226.995 L
413.69 226.995 L
413.907 226.995 L
414.124 226.995 L
414.341 226.995 L
414.558 226.996 L
414.775 226.996 L
414.992 226.996 L
415.209 226.996 L
415.426 226.996 L
415.643 226.996 L
415.86 226.996 L
416.077 226.996 L
416.294 226.996 L
416.511 226.997 L
416.728 226.997 L
416.945 226.997 L
417.162 226.997 L
417.379 226.997 L
417.596 226.997 L
417.813 226.997 L
418.03 226.997 L
418.247 226.997 L
418.464 226.996 L
418.681 226.996 L
418.898 226.996 L
419.115 226.996 L
419.332 226.996 L
419.549 226.996 L
419.766 226.996 L
419.983 226.997 L
420.2 226.996 L
420.417 226.996 L
420.634 226.996 L
420.851 226.996 L
421.068 226.996 L
421.285 226.996 L
421.502 226.996 L
421.719 226.996 L
421.936 226.996 L
422.153 226.996 L
422.37 226.996 L
422.587 226.996 L
422.804 226.996 L
423.021 226.996 L
423.238 226.996 L
423.455 226.996 L
423.672 226.996 L
423.889 226.996 L
424.106 226.996 L
424.323 226.996 L
424.54 226.996 L
424.757 226.996 L
424.974 226.996 L
425.191 226.996 L
425.408 226.996 L
425.625 226.996 L
425.842 226.996 L
426.059 226.996 L
426.276 226.996 L
426.493 226.996 L
426.71 226.996 L
426.927 226.996 L
427.144 226.996 L
427.361 226.996 L
427.578 226.996 L
427.795 226.996 L
428.012 226.996 L
428.229 226.996 L
428.446 226.996 L
428.663 226.996 L
428.88 226.996 L
429.097 226.996 L
429.314 226.996 L
429.531 226.996 L
429.748 226.996 L
429.965 226.996 L
430.182 226.996 L
430.399 226.996 L
430.616 226.996 L
430.833 226.996 L
431.05 226.996 L
431.267 226.996 L
431.484 226.996 L
431.701 226.996 L
431.918 226.997 L
432.135 226.996 L
432.352 226.996 L
432.569 226.996 L
432.786 226.996 L
433.003 226.996 L
433.22 226.996 L
433.437 226.996 L
433.654 226.996 L
433.871 226.996 L
434.088 226.996 L
434.305 226.996 L
434.522 226.996 L
434.739 226.996 L
434.956 226.996 L
435.173 226.996 L
435.39 226.997 L
435.607 226.997 L
435.824 226.996 L
436.041 226.996 L
436.258 226.997 L
436.475 226.996 L
436.692 226.996 L
436.909 226.996 L
437.126 226.996 L
437.343 226.996 L
437.56 226.996 L
437.777 226.996 L
437.994 226.996 L
438.211 226.996 L
438.428 226.996 L
438.645 226.996 L
438.862 226.996 L
439.079 226.996 L
439.296 226.997 L
439.513 226.997 L
439.73 226.996 L
439.947 226.996 L
440.164 226.996 L
440.381 226.996 L
440.598 226.996 L
440.815 226.996 L
441.032 226.996 L
441.249 226.996 L
441.466 226.996 L
441.683 226.996 L
441.9 226.996 L
442.117 226.996 L
442.334 226.997 L
442.551 226.997 L
442.768 226.996 L
442.985 226.996 L
443.202 226.996 L
443.419 226.996 L
443.636 226.996 L
443.853 226.996 L
444.07 226.996 L
444.287 226.996 L
444.504 226.996 L
444.721 226.996 L
444.938 226.996 L
445.155 226.996 L
445.372 226.996 L
445.589 226.996 L
445.806 226.996 L
446.023 226.996 L
446.24 226.996 L
446.457 226.996 L
446.674 226.996 L
446.891 226.996 L
447.108 226.996 L
447.325 226.996 L
447.542 226.996 L
447.759 226.996 L
447.976 226.996 L
448.193 226.996 L
448.41 226.996 L
448.627 226.996 L
448.844 226.996 L
449.061 226.996 L
449.278 226.996 L
449.495 226.996 L
449.712 226.996 L
449.929 226.996 L
450.146 226.996 L
450.363 226.996 L
450.58 226.996 L
450.797 226.996 L
451.014 226.996 L
451.231 226.996 L
451.448 226.996 L
451.665 226.996 L
451.882 226.996 L
452.099 226.996 L
452.316 226.996 L
452.533 226.996 L
452.75 226.996 L
452.967 226.996 L
453.184 226.996 L
453.401 226.996 L
453.618 226.996 L
453.835 226.996 L
454.052 226.996 L
454.269 226.996 L
454.486 226.996 L
454.703 226.996 L
454.92 226.996 L
455.137 226.996 L
455.354 226.996 L
455.571 226.996 L
455.788 226.996 L
456.005 226.996 L
456.222 226.996 L
456.439 226.996 L
456.656 226.996 L
456.873 226.996 L
457.09 226.996 L
457.307 226.996 L
457.524 226.996 L
457.741 226.996 L
457.958 226.996 L
458.175 226.996 L
458.392 226.996 L
458.609 226.996 L
458.826 226.996 L
459.043 226.996 L
459.26 226.996 L
459.477 226.996 L
459.694 226.996 L
459.911 226.996 L
460.128 226.996 L
460.345 226.996 L
460.562 226.996 L
460.779 226.996 L
460.996 226.996 L
461.213 226.996 L
461.43 226.996 L
461.647 226.996 L
461.864 226.996 L
462.081 226.996 L
462.298 226.996 L
462.515 226.996 L
462.732 226.996 L
462.949 226.996 L
463.166 226.996 L
463.383 226.996 L
463.6 226.996 L
463.817 226.996 L
464.034 226.996 L
464.251 226.996 L
464.468 226.996 L
464.685 226.996 L
464.902 226.996 L
465.119 226.996 L
465.336 226.996 L
465.553 226.996 L
465.77 226.996 L
465.987 226.996 L
466.204 226.996 L
466.421 226.996 L
466.638 226.996 L
466.855 226.996 L
467.072 226.996 L
467.289 226.996 L
467.506 226.996 L
467.723 226.996 L
467.94 226.996 L
468.157 226.996 L
468.374 226.996 L
468.591 226.996 L
468.808 226.996 L
469.025 226.996 L
469.242 226.996 L
469.459 226.996 L
469.676 226.996 L
469.893 226.996 L
470.11 226.996 L
470.327 226.996 L
470.544 226.996 L
470.761 226.996 L
470.978 226.996 L
471.195 226.996 L
471.412 226.996 L
471.629 226.996 L
471.846 226.996 L
472.063 226.996 L
472.28 226.996 L
472.497 226.996 L
472.714 226.996 L
472.931 226.996 L
473.148 226.996 L
473.365 226.996 L
473.582 226.996 L
473.799 226.996 L
474.016 226.996 L
474.233 226.996 L
474.45 226.996 L
474.667 226.996 L
474.884 226.996 L
475.101 226.996 L
475.318 226.996 L
475.535 226.996 L
475.752 226.996 L
475.969 226.996 L
476.186 226.996 L
476.403 226.996 L
476.62 226.996 L
476.837 226.996 L
477.054 226.996 L
477.271 226.996 L
477.488 226.996 L
477.705 226.996 L
477.922 226.996 L
478.139 226.996 L
478.356 226.996 L
478.573 226.996 L
478.79 226.996 L
479.007 226.996 L
479.224 226.996 L
479.441 226.996 L
479.658 226.996 L
479.875 226.996 L
480.092 226.996 L
480.309 226.996 L
480.526 226.996 L
480.743 226.996 L
480.96 226.995 L
481.177 226.995 L
481.394 226.996 L
481.611 226.996 L
481.828 226.995 L
482.045 226.996 L
482.262 226.996 L
482.479 226.996 L
482.696 226.996 L
482.913 226.996 L
483.13 226.996 L
483.347 226.996 L
483.564 226.996 L
483.781 226.996 L
483.998 226.996 L
484.215 226.996 L
484.432 226.996 L
484.649 226.996 L
484.866 226.996 L
485.083 226.996 L
485.3 226.996 L
485.517 226.996 L
485.734 226.996 L
485.951 226.996 L
486.168 226.996 L
486.385 226.996 L
486.602 226.996 L
486.819 226.996 L
487.036 226.996 L
487.253 226.996 L
487.47 226.996 L
487.687 226.996 L
487.904 226.996 L
488.121 226.996 L
488.338 226.996 L
488.555 226.996 L
488.772 226.997 L
488.989 226.997 L
489.206 226.997 L
489.423 226.997 L
489.64 226.997 L
489.857 226.997 L
490.074 226.997 L
490.291 226.997 L
490.508 226.997 L
490.725 226.997 L
490.942 226.997 L
491.159 226.997 L
491.376 226.997 L
491.593 226.997 L
491.81 226.997 L
492.027 226.997 L
492.244 226.997 L
492.461 226.997 L
492.678 226.997 L
492.895 226.997 L
493.112 226.997 L
493.329 226.997 L
493.546 226.997 L
493.763 226.997 L
493.98 226.997 L
494.197 226.997 L
494.414 226.997 L
494.631 226.997 L
494.848 226.997 L
495.065 226.997 L
495.282 226.997 L
495.499 226.997 L
495.716 226.997 L
495.933 226.997 L
496.15 226.997 L
496.367 226.997 L
496.584 226.997 L
496.801 226.997 L
497.018 226.997 L
497.235 226.997 L
497.452 226.997 L
497.669 226.997 L
497.886 226.997 L
498.103 226.997 L
498.32 226.997 L
498.537 226.997 L
498.754 226.997 L
498.971 226.997 L
499.188 226.997 L
499.405 226.997 L
499.622 226.997 L
499.839 226.997 L
500.056 226.997 L
500.273 226.997 L
500.49 226.997 L
500.707 226.997 L
500.924 226.997 L
501.141 226.997 L
501.358 226.997 L
501.575 226.997 L
501.792 226.997 L
502.009 226.997 L
502.226 226.997 L
502.443 226.997 L
502.66 226.997 L
502.877 226.997 L
503.094 226.997 L
503.311 226.997 L
503.528 226.997 L
503.745 226.997 L
503.962 226.997 L
504.179 226.997 L
504.396 226.997 L
504.613 226.997 L
504.83 226.997 L
505.047 226.997 L
505.264 226.997 L
505.481 226.997 L
505.698 226.997 L
505.915 226.997 L
506.132 226.997 L
506.349 226.997 L
506.566 226.997 L
506.783 226.997 L
507 226.997 L
S
GR
GS
[0.75 0 0 0.75 0 0] CT
1 GC
N
316 172 M
316 135 L
378 135 L
378 172 L
cp
f
GR
GS
[0.75 0 0 0.75 264.75 108.85275] CT
/Helvetica 12 F
GS
[1 0 0 1 0 0] CT
0 5 moveto 
1 -1 scale
(p11) t 
GR
GR
GS
[0.75 0 0 0.75 0 0] CT
1 0 0 RC
1 LJ
0.667 LW
N
320 145.137 M
350 145.137 L
S
GR
GS
[0.75 0 0 0.75 264.75 121.39725] CT
/Helvetica 12 F
GS
[1 0 0 1 0 0] CT
0 5 moveto 
1 -1 scale
(p22) t 
GR
GR
GS
[0.75 0 0 0.75 0 0] CT
0 1 0 RC
1 LJ
0.667 LW
N
320 161.863 M
350 161.863 L
S
GR
GS
[0.75 0 0 0.75 0 0] CT
0.149 GC
10.0 ML
0.667 LW
N
316 172 M
316 135 L
378 135 L
378 172 L
cp
S
GR
%%Trailer
%%Pages: 1
%%EOF
