%!PS-Adobe-3.0 EPSF-3.0
%%Creator: (MATLAB, The Mathworks, Inc. Version 9.0.0.341360 \(R2016a\). Operating System: Windows 8)
%%Title: C:/Users/Jan/Documents/JC.ISF/isf1/valA.eps
%%CreationDate: 2017-03-29T10:33:37
%%Pages: (atend)
%%BoundingBox: 0 0 420 315
%%LanguageLevel: 3
%%EndComments
%%BeginProlog
%%BeginResource: procset (Apache XML Graphics Std ProcSet) 1.2 0
%%Version: 1.2 0
%%Copyright: (Copyright 2001-2003,2010 The Apache Software Foundation. License terms: http://www.apache.org/licenses/LICENSE-2.0)
/bd{bind def}bind def
/ld{load def}bd
/GR/grestore ld
/M/moveto ld
/LJ/setlinejoin ld
/C/curveto ld
/f/fill ld
/LW/setlinewidth ld
/GC/setgray ld
/t/show ld
/N/newpath ld
/CT/concat ld
/cp/closepath ld
/S/stroke ld
/L/lineto ld
/CC/setcmykcolor ld
/A/ashow ld
/GS/gsave ld
/RC/setrgbcolor ld
/RM/rmoveto ld
/ML/setmiterlimit ld
/re {4 2 roll M
1 index 0 rlineto
0 exch rlineto
neg 0 rlineto
cp } bd
/_ctm matrix def
/_tm matrix def
/BT { _ctm currentmatrix pop matrix _tm copy pop 0 0 moveto } bd
/ET { _ctm setmatrix } bd
/iTm { _ctm setmatrix _tm concat } bd
/Tm { _tm astore pop iTm 0 0 moveto } bd
/ux 0.0 def
/uy 0.0 def
/F {
  /Tp exch def
  /Tf exch def
  Tf findfont Tp scalefont setfont
  /cf Tf def  /cs Tp def
} bd
/ULS {currentpoint /uy exch def /ux exch def} bd
/ULE {
  /Tcx currentpoint pop def
  gsave
  newpath
  cf findfont cs scalefont dup
  /FontMatrix get 0 get /Ts exch def /FontInfo get dup
  /UnderlinePosition get Ts mul /To exch def
  /UnderlineThickness get Ts mul /Tt exch def
  ux uy To add moveto  Tcx uy To add lineto
  Tt setlinewidth stroke
  grestore
} bd
/OLE {
  /Tcx currentpoint pop def
  gsave
  newpath
  cf findfont cs scalefont dup
  /FontMatrix get 0 get /Ts exch def /FontInfo get dup
  /UnderlinePosition get Ts mul /To exch def
  /UnderlineThickness get Ts mul /Tt exch def
  ux uy To add cs add moveto Tcx uy To add cs add lineto
  Tt setlinewidth stroke
  grestore
} bd
/SOE {
  /Tcx currentpoint pop def
  gsave
  newpath
  cf findfont cs scalefont dup
  /FontMatrix get 0 get /Ts exch def /FontInfo get dup
  /UnderlinePosition get Ts mul /To exch def
  /UnderlineThickness get Ts mul /Tt exch def
  ux uy To add cs 10 mul 26 idiv add moveto Tcx uy To add cs 10 mul 26 idiv add lineto
  Tt setlinewidth stroke
  grestore
} bd
/QT {
/Y22 exch store
/X22 exch store
/Y21 exch store
/X21 exch store
currentpoint
/Y21 load 2 mul add 3 div exch
/X21 load 2 mul add 3 div exch
/X21 load 2 mul /X22 load add 3 div
/Y21 load 2 mul /Y22 load add 3 div
/X22 load /Y22 load curveto
} bd
/SSPD {
dup length /d exch dict def
{
/v exch def
/k exch def
currentpagedevice k known {
/cpdv currentpagedevice k get def
v cpdv ne {
/upd false def
/nullv v type /nulltype eq def
/nullcpdv cpdv type /nulltype eq def
nullv nullcpdv or
{
/upd true def
} {
/sametype v type cpdv type eq def
sametype {
v type /arraytype eq {
/vlen v length def
/cpdvlen cpdv length def
vlen cpdvlen eq {
0 1 vlen 1 sub {
/i exch def
/obj v i get def
/cpdobj cpdv i get def
obj cpdobj ne {
/upd true def
exit
} if
} for
} {
/upd true def
} ifelse
} {
v type /dicttype eq {
v {
/dv exch def
/dk exch def
/cpddv cpdv dk get def
dv cpddv ne {
/upd true def
exit
} if
} forall
} {
/upd true def
} ifelse
} ifelse
} if
} ifelse
upd true eq {
d k v put
} if
} if
} if
} forall
d length 0 gt {
d setpagedevice
} if
} bd
%%EndResource
%%BeginResource: procset (Apache XML Graphics EPS ProcSet) 1.0 0
%%Version: 1.0 0
%%Copyright: (Copyright 2002-2003 The Apache Software Foundation. License terms: http://www.apache.org/licenses/LICENSE-2.0)
/BeginEPSF { %def
/b4_Inc_state save def         % Save state for cleanup
/dict_count countdictstack def % Count objects on dict stack
/op_count count 1 sub def      % Count objects on operand stack
userdict begin                 % Push userdict on dict stack
/showpage { } def              % Redefine showpage, { } = null proc
0 setgray 0 setlinecap         % Prepare graphics state
1 setlinewidth 0 setlinejoin
10 setmiterlimit [ ] 0 setdash newpath
/languagelevel where           % If level not equal to 1 then
{pop languagelevel             % set strokeadjust and
1 ne                           % overprint to their defaults.
{false setstrokeadjust false setoverprint
} if
} if
} bd
/EndEPSF { %def
count op_count sub {pop} repeat            % Clean up stacks
countdictstack dict_count sub {end} repeat
b4_Inc_state restore
} bd
%%EndResource
%FOPBeginFontDict
%%IncludeResource: font Courier-Bold
%%IncludeResource: font Helvetica
%%IncludeResource: font Courier-BoldOblique
%%IncludeResource: font Courier-Oblique
%%IncludeResource: font Times-Roman
%%IncludeResource: font Helvetica-BoldOblique
%%IncludeResource: font Helvetica-Bold
%%IncludeResource: font Helvetica-Oblique
%%IncludeResource: font Times-BoldItalic
%%IncludeResource: font Courier
%%IncludeResource: font Times-Italic
%%IncludeResource: font Times-Bold
%%IncludeResource: font Symbol
%%IncludeResource: font ZapfDingbats
%FOPEndFontDict
%%BeginResource: encoding WinAnsiEncoding
/WinAnsiEncoding [
/.notdef /.notdef /.notdef /.notdef /.notdef
/.notdef /.notdef /.notdef /.notdef /.notdef
/.notdef /.notdef /.notdef /.notdef /.notdef
/.notdef /.notdef /.notdef /.notdef /.notdef
/.notdef /.notdef /.notdef /.notdef /.notdef
/.notdef /.notdef /.notdef /.notdef /.notdef
/.notdef /.notdef /space /exclam /quotedbl
/numbersign /dollar /percent /ampersand /quotesingle
/parenleft /parenright /asterisk /plus /comma
/hyphen /period /slash /zero /one
/two /three /four /five /six
/seven /eight /nine /colon /semicolon
/less /equal /greater /question /at
/A /B /C /D /E
/F /G /H /I /J
/K /L /M /N /O
/P /Q /R /S /T
/U /V /W /X /Y
/Z /bracketleft /backslash /bracketright /asciicircum
/underscore /quoteleft /a /b /c
/d /e /f /g /h
/i /j /k /l /m
/n /o /p /q /r
/s /t /u /v /w
/x /y /z /braceleft /bar
/braceright /asciitilde /bullet /Euro /bullet
/quotesinglbase /florin /quotedblbase /ellipsis /dagger
/daggerdbl /circumflex /perthousand /Scaron /guilsinglleft
/OE /bullet /Zcaron /bullet /bullet
/quoteleft /quoteright /quotedblleft /quotedblright /bullet
/endash /emdash /asciitilde /trademark /scaron
/guilsinglright /oe /bullet /zcaron /Ydieresis
/space /exclamdown /cent /sterling /currency
/yen /brokenbar /section /dieresis /copyright
/ordfeminine /guillemotleft /logicalnot /sfthyphen /registered
/macron /degree /plusminus /twosuperior /threesuperior
/acute /mu /paragraph /middot /cedilla
/onesuperior /ordmasculine /guillemotright /onequarter /onehalf
/threequarters /questiondown /Agrave /Aacute /Acircumflex
/Atilde /Adieresis /Aring /AE /Ccedilla
/Egrave /Eacute /Ecircumflex /Edieresis /Igrave
/Iacute /Icircumflex /Idieresis /Eth /Ntilde
/Ograve /Oacute /Ocircumflex /Otilde /Odieresis
/multiply /Oslash /Ugrave /Uacute /Ucircumflex
/Udieresis /Yacute /Thorn /germandbls /agrave
/aacute /acircumflex /atilde /adieresis /aring
/ae /ccedilla /egrave /eacute /ecircumflex
/edieresis /igrave /iacute /icircumflex /idieresis
/eth /ntilde /ograve /oacute /ocircumflex
/otilde /odieresis /divide /oslash /ugrave
/uacute /ucircumflex /udieresis /yacute /thorn
/ydieresis
] def
%%EndResource
%FOPBeginFontReencode
/Courier-Bold findfont
dup length dict begin
  {1 index /FID ne {def} {pop pop} ifelse} forall
  /Encoding WinAnsiEncoding def
  currentdict
end
/Courier-Bold exch definefont pop
/Helvetica findfont
dup length dict begin
  {1 index /FID ne {def} {pop pop} ifelse} forall
  /Encoding WinAnsiEncoding def
  currentdict
end
/Helvetica exch definefont pop
/Courier-BoldOblique findfont
dup length dict begin
  {1 index /FID ne {def} {pop pop} ifelse} forall
  /Encoding WinAnsiEncoding def
  currentdict
end
/Courier-BoldOblique exch definefont pop
/Courier-Oblique findfont
dup length dict begin
  {1 index /FID ne {def} {pop pop} ifelse} forall
  /Encoding WinAnsiEncoding def
  currentdict
end
/Courier-Oblique exch definefont pop
/Times-Roman findfont
dup length dict begin
  {1 index /FID ne {def} {pop pop} ifelse} forall
  /Encoding WinAnsiEncoding def
  currentdict
end
/Times-Roman exch definefont pop
/Helvetica-BoldOblique findfont
dup length dict begin
  {1 index /FID ne {def} {pop pop} ifelse} forall
  /Encoding WinAnsiEncoding def
  currentdict
end
/Helvetica-BoldOblique exch definefont pop
/Helvetica-Bold findfont
dup length dict begin
  {1 index /FID ne {def} {pop pop} ifelse} forall
  /Encoding WinAnsiEncoding def
  currentdict
end
/Helvetica-Bold exch definefont pop
/Helvetica-Oblique findfont
dup length dict begin
  {1 index /FID ne {def} {pop pop} ifelse} forall
  /Encoding WinAnsiEncoding def
  currentdict
end
/Helvetica-Oblique exch definefont pop
/Times-BoldItalic findfont
dup length dict begin
  {1 index /FID ne {def} {pop pop} ifelse} forall
  /Encoding WinAnsiEncoding def
  currentdict
end
/Times-BoldItalic exch definefont pop
/Courier findfont
dup length dict begin
  {1 index /FID ne {def} {pop pop} ifelse} forall
  /Encoding WinAnsiEncoding def
  currentdict
end
/Courier exch definefont pop
/Times-Italic findfont
dup length dict begin
  {1 index /FID ne {def} {pop pop} ifelse} forall
  /Encoding WinAnsiEncoding def
  currentdict
end
/Times-Italic exch definefont pop
/Times-Bold findfont
dup length dict begin
  {1 index /FID ne {def} {pop pop} ifelse} forall
  /Encoding WinAnsiEncoding def
  currentdict
end
/Times-Bold exch definefont pop
%FOPEndFontReencode
%%EndProlog
%%Page: 1 1
%%PageBoundingBox: 0 0 420 315
%%BeginPageSetup
[1 0 0 -1 0 315] CT
%%EndPageSetup
GS
[0.75 0 0 0.75 0 0] CT
1 GC
N
0 0 560 420 re
f
GR
GS
[0.75 0 0 0.75 0 0] CT
1 GC
N
0 0 560 420 re
f
GR
GS
[0.75 0 0 0.75 0 0] CT
1 GC
N
73 374 M
507 374 L
507 31 L
73 31 L
cp
f
GR
GS
[0.75 0 0 0.75 0 0] CT
0.873 GC
1 LJ
0.667 LW
N
73 374 M
73 31 L
S
GR
GS
[0.75 0 0 0.75 0 0] CT
0.873 GC
1 LJ
0.667 LW
N
145.333 374 M
145.333 31 L
S
GR
GS
[0.75 0 0 0.75 0 0] CT
0.873 GC
1 LJ
0.667 LW
N
217.667 374 M
217.667 31 L
S
GR
GS
[0.75 0 0 0.75 0 0] CT
0.873 GC
1 LJ
0.667 LW
N
290 374 M
290 31 L
S
GR
GS
[0.75 0 0 0.75 0 0] CT
0.873 GC
1 LJ
0.667 LW
N
362.333 374 M
362.333 31 L
S
GR
GS
[0.75 0 0 0.75 0 0] CT
0.873 GC
1 LJ
0.667 LW
N
434.667 374 M
434.667 31 L
S
GR
GS
[0.75 0 0 0.75 0 0] CT
0.873 GC
1 LJ
0.667 LW
N
507 374 M
507 31 L
S
GR
GS
[0.75 0 0 0.75 0 0] CT
0.873 GC
1 LJ
0.667 LW
N
507 374 M
73 374 L
S
GR
GS
[0.75 0 0 0.75 0 0] CT
0.873 GC
1 LJ
0.667 LW
N
507 335.889 M
73 335.889 L
S
GR
GS
[0.75 0 0 0.75 0 0] CT
0.873 GC
1 LJ
0.667 LW
N
507 297.778 M
73 297.778 L
S
GR
GS
[0.75 0 0 0.75 0 0] CT
0.873 GC
1 LJ
0.667 LW
N
507 259.667 M
73 259.667 L
S
GR
GS
[0.75 0 0 0.75 0 0] CT
0.873 GC
1 LJ
0.667 LW
N
507 221.556 M
73 221.556 L
S
GR
GS
[0.75 0 0 0.75 0 0] CT
0.873 GC
1 LJ
0.667 LW
N
507 183.444 M
73 183.444 L
S
GR
GS
[0.75 0 0 0.75 0 0] CT
0.873 GC
1 LJ
0.667 LW
N
507 145.333 M
73 145.333 L
S
GR
GS
[0.75 0 0 0.75 0 0] CT
0.873 GC
1 LJ
0.667 LW
N
507 107.222 M
73 107.222 L
S
GR
GS
[0.75 0 0 0.75 0 0] CT
0.873 GC
1 LJ
0.667 LW
N
507 69.111 M
73 69.111 L
S
GR
GS
[0.75 0 0 0.75 0 0] CT
0.873 GC
1 LJ
0.667 LW
N
507 31 M
73 31 L
S
GR
GS
[0.75 0 0 0.75 0 0] CT
0.149 GC
2 setlinecap
1 LJ
0.667 LW
N
73 374 M
507 374 L
S
GR
GS
[0.75 0 0 0.75 0 0] CT
0.149 GC
2 setlinecap
1 LJ
0.667 LW
N
73 374 M
73 369.66 L
S
GR
GS
[0.75 0 0 0.75 0 0] CT
0.149 GC
2 setlinecap
1 LJ
0.667 LW
N
145.333 374 M
145.333 369.66 L
S
GR
GS
[0.75 0 0 0.75 0 0] CT
0.149 GC
2 setlinecap
1 LJ
0.667 LW
N
217.667 374 M
217.667 369.66 L
S
GR
GS
[0.75 0 0 0.75 0 0] CT
0.149 GC
2 setlinecap
1 LJ
0.667 LW
N
290 374 M
290 369.66 L
S
GR
GS
[0.75 0 0 0.75 0 0] CT
0.149 GC
2 setlinecap
1 LJ
0.667 LW
N
362.333 374 M
362.333 369.66 L
S
GR
GS
[0.75 0 0 0.75 0 0] CT
0.149 GC
2 setlinecap
1 LJ
0.667 LW
N
434.667 374 M
434.667 369.66 L
S
GR
GS
[0.75 0 0 0.75 0 0] CT
0.149 GC
2 setlinecap
1 LJ
0.667 LW
N
507 374 M
507 369.66 L
S
GR
GS
[0.75 0 0 0.75 54.75 284.50001] CT
0.149 GC
/Helvetica 13.333 F
GS
[1 0 0 1 0 0] CT
-4 14 moveto 
1 -1 scale
(0) t 
GR
GR
GS
[0.75 0 0 0.75 109 284.50001] CT
0.149 GC
/Helvetica 13.333 F
GS
[1 0 0 1 0 0] CT
-7.5 14 moveto 
1 -1 scale
(10) t 
GR
GR
GS
[0.75 0 0 0.75 163.25 284.50001] CT
0.149 GC
/Helvetica 13.333 F
GS
[1 0 0 1 0 0] CT
-7.5 14 moveto 
1 -1 scale
(20) t 
GR
GR
GS
[0.75 0 0 0.75 217.5 284.50001] CT
0.149 GC
/Helvetica 13.333 F
GS
[1 0 0 1 0 0] CT
-7.5 14 moveto 
1 -1 scale
(30) t 
GR
GR
GS
[0.75 0 0 0.75 271.75001 284.50001] CT
0.149 GC
/Helvetica 13.333 F
GS
[1 0 0 1 0 0] CT
-7.5 14 moveto 
1 -1 scale
(40) t 
GR
GR
GS
[0.75 0 0 0.75 325.99999 284.50001] CT
0.149 GC
/Helvetica 13.333 F
GS
[1 0 0 1 0 0] CT
-7.5 14 moveto 
1 -1 scale
(50) t 
GR
GR
GS
[0.75 0 0 0.75 380.25 284.50001] CT
0.149 GC
/Helvetica 13.333 F
GS
[1 0 0 1 0 0] CT
-7.5 14 moveto 
1 -1 scale
(60) t 
GR
GR
GS
[0.75 0 0 0.75 217.50016 298.24999] CT
0.149 GC
/Helvetica 14.667 F
GS
[1 0 0 1 0 0] CT
-4 16 moveto 
1 -1 scale
(k) t 
GR
GR
GS
[0.75 0 0 0.75 0 0] CT
0.149 GC
2 setlinecap
1 LJ
0.667 LW
N
73 374 M
73 31 L
S
GR
GS
[0.75 0 0 0.75 0 0] CT
0.149 GC
2 setlinecap
1 LJ
0.667 LW
N
73 374 M
77.34 374 L
S
GR
GS
[0.75 0 0 0.75 0 0] CT
0.149 GC
2 setlinecap
1 LJ
0.667 LW
N
73 335.889 M
77.34 335.889 L
S
GR
GS
[0.75 0 0 0.75 0 0] CT
0.149 GC
2 setlinecap
1 LJ
0.667 LW
N
73 297.778 M
77.34 297.778 L
S
GR
GS
[0.75 0 0 0.75 0 0] CT
0.149 GC
2 setlinecap
1 LJ
0.667 LW
N
73 259.667 M
77.34 259.667 L
S
GR
GS
[0.75 0 0 0.75 0 0] CT
0.149 GC
2 setlinecap
1 LJ
0.667 LW
N
73 221.556 M
77.34 221.556 L
S
GR
GS
[0.75 0 0 0.75 0 0] CT
0.149 GC
2 setlinecap
1 LJ
0.667 LW
N
73 183.444 M
77.34 183.444 L
S
GR
GS
[0.75 0 0 0.75 0 0] CT
0.149 GC
2 setlinecap
1 LJ
0.667 LW
N
73 145.333 M
77.34 145.333 L
S
GR
GS
[0.75 0 0 0.75 0 0] CT
0.149 GC
2 setlinecap
1 LJ
0.667 LW
N
73 107.222 M
77.34 107.222 L
S
GR
GS
[0.75 0 0 0.75 0 0] CT
0.149 GC
2 setlinecap
1 LJ
0.667 LW
N
73 69.111 M
77.34 69.111 L
S
GR
GS
[0.75 0 0 0.75 0 0] CT
0.149 GC
2 setlinecap
1 LJ
0.667 LW
N
73 31 M
77.34 31 L
S
GR
GS
[0.75 0 0 0.75 50.75 280.5] CT
0.149 GC
/Helvetica 13.333 F
GS
[1 0 0 1 0 0] CT
-15 5.5 moveto 
1 -1 scale
(15) t 
GR
GR
GS
[0.75 0 0 0.75 50.75 251.91666] CT
0.149 GC
/Helvetica 13.333 F
GS
[1 0 0 1 0 0] CT
-15 5.5 moveto 
1 -1 scale
(20) t 
GR
GR
GS
[0.75 0 0 0.75 50.75 223.33333] CT
0.149 GC
/Helvetica 13.333 F
GS
[1 0 0 1 0 0] CT
-15 5.5 moveto 
1 -1 scale
(25) t 
GR
GR
GS
[0.75 0 0 0.75 50.75 194.74999] CT
0.149 GC
/Helvetica 13.333 F
GS
[1 0 0 1 0 0] CT
-15 5.5 moveto 
1 -1 scale
(30) t 
GR
GR
GS
[0.75 0 0 0.75 50.75 166.16667] CT
0.149 GC
/Helvetica 13.333 F
GS
[1 0 0 1 0 0] CT
-15 5.5 moveto 
1 -1 scale
(35) t 
GR
GR
GS
[0.75 0 0 0.75 50.75 137.58333] CT
0.149 GC
/Helvetica 13.333 F
GS
[1 0 0 1 0 0] CT
-15 5.5 moveto 
1 -1 scale
(40) t 
GR
GR
GS
[0.75 0 0 0.75 50.75 109] CT
0.149 GC
/Helvetica 13.333 F
GS
[1 0 0 1 0 0] CT
-15 5.5 moveto 
1 -1 scale
(45) t 
GR
GR
GS
[0.75 0 0 0.75 50.75 80.41667] CT
0.149 GC
/Helvetica 13.333 F
GS
[1 0 0 1 0 0] CT
-15 5.5 moveto 
1 -1 scale
(50) t 
GR
GR
GS
[0.75 0 0 0.75 50.75 51.83334] CT
0.149 GC
/Helvetica 13.333 F
GS
[1 0 0 1 0 0] CT
-15 5.5 moveto 
1 -1 scale
(55) t 
GR
GR
GS
[0.75 0 0 0.75 50.75 23.25] CT
0.149 GC
/Helvetica 13.333 F
GS
[1 0 0 1 0 0] CT
-15 5.5 moveto 
1 -1 scale
(60) t 
GR
GR
GS
[0 -0.75 0.75 0 36.5 151.87487] CT
0.149 GC
/Helvetica 14.667 F
GS
[1 0 0 1 0 0] CT
-12.5 -4 moveto 
1 -1 scale
(y\(k\)) t 
GR
GR
GS
[0.75 0 0 0.75 217.50021 21.1875] CT
N
-168.219 -4 M
-170.578 -4 L
-171.516 -6.438 L
-175.813 -6.438 L
-176.703 -4 L
-179 -4 L
-174.813 -14.734 L
-172.531 -14.734 L
-168.219 -4 L
cp
-172.219 -8.25 M
-173.703 -12.234 L
-175.141 -8.25 L
-172.219 -8.25 L
cp
-167.4 -11.781 M
-165.478 -11.781 L
-165.478 -10.641 L
-165.103 -11.219 -164.47 -11.586 QT
-163.838 -11.953 -163.056 -11.953 QT
-161.697 -11.953 -160.752 -10.891 QT
-159.806 -9.828 -159.806 -7.938 QT
-159.806 -5.984 -160.759 -4.906 QT
-161.713 -3.828 -163.072 -3.828 QT
-163.713 -3.828 -164.236 -4.086 QT
-164.759 -4.344 -165.338 -4.953 QT
-165.338 -1.047 L
-167.4 -1.047 L
-167.4 -11.781 L
cp
-165.369 -8.016 M
-165.369 -6.703 -164.845 -6.078 QT
-164.322 -5.453 -163.572 -5.453 QT
-162.853 -5.453 -162.377 -6.031 QT
-161.9 -6.609 -161.9 -7.922 QT
-161.9 -9.141 -162.392 -9.734 QT
-162.884 -10.328 -163.603 -10.328 QT
-164.369 -10.328 -164.869 -9.742 QT
-165.369 -9.156 -165.369 -8.016 QT
cp
-156.416 -4 M
-158.479 -4 L
-158.479 -11.781 L
-156.557 -11.781 L
-156.557 -10.672 L
-156.072 -11.453 -155.682 -11.703 QT
-155.291 -11.953 -154.791 -11.953 QT
-154.088 -11.953 -153.432 -11.563 QT
-154.072 -9.766 L
-154.588 -10.109 -155.041 -10.109 QT
-155.479 -10.109 -155.776 -9.867 QT
-156.072 -9.625 -156.244 -9.008 QT
-156.416 -8.391 -156.416 -6.406 QT
-156.416 -4 L
cp
-153.166 -8 M
-153.166 -9.031 -152.658 -9.984 QT
-152.15 -10.938 -151.22 -11.445 QT
-150.291 -11.953 -149.15 -11.953 QT
-147.384 -11.953 -146.259 -10.805 QT
-145.134 -9.656 -145.134 -7.906 QT
-145.134 -6.141 -146.275 -4.984 QT
-147.416 -3.828 -149.134 -3.828 QT
-150.213 -3.828 -151.181 -4.313 QT
-152.15 -4.797 -152.658 -5.727 QT
-153.166 -6.656 -153.166 -8 QT
cp
-151.056 -7.891 M
-151.056 -6.734 -150.502 -6.117 QT
-149.947 -5.5 -149.15 -5.5 QT
-148.338 -5.5 -147.791 -6.117 QT
-147.244 -6.734 -147.244 -7.906 QT
-147.244 -9.047 -147.791 -9.664 QT
-148.338 -10.281 -149.15 -10.281 QT
-149.947 -10.281 -150.502 -9.664 QT
-151.056 -9.047 -151.056 -7.891 QT
cp
-144.713 -4 M
-141.916 -8 L
-144.604 -11.781 L
-142.088 -11.781 L
-140.713 -9.641 L
-139.26 -11.781 L
-136.838 -11.781 L
-139.479 -8.094 L
-136.604 -4 L
-139.135 -4 L
-140.713 -6.406 L
-142.307 -4 L
-144.713 -4 L
cp
-135.578 -12.828 M
-135.578 -14.734 L
-133.515 -14.734 L
-133.515 -12.828 L
-135.578 -12.828 L
cp
-135.578 -4 M
-135.578 -11.781 L
-133.515 -11.781 L
-133.515 -4 L
-135.578 -4 L
cp
-129.974 -9.406 M
-131.834 -9.75 L
-131.521 -10.875 -130.756 -11.414 QT
-129.99 -11.953 -128.474 -11.953 QT
-127.084 -11.953 -126.412 -11.625 QT
-125.74 -11.297 -125.467 -10.797 QT
-125.193 -10.297 -125.193 -8.953 QT
-125.209 -6.563 L
-125.209 -5.531 -125.115 -5.047 QT
-125.021 -4.563 -124.74 -4 QT
-126.787 -4 L
-126.865 -4.203 -126.974 -4.609 QT
-127.037 -4.797 -127.053 -4.844 QT
-127.584 -4.344 -128.185 -4.086 QT
-128.787 -3.828 -129.459 -3.828 QT
-130.662 -3.828 -131.357 -4.477 QT
-132.053 -5.125 -132.053 -6.125 QT
-132.053 -6.781 -131.732 -7.297 QT
-131.412 -7.813 -130.849 -8.086 QT
-130.287 -8.359 -129.209 -8.578 QT
-127.771 -8.844 -127.209 -9.078 QT
-127.209 -9.281 L
-127.209 -9.875 -127.506 -10.125 QT
-127.803 -10.375 -128.615 -10.375 QT
-129.162 -10.375 -129.467 -10.164 QT
-129.771 -9.953 -129.974 -9.406 QT
cp
-127.209 -7.734 M
-127.615 -7.609 -128.467 -7.422 QT
-129.318 -7.234 -129.584 -7.063 QT
-129.99 -6.781 -129.99 -6.344 QT
-129.99 -5.906 -129.67 -5.594 QT
-129.349 -5.281 -128.849 -5.281 QT
-128.287 -5.281 -127.787 -5.641 QT
-127.412 -5.922 -127.303 -6.328 QT
-127.209 -6.578 -127.209 -7.328 QT
-127.209 -7.734 L
cp
-123.511 -11.781 M
-121.62 -11.781 L
-121.62 -10.719 L
-120.589 -11.953 -119.183 -11.953 QT
-118.448 -11.953 -117.894 -11.648 QT
-117.339 -11.344 -116.995 -10.719 QT
-116.48 -11.344 -115.886 -11.648 QT
-115.292 -11.953 -114.62 -11.953 QT
-113.761 -11.953 -113.167 -11.609 QT
-112.573 -11.266 -112.276 -10.578 QT
-112.073 -10.094 -112.073 -8.969 QT
-112.073 -4 L
-114.12 -4 L
-114.12 -8.453 L
-114.12 -9.609 -114.339 -9.938 QT
-114.62 -10.375 -115.214 -10.375 QT
-115.651 -10.375 -116.034 -10.117 QT
-116.417 -9.859 -116.581 -9.344 QT
-116.745 -8.828 -116.745 -7.734 QT
-116.745 -4 L
-118.808 -4 L
-118.808 -8.266 L
-118.808 -9.391 -118.917 -9.727 QT
-119.026 -10.063 -119.261 -10.219 QT
-119.495 -10.375 -119.886 -10.375 QT
-120.355 -10.375 -120.737 -10.117 QT
-121.12 -9.859 -121.284 -9.383 QT
-121.448 -8.906 -121.448 -7.781 QT
-121.448 -4 L
-123.511 -4 L
-123.511 -11.781 L
cp
-103.542 -9.484 M
-105.573 -9.109 L
-105.667 -9.719 -106.034 -10.023 QT
-106.401 -10.328 -106.979 -10.328 QT
-107.745 -10.328 -108.206 -9.805 QT
-108.667 -9.281 -108.667 -8.031 QT
-108.667 -6.641 -108.198 -6.07 QT
-107.729 -5.5 -106.948 -5.5 QT
-106.354 -5.5 -105.987 -5.836 QT
-105.62 -6.172 -105.463 -6.984 QT
-103.432 -6.641 L
-103.76 -5.25 -104.651 -4.539 QT
-105.542 -3.828 -107.042 -3.828 QT
-108.745 -3.828 -109.76 -4.906 QT
-110.776 -5.984 -110.776 -7.875 QT
-110.776 -9.813 -109.76 -10.883 QT
-108.745 -11.953 -107.01 -11.953 QT
-105.588 -11.953 -104.745 -11.344 QT
-103.901 -10.734 -103.542 -9.484 QT
cp
-97.672 -6.469 M
-95.625 -6.125 L
-96.015 -5 -96.867 -4.414 QT
-97.719 -3.828 -99 -3.828 QT
-101.031 -3.828 -102 -5.156 QT
-102.781 -6.219 -102.781 -7.828 QT
-102.781 -9.766 -101.765 -10.859 QT
-100.75 -11.953 -99.203 -11.953 QT
-97.469 -11.953 -96.469 -10.805 QT
-95.469 -9.656 -95.515 -7.297 QT
-100.672 -7.297 L
-100.64 -6.375 -100.164 -5.867 QT
-99.687 -5.359 -98.984 -5.359 QT
-98.5 -5.359 -98.172 -5.625 QT
-97.844 -5.891 -97.672 -6.469 QT
cp
-97.547 -8.563 M
-97.578 -9.453 -98.015 -9.914 QT
-98.453 -10.375 -99.078 -10.375 QT
-99.75 -10.375 -100.203 -9.891 QT
-100.64 -9.391 -100.625 -8.563 QT
-97.547 -8.563 L
cp
-90.105 -11.781 M
-88.214 -11.781 L
-88.214 -10.719 L
-87.183 -11.953 -85.777 -11.953 QT
-85.042 -11.953 -84.488 -11.648 QT
-83.933 -11.344 -83.589 -10.719 QT
-83.074 -11.344 -82.48 -11.648 QT
-81.886 -11.953 -81.214 -11.953 QT
-80.355 -11.953 -79.761 -11.609 QT
-79.167 -11.266 -78.87 -10.578 QT
-78.667 -10.094 -78.667 -8.969 QT
-78.667 -4 L
-80.714 -4 L
-80.714 -8.453 L
-80.714 -9.609 -80.933 -9.938 QT
-81.214 -10.375 -81.808 -10.375 QT
-82.245 -10.375 -82.628 -10.117 QT
-83.011 -9.859 -83.175 -9.344 QT
-83.339 -8.828 -83.339 -7.734 QT
-83.339 -4 L
-85.402 -4 L
-85.402 -8.266 L
-85.402 -9.391 -85.511 -9.727 QT
-85.62 -10.063 -85.855 -10.219 QT
-86.089 -10.375 -86.48 -10.375 QT
-86.949 -10.375 -87.331 -10.117 QT
-87.714 -9.859 -87.878 -9.383 QT
-88.042 -8.906 -88.042 -7.781 QT
-88.042 -4 L
-90.105 -4 L
-90.105 -11.781 L
cp
-72.417 -6.469 M
-70.37 -6.125 L
-70.761 -5 -71.612 -4.414 QT
-72.464 -3.828 -73.745 -3.828 QT
-75.776 -3.828 -76.745 -5.156 QT
-77.526 -6.219 -77.526 -7.828 QT
-77.526 -9.766 -76.511 -10.859 QT
-75.495 -11.953 -73.948 -11.953 QT
-72.214 -11.953 -71.214 -10.805 QT
-70.214 -9.656 -70.261 -7.297 QT
-75.417 -7.297 L
-75.386 -6.375 -74.909 -5.867 QT
-74.432 -5.359 -73.729 -5.359 QT
-73.245 -5.359 -72.917 -5.625 QT
-72.589 -5.891 -72.417 -6.469 QT
cp
-72.292 -8.563 M
-72.323 -9.453 -72.761 -9.914 QT
-73.198 -10.375 -73.823 -10.375 QT
-74.495 -10.375 -74.948 -9.891 QT
-75.386 -9.391 -75.37 -8.563 QT
-72.292 -8.563 L
cp
-65.203 -11.781 M
-65.203 -10.141 L
-66.609 -10.141 L
-66.609 -7 L
-66.609 -6.047 -66.57 -5.891 QT
-66.531 -5.734 -66.383 -5.633 QT
-66.234 -5.531 -66.031 -5.531 QT
-65.75 -5.531 -65.203 -5.734 QT
-65.031 -4.125 L
-65.75 -3.828 -66.656 -3.828 QT
-67.219 -3.828 -67.664 -4.016 QT
-68.109 -4.203 -68.32 -4.5 QT
-68.531 -4.797 -68.609 -5.297 QT
-68.672 -5.656 -68.672 -6.75 QT
-68.672 -10.141 L
-69.609 -10.141 L
-69.609 -11.781 L
-68.672 -11.781 L
-68.672 -13.328 L
-66.609 -14.531 L
-66.609 -11.781 L
-65.203 -11.781 L
cp
-64.369 -8 M
-64.369 -9.031 -63.862 -9.984 QT
-63.354 -10.938 -62.424 -11.445 QT
-61.494 -11.953 -60.354 -11.953 QT
-58.588 -11.953 -57.463 -10.805 QT
-56.338 -9.656 -56.338 -7.906 QT
-56.338 -6.141 -57.479 -4.984 QT
-58.619 -3.828 -60.338 -3.828 QT
-61.416 -3.828 -62.385 -4.313 QT
-63.354 -4.797 -63.862 -5.727 QT
-64.369 -6.656 -64.369 -8 QT
cp
-62.26 -7.891 M
-62.26 -6.734 -61.705 -6.117 QT
-61.151 -5.5 -60.354 -5.5 QT
-59.541 -5.5 -58.994 -6.117 QT
-58.448 -6.734 -58.448 -7.906 QT
-58.448 -9.047 -58.994 -9.664 QT
-59.541 -10.281 -60.354 -10.281 QT
-61.151 -10.281 -61.705 -9.664 QT
-62.26 -9.047 -62.26 -7.891 QT
cp
-47.807 -4 M
-49.714 -4 L
-49.714 -5.141 L
-50.182 -4.469 -50.831 -4.148 QT
-51.479 -3.828 -52.136 -3.828 QT
-53.479 -3.828 -54.44 -4.906 QT
-55.401 -5.984 -55.401 -7.922 QT
-55.401 -9.891 -54.472 -10.922 QT
-53.542 -11.953 -52.12 -11.953 QT
-50.807 -11.953 -49.854 -10.875 QT
-49.854 -14.734 L
-47.807 -14.734 L
-47.807 -4 L
cp
-53.292 -8.063 M
-53.292 -6.813 -52.948 -6.25 QT
-52.448 -5.453 -51.557 -5.453 QT
-50.854 -5.453 -50.354 -6.055 QT
-49.854 -6.656 -49.854 -7.859 QT
-49.854 -9.203 -50.339 -9.789 QT
-50.823 -10.375 -51.573 -10.375 QT
-52.307 -10.375 -52.8 -9.797 QT
-53.292 -9.219 -53.292 -8.063 QT
cp
-46.464 -8 M
-46.464 -9.031 -45.956 -9.984 QT
-45.449 -10.938 -44.519 -11.445 QT
-43.589 -11.953 -42.449 -11.953 QT
-40.683 -11.953 -39.558 -10.805 QT
-38.433 -9.656 -38.433 -7.906 QT
-38.433 -6.141 -39.574 -4.984 QT
-40.714 -3.828 -42.433 -3.828 QT
-43.511 -3.828 -44.48 -4.313 QT
-45.449 -4.797 -45.956 -5.727 QT
-46.464 -6.656 -46.464 -8 QT
cp
-44.355 -7.891 M
-44.355 -6.734 -43.8 -6.117 QT
-43.245 -5.5 -42.449 -5.5 QT
-41.636 -5.5 -41.089 -6.117 QT
-40.542 -6.734 -40.542 -7.906 QT
-40.542 -9.047 -41.089 -9.664 QT
-41.636 -10.281 -42.449 -10.281 QT
-43.245 -10.281 -43.8 -9.664 QT
-44.355 -9.047 -44.355 -7.891 QT
cp
-31.902 -4 M
-31.902 -5.172 L
-32.34 -4.547 -33.027 -4.188 QT
-33.715 -3.828 -34.48 -3.828 QT
-35.277 -3.828 -35.894 -4.172 QT
-36.512 -4.516 -36.793 -5.141 QT
-37.074 -5.766 -37.074 -6.859 QT
-37.074 -11.781 L
-35.012 -11.781 L
-35.012 -8.203 L
-35.012 -6.563 -34.902 -6.195 QT
-34.793 -5.828 -34.488 -5.609 QT
-34.183 -5.391 -33.73 -5.391 QT
-33.199 -5.391 -32.777 -5.68 QT
-32.355 -5.969 -32.207 -6.398 QT
-32.058 -6.828 -32.058 -8.5 QT
-32.058 -11.781 L
-29.996 -11.781 L
-29.996 -4 L
-31.902 -4 L
cp
-14.299 -4 M
-16.659 -4 L
-17.596 -6.438 L
-21.893 -6.438 L
-22.784 -4 L
-25.081 -4 L
-20.893 -14.734 L
-18.612 -14.734 L
-14.299 -4 L
cp
-18.299 -8.25 M
-19.784 -12.234 L
-21.221 -8.25 L
-18.299 -8.25 L
cp
-10.065 -6.219 M
-8.003 -6.531 L
-7.878 -5.938 -7.471 -5.625 QT
-7.065 -5.313 -6.346 -5.313 QT
-5.549 -5.313 -5.143 -5.609 QT
-4.878 -5.813 -4.878 -6.156 QT
-4.878 -6.391 -5.018 -6.547 QT
-5.174 -6.688 -5.706 -6.813 QT
-8.19 -7.359 -8.862 -7.813 QT
-9.784 -8.453 -9.784 -9.563 QT
-9.784 -10.578 -8.987 -11.266 QT
-8.19 -11.953 -6.518 -11.953 QT
-4.909 -11.953 -4.135 -11.438 QT
-3.362 -10.922 -3.065 -9.891 QT
-5.018 -9.531 L
-5.143 -9.984 -5.487 -10.227 QT
-5.831 -10.469 -6.471 -10.469 QT
-7.284 -10.469 -7.643 -10.25 QT
-7.878 -10.094 -7.878 -9.828 QT
-7.878 -9.609 -7.674 -9.453 QT
-7.393 -9.25 -5.745 -8.875 QT
-4.096 -8.5 -3.456 -7.969 QT
-2.799 -7.406 -2.799 -6.438 QT
-2.799 -5.359 -3.698 -4.594 QT
-4.596 -3.828 -6.346 -3.828 QT
-7.94 -3.828 -8.862 -4.469 QT
-9.784 -5.109 -10.065 -6.219 QT
cp
9.955 -4 M
7.892 -4 L
7.892 -7.969 L
7.892 -9.234 7.76 -9.602 QT
7.627 -9.969 7.33 -10.172 QT
7.033 -10.375 6.611 -10.375 QT
6.08 -10.375 5.658 -10.086 QT
5.236 -9.797 5.08 -9.313 QT
4.924 -8.828 4.924 -7.516 QT
4.924 -4 L
2.861 -4 L
2.861 -11.781 L
4.767 -11.781 L
4.767 -10.641 L
5.783 -11.953 7.33 -11.953 QT
8.017 -11.953 8.58 -11.711 QT
9.142 -11.469 9.431 -11.086 QT
9.72 -10.703 9.838 -10.219 QT
9.955 -9.734 9.955 -8.828 QT
9.955 -4 L
cp
16.329 -6.469 M
18.376 -6.125 L
17.986 -5 17.134 -4.414 QT
16.282 -3.828 15.001 -3.828 QT
12.97 -3.828 12.001 -5.156 QT
11.22 -6.219 11.22 -7.828 QT
11.22 -9.766 12.236 -10.859 QT
13.251 -11.953 14.798 -11.953 QT
16.532 -11.953 17.532 -10.805 QT
18.532 -9.656 18.486 -7.297 QT
13.329 -7.297 L
13.361 -6.375 13.837 -5.867 QT
14.314 -5.359 15.017 -5.359 QT
15.501 -5.359 15.829 -5.625 QT
16.157 -5.891 16.329 -6.469 QT
cp
16.454 -8.563 M
16.423 -9.453 15.986 -9.914 QT
15.548 -10.375 14.923 -10.375 QT
14.251 -10.375 13.798 -9.891 QT
13.361 -9.391 13.376 -8.563 QT
16.454 -8.563 L
cp
19.934 -12.828 M
19.934 -14.734 L
21.996 -14.734 L
21.996 -12.828 L
19.934 -12.828 L
cp
21.996 -11.781 M
21.996 -4.234 L
21.996 -2.75 21.801 -2.141 QT
21.605 -1.531 21.051 -1.188 QT
20.496 -0.844 19.637 -0.844 QT
19.34 -0.844 18.98 -0.898 QT
18.621 -0.953 18.215 -1.063 QT
18.574 -2.828 L
18.715 -2.797 18.848 -2.773 QT
18.98 -2.75 19.09 -2.75 QT
19.402 -2.75 19.605 -2.891 QT
19.809 -3.031 19.871 -3.219 QT
19.934 -3.406 19.934 -4.359 QT
19.934 -11.781 L
21.996 -11.781 L
cp
23.896 -11.781 M
25.787 -11.781 L
25.787 -10.719 L
26.818 -11.953 28.224 -11.953 QT
28.959 -11.953 29.513 -11.648 QT
30.068 -11.344 30.412 -10.719 QT
30.927 -11.344 31.521 -11.648 QT
32.115 -11.953 32.787 -11.953 QT
33.646 -11.953 34.24 -11.609 QT
34.834 -11.266 35.131 -10.578 QT
35.334 -10.094 35.334 -8.969 QT
35.334 -4 L
33.287 -4 L
33.287 -8.453 L
33.287 -9.609 33.068 -9.938 QT
32.787 -10.375 32.193 -10.375 QT
31.756 -10.375 31.373 -10.117 QT
30.99 -9.859 30.826 -9.344 QT
30.662 -8.828 30.662 -7.734 QT
30.662 -4 L
28.599 -4 L
28.599 -8.266 L
28.599 -9.391 28.49 -9.727 QT
28.381 -10.063 28.146 -10.219 QT
27.912 -10.375 27.521 -10.375 QT
27.052 -10.375 26.67 -10.117 QT
26.287 -9.859 26.123 -9.383 QT
25.959 -8.906 25.959 -7.781 QT
25.959 -4 L
23.896 -4 L
23.896 -11.781 L
cp
41.584 -6.469 M
43.631 -6.125 L
43.24 -5 42.389 -4.414 QT
41.537 -3.828 40.256 -3.828 QT
38.225 -3.828 37.256 -5.156 QT
36.475 -6.219 36.475 -7.828 QT
36.475 -9.766 37.49 -10.859 QT
38.506 -11.953 40.053 -11.953 QT
41.787 -11.953 42.787 -10.805 QT
43.787 -9.656 43.74 -7.297 QT
38.584 -7.297 L
38.615 -6.375 39.092 -5.867 QT
39.569 -5.359 40.272 -5.359 QT
40.756 -5.359 41.084 -5.625 QT
41.412 -5.891 41.584 -6.469 QT
cp
41.709 -8.563 M
41.678 -9.453 41.24 -9.914 QT
40.803 -10.375 40.178 -10.375 QT
39.506 -10.375 39.053 -9.891 QT
38.615 -9.391 38.631 -8.563 QT
41.709 -8.563 L
cp
52.313 -4 M
50.251 -4 L
50.251 -7.969 L
50.251 -9.234 50.118 -9.602 QT
49.985 -9.969 49.688 -10.172 QT
49.392 -10.375 48.97 -10.375 QT
48.438 -10.375 48.017 -10.086 QT
47.595 -9.797 47.438 -9.313 QT
47.282 -8.828 47.282 -7.516 QT
47.282 -4 L
45.22 -4 L
45.22 -11.781 L
47.126 -11.781 L
47.126 -10.641 L
48.142 -11.953 49.688 -11.953 QT
50.376 -11.953 50.938 -11.711 QT
51.501 -11.469 51.79 -11.086 QT
52.079 -10.703 52.196 -10.219 QT
52.313 -9.734 52.313 -8.828 QT
52.313 -4 L
cp
53.469 -6.219 M
55.532 -6.531 L
55.657 -5.938 56.063 -5.625 QT
56.469 -5.313 57.188 -5.313 QT
57.985 -5.313 58.391 -5.609 QT
58.657 -5.813 58.657 -6.156 QT
58.657 -6.391 58.516 -6.547 QT
58.36 -6.688 57.829 -6.813 QT
55.344 -7.359 54.672 -7.813 QT
53.75 -8.453 53.75 -9.563 QT
53.75 -10.578 54.547 -11.266 QT
55.344 -11.953 57.016 -11.953 QT
58.625 -11.953 59.399 -11.438 QT
60.172 -10.922 60.469 -9.891 QT
58.516 -9.531 L
58.391 -9.984 58.047 -10.227 QT
57.704 -10.469 57.063 -10.469 QT
56.25 -10.469 55.891 -10.25 QT
55.657 -10.094 55.657 -9.828 QT
55.657 -9.609 55.86 -9.453 QT
56.141 -9.25 57.789 -8.875 QT
59.438 -8.5 60.079 -7.969 QT
60.735 -7.406 60.735 -6.438 QT
60.735 -5.359 59.836 -4.594 QT
58.938 -3.828 57.188 -3.828 QT
55.594 -3.828 54.672 -4.469 QT
53.75 -5.109 53.469 -6.219 QT
cp
55.157 -15.156 M
56.829 -15.156 L
57.61 -14.063 L
58.469 -15.156 L
60.125 -15.156 L
58.61 -13 L
56.704 -13 L
55.157 -15.156 L
cp
62.339 -4 M
62.339 -11.781 L
64.402 -11.781 L
64.402 -4 L
62.339 -4 L
cp
61.964 -13 M
62.964 -15.188 L
65.277 -15.188 L
63.261 -13 L
61.964 -13 L
cp
77.264 -9.484 M
75.233 -9.109 L
75.139 -9.719 74.772 -10.023 QT
74.405 -10.328 73.827 -10.328 QT
73.061 -10.328 72.6 -9.805 QT
72.139 -9.281 72.139 -8.031 QT
72.139 -6.641 72.608 -6.07 QT
73.077 -5.5 73.858 -5.5 QT
74.452 -5.5 74.819 -5.836 QT
75.186 -6.172 75.342 -6.984 QT
77.374 -6.641 L
77.045 -5.25 76.155 -4.539 QT
75.264 -3.828 73.764 -3.828 QT
72.061 -3.828 71.045 -4.906 QT
70.03 -5.984 70.03 -7.875 QT
70.03 -9.813 71.045 -10.883 QT
72.061 -11.953 73.795 -11.953 QT
75.217 -11.953 76.061 -11.344 QT
76.905 -10.734 77.264 -9.484 QT
cp
80.681 -14.734 M
80.681 -10.797 L
81.681 -11.953 83.072 -11.953 QT
83.775 -11.953 84.345 -11.688 QT
84.915 -11.422 85.204 -11.016 QT
85.493 -10.609 85.603 -10.109 QT
85.712 -9.609 85.712 -8.563 QT
85.712 -4 L
83.65 -4 L
83.65 -8.109 L
83.65 -9.328 83.533 -9.656 QT
83.415 -9.984 83.118 -10.18 QT
82.822 -10.375 82.368 -10.375 QT
81.868 -10.375 81.462 -10.125 QT
81.056 -9.875 80.868 -9.375 QT
80.681 -8.875 80.681 -7.891 QT
80.681 -4 L
78.618 -4 L
78.618 -14.734 L
80.681 -14.734 L
cp
86.618 -11.781 M
88.805 -11.781 L
90.665 -6.25 L
92.477 -11.781 L
94.602 -11.781 L
91.868 -4.297 L
91.368 -2.938 L
91.102 -2.25 90.86 -1.891 QT
90.618 -1.531 90.298 -1.313 QT
89.977 -1.094 89.509 -0.969 QT
89.04 -0.844 88.462 -0.844 QT
87.868 -0.844 87.29 -0.969 QT
87.102 -2.578 L
87.587 -2.484 87.977 -2.484 QT
88.696 -2.484 89.04 -2.906 QT
89.384 -3.328 89.571 -3.984 QT
86.618 -11.781 L
cp
95.644 -4 M
95.644 -14.734 L
97.707 -14.734 L
97.707 -10.875 L
98.66 -11.953 99.957 -11.953 QT
101.378 -11.953 102.308 -10.922 QT
103.238 -9.891 103.238 -7.969 QT
103.238 -5.984 102.292 -4.906 QT
101.347 -3.828 99.988 -3.828 QT
99.332 -3.828 98.683 -4.156 QT
98.035 -4.484 97.566 -5.141 QT
97.566 -4 L
95.644 -4 L
cp
97.691 -8.063 M
97.691 -6.844 98.066 -6.266 QT
98.613 -5.453 99.488 -5.453 QT
100.175 -5.453 100.652 -6.031 QT
101.128 -6.609 101.128 -7.875 QT
101.128 -9.203 100.652 -9.789 QT
100.175 -10.375 99.41 -10.375 QT
98.675 -10.375 98.183 -9.805 QT
97.691 -9.234 97.691 -8.063 QT
cp
104.206 -8 M
104.206 -9.031 104.714 -9.984 QT
105.222 -10.938 106.151 -11.445 QT
107.081 -11.953 108.222 -11.953 QT
109.987 -11.953 111.112 -10.805 QT
112.237 -9.656 112.237 -7.906 QT
112.237 -6.141 111.097 -4.984 QT
109.956 -3.828 108.237 -3.828 QT
107.159 -3.828 106.19 -4.313 QT
105.222 -4.797 104.714 -5.727 QT
104.206 -6.656 104.206 -8 QT
cp
106.315 -7.891 M
106.315 -6.734 106.87 -6.117 QT
107.425 -5.5 108.222 -5.5 QT
109.034 -5.5 109.581 -6.117 QT
110.128 -6.734 110.128 -7.906 QT
110.128 -9.047 109.581 -9.664 QT
109.034 -10.281 108.222 -10.281 QT
107.425 -10.281 106.87 -9.664 QT
106.315 -9.047 106.315 -7.891 QT
cp
118.768 -4 M
118.768 -5.172 L
118.331 -4.547 117.643 -4.188 QT
116.956 -3.828 116.19 -3.828 QT
115.393 -3.828 114.776 -4.172 QT
114.159 -4.516 113.877 -5.141 QT
113.596 -5.766 113.596 -6.859 QT
113.596 -11.781 L
115.659 -11.781 L
115.659 -8.203 L
115.659 -6.563 115.768 -6.195 QT
115.877 -5.828 116.182 -5.609 QT
116.487 -5.391 116.94 -5.391 QT
117.471 -5.391 117.893 -5.68 QT
118.315 -5.969 118.463 -6.398 QT
118.612 -6.828 118.612 -8.5 QT
118.612 -11.781 L
120.674 -11.781 L
120.674 -4 L
118.768 -4 L
cp
130.074 -0.844 M
128.668 -0.844 L
127.543 -2.531 126.957 -4.359 QT
126.371 -6.188 126.371 -7.891 QT
126.371 -10 127.105 -11.891 QT
127.73 -13.531 128.699 -14.922 QT
130.105 -14.922 L
129.105 -12.703 128.722 -11.148 QT
128.34 -9.594 128.34 -7.844 QT
128.34 -6.641 128.566 -5.383 QT
128.793 -4.125 129.183 -2.984 QT
129.433 -2.234 130.074 -0.844 QT
cp
133.517 -4 M
131.455 -4 L
131.455 -11.781 L
133.376 -11.781 L
133.376 -10.672 L
133.861 -11.453 134.251 -11.703 QT
134.642 -11.953 135.142 -11.953 QT
135.845 -11.953 136.501 -11.563 QT
135.861 -9.766 L
135.345 -10.109 134.892 -10.109 QT
134.455 -10.109 134.158 -9.867 QT
133.861 -9.625 133.689 -9.008 QT
133.517 -8.391 133.517 -6.406 QT
133.517 -4 L
cp
131.517 -15.156 M
133.189 -15.156 L
133.97 -14.063 L
134.83 -15.156 L
136.486 -15.156 L
134.97 -13 L
133.064 -13 L
131.517 -15.156 L
cp
138.783 -9.406 M
136.924 -9.75 L
137.236 -10.875 138.002 -11.414 QT
138.768 -11.953 140.283 -11.953 QT
141.674 -11.953 142.346 -11.625 QT
143.018 -11.297 143.291 -10.797 QT
143.564 -10.297 143.564 -8.953 QT
143.549 -6.563 L
143.549 -5.531 143.643 -5.047 QT
143.736 -4.563 144.018 -4 QT
141.971 -4 L
141.893 -4.203 141.783 -4.609 QT
141.721 -4.797 141.705 -4.844 QT
141.174 -4.344 140.572 -4.086 QT
139.971 -3.828 139.299 -3.828 QT
138.096 -3.828 137.4 -4.477 QT
136.705 -5.125 136.705 -6.125 QT
136.705 -6.781 137.025 -7.297 QT
137.346 -7.813 137.908 -8.086 QT
138.471 -8.359 139.549 -8.578 QT
140.986 -8.844 141.549 -9.078 QT
141.549 -9.281 L
141.549 -9.875 141.252 -10.125 QT
140.955 -10.375 140.143 -10.375 QT
139.596 -10.375 139.291 -10.164 QT
138.986 -9.953 138.783 -9.406 QT
cp
141.549 -7.734 M
141.143 -7.609 140.291 -7.422 QT
139.439 -7.234 139.174 -7.063 QT
138.768 -6.781 138.768 -6.344 QT
138.768 -5.906 139.088 -5.594 QT
139.408 -5.281 139.908 -5.281 QT
140.471 -5.281 140.971 -5.641 QT
141.346 -5.922 141.455 -6.328 QT
141.549 -6.578 141.549 -7.328 QT
141.549 -7.734 L
cp
138.877 -13 M
139.877 -15.188 L
142.189 -15.188 L
140.174 -13 L
138.877 -13 L
cp
152.528 -4 M
150.622 -4 L
150.622 -5.141 L
150.153 -4.469 149.505 -4.148 QT
148.856 -3.828 148.2 -3.828 QT
146.856 -3.828 145.895 -4.906 QT
144.934 -5.984 144.934 -7.922 QT
144.934 -9.891 145.864 -10.922 QT
146.794 -11.953 148.216 -11.953 QT
149.528 -11.953 150.481 -10.875 QT
150.481 -14.734 L
152.528 -14.734 L
152.528 -4 L
cp
147.044 -8.063 M
147.044 -6.813 147.387 -6.25 QT
147.887 -5.453 148.778 -5.453 QT
149.481 -5.453 149.981 -6.055 QT
150.481 -6.656 150.481 -7.859 QT
150.481 -9.203 149.997 -9.789 QT
149.512 -10.375 148.762 -10.375 QT
148.028 -10.375 147.536 -9.797 QT
147.044 -9.219 147.044 -8.063 QT
cp
157.99 -12.672 M
157.99 -14.594 L
165.021 -14.594 L
165.021 -13.094 L
164.146 -12.234 163.248 -10.633 QT
162.35 -9.031 161.881 -7.227 QT
161.412 -5.422 161.412 -4 QT
159.428 -4 L
159.475 -6.234 160.35 -8.547 QT
161.225 -10.859 162.662 -12.672 QT
157.99 -12.672 L
cp
166.001 -0.844 M
166.61 -2.141 166.86 -2.836 QT
167.11 -3.531 167.321 -4.445 QT
167.532 -5.359 167.633 -6.172 QT
167.735 -6.984 167.735 -7.844 QT
167.735 -9.594 167.368 -11.148 QT
167.001 -12.703 165.985 -14.922 QT
167.391 -14.922 L
168.501 -13.344 169.11 -11.578 QT
169.719 -9.813 169.719 -8 QT
169.719 -6.469 169.235 -4.719 QT
168.688 -2.75 167.423 -0.844 QT
166.001 -0.844 L
cp
f
GR
GS
[0.75 0 0 0.75 0 0] CT
0 0.447 0.741 RC
1 LJ
0.667 LW
N
80.233 266.874 M
87.467 202.753 L
94.7 154.893 L
101.933 120.131 L
109.167 95.753 L
116.4 79.453 L
123.633 69.294 L
130.867 63.671 L
138.1 61.274 L
145.333 61.053 L
152.567 62.192 L
159.8 64.072 L
167.033 66.248 L
174.267 68.421 L
181.5 70.414 L
188.733 72.153 L
195.967 73.639 L
203.2 74.938 L
210.433 76.159 L
217.667 77.437 L
224.9 78.927 L
232.133 80.783 L
239.367 83.154 L
246.6 86.174 L
253.833 89.953 L
261.067 94.575 L
268.3 100.089 L
275.533 106.512 L
282.767 113.826 L
290 121.976 L
297.233 130.875 L
304.467 140.407 L
311.7 150.431 L
318.933 160.787 L
326.167 171.302 L
333.4 181.804 L
340.633 192.124 L
347.867 202.114 L
355.1 211.656 L
362.333 220.676 L
369.567 229.16 L
376.8 237.168 L
384.033 244.852 L
391.267 252.475 L
398.5 260.429 L
405.733 269.254 L
412.967 279.661 L
420.2 292.556 L
427.433 309.057 L
434.667 330.524 L
441.9 358.58 L
S
GR
GS
[0.75 0 0 0.75 0 0] CT
0.851 0.325 0.098 RC
1 LJ
0.667 LW
N
80.233 255.886 M
87.467 206.081 L
94.7 155.981 L
101.933 105.684 L
109.167 100.682 L
116.4 74.007 L
123.633 74.812 L
130.867 64.645 L
138.1 63.59 L
145.333 67.761 L
152.567 77.302 L
159.8 57.747 L
167.033 65.755 L
174.267 72.524 L
181.5 67.071 L
188.733 65.978 L
195.967 71.771 L
203.2 84.761 L
210.433 86.701 L
217.667 74.976 L
224.9 83.694 L
232.133 91.81 L
239.367 66.756 L
246.6 85.809 L
253.833 90.957 L
261.067 98.327 L
268.3 111.036 L
275.533 107.549 L
282.767 110.715 L
290 122.305 L
297.233 123.606 L
304.467 144.415 L
311.7 147.934 L
318.933 168.664 L
326.167 170.5 L
333.4 175.35 L
340.633 196.399 L
347.867 180.631 L
355.1 214.538 L
362.333 212.35 L
369.567 219.236 L
376.8 234.111 L
384.033 233.679 L
391.267 251.39 L
398.5 250.732 L
405.733 274.342 L
412.967 284.549 L
420.2 286.373 L
427.433 319.35 L
434.667 320.415 L
441.9 365.115 L
S
GR
GS
[0.75 0 0 0.75 0 0] CT
1 GC
N
374 81 M
374 44 L
494 44 L
494 81 L
cp
f
GR
GS
[0.75 0 0 0.75 308.25 40.60274] CT
/Helvetica 12 F
GS
[1 0 0 1 0 0] CT
0 5 moveto 
1 -1 scale
(Odhad veliciny) t 
GR
GR
GS
[0.75 0 0 0.75 0 0] CT
0 0.447 0.741 RC
1 LJ
0.667 LW
N
378 54.137 M
408 54.137 L
S
GR
GS
[0.75 0 0 0.75 308.25 53.14726] CT
/Helvetica 12 F
GS
[1 0 0 1 0 0] CT
0 5 moveto 
1 -1 scale
(Validace) t 
GR
GR
GS
[0.75 0 0 0.75 0 0] CT
0.851 0.325 0.098 RC
1 LJ
0.667 LW
N
378 70.863 M
408 70.863 L
S
GR
GS
[0.75 0 0 0.75 0 0] CT
0.149 GC
10.0 ML
0.667 LW
N
374 81 M
374 44 L
494 44 L
494 81 L
cp
S
GR
%%Trailer
%%Pages: 1
%%EOF
