%!PS-Adobe-3.0 EPSF-3.0
%%Creator: (MATLAB, The Mathworks, Inc. Version 9.0.0.341360 \(R2016a\). Operating System: Windows 8)
%%Title: C:/Users/Jan/Documents/JC.ISF/isf2/rmnc4.eps
%%CreationDate: 2017-04-11T11:38:34
%%Pages: (atend)
%%BoundingBox: 0 0 420 315
%%LanguageLevel: 3
%%EndComments
%%BeginProlog
%%BeginResource: procset (Apache XML Graphics Std ProcSet) 1.2 0
%%Version: 1.2 0
%%Copyright: (Copyright 2001-2003,2010 The Apache Software Foundation. License terms: http://www.apache.org/licenses/LICENSE-2.0)
/bd{bind def}bind def
/ld{load def}bd
/GR/grestore ld
/M/moveto ld
/LJ/setlinejoin ld
/C/curveto ld
/f/fill ld
/LW/setlinewidth ld
/GC/setgray ld
/t/show ld
/N/newpath ld
/CT/concat ld
/cp/closepath ld
/S/stroke ld
/L/lineto ld
/CC/setcmykcolor ld
/A/ashow ld
/GS/gsave ld
/RC/setrgbcolor ld
/RM/rmoveto ld
/ML/setmiterlimit ld
/re {4 2 roll M
1 index 0 rlineto
0 exch rlineto
neg 0 rlineto
cp } bd
/_ctm matrix def
/_tm matrix def
/BT { _ctm currentmatrix pop matrix _tm copy pop 0 0 moveto } bd
/ET { _ctm setmatrix } bd
/iTm { _ctm setmatrix _tm concat } bd
/Tm { _tm astore pop iTm 0 0 moveto } bd
/ux 0.0 def
/uy 0.0 def
/F {
  /Tp exch def
  /Tf exch def
  Tf findfont Tp scalefont setfont
  /cf Tf def  /cs Tp def
} bd
/ULS {currentpoint /uy exch def /ux exch def} bd
/ULE {
  /Tcx currentpoint pop def
  gsave
  newpath
  cf findfont cs scalefont dup
  /FontMatrix get 0 get /Ts exch def /FontInfo get dup
  /UnderlinePosition get Ts mul /To exch def
  /UnderlineThickness get Ts mul /Tt exch def
  ux uy To add moveto  Tcx uy To add lineto
  Tt setlinewidth stroke
  grestore
} bd
/OLE {
  /Tcx currentpoint pop def
  gsave
  newpath
  cf findfont cs scalefont dup
  /FontMatrix get 0 get /Ts exch def /FontInfo get dup
  /UnderlinePosition get Ts mul /To exch def
  /UnderlineThickness get Ts mul /Tt exch def
  ux uy To add cs add moveto Tcx uy To add cs add lineto
  Tt setlinewidth stroke
  grestore
} bd
/SOE {
  /Tcx currentpoint pop def
  gsave
  newpath
  cf findfont cs scalefont dup
  /FontMatrix get 0 get /Ts exch def /FontInfo get dup
  /UnderlinePosition get Ts mul /To exch def
  /UnderlineThickness get Ts mul /Tt exch def
  ux uy To add cs 10 mul 26 idiv add moveto Tcx uy To add cs 10 mul 26 idiv add lineto
  Tt setlinewidth stroke
  grestore
} bd
/QT {
/Y22 exch store
/X22 exch store
/Y21 exch store
/X21 exch store
currentpoint
/Y21 load 2 mul add 3 div exch
/X21 load 2 mul add 3 div exch
/X21 load 2 mul /X22 load add 3 div
/Y21 load 2 mul /Y22 load add 3 div
/X22 load /Y22 load curveto
} bd
/SSPD {
dup length /d exch dict def
{
/v exch def
/k exch def
currentpagedevice k known {
/cpdv currentpagedevice k get def
v cpdv ne {
/upd false def
/nullv v type /nulltype eq def
/nullcpdv cpdv type /nulltype eq def
nullv nullcpdv or
{
/upd true def
} {
/sametype v type cpdv type eq def
sametype {
v type /arraytype eq {
/vlen v length def
/cpdvlen cpdv length def
vlen cpdvlen eq {
0 1 vlen 1 sub {
/i exch def
/obj v i get def
/cpdobj cpdv i get def
obj cpdobj ne {
/upd true def
exit
} if
} for
} {
/upd true def
} ifelse
} {
v type /dicttype eq {
v {
/dv exch def
/dk exch def
/cpddv cpdv dk get def
dv cpddv ne {
/upd true def
exit
} if
} forall
} {
/upd true def
} ifelse
} ifelse
} if
} ifelse
upd true eq {
d k v put
} if
} if
} if
} forall
d length 0 gt {
d setpagedevice
} if
} bd
%%EndResource
%%BeginResource: procset (Apache XML Graphics EPS ProcSet) 1.0 0
%%Version: 1.0 0
%%Copyright: (Copyright 2002-2003 The Apache Software Foundation. License terms: http://www.apache.org/licenses/LICENSE-2.0)
/BeginEPSF { %def
/b4_Inc_state save def         % Save state for cleanup
/dict_count countdictstack def % Count objects on dict stack
/op_count count 1 sub def      % Count objects on operand stack
userdict begin                 % Push userdict on dict stack
/showpage { } def              % Redefine showpage, { } = null proc
0 setgray 0 setlinecap         % Prepare graphics state
1 setlinewidth 0 setlinejoin
10 setmiterlimit [ ] 0 setdash newpath
/languagelevel where           % If level not equal to 1 then
{pop languagelevel             % set strokeadjust and
1 ne                           % overprint to their defaults.
{false setstrokeadjust false setoverprint
} if
} if
} bd
/EndEPSF { %def
count op_count sub {pop} repeat            % Clean up stacks
countdictstack dict_count sub {end} repeat
b4_Inc_state restore
} bd
%%EndResource
%FOPBeginFontDict
%%IncludeResource: font Courier-Bold
%%IncludeResource: font Helvetica
%%IncludeResource: font Courier-BoldOblique
%%IncludeResource: font Courier-Oblique
%%IncludeResource: font Times-Roman
%%IncludeResource: font Helvetica-BoldOblique
%%IncludeResource: font Helvetica-Bold
%%IncludeResource: font Helvetica-Oblique
%%IncludeResource: font Times-BoldItalic
%%IncludeResource: font Courier
%%IncludeResource: font Times-Italic
%%IncludeResource: font Times-Bold
%%IncludeResource: font Symbol
%%IncludeResource: font ZapfDingbats
%FOPEndFontDict
%%BeginResource: encoding WinAnsiEncoding
/WinAnsiEncoding [
/.notdef /.notdef /.notdef /.notdef /.notdef
/.notdef /.notdef /.notdef /.notdef /.notdef
/.notdef /.notdef /.notdef /.notdef /.notdef
/.notdef /.notdef /.notdef /.notdef /.notdef
/.notdef /.notdef /.notdef /.notdef /.notdef
/.notdef /.notdef /.notdef /.notdef /.notdef
/.notdef /.notdef /space /exclam /quotedbl
/numbersign /dollar /percent /ampersand /quotesingle
/parenleft /parenright /asterisk /plus /comma
/hyphen /period /slash /zero /one
/two /three /four /five /six
/seven /eight /nine /colon /semicolon
/less /equal /greater /question /at
/A /B /C /D /E
/F /G /H /I /J
/K /L /M /N /O
/P /Q /R /S /T
/U /V /W /X /Y
/Z /bracketleft /backslash /bracketright /asciicircum
/underscore /quoteleft /a /b /c
/d /e /f /g /h
/i /j /k /l /m
/n /o /p /q /r
/s /t /u /v /w
/x /y /z /braceleft /bar
/braceright /asciitilde /bullet /Euro /bullet
/quotesinglbase /florin /quotedblbase /ellipsis /dagger
/daggerdbl /circumflex /perthousand /Scaron /guilsinglleft
/OE /bullet /Zcaron /bullet /bullet
/quoteleft /quoteright /quotedblleft /quotedblright /bullet
/endash /emdash /asciitilde /trademark /scaron
/guilsinglright /oe /bullet /zcaron /Ydieresis
/space /exclamdown /cent /sterling /currency
/yen /brokenbar /section /dieresis /copyright
/ordfeminine /guillemotleft /logicalnot /sfthyphen /registered
/macron /degree /plusminus /twosuperior /threesuperior
/acute /mu /paragraph /middot /cedilla
/onesuperior /ordmasculine /guillemotright /onequarter /onehalf
/threequarters /questiondown /Agrave /Aacute /Acircumflex
/Atilde /Adieresis /Aring /AE /Ccedilla
/Egrave /Eacute /Ecircumflex /Edieresis /Igrave
/Iacute /Icircumflex /Idieresis /Eth /Ntilde
/Ograve /Oacute /Ocircumflex /Otilde /Odieresis
/multiply /Oslash /Ugrave /Uacute /Ucircumflex
/Udieresis /Yacute /Thorn /germandbls /agrave
/aacute /acircumflex /atilde /adieresis /aring
/ae /ccedilla /egrave /eacute /ecircumflex
/edieresis /igrave /iacute /icircumflex /idieresis
/eth /ntilde /ograve /oacute /ocircumflex
/otilde /odieresis /divide /oslash /ugrave
/uacute /ucircumflex /udieresis /yacute /thorn
/ydieresis
] def
%%EndResource
%FOPBeginFontReencode
/Courier-Bold findfont
dup length dict begin
  {1 index /FID ne {def} {pop pop} ifelse} forall
  /Encoding WinAnsiEncoding def
  currentdict
end
/Courier-Bold exch definefont pop
/Helvetica findfont
dup length dict begin
  {1 index /FID ne {def} {pop pop} ifelse} forall
  /Encoding WinAnsiEncoding def
  currentdict
end
/Helvetica exch definefont pop
/Courier-BoldOblique findfont
dup length dict begin
  {1 index /FID ne {def} {pop pop} ifelse} forall
  /Encoding WinAnsiEncoding def
  currentdict
end
/Courier-BoldOblique exch definefont pop
/Courier-Oblique findfont
dup length dict begin
  {1 index /FID ne {def} {pop pop} ifelse} forall
  /Encoding WinAnsiEncoding def
  currentdict
end
/Courier-Oblique exch definefont pop
/Times-Roman findfont
dup length dict begin
  {1 index /FID ne {def} {pop pop} ifelse} forall
  /Encoding WinAnsiEncoding def
  currentdict
end
/Times-Roman exch definefont pop
/Helvetica-BoldOblique findfont
dup length dict begin
  {1 index /FID ne {def} {pop pop} ifelse} forall
  /Encoding WinAnsiEncoding def
  currentdict
end
/Helvetica-BoldOblique exch definefont pop
/Helvetica-Bold findfont
dup length dict begin
  {1 index /FID ne {def} {pop pop} ifelse} forall
  /Encoding WinAnsiEncoding def
  currentdict
end
/Helvetica-Bold exch definefont pop
/Helvetica-Oblique findfont
dup length dict begin
  {1 index /FID ne {def} {pop pop} ifelse} forall
  /Encoding WinAnsiEncoding def
  currentdict
end
/Helvetica-Oblique exch definefont pop
/Times-BoldItalic findfont
dup length dict begin
  {1 index /FID ne {def} {pop pop} ifelse} forall
  /Encoding WinAnsiEncoding def
  currentdict
end
/Times-BoldItalic exch definefont pop
/Courier findfont
dup length dict begin
  {1 index /FID ne {def} {pop pop} ifelse} forall
  /Encoding WinAnsiEncoding def
  currentdict
end
/Courier exch definefont pop
/Times-Italic findfont
dup length dict begin
  {1 index /FID ne {def} {pop pop} ifelse} forall
  /Encoding WinAnsiEncoding def
  currentdict
end
/Times-Italic exch definefont pop
/Times-Bold findfont
dup length dict begin
  {1 index /FID ne {def} {pop pop} ifelse} forall
  /Encoding WinAnsiEncoding def
  currentdict
end
/Times-Bold exch definefont pop
%FOPEndFontReencode
%%EndProlog
%%Page: 1 1
%%PageBoundingBox: 0 0 420 315
%%BeginPageSetup
[1 0 0 -1 0 315] CT
%%EndPageSetup
GS
[0.75 0 0 0.75 0 0] CT
1 GC
N
0 0 560 420 re
f
GR
GS
[0.75 0 0 0.75 0 0] CT
1 GC
N
0 0 560 420 re
f
GR
GS
[0.75 0 0 0.75 0 0] CT
1 GC
N
73 374 M
507 374 L
507 31 L
73 31 L
cp
f
GR
GS
[0.75 0 0 0.75 0 0] CT
0.873 GC
1 LJ
0.667 LW
N
81.215 374 M
81.215 31 L
S
GR
GS
[0.75 0 0 0.75 0 0] CT
0.873 GC
1 LJ
0.667 LW
N
125.616 374 M
125.616 31 L
S
GR
GS
[0.75 0 0 0.75 0 0] CT
0.873 GC
1 LJ
0.667 LW
N
170.017 374 M
170.017 31 L
S
GR
GS
[0.75 0 0 0.75 0 0] CT
0.873 GC
1 LJ
0.667 LW
N
214.418 374 M
214.418 31 L
S
GR
GS
[0.75 0 0 0.75 0 0] CT
0.873 GC
1 LJ
0.667 LW
N
258.819 374 M
258.819 31 L
S
GR
GS
[0.75 0 0 0.75 0 0] CT
0.873 GC
1 LJ
0.667 LW
N
303.22 374 M
303.22 31 L
S
GR
GS
[0.75 0 0 0.75 0 0] CT
0.873 GC
1 LJ
0.667 LW
N
347.621 374 M
347.621 31 L
S
GR
GS
[0.75 0 0 0.75 0 0] CT
0.873 GC
1 LJ
0.667 LW
N
392.021 374 M
392.021 31 L
S
GR
GS
[0.75 0 0 0.75 0 0] CT
0.873 GC
1 LJ
0.667 LW
N
436.422 374 M
436.422 31 L
S
GR
GS
[0.75 0 0 0.75 0 0] CT
0.873 GC
1 LJ
0.667 LW
N
480.823 374 M
480.823 31 L
S
GR
GS
[0.75 0 0 0.75 0 0] CT
0.873 GC
1 LJ
0.667 LW
N
507 367.265 M
73 367.265 L
S
GR
GS
[0.75 0 0 0.75 0 0] CT
0.873 GC
1 LJ
0.667 LW
N
507 334.858 M
73 334.858 L
S
GR
GS
[0.75 0 0 0.75 0 0] CT
0.873 GC
1 LJ
0.667 LW
N
507 302.45 M
73 302.45 L
S
GR
GS
[0.75 0 0 0.75 0 0] CT
0.873 GC
1 LJ
0.667 LW
N
507 270.043 M
73 270.043 L
S
GR
GS
[0.75 0 0 0.75 0 0] CT
0.873 GC
1 LJ
0.667 LW
N
507 237.636 M
73 237.636 L
S
GR
GS
[0.75 0 0 0.75 0 0] CT
0.873 GC
1 LJ
0.667 LW
N
507 205.228 M
73 205.228 L
S
GR
GS
[0.75 0 0 0.75 0 0] CT
0.873 GC
1 LJ
0.667 LW
N
507 172.821 M
73 172.821 L
S
GR
GS
[0.75 0 0 0.75 0 0] CT
0.873 GC
1 LJ
0.667 LW
N
507 140.414 M
73 140.414 L
S
GR
GS
[0.75 0 0 0.75 0 0] CT
0.873 GC
1 LJ
0.667 LW
N
507 108.006 M
73 108.006 L
S
GR
GS
[0.75 0 0 0.75 0 0] CT
0.873 GC
1 LJ
0.667 LW
N
507 75.599 M
73 75.599 L
S
GR
GS
[0.75 0 0 0.75 0 0] CT
0.873 GC
1 LJ
0.667 LW
N
507 43.192 M
73 43.192 L
S
GR
GS
[0.75 0 0 0.75 0 0] CT
0.149 GC
2 setlinecap
1 LJ
0.667 LW
N
73 374 M
507 374 L
S
GR
GS
[0.75 0 0 0.75 0 0] CT
0.149 GC
2 setlinecap
1 LJ
0.667 LW
N
81.215 374 M
81.215 369.66 L
S
GR
GS
[0.75 0 0 0.75 0 0] CT
0.149 GC
2 setlinecap
1 LJ
0.667 LW
N
125.616 374 M
125.616 369.66 L
S
GR
GS
[0.75 0 0 0.75 0 0] CT
0.149 GC
2 setlinecap
1 LJ
0.667 LW
N
170.017 374 M
170.017 369.66 L
S
GR
GS
[0.75 0 0 0.75 0 0] CT
0.149 GC
2 setlinecap
1 LJ
0.667 LW
N
214.418 374 M
214.418 369.66 L
S
GR
GS
[0.75 0 0 0.75 0 0] CT
0.149 GC
2 setlinecap
1 LJ
0.667 LW
N
258.819 374 M
258.819 369.66 L
S
GR
GS
[0.75 0 0 0.75 0 0] CT
0.149 GC
2 setlinecap
1 LJ
0.667 LW
N
303.22 374 M
303.22 369.66 L
S
GR
GS
[0.75 0 0 0.75 0 0] CT
0.149 GC
2 setlinecap
1 LJ
0.667 LW
N
347.621 374 M
347.621 369.66 L
S
GR
GS
[0.75 0 0 0.75 0 0] CT
0.149 GC
2 setlinecap
1 LJ
0.667 LW
N
392.021 374 M
392.021 369.66 L
S
GR
GS
[0.75 0 0 0.75 0 0] CT
0.149 GC
2 setlinecap
1 LJ
0.667 LW
N
436.422 374 M
436.422 369.66 L
S
GR
GS
[0.75 0 0 0.75 0 0] CT
0.149 GC
2 setlinecap
1 LJ
0.667 LW
N
480.823 374 M
480.823 369.66 L
S
GR
GS
[0.75 0 0 0.75 60.91136 284.50001] CT
0.149 GC
/Helvetica 13.333 F
GS
[1 0 0 1 0 0] CT
-4 14 moveto 
1 -1 scale
(0) t 
GR
GR
GS
[0.75 0 0 0.75 94.21204 284.50001] CT
0.149 GC
/Helvetica 13.333 F
GS
[1 0 0 1 0 0] CT
-7.5 14 moveto 
1 -1 scale
(50) t 
GR
GR
GS
[0.75 0 0 0.75 127.51271 284.50001] CT
0.149 GC
/Helvetica 13.333 F
GS
[1 0 0 1 0 0] CT
-11 14 moveto 
1 -1 scale
(100) t 
GR
GR
GS
[0.75 0 0 0.75 160.8134 284.50001] CT
0.149 GC
/Helvetica 13.333 F
GS
[1 0 0 1 0 0] CT
-11 14 moveto 
1 -1 scale
(150) t 
GR
GR
GS
[0.75 0 0 0.75 194.11407 284.50001] CT
0.149 GC
/Helvetica 13.333 F
GS
[1 0 0 1 0 0] CT
-11 14 moveto 
1 -1 scale
(200) t 
GR
GR
GS
[0.75 0 0 0.75 227.41475 284.50001] CT
0.149 GC
/Helvetica 13.333 F
GS
[1 0 0 1 0 0] CT
-11 14 moveto 
1 -1 scale
(250) t 
GR
GR
GS
[0.75 0 0 0.75 260.71543 284.50001] CT
0.149 GC
/Helvetica 13.333 F
GS
[1 0 0 1 0 0] CT
-11 14 moveto 
1 -1 scale
(300) t 
GR
GR
GS
[0.75 0 0 0.75 294.01611 284.50001] CT
0.149 GC
/Helvetica 13.333 F
GS
[1 0 0 1 0 0] CT
-11 14 moveto 
1 -1 scale
(350) t 
GR
GR
GS
[0.75 0 0 0.75 327.31677 284.50001] CT
0.149 GC
/Helvetica 13.333 F
GS
[1 0 0 1 0 0] CT
-11 14 moveto 
1 -1 scale
(400) t 
GR
GR
GS
[0.75 0 0 0.75 360.61745 284.50001] CT
0.149 GC
/Helvetica 13.333 F
GS
[1 0 0 1 0 0] CT
-11 14 moveto 
1 -1 scale
(450) t 
GR
GR
GS
[0.75 0 0 0.75 0 0] CT
0.149 GC
2 setlinecap
1 LJ
0.667 LW
N
73 374 M
73 31 L
S
GR
GS
[0.75 0 0 0.75 0 0] CT
0.149 GC
2 setlinecap
1 LJ
0.667 LW
N
73 367.265 M
77.34 367.265 L
S
GR
GS
[0.75 0 0 0.75 0 0] CT
0.149 GC
2 setlinecap
1 LJ
0.667 LW
N
73 334.858 M
77.34 334.858 L
S
GR
GS
[0.75 0 0 0.75 0 0] CT
0.149 GC
2 setlinecap
1 LJ
0.667 LW
N
73 302.45 M
77.34 302.45 L
S
GR
GS
[0.75 0 0 0.75 0 0] CT
0.149 GC
2 setlinecap
1 LJ
0.667 LW
N
73 270.043 M
77.34 270.043 L
S
GR
GS
[0.75 0 0 0.75 0 0] CT
0.149 GC
2 setlinecap
1 LJ
0.667 LW
N
73 237.636 M
77.34 237.636 L
S
GR
GS
[0.75 0 0 0.75 0 0] CT
0.149 GC
2 setlinecap
1 LJ
0.667 LW
N
73 205.228 M
77.34 205.228 L
S
GR
GS
[0.75 0 0 0.75 0 0] CT
0.149 GC
2 setlinecap
1 LJ
0.667 LW
N
73 172.821 M
77.34 172.821 L
S
GR
GS
[0.75 0 0 0.75 0 0] CT
0.149 GC
2 setlinecap
1 LJ
0.667 LW
N
73 140.414 M
77.34 140.414 L
S
GR
GS
[0.75 0 0 0.75 0 0] CT
0.149 GC
2 setlinecap
1 LJ
0.667 LW
N
73 108.006 M
77.34 108.006 L
S
GR
GS
[0.75 0 0 0.75 0 0] CT
0.149 GC
2 setlinecap
1 LJ
0.667 LW
N
73 75.599 M
77.34 75.599 L
S
GR
GS
[0.75 0 0 0.75 0 0] CT
0.149 GC
2 setlinecap
1 LJ
0.667 LW
N
73 43.192 M
77.34 43.192 L
S
GR
GS
[0.75 0 0 0.75 50.75 275.44878] CT
0.149 GC
/Helvetica 13.333 F
GS
[1 0 0 1 0 0] CT
-8 5.5 moveto 
1 -1 scale
(0) t 
GR
GR
GS
[0.75 0 0 0.75 50.75 251.1433] CT
0.149 GC
/Helvetica 13.333 F
GS
[1 0 0 1 0 0] CT
-26 5.5 moveto 
1 -1 scale
(0.01) t 
GR
GR
GS
[0.75 0 0 0.75 50.75 226.83781] CT
0.149 GC
/Helvetica 13.333 F
GS
[1 0 0 1 0 0] CT
-26 5.5 moveto 
1 -1 scale
(0.02) t 
GR
GR
GS
[0.75 0 0 0.75 50.75 202.5323] CT
0.149 GC
/Helvetica 13.333 F
GS
[1 0 0 1 0 0] CT
-26 5.5 moveto 
1 -1 scale
(0.03) t 
GR
GR
GS
[0.75 0 0 0.75 50.75 178.22681] CT
0.149 GC
/Helvetica 13.333 F
GS
[1 0 0 1 0 0] CT
-26 5.5 moveto 
1 -1 scale
(0.04) t 
GR
GR
GS
[0.75 0 0 0.75 50.75 153.92131] CT
0.149 GC
/Helvetica 13.333 F
GS
[1 0 0 1 0 0] CT
-26 5.5 moveto 
1 -1 scale
(0.05) t 
GR
GR
GS
[0.75 0 0 0.75 50.75 129.61582] CT
0.149 GC
/Helvetica 13.333 F
GS
[1 0 0 1 0 0] CT
-26 5.5 moveto 
1 -1 scale
(0.06) t 
GR
GR
GS
[0.75 0 0 0.75 50.75 105.31031] CT
0.149 GC
/Helvetica 13.333 F
GS
[1 0 0 1 0 0] CT
-26 5.5 moveto 
1 -1 scale
(0.07) t 
GR
GR
GS
[0.75 0 0 0.75 50.75 81.00482] CT
0.149 GC
/Helvetica 13.333 F
GS
[1 0 0 1 0 0] CT
-26 5.5 moveto 
1 -1 scale
(0.08) t 
GR
GR
GS
[0.75 0 0 0.75 50.75 56.69931] CT
0.149 GC
/Helvetica 13.333 F
GS
[1 0 0 1 0 0] CT
-26 5.5 moveto 
1 -1 scale
(0.09) t 
GR
GR
GS
[0.75 0 0 0.75 50.75 32.39382] CT
0.149 GC
/Helvetica 13.333 F
GS
[1 0 0 1 0 0] CT
-19 5.5 moveto 
1 -1 scale
(0.1) t 
GR
GR
GS
[0.75 0 0 0.75 217.50021 21.18749] CT
N
-133.453 -4 M
-135.516 -4 L
-135.516 -11.781 L
-133.594 -11.781 L
-133.594 -10.672 L
-133.109 -11.453 -132.719 -11.703 QT
-132.328 -11.953 -131.828 -11.953 QT
-131.125 -11.953 -130.469 -11.563 QT
-131.109 -9.766 L
-131.625 -10.109 -132.078 -10.109 QT
-132.516 -10.109 -132.813 -9.867 QT
-133.109 -9.625 -133.281 -9.008 QT
-133.453 -8.391 -133.453 -6.406 QT
-133.453 -4 L
cp
-125.218 -6.469 M
-123.171 -6.125 L
-123.562 -5 -124.414 -4.414 QT
-125.265 -3.828 -126.546 -3.828 QT
-128.578 -3.828 -129.546 -5.156 QT
-130.328 -6.219 -130.328 -7.828 QT
-130.328 -9.766 -129.312 -10.859 QT
-128.296 -11.953 -126.749 -11.953 QT
-125.015 -11.953 -124.015 -10.805 QT
-123.015 -9.656 -123.062 -7.297 QT
-128.218 -7.297 L
-128.187 -6.375 -127.71 -5.867 QT
-127.234 -5.359 -126.531 -5.359 QT
-126.046 -5.359 -125.718 -5.625 QT
-125.39 -5.891 -125.218 -6.469 QT
cp
-125.093 -8.563 M
-125.124 -9.453 -125.562 -9.914 QT
-125.999 -10.375 -126.624 -10.375 QT
-127.296 -10.375 -127.749 -9.891 QT
-128.187 -9.391 -128.171 -8.563 QT
-125.093 -8.563 L
cp
-121.645 -4 M
-121.645 -14.734 L
-119.583 -14.734 L
-119.583 -9.047 L
-117.177 -11.781 L
-114.645 -11.781 L
-117.302 -8.938 L
-114.442 -4 L
-116.661 -4 L
-118.63 -7.5 L
-119.583 -6.484 L
-119.583 -4 L
-121.645 -4 L
cp
-108.291 -4 M
-108.291 -5.172 L
-108.729 -4.547 -109.416 -4.188 QT
-110.104 -3.828 -110.869 -3.828 QT
-111.666 -3.828 -112.283 -4.172 QT
-112.9 -4.516 -113.182 -5.141 QT
-113.463 -5.766 -113.463 -6.859 QT
-113.463 -11.781 L
-111.4 -11.781 L
-111.4 -8.203 L
-111.4 -6.563 -111.291 -6.195 QT
-111.182 -5.828 -110.877 -5.609 QT
-110.572 -5.391 -110.119 -5.391 QT
-109.588 -5.391 -109.166 -5.68 QT
-108.744 -5.969 -108.596 -6.398 QT
-108.447 -6.828 -108.447 -8.5 QT
-108.447 -11.781 L
-106.385 -11.781 L
-106.385 -4 L
-108.291 -4 L
cp
-102.495 -4 M
-104.557 -4 L
-104.557 -11.781 L
-102.635 -11.781 L
-102.635 -10.672 L
-102.151 -11.453 -101.76 -11.703 QT
-101.37 -11.953 -100.87 -11.953 QT
-100.167 -11.953 -99.51 -11.563 QT
-100.151 -9.766 L
-100.667 -10.109 -101.12 -10.109 QT
-101.557 -10.109 -101.854 -9.867 QT
-102.151 -9.625 -102.323 -9.008 QT
-102.495 -8.391 -102.495 -6.406 QT
-102.495 -4 L
cp
-99.588 -4 M
-99.588 -5.609 L
-96.666 -8.953 L
-95.963 -9.766 -95.619 -10.109 QT
-95.963 -10.094 -96.557 -10.094 QT
-99.307 -10.078 L
-99.307 -11.781 L
-92.869 -11.781 L
-92.869 -10.328 L
-95.854 -6.891 L
-96.9 -5.766 L
-96.041 -5.813 -95.838 -5.813 QT
-92.65 -5.813 L
-92.65 -4 L
-99.588 -4 L
cp
-91.432 -12.828 M
-91.432 -14.734 L
-89.369 -14.734 L
-89.369 -12.828 L
-91.432 -12.828 L
cp
-91.432 -4 M
-91.432 -11.781 L
-89.369 -11.781 L
-89.369 -4 L
-91.432 -4 L
cp
-85.219 -4 M
-88.36 -11.781 L
-86.203 -11.781 L
-84.735 -7.813 L
-84.313 -6.484 L
-84.141 -6.984 -84.094 -7.156 QT
-83.985 -7.484 -83.875 -7.813 QT
-82.391 -11.781 L
-80.282 -11.781 L
-83.375 -4 L
-85.219 -4 L
cp
-72.13 -4 M
-74.193 -4 L
-74.193 -7.969 L
-74.193 -9.234 -74.326 -9.602 QT
-74.459 -9.969 -74.755 -10.172 QT
-75.052 -10.375 -75.474 -10.375 QT
-76.005 -10.375 -76.427 -10.086 QT
-76.849 -9.797 -77.005 -9.313 QT
-77.162 -8.828 -77.162 -7.516 QT
-77.162 -4 L
-79.224 -4 L
-79.224 -11.781 L
-77.318 -11.781 L
-77.318 -10.641 L
-76.302 -11.953 -74.755 -11.953 QT
-74.068 -11.953 -73.505 -11.711 QT
-72.943 -11.469 -72.654 -11.086 QT
-72.365 -10.703 -72.248 -10.219 QT
-72.13 -9.734 -72.13 -8.828 QT
-72.13 -4 L
cp
-70.256 -12.828 M
-70.256 -14.734 L
-68.193 -14.734 L
-68.193 -12.828 L
-70.256 -12.828 L
cp
-70.256 -4 M
-70.256 -11.781 L
-68.193 -11.781 L
-68.193 -4 L
-70.256 -4 L
cp
-62.268 -11.781 M
-60.378 -11.781 L
-60.378 -10.719 L
-59.346 -11.953 -57.94 -11.953 QT
-57.206 -11.953 -56.651 -11.648 QT
-56.096 -11.344 -55.753 -10.719 QT
-55.237 -11.344 -54.643 -11.648 QT
-54.049 -11.953 -53.378 -11.953 QT
-52.518 -11.953 -51.924 -11.609 QT
-51.331 -11.266 -51.034 -10.578 QT
-50.831 -10.094 -50.831 -8.969 QT
-50.831 -4 L
-52.878 -4 L
-52.878 -8.453 L
-52.878 -9.609 -53.096 -9.938 QT
-53.378 -10.375 -53.971 -10.375 QT
-54.409 -10.375 -54.792 -10.117 QT
-55.174 -9.859 -55.339 -9.344 QT
-55.503 -8.828 -55.503 -7.734 QT
-55.503 -4 L
-57.565 -4 L
-57.565 -8.266 L
-57.565 -9.391 -57.674 -9.727 QT
-57.784 -10.063 -58.018 -10.219 QT
-58.253 -10.375 -58.643 -10.375 QT
-59.112 -10.375 -59.495 -10.117 QT
-59.878 -9.859 -60.042 -9.383 QT
-60.206 -8.906 -60.206 -7.781 QT
-60.206 -4 L
-62.268 -4 L
-62.268 -11.781 L
cp
-44.58 -6.469 M
-42.533 -6.125 L
-42.924 -5 -43.776 -4.414 QT
-44.627 -3.828 -45.908 -3.828 QT
-47.94 -3.828 -48.908 -5.156 QT
-49.69 -6.219 -49.69 -7.828 QT
-49.69 -9.766 -48.674 -10.859 QT
-47.658 -11.953 -46.111 -11.953 QT
-44.377 -11.953 -43.377 -10.805 QT
-42.377 -9.656 -42.424 -7.297 QT
-47.58 -7.297 L
-47.549 -6.375 -47.072 -5.867 QT
-46.596 -5.359 -45.893 -5.359 QT
-45.408 -5.359 -45.08 -5.625 QT
-44.752 -5.891 -44.58 -6.469 QT
cp
-44.455 -8.563 M
-44.486 -9.453 -44.924 -9.914 QT
-45.361 -10.375 -45.986 -10.375 QT
-46.658 -10.375 -47.111 -9.891 QT
-47.549 -9.391 -47.533 -8.563 QT
-44.455 -8.563 L
cp
-37.367 -11.781 M
-37.367 -10.141 L
-38.773 -10.141 L
-38.773 -7 L
-38.773 -6.047 -38.734 -5.891 QT
-38.695 -5.734 -38.546 -5.633 QT
-38.398 -5.531 -38.195 -5.531 QT
-37.914 -5.531 -37.367 -5.734 QT
-37.195 -4.125 L
-37.914 -3.828 -38.82 -3.828 QT
-39.382 -3.828 -39.828 -4.016 QT
-40.273 -4.203 -40.484 -4.5 QT
-40.695 -4.797 -40.773 -5.297 QT
-40.835 -5.656 -40.835 -6.75 QT
-40.835 -10.141 L
-41.773 -10.141 L
-41.773 -11.781 L
-40.835 -11.781 L
-40.835 -13.328 L
-38.773 -14.531 L
-38.773 -11.781 L
-37.367 -11.781 L
cp
-36.533 -8 M
-36.533 -9.031 -36.025 -9.984 QT
-35.517 -10.938 -34.588 -11.445 QT
-33.658 -11.953 -32.517 -11.953 QT
-30.752 -11.953 -29.627 -10.805 QT
-28.502 -9.656 -28.502 -7.906 QT
-28.502 -6.141 -29.642 -4.984 QT
-30.783 -3.828 -32.502 -3.828 QT
-33.58 -3.828 -34.548 -4.313 QT
-35.517 -4.797 -36.025 -5.727 QT
-36.533 -6.656 -36.533 -8 QT
cp
-34.423 -7.891 M
-34.423 -6.734 -33.869 -6.117 QT
-33.314 -5.5 -32.517 -5.5 QT
-31.705 -5.5 -31.158 -6.117 QT
-30.611 -6.734 -30.611 -7.906 QT
-30.611 -9.047 -31.158 -9.664 QT
-31.705 -10.281 -32.517 -10.281 QT
-33.314 -10.281 -33.869 -9.664 QT
-34.423 -9.047 -34.423 -7.891 QT
cp
-19.971 -4 M
-21.877 -4 L
-21.877 -5.141 L
-22.346 -4.469 -22.994 -4.148 QT
-23.643 -3.828 -24.299 -3.828 QT
-25.643 -3.828 -26.604 -4.906 QT
-27.565 -5.984 -27.565 -7.922 QT
-27.565 -9.891 -26.635 -10.922 QT
-25.705 -11.953 -24.283 -11.953 QT
-22.971 -11.953 -22.018 -10.875 QT
-22.018 -14.734 L
-19.971 -14.734 L
-19.971 -4 L
cp
-25.455 -8.063 M
-25.455 -6.813 -25.111 -6.25 QT
-24.611 -5.453 -23.721 -5.453 QT
-23.018 -5.453 -22.518 -6.055 QT
-22.018 -6.656 -22.018 -7.859 QT
-22.018 -9.203 -22.502 -9.789 QT
-22.986 -10.375 -23.736 -10.375 QT
-24.471 -10.375 -24.963 -9.797 QT
-25.455 -9.219 -25.455 -8.063 QT
cp
-16.612 -9.406 M
-18.471 -9.75 L
-18.159 -10.875 -17.393 -11.414 QT
-16.628 -11.953 -15.112 -11.953 QT
-13.721 -11.953 -13.049 -11.625 QT
-12.378 -11.297 -12.104 -10.797 QT
-11.831 -10.297 -11.831 -8.953 QT
-11.846 -6.563 L
-11.846 -5.531 -11.753 -5.047 QT
-11.659 -4.563 -11.378 -4 QT
-13.424 -4 L
-13.503 -4.203 -13.612 -4.609 QT
-13.674 -4.797 -13.69 -4.844 QT
-14.221 -4.344 -14.823 -4.086 QT
-15.424 -3.828 -16.096 -3.828 QT
-17.299 -3.828 -17.995 -4.477 QT
-18.69 -5.125 -18.69 -6.125 QT
-18.69 -6.781 -18.37 -7.297 QT
-18.049 -7.813 -17.487 -8.086 QT
-16.924 -8.359 -15.846 -8.578 QT
-14.409 -8.844 -13.846 -9.078 QT
-13.846 -9.281 L
-13.846 -9.875 -14.143 -10.125 QT
-14.44 -10.375 -15.253 -10.375 QT
-15.799 -10.375 -16.104 -10.164 QT
-16.409 -9.953 -16.612 -9.406 QT
cp
-13.846 -7.734 M
-14.253 -7.609 -15.104 -7.422 QT
-15.956 -7.234 -16.221 -7.063 QT
-16.628 -6.781 -16.628 -6.344 QT
-16.628 -5.906 -16.307 -5.594 QT
-15.987 -5.281 -15.487 -5.281 QT
-14.924 -5.281 -14.424 -5.641 QT
-14.049 -5.922 -13.94 -6.328 QT
-13.846 -6.578 -13.846 -7.328 QT
-13.846 -7.734 L
cp
1.158 -4 M
-0.905 -4 L
-0.905 -7.969 L
-0.905 -9.234 -1.037 -9.602 QT
-1.17 -9.969 -1.467 -10.172 QT
-1.764 -10.375 -2.186 -10.375 QT
-2.717 -10.375 -3.139 -10.086 QT
-3.561 -9.797 -3.717 -9.313 QT
-3.873 -8.828 -3.873 -7.516 QT
-3.873 -4 L
-5.936 -4 L
-5.936 -11.781 L
-4.03 -11.781 L
-4.03 -10.641 L
-3.014 -11.953 -1.467 -11.953 QT
-0.78 -11.953 -0.217 -11.711 QT
0.345 -11.469 0.635 -11.086 QT
0.924 -10.703 1.041 -10.219 QT
1.158 -9.734 1.158 -8.828 QT
1.158 -4 L
cp
7.532 -6.469 M
9.579 -6.125 L
9.189 -5 8.337 -4.414 QT
7.486 -3.828 6.204 -3.828 QT
4.173 -3.828 3.204 -5.156 QT
2.423 -6.219 2.423 -7.828 QT
2.423 -9.766 3.439 -10.859 QT
4.454 -11.953 6.001 -11.953 QT
7.736 -11.953 8.736 -10.805 QT
9.736 -9.656 9.689 -7.297 QT
4.532 -7.297 L
4.564 -6.375 5.04 -5.867 QT
5.517 -5.359 6.22 -5.359 QT
6.704 -5.359 7.032 -5.625 QT
7.361 -5.891 7.532 -6.469 QT
cp
7.657 -8.563 M
7.626 -9.453 7.189 -9.914 QT
6.751 -10.375 6.126 -10.375 QT
5.454 -10.375 5.001 -9.891 QT
4.564 -9.391 4.579 -8.563 QT
7.657 -8.563 L
cp
11.137 -12.828 M
11.137 -14.734 L
13.199 -14.734 L
13.199 -12.828 L
11.137 -12.828 L
cp
13.199 -11.781 M
13.199 -4.234 L
13.199 -2.75 13.004 -2.141 QT
12.809 -1.531 12.254 -1.188 QT
11.699 -0.844 10.84 -0.844 QT
10.543 -0.844 10.184 -0.898 QT
9.824 -0.953 9.418 -1.063 QT
9.777 -2.828 L
9.918 -2.797 10.051 -2.773 QT
10.184 -2.75 10.293 -2.75 QT
10.605 -2.75 10.809 -2.891 QT
11.012 -3.031 11.074 -3.219 QT
11.137 -3.406 11.137 -4.359 QT
11.137 -11.781 L
13.199 -11.781 L
cp
15.099 -11.781 M
16.99 -11.781 L
16.99 -10.719 L
18.021 -11.953 19.427 -11.953 QT
20.162 -11.953 20.716 -11.648 QT
21.271 -11.344 21.615 -10.719 QT
22.131 -11.344 22.724 -11.648 QT
23.318 -11.953 23.99 -11.953 QT
24.849 -11.953 25.443 -11.609 QT
26.037 -11.266 26.334 -10.578 QT
26.537 -10.094 26.537 -8.969 QT
26.537 -4 L
24.49 -4 L
24.49 -8.453 L
24.49 -9.609 24.271 -9.938 QT
23.99 -10.375 23.396 -10.375 QT
22.959 -10.375 22.576 -10.117 QT
22.193 -9.859 22.029 -9.344 QT
21.865 -8.828 21.865 -7.734 QT
21.865 -4 L
19.802 -4 L
19.802 -8.266 L
19.802 -9.391 19.693 -9.727 QT
19.584 -10.063 19.349 -10.219 QT
19.115 -10.375 18.724 -10.375 QT
18.256 -10.375 17.873 -10.117 QT
17.49 -9.859 17.326 -9.383 QT
17.162 -8.906 17.162 -7.781 QT
17.162 -4 L
15.099 -4 L
15.099 -11.781 L
cp
32.787 -6.469 M
34.834 -6.125 L
34.444 -5 33.592 -4.414 QT
32.74 -3.828 31.459 -3.828 QT
29.428 -3.828 28.459 -5.156 QT
27.678 -6.219 27.678 -7.828 QT
27.678 -9.766 28.694 -10.859 QT
29.709 -11.953 31.256 -11.953 QT
32.99 -11.953 33.99 -10.805 QT
34.99 -9.656 34.944 -7.297 QT
29.787 -7.297 L
29.819 -6.375 30.295 -5.867 QT
30.772 -5.359 31.475 -5.359 QT
31.959 -5.359 32.287 -5.625 QT
32.615 -5.891 32.787 -6.469 QT
cp
32.912 -8.563 M
32.881 -9.453 32.444 -9.914 QT
32.006 -10.375 31.381 -10.375 QT
30.709 -10.375 30.256 -9.891 QT
29.819 -9.391 29.834 -8.563 QT
32.912 -8.563 L
cp
43.517 -4 M
41.454 -4 L
41.454 -7.969 L
41.454 -9.234 41.321 -9.602 QT
41.188 -9.969 40.892 -10.172 QT
40.595 -10.375 40.173 -10.375 QT
39.642 -10.375 39.22 -10.086 QT
38.798 -9.797 38.642 -9.313 QT
38.485 -8.828 38.485 -7.516 QT
38.485 -4 L
36.423 -4 L
36.423 -11.781 L
38.329 -11.781 L
38.329 -10.641 L
39.345 -11.953 40.892 -11.953 QT
41.579 -11.953 42.142 -11.711 QT
42.704 -11.469 42.993 -11.086 QT
43.282 -10.703 43.399 -10.219 QT
43.517 -9.734 43.517 -8.828 QT
43.517 -4 L
cp
44.672 -6.219 M
46.735 -6.531 L
46.86 -5.938 47.266 -5.625 QT
47.672 -5.313 48.391 -5.313 QT
49.188 -5.313 49.594 -5.609 QT
49.86 -5.813 49.86 -6.156 QT
49.86 -6.391 49.719 -6.547 QT
49.563 -6.688 49.032 -6.813 QT
46.547 -7.359 45.875 -7.813 QT
44.954 -8.453 44.954 -9.563 QT
44.954 -10.578 45.75 -11.266 QT
46.547 -11.953 48.219 -11.953 QT
49.829 -11.953 50.602 -11.438 QT
51.375 -10.922 51.672 -9.891 QT
49.719 -9.531 L
49.594 -9.984 49.25 -10.227 QT
48.907 -10.469 48.266 -10.469 QT
47.454 -10.469 47.094 -10.25 QT
46.86 -10.094 46.86 -9.828 QT
46.86 -9.609 47.063 -9.453 QT
47.344 -9.25 48.993 -8.875 QT
50.641 -8.5 51.282 -7.969 QT
51.938 -7.406 51.938 -6.438 QT
51.938 -5.359 51.039 -4.594 QT
50.141 -3.828 48.391 -3.828 QT
46.797 -3.828 45.875 -4.469 QT
44.954 -5.109 44.672 -6.219 QT
cp
46.36 -15.156 M
48.032 -15.156 L
48.813 -14.063 L
49.672 -15.156 L
51.329 -15.156 L
49.813 -13 L
47.907 -13 L
46.36 -15.156 L
cp
53.542 -4 M
53.542 -11.781 L
55.605 -11.781 L
55.605 -4 L
53.542 -4 L
cp
53.167 -13 M
54.167 -15.188 L
56.48 -15.188 L
54.464 -13 L
53.167 -13 L
cp
64.395 -9.484 M
62.364 -9.109 L
62.27 -9.719 61.903 -10.023 QT
61.536 -10.328 60.958 -10.328 QT
60.192 -10.328 59.731 -9.805 QT
59.27 -9.281 59.27 -8.031 QT
59.27 -6.641 59.739 -6.07 QT
60.208 -5.5 60.989 -5.5 QT
61.583 -5.5 61.95 -5.836 QT
62.317 -6.172 62.473 -6.984 QT
64.505 -6.641 L
64.177 -5.25 63.286 -4.539 QT
62.395 -3.828 60.895 -3.828 QT
59.192 -3.828 58.177 -4.906 QT
57.161 -5.984 57.161 -7.875 QT
57.161 -9.813 58.177 -10.883 QT
59.192 -11.953 60.927 -11.953 QT
62.348 -11.953 63.192 -11.344 QT
64.036 -10.734 64.395 -9.484 QT
cp
67.812 -14.734 M
67.812 -10.797 L
68.812 -11.953 70.203 -11.953 QT
70.906 -11.953 71.476 -11.688 QT
72.046 -11.422 72.336 -11.016 QT
72.625 -10.609 72.734 -10.109 QT
72.843 -9.609 72.843 -8.563 QT
72.843 -4 L
70.781 -4 L
70.781 -8.109 L
70.781 -9.328 70.664 -9.656 QT
70.546 -9.984 70.25 -10.18 QT
69.953 -10.375 69.5 -10.375 QT
69 -10.375 68.593 -10.125 QT
68.187 -9.875 68 -9.375 QT
67.812 -8.875 67.812 -7.891 QT
67.812 -4 L
65.75 -4 L
65.75 -14.734 L
67.812 -14.734 L
cp
85.571 -9.484 M
83.54 -9.109 L
83.446 -9.719 83.079 -10.023 QT
82.712 -10.328 82.134 -10.328 QT
81.368 -10.328 80.907 -9.805 QT
80.446 -9.281 80.446 -8.031 QT
80.446 -6.641 80.915 -6.07 QT
81.384 -5.5 82.165 -5.5 QT
82.759 -5.5 83.126 -5.836 QT
83.493 -6.172 83.649 -6.984 QT
85.68 -6.641 L
85.352 -5.25 84.462 -4.539 QT
83.571 -3.828 82.071 -3.828 QT
80.368 -3.828 79.352 -4.906 QT
78.337 -5.984 78.337 -7.875 QT
78.337 -9.813 79.352 -10.883 QT
80.368 -11.953 82.102 -11.953 QT
83.524 -11.953 84.368 -11.344 QT
85.212 -10.734 85.571 -9.484 QT
cp
79.759 -15.156 M
81.43 -15.156 L
82.212 -14.063 L
83.071 -15.156 L
84.727 -15.156 L
83.212 -13 L
81.305 -13 L
79.759 -15.156 L
cp
90.503 -11.781 M
90.503 -10.141 L
89.097 -10.141 L
89.097 -7 L
89.097 -6.047 89.136 -5.891 QT
89.175 -5.734 89.324 -5.633 QT
89.472 -5.531 89.675 -5.531 QT
89.957 -5.531 90.503 -5.734 QT
90.675 -4.125 L
89.957 -3.828 89.05 -3.828 QT
88.488 -3.828 88.042 -4.016 QT
87.597 -4.203 87.386 -4.5 QT
87.175 -4.797 87.097 -5.297 QT
87.035 -5.656 87.035 -6.75 QT
87.035 -10.141 L
86.097 -10.141 L
86.097 -11.781 L
87.035 -11.781 L
87.035 -13.328 L
89.097 -14.531 L
89.097 -11.781 L
90.503 -11.781 L
cp
93.962 -4 M
90.822 -11.781 L
92.978 -11.781 L
94.447 -7.813 L
94.868 -6.484 L
95.04 -6.984 95.087 -7.156 QT
95.197 -7.484 95.306 -7.813 QT
96.79 -11.781 L
98.9 -11.781 L
95.806 -4 L
93.962 -4 L
cp
104.473 -6.469 M
106.52 -6.125 L
106.129 -5 105.277 -4.414 QT
104.426 -3.828 103.145 -3.828 QT
101.113 -3.828 100.145 -5.156 QT
99.363 -6.219 99.363 -7.828 QT
99.363 -9.766 100.379 -10.859 QT
101.395 -11.953 102.941 -11.953 QT
104.676 -11.953 105.676 -10.805 QT
106.676 -9.656 106.629 -7.297 QT
101.473 -7.297 L
101.504 -6.375 101.98 -5.867 QT
102.457 -5.359 103.16 -5.359 QT
103.645 -5.359 103.973 -5.625 QT
104.301 -5.891 104.473 -6.469 QT
cp
104.598 -8.563 M
104.566 -9.453 104.129 -9.914 QT
103.691 -10.375 103.066 -10.375 QT
102.395 -10.375 101.941 -9.891 QT
101.504 -9.391 101.52 -8.563 QT
104.598 -8.563 L
cp
110.093 -4 M
108.03 -4 L
108.03 -11.781 L
109.952 -11.781 L
109.952 -10.672 L
110.436 -11.453 110.827 -11.703 QT
111.218 -11.953 111.718 -11.953 QT
112.421 -11.953 113.077 -11.563 QT
112.436 -9.766 L
111.921 -10.109 111.468 -10.109 QT
111.03 -10.109 110.733 -9.867 QT
110.436 -9.625 110.264 -9.008 QT
110.093 -8.391 110.093 -6.406 QT
110.093 -4 L
cp
120.609 -9.484 M
118.577 -9.109 L
118.484 -9.719 118.116 -10.023 QT
117.749 -10.328 117.171 -10.328 QT
116.406 -10.328 115.945 -9.805 QT
115.484 -9.281 115.484 -8.031 QT
115.484 -6.641 115.952 -6.07 QT
116.421 -5.5 117.202 -5.5 QT
117.796 -5.5 118.163 -5.836 QT
118.531 -6.172 118.687 -6.984 QT
120.718 -6.641 L
120.39 -5.25 119.499 -4.539 QT
118.609 -3.828 117.109 -3.828 QT
115.406 -3.828 114.39 -4.906 QT
113.374 -5.984 113.374 -7.875 QT
113.374 -9.813 114.39 -10.883 QT
115.406 -11.953 117.14 -11.953 QT
118.562 -11.953 119.406 -11.344 QT
120.249 -10.734 120.609 -9.484 QT
cp
127.104 -4 M
127.104 -5.172 L
126.666 -4.547 125.979 -4.188 QT
125.291 -3.828 124.525 -3.828 QT
123.729 -3.828 123.111 -4.172 QT
122.494 -4.516 122.213 -5.141 QT
121.932 -5.766 121.932 -6.859 QT
121.932 -11.781 L
123.994 -11.781 L
123.994 -8.203 L
123.994 -6.563 124.104 -6.195 QT
124.213 -5.828 124.518 -5.609 QT
124.822 -5.391 125.275 -5.391 QT
125.807 -5.391 126.229 -5.68 QT
126.65 -5.969 126.799 -6.398 QT
126.947 -6.828 126.947 -8.5 QT
126.947 -11.781 L
129.01 -11.781 L
129.01 -4 L
127.104 -4 L
cp
127.338 -14.438 M
127.338 -13.844 126.916 -13.422 QT
126.494 -13 125.9 -13 QT
125.307 -13 124.885 -13.422 QT
124.463 -13.844 124.463 -14.438 QT
124.463 -15.031 124.885 -15.453 QT
125.307 -15.875 125.9 -15.875 QT
126.494 -15.875 126.916 -15.461 QT
127.338 -15.047 127.338 -14.438 QT
cp
126.557 -14.438 M
126.557 -14.703 126.361 -14.898 QT
126.166 -15.094 125.9 -15.094 QT
125.635 -15.094 125.439 -14.898 QT
125.244 -14.703 125.244 -14.438 QT
125.244 -14.172 125.439 -13.977 QT
125.635 -13.781 125.9 -13.781 QT
126.166 -13.781 126.361 -13.977 QT
126.557 -14.172 126.557 -14.438 QT
cp
f
GR
GS
[0.75 0 0 0.75 0 0] CT
1 0 0 RC
1 LJ
0.667 LW
N
86.478 30.966 M
86.543 88.992 L
87.431 89.64 L
88.319 132.383 L
89.207 224.976 L
90.095 229.444 L
90.983 230.051 L
91.871 251.088 L
92.759 251.866 L
93.647 265.515 L
94.535 270.617 L
95.423 295.163 L
96.311 298.146 L
97.199 303.299 L
98.087 303.499 L
98.976 305.016 L
99.864 306.229 L
100.752 306.699 L
101.64 311.079 L
102.528 311.087 L
103.416 311.115 L
104.304 311.33 L
105.192 311.355 L
106.08 315.95 L
106.968 317.893 L
107.856 317.946 L
108.744 318.602 L
109.632 318.631 L
110.52 319.354 L
111.408 319.674 L
112.296 320.022 L
113.184 320.169 L
114.072 320.644 L
114.96 320.915 L
115.848 322.794 L
116.736 323.311 L
117.624 323.404 L
118.512 324.265 L
119.4 326.165 L
120.288 326.172 L
121.176 326.228 L
122.064 326.872 L
122.952 326.972 L
123.84 326.973 L
124.728 326.996 L
125.616 327.143 L
126.504 327.19 L
127.392 327.247 L
128.28 327.643 L
129.168 329.706 L
130.056 332.444 L
130.944 334.289 L
131.832 335.106 L
132.72 335.312 L
133.608 335.319 L
134.496 335.477 L
135.384 335.479 L
136.272 336.434 L
137.16 336.813 L
138.048 336.979 L
138.936 337.483 L
139.824 337.509 L
140.712 337.588 L
141.6 339.387 L
142.488 340.47 L
143.376 341.442 L
144.264 342.609 L
145.152 342.888 L
146.04 343.43 L
146.928 343.43 L
147.816 343.955 L
148.705 344.821 L
149.593 345.515 L
150.481 345.604 L
151.369 346.123 L
152.257 346.687 L
153.145 349.208 L
154.033 350.544 L
154.921 351.547 L
155.809 351.971 L
156.697 352.2 L
157.585 352.208 L
158.473 352.312 L
159.361 352.52 L
160.249 352.525 L
161.137 352.803 L
162.025 354.32 L
162.913 354.71 L
163.801 355.549 L
164.689 356.035 L
165.577 356.085 L
166.465 356.219 L
167.353 356.657 L
168.241 356.752 L
169.129 356.753 L
170.017 356.758 L
170.905 356.819 L
171.793 356.835 L
172.681 356.851 L
173.569 356.932 L
174.457 357.065 L
175.345 357.07 L
176.233 357.143 L
177.121 357.143 L
178.009 357.161 L
178.897 357.514 L
179.785 357.767 L
180.673 357.828 L
181.561 357.901 L
182.449 357.907 L
183.337 357.925 L
184.225 358.168 L
185.113 358.314 L
186.001 358.368 L
186.889 358.381 L
187.777 358.423 L
188.665 358.428 L
189.553 358.526 L
190.441 358.531 L
191.329 358.537 L
192.217 358.537 L
193.105 358.7 L
193.993 358.708 L
194.881 358.722 L
195.769 358.723 L
196.657 358.739 L
197.546 358.764 L
198.434 358.765 L
199.322 358.77 L
200.21 358.829 L
201.098 358.85 L
201.986 358.881 L
202.874 358.881 L
203.762 358.902 L
204.65 358.959 L
205.538 358.965 L
206.426 358.998 L
207.314 359.065 L
208.202 359.187 L
209.09 359.243 L
209.978 359.245 L
210.866 359.245 L
211.754 359.25 L
212.642 359.262 L
213.53 359.438 L
214.418 359.491 L
215.306 359.6 L
216.194 359.632 L
217.082 359.65 L
217.97 359.662 L
218.858 359.676 L
219.746 359.691 L
220.634 359.766 L
221.522 360.007 L
222.41 360.199 L
223.298 360.25 L
224.186 360.252 L
225.074 360.266 L
225.962 360.317 L
226.85 360.32 L
227.738 360.324 L
228.626 360.382 L
229.514 360.406 L
230.402 360.446 L
231.29 360.452 L
232.178 360.468 L
233.066 360.479 L
233.954 360.48 L
234.842 360.498 L
235.73 360.516 L
236.618 360.516 L
237.506 360.528 L
238.394 360.531 L
239.282 360.532 L
240.17 360.536 L
241.058 360.559 L
241.946 360.582 L
242.834 360.583 L
243.722 360.592 L
244.61 360.604 L
245.498 360.637 L
246.387 360.648 L
247.275 360.648 L
248.163 360.651 L
249.051 360.653 L
249.939 360.654 L
250.827 360.655 L
251.715 360.675 L
252.603 360.686 L
253.491 360.739 L
254.379 360.859 L
255.267 360.927 L
256.155 360.928 L
257.043 360.946 L
257.931 360.946 L
258.819 360.949 L
259.707 360.957 L
260.595 360.997 L
261.483 361.006 L
262.371 361.097 L
263.259 361.161 L
264.147 361.224 L
265.035 361.343 L
265.923 361.374 L
266.811 361.404 L
267.699 361.46 L
268.587 361.496 L
269.475 361.517 L
270.363 361.613 L
271.251 361.673 L
272.139 361.713 L
273.027 361.748 L
273.915 361.748 L
274.803 361.772 L
275.691 361.774 L
276.579 361.875 L
277.467 361.976 L
278.355 362.044 L
279.243 362.061 L
280.131 362.091 L
281.019 362.094 L
281.907 362.158 L
282.795 362.197 L
283.683 362.205 L
284.571 362.212 L
285.459 362.268 L
286.347 362.303 L
287.235 362.322 L
288.123 362.422 L
289.011 362.451 L
289.899 362.453 L
290.787 362.454 L
291.675 362.455 L
292.563 362.457 L
293.451 362.459 L
294.339 362.469 L
295.228 362.49 L
296.116 362.52 L
297.004 362.52 L
297.892 362.521 L
298.78 362.568 L
299.668 362.577 L
300.556 362.584 L
301.444 362.637 L
302.332 362.716 L
303.22 362.743 L
304.108 362.772 L
304.996 362.805 L
305.884 362.806 L
306.772 362.817 L
307.66 362.876 L
308.548 362.877 L
309.436 362.881 L
310.324 362.887 L
311.212 362.888 L
312.1 362.892 L
312.988 362.897 L
313.876 362.898 L
314.764 362.901 L
315.652 362.921 L
316.54 362.94 L
317.428 362.972 L
318.316 362.992 L
319.204 363.005 L
320.092 363.047 L
320.98 363.073 L
321.868 363.113 L
322.756 363.125 L
323.644 363.146 L
324.532 363.157 L
325.42 363.175 L
326.308 363.204 L
327.196 363.212 L
328.084 363.218 L
328.972 363.218 L
329.86 363.242 L
330.748 363.247 L
331.636 363.248 L
332.524 363.248 L
333.412 363.248 L
334.3 363.265 L
335.188 363.265 L
336.076 363.27 L
336.964 363.281 L
337.852 363.308 L
338.74 363.308 L
339.628 363.308 L
340.516 363.332 L
341.404 363.338 L
342.292 363.339 L
343.18 363.342 L
344.068 363.343 L
344.957 363.353 L
345.845 363.354 L
346.733 363.366 L
347.621 363.366 L
348.509 363.376 L
349.397 363.379 L
350.285 363.38 L
351.173 363.382 L
352.061 363.392 L
352.949 363.422 L
353.837 363.442 L
354.725 363.442 L
355.613 363.443 L
356.501 363.456 L
357.389 363.457 L
358.277 363.459 L
359.165 363.459 L
360.053 363.462 L
360.941 363.463 L
361.829 363.464 L
362.717 363.488 L
363.605 363.488 L
364.493 363.488 L
365.381 363.507 L
366.269 363.508 L
367.157 363.522 L
368.045 363.537 L
368.933 363.543 L
369.821 363.547 L
370.709 363.549 L
371.597 363.589 L
372.485 363.596 L
373.373 363.599 L
374.261 363.601 L
375.149 363.617 L
376.037 363.632 L
376.925 363.662 L
377.813 363.724 L
378.701 363.736 L
379.589 363.742 L
380.477 363.743 L
381.365 363.743 L
382.253 363.744 L
383.141 363.751 L
384.029 363.762 L
384.917 363.789 L
385.805 363.866 L
386.693 363.906 L
387.581 363.93 L
388.469 363.941 L
389.357 363.949 L
390.245 363.966 L
391.133 363.972 L
392.021 363.972 L
392.909 363.975 L
393.798 363.978 L
394.686 363.989 L
395.574 364.008 L
396.462 364.024 L
397.35 364.038 L
398.238 364.047 L
399.126 364.053 L
400.014 364.06 L
400.902 364.061 L
401.79 364.063 L
402.678 364.063 L
403.566 364.067 L
404.454 364.07 L
405.342 364.071 L
406.23 364.073 L
407.118 364.126 L
408.006 364.128 L
408.894 364.128 L
409.782 364.133 L
410.67 364.142 L
411.558 364.163 L
412.446 364.181 L
413.334 364.186 L
414.222 364.197 L
415.11 364.201 L
415.998 364.201 L
416.886 364.206 L
417.774 364.227 L
418.662 364.233 L
419.55 364.239 L
420.438 364.252 L
421.326 364.255 L
422.214 364.255 L
423.102 364.268 L
423.99 364.292 L
424.878 364.294 L
425.766 364.299 L
426.654 364.299 L
427.542 364.301 L
428.43 364.301 L
429.318 364.302 L
430.206 364.303 L
431.094 364.303 L
431.982 364.303 L
432.87 364.321 L
433.758 364.331 L
434.646 364.338 L
435.534 364.339 L
436.422 364.343 L
437.31 364.343 L
438.198 364.345 L
439.086 364.361 L
439.974 364.365 L
440.862 364.378 L
441.75 364.382 L
442.638 364.389 L
443.527 364.395 L
444.415 364.399 L
445.303 364.437 L
446.191 364.484 L
447.079 364.519 L
447.967 364.534 L
448.855 364.535 L
449.743 364.544 L
450.631 364.544 L
451.519 364.548 L
452.407 364.567 L
453.295 364.571 L
454.183 364.593 L
455.071 364.593 L
455.959 364.596 L
456.847 364.596 L
457.735 364.607 L
458.623 364.618 L
459.511 364.619 L
460.399 364.621 L
461.287 364.66 L
462.175 364.683 L
463.063 364.684 L
463.951 364.698 L
464.839 364.701 L
465.727 364.706 L
466.615 364.712 L
467.503 364.712 L
468.391 364.733 L
469.279 364.784 L
470.167 364.786 L
471.055 364.788 L
471.943 364.789 L
472.831 364.797 L
473.719 364.806 L
474.607 364.809 L
475.495 364.812 L
476.383 364.813 L
477.271 364.815 L
478.159 364.818 L
479.047 364.819 L
479.935 364.826 L
480.823 364.836 L
481.711 364.848 L
482.599 364.859 L
483.487 364.859 L
484.375 364.865 L
485.263 364.872 L
486.151 364.874 L
487.039 364.884 L
487.927 364.884 L
488.815 364.884 L
489.703 364.891 L
490.591 364.891 L
491.479 364.893 L
492.368 364.893 L
493.256 364.894 L
494.144 364.895 L
495.032 364.905 L
495.92 364.926 L
496.808 364.971 L
497.696 364.999 L
498.584 365 L
499.472 365 L
500.36 365.002 L
501.248 365.006 L
502.136 365.006 L
503.024 365.007 L
503.912 365.008 L
504.8 365.008 L
505.688 365.011 L
506.576 365.013 L
507.043 365.014 L
S
GR
GS
[0.75 0 0 0.75 0 0] CT
0 1 0 RC
1 LJ
0.667 LW
N
85.382 30.966 M
85.655 76.586 L
86.543 125.727 L
87.431 128.325 L
88.319 128.849 L
89.207 169.065 L
90.095 169.449 L
90.983 186.934 L
91.871 190.259 L
92.759 198.046 L
93.647 199.861 L
94.535 219.835 L
95.423 231.971 L
96.311 232.487 L
97.199 236.619 L
98.087 239.594 L
98.976 239.874 L
99.864 241.186 L
100.752 243.846 L
101.64 254.406 L
102.528 260.701 L
103.416 261.302 L
104.304 261.514 L
105.192 280.367 L
106.08 280.515 L
106.968 284.23 L
107.856 285.283 L
108.744 286.492 L
109.632 288.146 L
110.52 288.212 L
111.408 288.379 L
112.296 288.64 L
113.184 289.27 L
114.072 289.843 L
114.96 290.154 L
115.848 290.766 L
116.736 291.923 L
117.624 292.838 L
118.512 293.036 L
119.4 296.123 L
120.288 297.993 L
121.176 298.365 L
122.064 298.365 L
122.952 298.684 L
123.84 298.769 L
124.728 299.418 L
125.616 300.282 L
126.504 300.466 L
127.392 301.437 L
128.28 305.478 L
129.168 305.694 L
130.056 305.982 L
130.944 306.063 L
131.832 306.08 L
132.72 306.417 L
133.608 306.43 L
134.496 306.446 L
135.384 307.59 L
136.272 308.321 L
137.16 308.552 L
138.048 310.376 L
138.936 310.924 L
139.824 310.965 L
140.712 313.502 L
141.6 313.502 L
142.488 313.505 L
143.376 316.657 L
144.264 317.249 L
145.152 317.263 L
146.04 317.425 L
146.928 318.852 L
147.816 319.224 L
148.705 320.527 L
149.593 322.444 L
150.481 324.731 L
151.369 324.854 L
152.257 325.481 L
153.145 325.503 L
154.033 326.82 L
154.921 326.843 L
155.809 327.558 L
156.697 327.956 L
157.585 328.793 L
158.473 330.428 L
159.361 330.827 L
160.249 330.967 L
161.137 332.06 L
162.025 332.189 L
162.913 332.623 L
163.801 332.623 L
164.689 332.626 L
165.577 332.744 L
166.465 333.636 L
167.353 334.327 L
168.241 334.455 L
169.129 334.455 L
170.017 334.545 L
170.905 334.604 L
171.793 334.665 L
172.681 335.03 L
173.569 335.593 L
174.457 336.75 L
175.345 336.797 L
176.233 336.798 L
177.121 337.038 L
178.009 338.047 L
178.897 338.28 L
179.785 338.28 L
180.673 339.826 L
181.561 339.826 L
182.449 339.99 L
183.337 340.548 L
184.225 340.625 L
185.113 340.686 L
186.001 340.7 L
186.889 341.349 L
187.777 341.41 L
188.665 341.666 L
189.553 341.69 L
190.441 341.702 L
191.329 341.71 L
192.217 341.833 L
193.105 342.19 L
193.993 342.331 L
194.881 342.358 L
195.769 342.403 L
196.657 342.64 L
197.546 342.643 L
198.434 342.644 L
199.322 342.644 L
200.21 342.824 L
201.098 342.831 L
201.986 342.913 L
202.874 343.299 L
203.762 343.404 L
204.65 343.609 L
205.538 343.668 L
206.426 344.261 L
207.314 344.313 L
208.202 344.616 L
209.09 344.626 L
209.978 344.711 L
210.866 344.723 L
211.754 344.723 L
212.642 344.847 L
213.53 345.141 L
214.418 345.147 L
215.306 345.735 L
216.194 345.746 L
217.082 345.855 L
217.97 345.873 L
218.858 346.313 L
219.746 346.393 L
220.634 346.538 L
221.522 346.576 L
222.41 346.634 L
223.298 347.279 L
224.186 347.291 L
225.074 347.747 L
225.962 347.772 L
226.85 347.797 L
227.738 347.954 L
228.626 347.959 L
229.514 348.139 L
230.402 348.139 L
231.29 348.15 L
232.178 348.15 L
233.066 348.2 L
233.954 348.31 L
234.842 348.311 L
235.73 348.346 L
236.618 348.407 L
237.506 348.483 L
238.394 348.568 L
239.282 348.688 L
240.17 348.704 L
241.058 349.173 L
241.946 349.196 L
242.834 349.196 L
243.722 349.299 L
244.61 349.496 L
245.498 349.498 L
246.387 349.661 L
247.275 349.745 L
248.163 349.752 L
249.051 349.824 L
249.939 349.871 L
250.827 349.978 L
251.715 349.979 L
252.603 350.794 L
253.491 351.035 L
254.379 351.035 L
255.267 351.081 L
256.155 351.206 L
257.043 351.208 L
257.931 351.3 L
258.819 351.3 L
259.707 351.371 L
260.595 351.407 L
261.483 351.45 L
262.371 351.451 L
263.259 351.455 L
264.147 351.683 L
265.035 351.76 L
265.923 351.763 L
266.811 351.768 L
267.699 352.2 L
268.587 352.241 L
269.475 352.617 L
270.363 352.619 L
271.251 352.62 L
272.139 352.683 L
273.027 352.688 L
273.915 352.724 L
274.803 352.735 L
275.691 353.113 L
276.579 353.18 L
277.467 353.18 L
278.355 353.186 L
279.243 353.206 L
280.131 353.24 L
281.019 353.446 L
281.907 353.446 L
282.795 353.458 L
283.683 353.459 L
284.571 353.695 L
285.459 353.715 L
286.347 353.729 L
287.235 353.841 L
288.123 353.853 L
289.011 353.862 L
289.899 353.871 L
290.787 353.922 L
291.675 353.938 L
292.563 353.938 L
293.451 353.947 L
294.339 353.979 L
295.228 353.999 L
296.116 354.085 L
297.004 354.118 L
297.892 354.121 L
298.78 354.191 L
299.668 354.293 L
300.556 354.463 L
301.444 354.469 L
302.332 354.469 L
303.22 354.646 L
304.108 354.646 L
304.996 354.673 L
305.884 354.676 L
306.772 354.879 L
307.66 354.884 L
308.548 354.898 L
309.436 354.929 L
310.324 354.998 L
311.212 355.027 L
312.1 355.113 L
312.988 355.118 L
313.876 355.118 L
314.764 355.155 L
315.652 355.163 L
316.54 355.198 L
317.428 355.226 L
318.316 355.251 L
319.204 355.275 L
320.092 355.302 L
320.98 355.366 L
321.868 355.381 L
322.756 355.386 L
323.644 355.387 L
324.532 355.402 L
325.42 355.415 L
326.308 355.431 L
327.196 355.482 L
328.084 355.484 L
328.972 355.487 L
329.86 355.523 L
330.748 355.552 L
331.636 355.553 L
332.524 355.558 L
333.412 355.703 L
334.3 355.745 L
335.188 355.846 L
336.076 355.922 L
336.964 356.043 L
337.852 356.077 L
338.74 356.113 L
339.628 356.14 L
340.516 356.151 L
341.404 356.169 L
342.292 356.212 L
343.18 356.261 L
344.068 356.346 L
344.957 356.547 L
345.845 356.575 L
346.733 356.595 L
347.621 356.701 L
348.509 356.762 L
349.397 356.826 L
350.285 356.854 L
351.173 356.861 L
352.061 356.96 L
352.949 357.012 L
353.837 357.032 L
354.725 357.127 L
355.613 357.146 L
356.501 357.146 L
357.389 357.195 L
358.277 357.227 L
359.165 357.227 L
360.053 357.25 L
360.941 357.251 L
361.829 357.293 L
362.717 357.296 L
363.605 357.315 L
364.493 357.326 L
365.381 357.327 L
366.269 357.418 L
367.157 357.446 L
368.045 357.447 L
368.933 357.447 L
369.821 357.471 L
370.709 357.542 L
371.597 357.544 L
372.485 357.577 L
373.373 357.603 L
374.261 357.724 L
375.149 357.725 L
376.037 357.76 L
376.925 357.783 L
377.813 357.784 L
378.701 357.788 L
379.589 357.789 L
380.477 357.791 L
381.365 357.841 L
382.253 357.885 L
383.141 357.888 L
384.029 357.922 L
384.917 357.981 L
385.805 357.989 L
386.693 357.99 L
387.581 357.99 L
388.469 357.997 L
389.357 358.039 L
390.245 358.094 L
391.133 358.106 L
392.021 358.106 L
392.909 358.212 L
393.798 358.255 L
394.686 358.259 L
395.574 358.263 L
396.462 358.3 L
397.35 358.3 L
398.238 358.301 L
399.126 358.317 L
400.014 358.317 L
400.902 358.319 L
401.79 358.321 L
402.678 358.342 L
403.566 358.438 L
404.454 358.441 L
405.342 358.463 L
406.23 358.54 L
407.118 358.575 L
408.006 358.583 L
408.894 358.588 L
409.782 358.591 L
410.67 358.611 L
411.558 358.621 L
412.446 358.766 L
413.334 358.768 L
414.222 358.772 L
415.11 358.781 L
415.998 358.783 L
416.886 358.862 L
417.774 358.879 L
418.662 358.879 L
419.55 358.922 L
420.438 358.957 L
421.326 358.974 L
422.214 359.016 L
423.102 359.035 L
423.99 359.048 L
424.878 359.06 L
425.766 359.083 L
426.654 359.118 L
427.542 359.12 L
428.43 359.174 L
429.318 359.177 L
430.206 359.238 L
431.094 359.24 L
431.982 359.291 L
432.87 359.297 L
433.758 359.302 L
434.646 359.317 L
435.534 359.323 L
436.422 359.334 L
437.31 359.338 L
438.198 359.441 L
439.086 359.445 L
439.974 359.516 L
440.862 359.521 L
441.75 359.525 L
442.638 359.537 L
443.527 359.558 L
444.415 359.607 L
445.303 359.61 L
446.191 359.617 L
447.079 359.632 L
447.967 359.635 L
448.855 359.677 L
449.743 359.679 L
450.631 359.679 L
451.519 359.708 L
452.407 359.71 L
453.295 359.735 L
454.183 359.783 L
455.071 359.798 L
455.959 359.805 L
456.847 359.807 L
457.735 359.834 L
458.623 359.856 L
459.511 359.873 L
460.399 360.08 L
461.287 360.081 L
462.175 360.084 L
463.063 360.089 L
463.951 360.108 L
464.839 360.118 L
465.727 360.203 L
466.615 360.208 L
467.503 360.223 L
468.391 360.335 L
469.279 360.349 L
470.167 360.349 L
471.055 360.349 L
471.943 360.363 L
472.831 360.399 L
473.719 360.399 L
474.607 360.4 L
475.495 360.4 L
476.383 360.404 L
477.271 360.418 L
478.159 360.421 L
479.047 360.421 L
479.935 360.423 L
480.823 360.47 L
481.711 360.47 L
482.599 360.47 L
483.487 360.483 L
484.375 360.483 L
485.263 360.485 L
486.151 360.507 L
487.039 360.515 L
487.927 360.515 L
488.815 360.577 L
489.703 360.586 L
490.591 360.601 L
491.479 360.607 L
492.368 360.611 L
493.256 360.614 L
494.144 360.622 L
495.032 360.623 L
495.92 360.624 L
496.808 360.626 L
497.696 360.65 L
498.584 360.657 L
499.472 360.671 L
500.36 360.671 L
501.248 360.671 L
502.136 360.68 L
503.024 360.681 L
503.912 360.681 L
504.8 360.706 L
505.688 360.706 L
506.576 360.738 L
507.043 360.746 L
S
GR
GS
[0.75 0 0 0.75 0 0] CT
0 0 1 RC
1 LJ
0.667 LW
N
86.499 30.966 M
86.543 69.469 L
87.431 107.188 L
88.319 112.752 L
89.207 181.977 L
90.095 197.781 L
90.983 199.142 L
91.871 223.788 L
92.759 226.439 L
93.647 235.108 L
94.535 237.732 L
95.423 249.601 L
96.311 250.002 L
97.199 255.072 L
98.087 258.103 L
98.976 258.64 L
99.864 265.193 L
100.752 265.505 L
101.64 269.849 L
102.528 272.119 L
103.416 275.39 L
104.304 275.525 L
105.192 275.945 L
106.08 280.659 L
106.968 282.684 L
107.856 282.733 L
108.744 283.99 L
109.632 284.053 L
110.52 284.053 L
111.408 284.88 L
112.296 285.157 L
113.184 286.917 L
114.072 286.919 L
114.96 294.359 L
115.848 294.369 L
116.736 296.592 L
117.624 296.865 L
118.512 297.935 L
119.4 298.207 L
120.288 300.009 L
121.176 300.393 L
122.064 301.295 L
122.952 301.298 L
123.84 301.304 L
124.728 301.33 L
125.616 301.372 L
126.504 301.375 L
127.392 302.463 L
128.28 304.8 L
129.168 304.814 L
130.056 304.824 L
130.944 305.94 L
131.832 306.639 L
132.72 307.478 L
133.608 308.498 L
134.496 309.512 L
135.384 310.123 L
136.272 310.124 L
137.16 310.508 L
138.048 311.255 L
138.936 311.4 L
139.824 311.42 L
140.712 311.647 L
141.6 311.992 L
142.488 312.027 L
143.376 313.733 L
144.264 313.998 L
145.152 314.133 L
146.04 315.636 L
146.928 315.785 L
147.816 315.831 L
148.705 317.306 L
149.593 318.667 L
150.481 319.1 L
151.369 319.211 L
152.257 319.89 L
153.145 321.002 L
154.033 323.054 L
154.921 323.769 L
155.809 325.279 L
156.697 325.419 L
157.585 325.473 L
158.473 326.331 L
159.361 326.425 L
160.249 327.063 L
161.137 327.272 L
162.025 328.718 L
162.913 328.729 L
163.801 329.476 L
164.689 330.944 L
165.577 330.953 L
166.465 331.039 L
167.353 331.251 L
168.241 331.635 L
169.129 331.668 L
170.017 331.68 L
170.905 332.015 L
171.793 332.129 L
172.681 332.271 L
173.569 333.15 L
174.457 333.23 L
175.345 333.275 L
176.233 333.791 L
177.121 334.125 L
178.009 334.935 L
178.897 335.541 L
179.785 336.169 L
180.673 336.201 L
181.561 336.471 L
182.449 336.801 L
183.337 336.844 L
184.225 337.219 L
185.113 337.672 L
186.001 337.943 L
186.889 337.953 L
187.777 338.247 L
188.665 338.265 L
189.553 338.938 L
190.441 338.944 L
191.329 339.082 L
192.217 339.502 L
193.105 339.582 L
193.993 339.648 L
194.881 339.924 L
195.769 339.928 L
196.657 340.183 L
197.546 340.329 L
198.434 340.335 L
199.322 340.49 L
200.21 340.88 L
201.098 340.909 L
201.986 341.423 L
202.874 341.44 L
203.762 341.449 L
204.65 341.45 L
205.538 341.601 L
206.426 341.787 L
207.314 341.791 L
208.202 342.486 L
209.09 342.666 L
209.978 342.686 L
210.866 342.693 L
211.754 342.941 L
212.642 343.15 L
213.53 344.435 L
214.418 344.466 L
215.306 344.748 L
216.194 344.749 L
217.082 344.891 L
217.97 344.907 L
218.858 344.909 L
219.746 344.926 L
220.634 344.976 L
221.522 345.058 L
222.41 345.158 L
223.298 345.245 L
224.186 345.306 L
225.074 345.367 L
225.962 345.44 L
226.85 345.457 L
227.738 345.609 L
228.626 345.685 L
229.514 345.763 L
230.402 345.851 L
231.29 345.852 L
232.178 345.855 L
233.066 345.877 L
233.954 345.879 L
234.842 345.879 L
235.73 345.889 L
236.618 345.889 L
237.506 346.045 L
238.394 346.049 L
239.282 346.094 L
240.17 346.202 L
241.058 346.22 L
241.946 346.31 L
242.834 346.353 L
243.722 346.403 L
244.61 346.508 L
245.498 346.525 L
246.387 346.533 L
247.275 346.718 L
248.163 346.727 L
249.051 346.729 L
249.939 346.769 L
250.827 346.771 L
251.715 347.21 L
252.603 347.21 L
253.491 347.233 L
254.379 347.28 L
255.267 347.577 L
256.155 347.587 L
257.043 347.713 L
257.931 347.727 L
258.819 347.738 L
259.707 347.979 L
260.595 347.984 L
261.483 348.099 L
262.371 348.115 L
263.259 348.117 L
264.147 348.159 L
265.035 348.615 L
265.923 348.617 L
266.811 348.668 L
267.699 348.917 L
268.587 348.92 L
269.475 348.939 L
270.363 348.976 L
271.251 348.985 L
272.139 349.061 L
273.027 349.223 L
273.915 349.268 L
274.803 349.426 L
275.691 349.446 L
276.579 349.495 L
277.467 349.512 L
278.355 349.58 L
279.243 349.581 L
280.131 349.761 L
281.019 349.772 L
281.907 349.794 L
282.795 349.829 L
283.683 349.831 L
284.571 349.974 L
285.459 350.037 L
286.347 350.037 L
287.235 350.057 L
288.123 350.303 L
289.011 350.368 L
289.899 350.435 L
290.787 350.444 L
291.675 350.573 L
292.563 350.574 L
293.451 350.645 L
294.339 350.902 L
295.228 350.945 L
296.116 351.015 L
297.004 351.048 L
297.892 351.262 L
298.78 351.267 L
299.668 351.294 L
300.556 351.496 L
301.444 351.5 L
302.332 351.611 L
303.22 351.732 L
304.108 351.734 L
304.996 351.89 L
305.884 351.981 L
306.772 351.983 L
307.66 352.233 L
308.548 352.233 L
309.436 352.245 L
310.324 352.26 L
311.212 352.265 L
312.1 352.326 L
312.988 352.334 L
313.876 352.353 L
314.764 352.355 L
315.652 352.361 L
316.54 352.363 L
317.428 352.369 L
318.316 352.376 L
319.204 352.385 L
320.092 352.457 L
320.98 352.471 L
321.868 352.487 L
322.756 352.504 L
323.644 352.912 L
324.532 352.912 L
325.42 352.913 L
326.308 353.025 L
327.196 353.078 L
328.084 353.093 L
328.972 353.258 L
329.86 353.434 L
330.748 353.447 L
331.636 353.448 L
332.524 353.448 L
333.412 353.452 L
334.3 353.486 L
335.188 353.497 L
336.076 353.523 L
336.964 353.547 L
337.852 353.619 L
338.74 353.641 L
339.628 353.702 L
340.516 353.716 L
341.404 353.746 L
342.292 353.748 L
343.18 353.749 L
344.068 353.761 L
344.957 353.765 L
345.845 353.817 L
346.733 353.835 L
347.621 353.837 L
348.509 353.869 L
349.397 353.871 L
350.285 354.01 L
351.173 354.011 L
352.061 354.021 L
352.949 354.101 L
353.837 354.134 L
354.725 354.232 L
355.613 354.279 L
356.501 354.438 L
357.389 354.487 L
358.277 354.569 L
359.165 354.594 L
360.053 354.6 L
360.941 354.6 L
361.829 354.611 L
362.717 354.806 L
363.605 354.817 L
364.493 354.906 L
365.381 355.073 L
366.269 355.079 L
367.157 355.092 L
368.045 355.112 L
368.933 355.113 L
369.821 355.118 L
370.709 355.156 L
371.597 355.262 L
372.485 355.271 L
373.373 355.302 L
374.261 355.313 L
375.149 355.313 L
376.037 355.314 L
376.925 355.319 L
377.813 355.419 L
378.701 355.437 L
379.589 355.453 L
380.477 355.453 L
381.365 355.456 L
382.253 355.47 L
383.141 355.47 L
384.029 355.47 L
384.917 355.479 L
385.805 355.488 L
386.693 355.496 L
387.581 355.511 L
388.469 355.511 L
389.357 355.518 L
390.245 355.643 L
391.133 355.655 L
392.021 355.683 L
392.909 355.684 L
393.798 355.684 L
394.686 355.703 L
395.574 355.712 L
396.462 355.749 L
397.35 355.755 L
398.238 355.76 L
399.126 355.77 L
400.014 355.794 L
400.902 355.812 L
401.79 355.854 L
402.678 355.854 L
403.566 355.854 L
404.454 355.88 L
405.342 355.883 L
406.23 355.936 L
407.118 356.042 L
408.006 356.048 L
408.894 356.1 L
409.782 356.101 L
410.67 356.101 L
411.558 356.114 L
412.446 356.157 L
413.334 356.16 L
414.222 356.192 L
415.11 356.206 L
415.998 356.215 L
416.886 356.219 L
417.774 356.307 L
418.662 356.307 L
419.55 356.42 L
420.438 356.42 L
421.326 356.476 L
422.214 356.501 L
423.102 356.501 L
423.99 356.663 L
424.878 356.713 L
425.766 356.715 L
426.654 356.72 L
427.542 356.752 L
428.43 356.766 L
429.318 356.784 L
430.206 356.815 L
431.094 356.816 L
431.982 356.837 L
432.87 356.856 L
433.758 356.857 L
434.646 356.857 L
435.534 356.858 L
436.422 356.926 L
437.31 356.934 L
438.198 356.965 L
439.086 356.975 L
439.974 357.023 L
440.862 357.028 L
441.75 357.028 L
442.638 357.037 L
443.527 357.065 L
444.415 357.305 L
445.303 357.306 L
446.191 357.32 L
447.079 357.323 L
447.967 357.415 L
448.855 357.415 L
449.743 357.461 L
450.631 357.487 L
451.519 357.492 L
452.407 357.519 L
453.295 357.529 L
454.183 357.577 L
455.071 357.58 L
455.959 357.58 L
456.847 357.613 L
457.735 357.628 L
458.623 357.666 L
459.511 357.671 L
460.399 357.671 L
461.287 357.685 L
462.175 357.75 L
463.063 357.779 L
463.951 357.78 L
464.839 357.781 L
465.727 357.799 L
466.615 357.807 L
467.503 357.856 L
468.391 357.86 L
469.279 357.992 L
470.167 357.993 L
471.055 358.042 L
471.943 358.042 L
472.831 358.063 L
473.719 358.067 L
474.607 358.068 L
475.495 358.109 L
476.383 358.109 L
477.271 358.117 L
478.159 358.183 L
479.047 358.22 L
479.935 358.22 L
480.823 358.247 L
481.711 358.247 L
482.599 358.299 L
483.487 358.32 L
484.375 358.32 L
485.263 358.339 L
486.151 358.339 L
487.039 358.373 L
487.927 358.375 L
488.815 358.381 L
489.703 358.436 L
490.591 358.44 L
491.479 358.444 L
492.368 358.444 L
493.256 358.459 L
494.144 358.538 L
495.032 358.551 L
495.92 358.579 L
496.808 358.601 L
497.696 358.657 L
498.584 358.659 L
499.472 358.665 L
500.36 358.668 L
501.248 358.69 L
502.136 358.691 L
503.024 358.705 L
503.912 358.72 L
504.8 358.721 L
505.688 358.782 L
506.576 358.787 L
507.043 358.793 L
S
GR
GS
[0.75 0 0 0.75 0 0] CT
1 GC
N
432 97 M
432 44 L
494 44 L
494 97 L
cp
f
GR
GS
[0.75 0 0 0.75 351.75 40.5] CT
/Helvetica 12 F
GS
[1 0 0 1 0 0] CT
0 5 moveto 
1 -1 scale
(p11) t 
GR
GR
GS
[0.75 0 0 0.75 0 0] CT
1 0 0 RC
1 LJ
0.667 LW
N
436 54 M
466 54 L
S
GR
GS
[0.75 0 0 0.75 351.75 52.875] CT
/Helvetica 12 F
GS
[1 0 0 1 0 0] CT
0 5 moveto 
1 -1 scale
(p22) t 
GR
GR
GS
[0.75 0 0 0.75 0 0] CT
0 1 0 RC
1 LJ
0.667 LW
N
436 70.5 M
466 70.5 L
S
GR
GS
[0.75 0 0 0.75 351.75 65.25] CT
/Helvetica 12 F
GS
[1 0 0 1 0 0] CT
0 5 moveto 
1 -1 scale
(p33) t 
GR
GR
GS
[0.75 0 0 0.75 0 0] CT
0 0 1 RC
1 LJ
0.667 LW
N
436 87 M
466 87 L
S
GR
GS
[0.75 0 0 0.75 0 0] CT
0.149 GC
10.0 ML
0.667 LW
N
432 97 M
432 44 L
494 44 L
494 97 L
cp
S
GR
%%Trailer
%%Pages: 1
%%EOF
