\relax 
\catcode `"\active 
\catcode `-\active 
\select@language{czech}
\@writefile{toc}{\select@language{czech}}
\@writefile{lof}{\select@language{czech}}
\@writefile{lot}{\select@language{czech}}
\@writefile{toc}{\contentsline {section}{\numberline {1}Zad\IeC {\'a}n\IeC {\'\i }}{2}}
\newlabel{1}{{4}{2}}
\@writefile{toc}{\contentsline {section}{\numberline {2}\IeC {\v R}e\IeC {\v s}en\IeC {\'\i }}{3}}
\@writefile{toc}{\contentsline {subsection}{\numberline {2.1}Prvn\IeC {\'\i } \IeC {\'u}kol}{3}}
\@writefile{lof}{\contentsline {figure}{\numberline {1}{\ignorespaces Vstupn\IeC {\v e} v\IeC {\'y}stupn\IeC {\'\i } sady dat pro $S_1$.}}{3}}
\@writefile{lof}{\contentsline {figure}{\numberline {2}{\ignorespaces Vstupn\IeC {\v e} v\IeC {\'y}stupn\IeC {\'\i } sady dat pro $S_2$.}}{4}}
\@writefile{toc}{\contentsline {subsection}{\numberline {2.2}Druh\IeC {\'y} \IeC {\'u}kol}{5}}
\@writefile{toc}{\contentsline {paragraph}{Metoda nejmen\IeC {\v s}\IeC {\'\i }ch \IeC {\v c}tverc\IeC {\r u}}{5}}
\newlabel{mnc}{{5}{5}}
\@writefile{toc}{\contentsline {subsection}{\numberline {2.3}T\IeC {\v r}et\IeC {\'\i } \IeC {\'u}kol}{6}}
\@writefile{toc}{\contentsline {subsubsection}{\numberline {2.3.1}Anal\IeC {\'y}za vstupn\IeC {\'\i }ho sign\IeC {\'a}lu z hlediska bohatosti}{6}}
\newlabel{2}{{6}{6}}
\@writefile{toc}{\contentsline {paragraph}{Jednotkov\IeC {\'y} impuls}{7}}
\@writefile{toc}{\contentsline {paragraph}{Jednotkov\IeC {\'y} skok}{7}}
\@writefile{toc}{\contentsline {paragraph}{B\IeC {\'\i }l\IeC {\'y} \IeC {\v s}um}{7}}
\@writefile{toc}{\contentsline {subsubsection}{\numberline {2.3.2}Odvozen\IeC {\'\i } vztah\IeC {\r u} pro odhad parametr\IeC {\r u} jako funkce zdroje}{7}}
\newlabel{mnc2}{{9}{7}}
\@writefile{toc}{\contentsline {paragraph}{Parametrick\IeC {\'e} rovnice pro b\IeC {\'\i }l\IeC {\'y} \IeC {\v s}um}{8}}
\newlabel{vyraz}{{10}{8}}
\@writefile{toc}{\contentsline {paragraph}{Parametrick\IeC {\'e} rovnice pro impuls}{9}}
\newlabel{impuls}{{19}{9}}
\@writefile{toc}{\contentsline {paragraph}{Parametrick\IeC {\'e} rovnice pro skok}{9}}
