\relax 
\catcode `"\active 
\catcode `-\active 
\select@language{czech}
\@writefile{toc}{\select@language{czech}}
\@writefile{lof}{\select@language{czech}}
\@writefile{lot}{\select@language{czech}}
\@writefile{toc}{\contentsline {chapter}{\numberline {1}Zad\IeC {\'a}n\IeC {\'\i }}{1}}
\@writefile{lof}{\addvspace {10\p@ }}
\@writefile{lot}{\addvspace {10\p@ }}
\@writefile{toc}{\contentsline {chapter}{\numberline {2}\IeC {\v R}e\IeC {\v s}en\IeC {\'\i }}{2}}
\@writefile{lof}{\addvspace {10\p@ }}
\@writefile{lot}{\addvspace {10\p@ }}
\@writefile{toc}{\contentsline {section}{\numberline {2.1}Metoda p\IeC {\v r}\IeC {\'\i }davn\IeC {\'e} prom\IeC {\v e}nn\IeC {\'e}}{2}}
\@writefile{toc}{\contentsline {section}{\numberline {2.2}Metoda chyby predikce}{3}}
\@writefile{toc}{\contentsline {section}{\numberline {2.3}Rekurzivn\IeC {\'\i } metoda p\IeC {\v r}\IeC {\'\i }davn\IeC {\'e} prom\IeC {\v e}nn\IeC {\'e}}{4}}
\@writefile{toc}{\contentsline {section}{\numberline {2.4}Rekurzivn\IeC {\'\i } metoda chyby predikce}{4}}
\@writefile{toc}{\contentsline {section}{\numberline {2.5}Roz\IeC {\v s}\IeC {\'\i }\IeC {\v r}en\IeC {\'a} metoda nejmen\IeC {\v s}\IeC {\'\i }ch \IeC {\v c}tverc\IeC {\r u}.}{5}}
\@writefile{toc}{\contentsline {section}{\numberline {2.6}V\IeC {\'y}sledky metod}{5}}
\@writefile{toc}{\contentsline {subsection}{\numberline {2.6.1}V\IeC {\'y}sledky nerekurzivn\IeC {\'\i }ch metod}{5}}
\@writefile{toc}{\contentsline {subsubsection}{Metoda p\IeC {\v r}\IeC {\'\i }davn\IeC {\'e} prom\IeC {\v e}nn\IeC {\'e}}{5}}
\@writefile{lot}{\contentsline {table}{\numberline {2.1}{\ignorespaces Tabulka v\IeC {\'y}sledk\IeC {\r u} odhadu parametr\IeC {\r u} pro metodu p\IeC {\v r}\IeC {\'\i }davn\IeC {\'e} prom\IeC {\v e}nn\IeC {\'e} pro r\IeC {\r u}zn\IeC {\'e} hodnoty d\IeC {\'e}lky sign\IeC {\'a}lu.}}{5}}
\newlabel{my-label}{{2.1}{5}}
\@writefile{toc}{\contentsline {subsubsection}{Metoda chyby predikce}{6}}
\@writefile{lot}{\contentsline {table}{\numberline {2.2}{\ignorespaces Tabulka v\IeC {\'y}sledk\IeC {\r u} odhadu parametr\IeC {\r u} pro metodu chyby predikce pro r\IeC {\r u}zn\IeC {\'e} hodnoty d\IeC {\'e}lky sign\IeC {\'a}lu.}}{6}}
\newlabel{my-label2}{{2.2}{6}}
\@writefile{toc}{\contentsline {subsection}{\numberline {2.6.2}Rekurzivn\IeC {\'\i } metody}{7}}
\@writefile{toc}{\contentsline {subsubsection}{Rekurzivn\IeC {\'\i } metoda nejmen\IeC {\v s}\IeC {\'\i }ch \IeC {\v c}tverc\IeC {\r u}}{7}}
\@writefile{lof}{\contentsline {figure}{\numberline {2.1}{\ignorespaces V\IeC {\'y}voj odhadu parametr\IeC {\r u} v rekurzivn\IeC {\'\i } metod\IeC {\v e} nejmen\IeC {\v s}\IeC {\'\i }ch \IeC {\v c}tverc\IeC {\r u}.}}{7}}
\@writefile{lof}{\contentsline {figure}{\numberline {2.2}{\ignorespaces V\IeC {\'y}voj odhadu parametr\IeC {\r u} v rekurzivn\IeC {\'\i } metod\IeC {\v e} nejmen\IeC {\v s}\IeC {\'\i }ch \IeC {\v c}tverc\IeC {\r u}. - detail}}{8}}
\@writefile{lof}{\contentsline {figure}{\numberline {2.3}{\ignorespaces V\IeC {\'y}voj variance odhadu parametr\IeC {\r u} v rekurzivn\IeC {\'\i } metod\IeC {\v e} nejmen\IeC {\v s}\IeC {\'\i }ch \IeC {\v c}tverc\IeC {\r u}.}}{9}}
\@writefile{lof}{\contentsline {figure}{\numberline {2.4}{\ignorespaces V\IeC {\'y}voj variance odhadu parametr\IeC {\r u} v rekurzivn\IeC {\'\i } metod\IeC {\v e} nejmen\IeC {\v s}\IeC {\'\i }ch \IeC {\v c}tverc\IeC {\r u}. -detail}}{10}}
\@writefile{toc}{\contentsline {subsubsection}{Rekurzivn\IeC {\'\i } metoda chyby predikce}{11}}
\@writefile{lof}{\contentsline {figure}{\numberline {2.5}{\ignorespaces V\IeC {\'y}voj odhadu parametr\IeC {\r u} v rekurzivn\IeC {\'\i } metod\IeC {\v e} chyby predikce.}}{11}}
\@writefile{lof}{\contentsline {figure}{\numberline {2.6}{\ignorespaces V\IeC {\'y}voj odhadu parametr\IeC {\r u} v rekurzivn\IeC {\'\i } metod\IeC {\v e} chyby predikce. - detail}}{12}}
\@writefile{lof}{\contentsline {figure}{\numberline {2.7}{\ignorespaces V\IeC {\'y}voj variance odhadu parametr\IeC {\r u} v rekurzivn\IeC {\'\i } metod\IeC {\v e} chyby predikce.}}{13}}
\@writefile{lof}{\contentsline {figure}{\numberline {2.8}{\ignorespaces V\IeC {\'y}voj variance odhadu parametr\IeC {\r u} v rekurzivn\IeC {\'\i } metod\IeC {\v e} chyby predikce. -detail}}{14}}
\@writefile{toc}{\contentsline {subsubsection}{Rekurzivn\IeC {\'\i } metoda p\IeC {\v r}\IeC {\'\i }davn\IeC {\'e} prom\IeC {\v e}nn\IeC {\'e}}{15}}
\@writefile{lof}{\contentsline {figure}{\numberline {2.9}{\ignorespaces V\IeC {\'y}voj odhadu parametr\IeC {\r u} v rekurzivn\IeC {\'\i } metod\IeC {\v e} p\IeC {\v r}\IeC {\'\i }davn\IeC {\'e} prom\IeC {\v e}nn\IeC {\'e}.}}{15}}
\@writefile{lof}{\contentsline {figure}{\numberline {2.10}{\ignorespaces V\IeC {\'y}voj odhadu parametr\IeC {\r u} v rekurzivn\IeC {\'\i } metod\IeC {\v e} p\IeC {\v r}\IeC {\'\i }davn\IeC {\'e} prom\IeC {\v e}nn\IeC {\'e}. - detail}}{16}}
\@writefile{lof}{\contentsline {figure}{\numberline {2.11}{\ignorespaces V\IeC {\'y}voj variance odhadu parametr\IeC {\r u} v rekurzivn\IeC {\'\i } metod\IeC {\v e} p\IeC {\v r}\IeC {\'\i }davn\IeC {\'e} prom\IeC {\v e}nn\IeC {\'e}.}}{17}}
\@writefile{lof}{\contentsline {figure}{\numberline {2.12}{\ignorespaces V\IeC {\'y}voj variance odhadu parametr\IeC {\r u} v rekurzivn\IeC {\'\i } metod\IeC {\v e} p\IeC {\v r}\IeC {\'\i }davn\IeC {\'e} prom\IeC {\v e}nn\IeC {\'e}. -detail}}{18}}
\@writefile{toc}{\contentsline {section}{\numberline {2.7}Diskuze vlastnost\IeC {\'\i } jednotliv\IeC {\'y}ch metod}{18}}
\@writefile{toc}{\contentsline {chapter}{\numberline {3}Z\IeC {\'a}v\IeC {\v e}r}{20}}
\@writefile{lof}{\addvspace {10\p@ }}
\@writefile{lot}{\addvspace {10\p@ }}
