%!PS-Adobe-3.0 EPSF-3.0
%%Creator: (MATLAB, The Mathworks, Inc. Version 9.0.0.341360 \(R2016a\). Operating System: Windows 8)
%%Title: C:/Users/Jan/Desktop/isf1/ioS1.eps
%%CreationDate: 2017-03-23T21:18:17
%%Pages: (atend)
%%BoundingBox: 0 0 420 315
%%LanguageLevel: 3
%%EndComments
%%BeginProlog
%%BeginResource: procset (Apache XML Graphics Std ProcSet) 1.2 0
%%Version: 1.2 0
%%Copyright: (Copyright 2001-2003,2010 The Apache Software Foundation. License terms: http://www.apache.org/licenses/LICENSE-2.0)
/bd{bind def}bind def
/ld{load def}bd
/GR/grestore ld
/M/moveto ld
/LJ/setlinejoin ld
/C/curveto ld
/f/fill ld
/LW/setlinewidth ld
/GC/setgray ld
/t/show ld
/N/newpath ld
/CT/concat ld
/cp/closepath ld
/S/stroke ld
/L/lineto ld
/CC/setcmykcolor ld
/A/ashow ld
/GS/gsave ld
/RC/setrgbcolor ld
/RM/rmoveto ld
/ML/setmiterlimit ld
/re {4 2 roll M
1 index 0 rlineto
0 exch rlineto
neg 0 rlineto
cp } bd
/_ctm matrix def
/_tm matrix def
/BT { _ctm currentmatrix pop matrix _tm copy pop 0 0 moveto } bd
/ET { _ctm setmatrix } bd
/iTm { _ctm setmatrix _tm concat } bd
/Tm { _tm astore pop iTm 0 0 moveto } bd
/ux 0.0 def
/uy 0.0 def
/F {
  /Tp exch def
  /Tf exch def
  Tf findfont Tp scalefont setfont
  /cf Tf def  /cs Tp def
} bd
/ULS {currentpoint /uy exch def /ux exch def} bd
/ULE {
  /Tcx currentpoint pop def
  gsave
  newpath
  cf findfont cs scalefont dup
  /FontMatrix get 0 get /Ts exch def /FontInfo get dup
  /UnderlinePosition get Ts mul /To exch def
  /UnderlineThickness get Ts mul /Tt exch def
  ux uy To add moveto  Tcx uy To add lineto
  Tt setlinewidth stroke
  grestore
} bd
/OLE {
  /Tcx currentpoint pop def
  gsave
  newpath
  cf findfont cs scalefont dup
  /FontMatrix get 0 get /Ts exch def /FontInfo get dup
  /UnderlinePosition get Ts mul /To exch def
  /UnderlineThickness get Ts mul /Tt exch def
  ux uy To add cs add moveto Tcx uy To add cs add lineto
  Tt setlinewidth stroke
  grestore
} bd
/SOE {
  /Tcx currentpoint pop def
  gsave
  newpath
  cf findfont cs scalefont dup
  /FontMatrix get 0 get /Ts exch def /FontInfo get dup
  /UnderlinePosition get Ts mul /To exch def
  /UnderlineThickness get Ts mul /Tt exch def
  ux uy To add cs 10 mul 26 idiv add moveto Tcx uy To add cs 10 mul 26 idiv add lineto
  Tt setlinewidth stroke
  grestore
} bd
/QT {
/Y22 exch store
/X22 exch store
/Y21 exch store
/X21 exch store
currentpoint
/Y21 load 2 mul add 3 div exch
/X21 load 2 mul add 3 div exch
/X21 load 2 mul /X22 load add 3 div
/Y21 load 2 mul /Y22 load add 3 div
/X22 load /Y22 load curveto
} bd
/SSPD {
dup length /d exch dict def
{
/v exch def
/k exch def
currentpagedevice k known {
/cpdv currentpagedevice k get def
v cpdv ne {
/upd false def
/nullv v type /nulltype eq def
/nullcpdv cpdv type /nulltype eq def
nullv nullcpdv or
{
/upd true def
} {
/sametype v type cpdv type eq def
sametype {
v type /arraytype eq {
/vlen v length def
/cpdvlen cpdv length def
vlen cpdvlen eq {
0 1 vlen 1 sub {
/i exch def
/obj v i get def
/cpdobj cpdv i get def
obj cpdobj ne {
/upd true def
exit
} if
} for
} {
/upd true def
} ifelse
} {
v type /dicttype eq {
v {
/dv exch def
/dk exch def
/cpddv cpdv dk get def
dv cpddv ne {
/upd true def
exit
} if
} forall
} {
/upd true def
} ifelse
} ifelse
} if
} ifelse
upd true eq {
d k v put
} if
} if
} if
} forall
d length 0 gt {
d setpagedevice
} if
} bd
%%EndResource
%%BeginResource: procset (Apache XML Graphics EPS ProcSet) 1.0 0
%%Version: 1.0 0
%%Copyright: (Copyright 2002-2003 The Apache Software Foundation. License terms: http://www.apache.org/licenses/LICENSE-2.0)
/BeginEPSF { %def
/b4_Inc_state save def         % Save state for cleanup
/dict_count countdictstack def % Count objects on dict stack
/op_count count 1 sub def      % Count objects on operand stack
userdict begin                 % Push userdict on dict stack
/showpage { } def              % Redefine showpage, { } = null proc
0 setgray 0 setlinecap         % Prepare graphics state
1 setlinewidth 0 setlinejoin
10 setmiterlimit [ ] 0 setdash newpath
/languagelevel where           % If level not equal to 1 then
{pop languagelevel             % set strokeadjust and
1 ne                           % overprint to their defaults.
{false setstrokeadjust false setoverprint
} if
} if
} bd
/EndEPSF { %def
count op_count sub {pop} repeat            % Clean up stacks
countdictstack dict_count sub {end} repeat
b4_Inc_state restore
} bd
%%EndResource
%FOPBeginFontDict
%%IncludeResource: font Courier-Bold
%%IncludeResource: font Helvetica
%%IncludeResource: font Courier-BoldOblique
%%IncludeResource: font Courier-Oblique
%%IncludeResource: font Times-Roman
%%IncludeResource: font Helvetica-BoldOblique
%%IncludeResource: font Helvetica-Bold
%%IncludeResource: font Helvetica-Oblique
%%IncludeResource: font Times-BoldItalic
%%IncludeResource: font Courier
%%IncludeResource: font Times-Italic
%%IncludeResource: font Times-Bold
%%IncludeResource: font Symbol
%%IncludeResource: font ZapfDingbats
%FOPEndFontDict
%%BeginResource: encoding WinAnsiEncoding
/WinAnsiEncoding [
/.notdef /.notdef /.notdef /.notdef /.notdef
/.notdef /.notdef /.notdef /.notdef /.notdef
/.notdef /.notdef /.notdef /.notdef /.notdef
/.notdef /.notdef /.notdef /.notdef /.notdef
/.notdef /.notdef /.notdef /.notdef /.notdef
/.notdef /.notdef /.notdef /.notdef /.notdef
/.notdef /.notdef /space /exclam /quotedbl
/numbersign /dollar /percent /ampersand /quotesingle
/parenleft /parenright /asterisk /plus /comma
/hyphen /period /slash /zero /one
/two /three /four /five /six
/seven /eight /nine /colon /semicolon
/less /equal /greater /question /at
/A /B /C /D /E
/F /G /H /I /J
/K /L /M /N /O
/P /Q /R /S /T
/U /V /W /X /Y
/Z /bracketleft /backslash /bracketright /asciicircum
/underscore /quoteleft /a /b /c
/d /e /f /g /h
/i /j /k /l /m
/n /o /p /q /r
/s /t /u /v /w
/x /y /z /braceleft /bar
/braceright /asciitilde /bullet /Euro /bullet
/quotesinglbase /florin /quotedblbase /ellipsis /dagger
/daggerdbl /circumflex /perthousand /Scaron /guilsinglleft
/OE /bullet /Zcaron /bullet /bullet
/quoteleft /quoteright /quotedblleft /quotedblright /bullet
/endash /emdash /asciitilde /trademark /scaron
/guilsinglright /oe /bullet /zcaron /Ydieresis
/space /exclamdown /cent /sterling /currency
/yen /brokenbar /section /dieresis /copyright
/ordfeminine /guillemotleft /logicalnot /sfthyphen /registered
/macron /degree /plusminus /twosuperior /threesuperior
/acute /mu /paragraph /middot /cedilla
/onesuperior /ordmasculine /guillemotright /onequarter /onehalf
/threequarters /questiondown /Agrave /Aacute /Acircumflex
/Atilde /Adieresis /Aring /AE /Ccedilla
/Egrave /Eacute /Ecircumflex /Edieresis /Igrave
/Iacute /Icircumflex /Idieresis /Eth /Ntilde
/Ograve /Oacute /Ocircumflex /Otilde /Odieresis
/multiply /Oslash /Ugrave /Uacute /Ucircumflex
/Udieresis /Yacute /Thorn /germandbls /agrave
/aacute /acircumflex /atilde /adieresis /aring
/ae /ccedilla /egrave /eacute /ecircumflex
/edieresis /igrave /iacute /icircumflex /idieresis
/eth /ntilde /ograve /oacute /ocircumflex
/otilde /odieresis /divide /oslash /ugrave
/uacute /ucircumflex /udieresis /yacute /thorn
/ydieresis
] def
%%EndResource
%FOPBeginFontReencode
/Courier-Bold findfont
dup length dict begin
  {1 index /FID ne {def} {pop pop} ifelse} forall
  /Encoding WinAnsiEncoding def
  currentdict
end
/Courier-Bold exch definefont pop
/Helvetica findfont
dup length dict begin
  {1 index /FID ne {def} {pop pop} ifelse} forall
  /Encoding WinAnsiEncoding def
  currentdict
end
/Helvetica exch definefont pop
/Courier-BoldOblique findfont
dup length dict begin
  {1 index /FID ne {def} {pop pop} ifelse} forall
  /Encoding WinAnsiEncoding def
  currentdict
end
/Courier-BoldOblique exch definefont pop
/Courier-Oblique findfont
dup length dict begin
  {1 index /FID ne {def} {pop pop} ifelse} forall
  /Encoding WinAnsiEncoding def
  currentdict
end
/Courier-Oblique exch definefont pop
/Times-Roman findfont
dup length dict begin
  {1 index /FID ne {def} {pop pop} ifelse} forall
  /Encoding WinAnsiEncoding def
  currentdict
end
/Times-Roman exch definefont pop
/Helvetica-BoldOblique findfont
dup length dict begin
  {1 index /FID ne {def} {pop pop} ifelse} forall
  /Encoding WinAnsiEncoding def
  currentdict
end
/Helvetica-BoldOblique exch definefont pop
/Helvetica-Bold findfont
dup length dict begin
  {1 index /FID ne {def} {pop pop} ifelse} forall
  /Encoding WinAnsiEncoding def
  currentdict
end
/Helvetica-Bold exch definefont pop
/Helvetica-Oblique findfont
dup length dict begin
  {1 index /FID ne {def} {pop pop} ifelse} forall
  /Encoding WinAnsiEncoding def
  currentdict
end
/Helvetica-Oblique exch definefont pop
/Times-BoldItalic findfont
dup length dict begin
  {1 index /FID ne {def} {pop pop} ifelse} forall
  /Encoding WinAnsiEncoding def
  currentdict
end
/Times-BoldItalic exch definefont pop
/Courier findfont
dup length dict begin
  {1 index /FID ne {def} {pop pop} ifelse} forall
  /Encoding WinAnsiEncoding def
  currentdict
end
/Courier exch definefont pop
/Times-Italic findfont
dup length dict begin
  {1 index /FID ne {def} {pop pop} ifelse} forall
  /Encoding WinAnsiEncoding def
  currentdict
end
/Times-Italic exch definefont pop
/Times-Bold findfont
dup length dict begin
  {1 index /FID ne {def} {pop pop} ifelse} forall
  /Encoding WinAnsiEncoding def
  currentdict
end
/Times-Bold exch definefont pop
%FOPEndFontReencode
%%EndProlog
%%Page: 1 1
%%PageBoundingBox: 0 0 420 315
%%BeginPageSetup
[1 0 0 -1 0 315] CT
%%EndPageSetup
GS
[0.75 0 0 0.75 0 0] CT
1 GC
N
0 0 560 420 re
f
GR
GS
[0.75 0 0 0.75 0 0] CT
1 GC
N
0 0 560 420 re
f
GR
GS
[0.75 0 0 0.75 0 0] CT
1 GC
N
73 101 M
259 101 L
259 31 L
73 31 L
cp
f
GR
GS
[0.75 0 0 0.75 0 0] CT
0.149 GC
2 setlinecap
1 LJ
0.667 LW
N
73 101 M
259 101 L
S
GR
GS
[0.75 0 0 0.75 0 0] CT
0.149 GC
2 setlinecap
1 LJ
0.667 LW
N
73 31 M
259 31 L
S
GR
GS
[0.75 0 0 0.75 0 0] CT
0.149 GC
2 setlinecap
1 LJ
0.667 LW
N
73 101 M
73 99.14 L
S
GR
GS
[0.75 0 0 0.75 0 0] CT
0.149 GC
2 setlinecap
1 LJ
0.667 LW
N
110.2 101 M
110.2 99.14 L
S
GR
GS
[0.75 0 0 0.75 0 0] CT
0.149 GC
2 setlinecap
1 LJ
0.667 LW
N
147.4 101 M
147.4 99.14 L
S
GR
GS
[0.75 0 0 0.75 0 0] CT
0.149 GC
2 setlinecap
1 LJ
0.667 LW
N
184.6 101 M
184.6 99.14 L
S
GR
GS
[0.75 0 0 0.75 0 0] CT
0.149 GC
2 setlinecap
1 LJ
0.667 LW
N
221.8 101 M
221.8 99.14 L
S
GR
GS
[0.75 0 0 0.75 0 0] CT
0.149 GC
2 setlinecap
1 LJ
0.667 LW
N
259 101 M
259 99.14 L
S
GR
GS
[0.75 0 0 0.75 0 0] CT
0.149 GC
2 setlinecap
1 LJ
0.667 LW
N
73 31 M
73 32.86 L
S
GR
GS
[0.75 0 0 0.75 0 0] CT
0.149 GC
2 setlinecap
1 LJ
0.667 LW
N
110.2 31 M
110.2 32.86 L
S
GR
GS
[0.75 0 0 0.75 0 0] CT
0.149 GC
2 setlinecap
1 LJ
0.667 LW
N
147.4 31 M
147.4 32.86 L
S
GR
GS
[0.75 0 0 0.75 0 0] CT
0.149 GC
2 setlinecap
1 LJ
0.667 LW
N
184.6 31 M
184.6 32.86 L
S
GR
GS
[0.75 0 0 0.75 0 0] CT
0.149 GC
2 setlinecap
1 LJ
0.667 LW
N
221.8 31 M
221.8 32.86 L
S
GR
GS
[0.75 0 0 0.75 0 0] CT
0.149 GC
2 setlinecap
1 LJ
0.667 LW
N
259 31 M
259 32.86 L
S
GR
GS
[0.75 0 0 0.75 54.75 79.75] CT
0.149 GC
/Helvetica 13.333 F
GS
[1 0 0 1 0 0] CT
-4 14 moveto 
1 -1 scale
(0) t 
GR
GR
GS
[0.75 0 0 0.75 82.65 79.75] CT
0.149 GC
/Helvetica 13.333 F
GS
[1 0 0 1 0 0] CT
-11 14 moveto 
1 -1 scale
(100) t 
GR
GR
GS
[0.75 0 0 0.75 110.55 79.75] CT
0.149 GC
/Helvetica 13.333 F
GS
[1 0 0 1 0 0] CT
-11 14 moveto 
1 -1 scale
(200) t 
GR
GR
GS
[0.75 0 0 0.75 138.45 79.75] CT
0.149 GC
/Helvetica 13.333 F
GS
[1 0 0 1 0 0] CT
-11 14 moveto 
1 -1 scale
(300) t 
GR
GR
GS
[0.75 0 0 0.75 166.35 79.75] CT
0.149 GC
/Helvetica 13.333 F
GS
[1 0 0 1 0 0] CT
-11 14 moveto 
1 -1 scale
(400) t 
GR
GR
GS
[0.75 0 0 0.75 194.25 79.75] CT
0.149 GC
/Helvetica 13.333 F
GS
[1 0 0 1 0 0] CT
-11 14 moveto 
1 -1 scale
(500) t 
GR
GR
GS
[0.75 0 0 0.75 124.50007 93.5] CT
0.149 GC
/Helvetica 14.667 F
GS
[1 0 0 1 0 0] CT
-4 16 moveto 
1 -1 scale
(k) t 
GR
GR
GS
[0.75 0 0 0.75 0 0] CT
0.149 GC
2 setlinecap
1 LJ
0.667 LW
N
73 101 M
73 31 L
S
GR
GS
[0.75 0 0 0.75 0 0] CT
0.149 GC
2 setlinecap
1 LJ
0.667 LW
N
259 101 M
259 31 L
S
GR
GS
[0.75 0 0 0.75 0 0] CT
0.149 GC
2 setlinecap
1 LJ
0.667 LW
N
73 101 M
74.86 101 L
S
GR
GS
[0.75 0 0 0.75 0 0] CT
0.149 GC
2 setlinecap
1 LJ
0.667 LW
N
73 66 M
74.86 66 L
S
GR
GS
[0.75 0 0 0.75 0 0] CT
0.149 GC
2 setlinecap
1 LJ
0.667 LW
N
73 31 M
74.86 31 L
S
GR
GS
[0.75 0 0 0.75 0 0] CT
0.149 GC
2 setlinecap
1 LJ
0.667 LW
N
259 101 M
257.14 101 L
S
GR
GS
[0.75 0 0 0.75 0 0] CT
0.149 GC
2 setlinecap
1 LJ
0.667 LW
N
259 66 M
257.14 66 L
S
GR
GS
[0.75 0 0 0.75 0 0] CT
0.149 GC
2 setlinecap
1 LJ
0.667 LW
N
259 31 M
257.14 31 L
S
GR
GS
[0.75 0 0 0.75 50.75 75.75] CT
0.149 GC
/Helvetica 13.333 F
GS
[1 0 0 1 0 0] CT
-8 5.5 moveto 
1 -1 scale
(0) t 
GR
GR
GS
[0.75 0 0 0.75 50.75 49.5] CT
0.149 GC
/Helvetica 13.333 F
GS
[1 0 0 1 0 0] CT
-19 5.5 moveto 
1 -1 scale
(0.5) t 
GR
GR
GS
[0.75 0 0 0.75 50.75 23.25] CT
0.149 GC
/Helvetica 13.333 F
GS
[1 0 0 1 0 0] CT
-8 5.5 moveto 
1 -1 scale
(1) t 
GR
GR
GS
[0 -0.75 0.75 0 33.5 49.49998] CT
0.149 GC
/Helvetica 14.667 F
GS
[1 0 0 1 0 0] CT
-4 -4 moveto 
1 -1 scale
(y) t 
GR
GR
GS
[0.75 0 0 0.75 124.50011 21.1875] CT
/Helvetica-Bold 14.667 F
GS
[1 0 0 1 0 0] CT
-25.5 -4 moveto 
1 -1 scale
(Vstupy) t 
GR
GR
GS
[0.75 0 0 0.75 0 0] CT
0 0.447 0.741 RC
1 LJ
0.667 LW
N
73.372 31 M
73.744 101 L
74.116 101 L
74.488 101 L
74.86 101 L
75.232 101 L
75.604 101 L
75.976 101 L
76.348 101 L
76.72 101 L
77.092 101 L
77.464 101 L
77.836 101 L
78.208 101 L
78.58 101 L
78.952 101 L
79.324 101 L
79.696 101 L
80.068 101 L
80.44 101 L
80.812 101 L
81.184 101 L
81.556 101 L
81.928 101 L
82.3 101 L
82.672 101 L
83.044 101 L
83.416 101 L
83.788 101 L
84.16 101 L
84.532 101 L
84.904 101 L
85.276 101 L
85.648 101 L
86.02 101 L
86.392 101 L
86.764 101 L
87.136 101 L
87.508 101 L
87.88 101 L
88.252 101 L
88.624 101 L
88.996 101 L
89.368 101 L
89.74 101 L
90.112 101 L
90.484 101 L
90.856 101 L
91.228 101 L
91.6 101 L
91.972 101 L
92.344 101 L
92.716 101 L
93.088 101 L
93.46 101 L
93.832 101 L
94.204 101 L
94.576 101 L
94.948 101 L
95.32 101 L
95.692 101 L
96.064 101 L
96.436 101 L
96.808 101 L
97.18 101 L
97.552 101 L
97.924 101 L
98.296 101 L
98.668 101 L
99.04 101 L
99.412 101 L
99.784 101 L
100.156 101 L
100.528 101 L
100.9 101 L
101.272 101 L
101.644 101 L
102.016 101 L
102.388 101 L
102.76 101 L
103.132 101 L
103.504 101 L
103.876 101 L
104.248 101 L
104.62 101 L
104.992 101 L
105.364 101 L
105.736 101 L
106.108 101 L
106.48 101 L
106.852 101 L
107.224 101 L
107.596 101 L
107.968 101 L
108.34 101 L
108.712 101 L
109.084 101 L
109.456 101 L
109.828 101 L
110.2 101 L
110.572 101 L
110.944 101 L
111.316 101 L
111.688 101 L
112.06 101 L
112.432 101 L
112.804 101 L
113.176 101 L
113.548 101 L
113.92 101 L
114.292 101 L
114.664 101 L
115.036 101 L
115.408 101 L
115.78 101 L
116.152 101 L
116.524 101 L
116.896 101 L
117.268 101 L
117.64 101 L
118.012 101 L
118.384 101 L
118.756 101 L
119.128 101 L
119.5 101 L
119.872 101 L
120.244 101 L
120.616 101 L
120.988 101 L
121.36 101 L
121.732 101 L
122.104 101 L
122.476 101 L
122.848 101 L
123.22 101 L
123.592 101 L
123.964 101 L
124.336 101 L
124.708 101 L
125.08 101 L
125.452 101 L
125.824 101 L
126.196 101 L
126.568 101 L
126.94 101 L
127.312 101 L
127.684 101 L
128.056 101 L
128.428 101 L
128.8 101 L
129.172 101 L
129.544 101 L
129.916 101 L
130.288 101 L
130.66 101 L
131.032 101 L
131.404 101 L
131.776 101 L
132.148 101 L
132.52 101 L
132.892 101 L
133.264 101 L
133.636 101 L
134.008 101 L
134.38 101 L
134.752 101 L
135.124 101 L
135.496 101 L
135.868 101 L
136.24 101 L
136.612 101 L
136.984 101 L
137.356 101 L
137.728 101 L
138.1 101 L
138.472 101 L
138.844 101 L
139.216 101 L
139.588 101 L
139.96 101 L
140.332 101 L
140.704 101 L
141.076 101 L
141.448 101 L
141.82 101 L
142.192 101 L
142.564 101 L
142.936 101 L
143.308 101 L
143.68 101 L
144.052 101 L
144.424 101 L
144.796 101 L
145.168 101 L
145.54 101 L
145.912 101 L
146.284 101 L
146.656 101 L
147.028 101 L
147.4 101 L
147.772 101 L
148.144 101 L
148.516 101 L
148.888 101 L
149.26 101 L
149.632 101 L
150.004 101 L
150.376 101 L
150.748 101 L
151.12 101 L
151.492 101 L
151.864 101 L
152.236 101 L
152.608 101 L
152.98 101 L
153.352 101 L
153.724 101 L
154.096 101 L
154.468 101 L
154.84 101 L
155.212 101 L
155.584 101 L
155.956 101 L
156.328 101 L
156.7 101 L
157.072 101 L
157.444 101 L
157.816 101 L
158.188 101 L
158.56 101 L
158.932 101 L
159.304 101 L
159.676 101 L
160.048 101 L
160.42 101 L
160.792 101 L
161.164 101 L
161.536 101 L
161.908 101 L
162.28 101 L
162.652 101 L
163.024 101 L
163.396 101 L
163.768 101 L
164.14 101 L
164.512 101 L
164.884 101 L
165.256 101 L
165.628 101 L
166 101 L
166.372 101 L
166.744 101 L
167.116 101 L
167.488 101 L
167.86 101 L
168.232 101 L
168.604 101 L
168.976 101 L
169.348 101 L
169.72 101 L
170.092 101 L
170.464 101 L
170.836 101 L
171.208 101 L
171.58 101 L
171.952 101 L
172.324 101 L
172.696 101 L
173.068 101 L
173.44 101 L
173.812 101 L
174.184 101 L
174.556 101 L
174.928 101 L
175.3 101 L
175.672 101 L
176.044 101 L
176.416 101 L
176.788 101 L
177.16 101 L
177.532 101 L
177.904 101 L
178.276 101 L
178.648 101 L
179.02 101 L
179.392 101 L
179.764 101 L
180.136 101 L
180.508 101 L
180.88 101 L
181.252 101 L
181.624 101 L
181.996 101 L
182.368 101 L
182.74 101 L
183.112 101 L
183.484 101 L
183.856 101 L
184.228 101 L
184.6 101 L
184.972 101 L
185.344 101 L
185.716 101 L
186.088 101 L
186.46 101 L
186.832 101 L
187.204 101 L
187.576 101 L
187.948 101 L
188.32 101 L
188.692 101 L
189.064 101 L
189.436 101 L
189.808 101 L
190.18 101 L
190.552 101 L
190.924 101 L
191.296 101 L
191.668 101 L
192.04 101 L
192.412 101 L
192.784 101 L
193.156 101 L
193.528 101 L
193.9 101 L
194.272 101 L
194.644 101 L
195.016 101 L
195.388 101 L
195.76 101 L
196.132 101 L
196.504 101 L
196.876 101 L
197.248 101 L
197.62 101 L
197.992 101 L
198.364 101 L
198.736 101 L
199.108 101 L
199.48 101 L
199.852 101 L
200.224 101 L
200.596 101 L
200.968 101 L
201.34 101 L
201.712 101 L
202.084 101 L
202.456 101 L
202.828 101 L
203.2 101 L
203.572 101 L
203.944 101 L
204.316 101 L
204.688 101 L
205.06 101 L
205.432 101 L
205.804 101 L
206.176 101 L
206.548 101 L
206.92 101 L
207.292 101 L
207.664 101 L
208.036 101 L
208.408 101 L
208.78 101 L
209.152 101 L
209.524 101 L
209.896 101 L
210.268 101 L
210.64 101 L
211.012 101 L
211.384 101 L
211.756 101 L
212.128 101 L
212.5 101 L
212.872 101 L
213.244 101 L
213.616 101 L
213.988 101 L
214.36 101 L
214.732 101 L
215.104 101 L
215.476 101 L
215.848 101 L
216.22 101 L
216.592 101 L
216.964 101 L
217.336 101 L
217.708 101 L
218.08 101 L
218.452 101 L
218.824 101 L
219.196 101 L
219.568 101 L
219.94 101 L
220.312 101 L
220.684 101 L
221.056 101 L
221.428 101 L
221.8 101 L
222.172 101 L
222.544 101 L
222.916 101 L
223.288 101 L
223.66 101 L
224.032 101 L
224.404 101 L
224.776 101 L
225.148 101 L
225.52 101 L
225.892 101 L
226.264 101 L
226.636 101 L
227.008 101 L
227.38 101 L
227.752 101 L
228.124 101 L
228.496 101 L
228.868 101 L
229.24 101 L
229.612 101 L
229.984 101 L
230.356 101 L
230.728 101 L
231.1 101 L
231.472 101 L
231.844 101 L
232.216 101 L
232.588 101 L
232.96 101 L
233.332 101 L
233.704 101 L
234.076 101 L
234.448 101 L
234.82 101 L
235.192 101 L
235.564 101 L
235.936 101 L
236.308 101 L
236.68 101 L
237.052 101 L
237.424 101 L
237.796 101 L
238.168 101 L
238.54 101 L
238.912 101 L
239.284 101 L
239.656 101 L
240.028 101 L
240.4 101 L
240.772 101 L
241.144 101 L
241.516 101 L
241.888 101 L
242.26 101 L
242.632 101 L
243.004 101 L
243.376 101 L
243.748 101 L
244.12 101 L
244.492 101 L
244.864 101 L
245.236 101 L
245.608 101 L
245.98 101 L
246.352 101 L
246.724 101 L
247.096 101 L
247.468 101 L
247.84 101 L
248.212 101 L
248.584 101 L
248.956 101 L
249.328 101 L
249.7 101 L
250.072 101 L
250.444 101 L
250.816 101 L
251.188 101 L
251.56 101 L
251.932 101 L
252.304 101 L
252.676 101 L
253.048 101 L
253.42 101 L
253.792 101 L
254.164 101 L
254.536 101 L
254.908 101 L
255.28 101 L
255.652 101 L
256.024 101 L
256.396 101 L
256.768 101 L
257.14 101 L
257.512 101 L
257.884 101 L
258.256 101 L
258.628 101 L
259 101 L
S
GR
GS
[0.75 0 0 0.75 0 0] CT
1 GC
N
73 227 M
259 227 L
259 157 L
73 157 L
cp
f
GR
GS
[0.75 0 0 0.75 0 0] CT
0.149 GC
2 setlinecap
1 LJ
0.667 LW
N
73 227 M
259 227 L
S
GR
GS
[0.75 0 0 0.75 0 0] CT
0.149 GC
2 setlinecap
1 LJ
0.667 LW
N
73 157 M
259 157 L
S
GR
GS
[0.75 0 0 0.75 0 0] CT
0.149 GC
2 setlinecap
1 LJ
0.667 LW
N
73 227 M
73 225.14 L
S
GR
GS
[0.75 0 0 0.75 0 0] CT
0.149 GC
2 setlinecap
1 LJ
0.667 LW
N
110.2 227 M
110.2 225.14 L
S
GR
GS
[0.75 0 0 0.75 0 0] CT
0.149 GC
2 setlinecap
1 LJ
0.667 LW
N
147.4 227 M
147.4 225.14 L
S
GR
GS
[0.75 0 0 0.75 0 0] CT
0.149 GC
2 setlinecap
1 LJ
0.667 LW
N
184.6 227 M
184.6 225.14 L
S
GR
GS
[0.75 0 0 0.75 0 0] CT
0.149 GC
2 setlinecap
1 LJ
0.667 LW
N
221.8 227 M
221.8 225.14 L
S
GR
GS
[0.75 0 0 0.75 0 0] CT
0.149 GC
2 setlinecap
1 LJ
0.667 LW
N
259 227 M
259 225.14 L
S
GR
GS
[0.75 0 0 0.75 0 0] CT
0.149 GC
2 setlinecap
1 LJ
0.667 LW
N
73 157 M
73 158.86 L
S
GR
GS
[0.75 0 0 0.75 0 0] CT
0.149 GC
2 setlinecap
1 LJ
0.667 LW
N
110.2 157 M
110.2 158.86 L
S
GR
GS
[0.75 0 0 0.75 0 0] CT
0.149 GC
2 setlinecap
1 LJ
0.667 LW
N
147.4 157 M
147.4 158.86 L
S
GR
GS
[0.75 0 0 0.75 0 0] CT
0.149 GC
2 setlinecap
1 LJ
0.667 LW
N
184.6 157 M
184.6 158.86 L
S
GR
GS
[0.75 0 0 0.75 0 0] CT
0.149 GC
2 setlinecap
1 LJ
0.667 LW
N
221.8 157 M
221.8 158.86 L
S
GR
GS
[0.75 0 0 0.75 0 0] CT
0.149 GC
2 setlinecap
1 LJ
0.667 LW
N
259 157 M
259 158.86 L
S
GR
GS
[0.75 0 0 0.75 54.75 174.25] CT
0.149 GC
/Helvetica 13.333 F
GS
[1 0 0 1 0 0] CT
-4 14 moveto 
1 -1 scale
(0) t 
GR
GR
GS
[0.75 0 0 0.75 82.65 174.25] CT
0.149 GC
/Helvetica 13.333 F
GS
[1 0 0 1 0 0] CT
-11 14 moveto 
1 -1 scale
(100) t 
GR
GR
GS
[0.75 0 0 0.75 110.55 174.25] CT
0.149 GC
/Helvetica 13.333 F
GS
[1 0 0 1 0 0] CT
-11 14 moveto 
1 -1 scale
(200) t 
GR
GR
GS
[0.75 0 0 0.75 138.45 174.25] CT
0.149 GC
/Helvetica 13.333 F
GS
[1 0 0 1 0 0] CT
-11 14 moveto 
1 -1 scale
(300) t 
GR
GR
GS
[0.75 0 0 0.75 166.35 174.25] CT
0.149 GC
/Helvetica 13.333 F
GS
[1 0 0 1 0 0] CT
-11 14 moveto 
1 -1 scale
(400) t 
GR
GR
GS
[0.75 0 0 0.75 194.25 174.25] CT
0.149 GC
/Helvetica 13.333 F
GS
[1 0 0 1 0 0] CT
-11 14 moveto 
1 -1 scale
(500) t 
GR
GR
GS
[0.75 0 0 0.75 124.50007 188] CT
0.149 GC
/Helvetica 14.667 F
GS
[1 0 0 1 0 0] CT
-4 16 moveto 
1 -1 scale
(k) t 
GR
GR
GS
[0.75 0 0 0.75 0 0] CT
0.149 GC
2 setlinecap
1 LJ
0.667 LW
N
73 227 M
73 157 L
S
GR
GS
[0.75 0 0 0.75 0 0] CT
0.149 GC
2 setlinecap
1 LJ
0.667 LW
N
259 227 M
259 157 L
S
GR
GS
[0.75 0 0 0.75 0 0] CT
0.149 GC
2 setlinecap
1 LJ
0.667 LW
N
73 227 M
74.86 227 L
S
GR
GS
[0.75 0 0 0.75 0 0] CT
0.149 GC
2 setlinecap
1 LJ
0.667 LW
N
73 192 M
74.86 192 L
S
GR
GS
[0.75 0 0 0.75 0 0] CT
0.149 GC
2 setlinecap
1 LJ
0.667 LW
N
73 157 M
74.86 157 L
S
GR
GS
[0.75 0 0 0.75 0 0] CT
0.149 GC
2 setlinecap
1 LJ
0.667 LW
N
259 227 M
257.14 227 L
S
GR
GS
[0.75 0 0 0.75 0 0] CT
0.149 GC
2 setlinecap
1 LJ
0.667 LW
N
259 192 M
257.14 192 L
S
GR
GS
[0.75 0 0 0.75 0 0] CT
0.149 GC
2 setlinecap
1 LJ
0.667 LW
N
259 157 M
257.14 157 L
S
GR
GS
[0.75 0 0 0.75 50.75 170.25] CT
0.149 GC
/Helvetica 13.333 F
GS
[1 0 0 1 0 0] CT
-8 5.5 moveto 
1 -1 scale
(0) t 
GR
GR
GS
[0.75 0 0 0.75 50.75 144] CT
0.149 GC
/Helvetica 13.333 F
GS
[1 0 0 1 0 0] CT
-8 5.5 moveto 
1 -1 scale
(1) t 
GR
GR
GS
[0.75 0 0 0.75 50.75 117.75] CT
0.149 GC
/Helvetica 13.333 F
GS
[1 0 0 1 0 0] CT
-8 5.5 moveto 
1 -1 scale
(2) t 
GR
GR
GS
[0 -0.75 0.75 0 41.75 143.99998] CT
0.149 GC
/Helvetica 14.667 F
GS
[1 0 0 1 0 0] CT
-4 -4 moveto 
1 -1 scale
(y) t 
GR
GR
GS
[0.75 0 0 0.75 0 0] CT
0 0.447 0.741 RC
1 LJ
0.667 LW
N
73.372 192 M
73.744 192 L
74.116 192 L
74.488 192 L
74.86 192 L
75.232 192 L
75.604 192 L
75.976 192 L
76.348 192 L
76.72 192 L
77.092 192 L
77.464 192 L
77.836 192 L
78.208 192 L
78.58 192 L
78.952 192 L
79.324 192 L
79.696 192 L
80.068 192 L
80.44 192 L
80.812 192 L
81.184 192 L
81.556 192 L
81.928 192 L
82.3 192 L
82.672 192 L
83.044 192 L
83.416 192 L
83.788 192 L
84.16 192 L
84.532 192 L
84.904 192 L
85.276 192 L
85.648 192 L
86.02 192 L
86.392 192 L
86.764 192 L
87.136 192 L
87.508 192 L
87.88 192 L
88.252 192 L
88.624 192 L
88.996 192 L
89.368 192 L
89.74 192 L
90.112 192 L
90.484 192 L
90.856 192 L
91.228 192 L
91.6 192 L
91.972 192 L
92.344 192 L
92.716 192 L
93.088 192 L
93.46 192 L
93.832 192 L
94.204 192 L
94.576 192 L
94.948 192 L
95.32 192 L
95.692 192 L
96.064 192 L
96.436 192 L
96.808 192 L
97.18 192 L
97.552 192 L
97.924 192 L
98.296 192 L
98.668 192 L
99.04 192 L
99.412 192 L
99.784 192 L
100.156 192 L
100.528 192 L
100.9 192 L
101.272 192 L
101.644 192 L
102.016 192 L
102.388 192 L
102.76 192 L
103.132 192 L
103.504 192 L
103.876 192 L
104.248 192 L
104.62 192 L
104.992 192 L
105.364 192 L
105.736 192 L
106.108 192 L
106.48 192 L
106.852 192 L
107.224 192 L
107.596 192 L
107.968 192 L
108.34 192 L
108.712 192 L
109.084 192 L
109.456 192 L
109.828 192 L
110.2 192 L
110.572 192 L
110.944 192 L
111.316 192 L
111.688 192 L
112.06 192 L
112.432 192 L
112.804 192 L
113.176 192 L
113.548 192 L
113.92 192 L
114.292 192 L
114.664 192 L
115.036 192 L
115.408 192 L
115.78 192 L
116.152 192 L
116.524 192 L
116.896 192 L
117.268 192 L
117.64 192 L
118.012 192 L
118.384 192 L
118.756 192 L
119.128 192 L
119.5 192 L
119.872 192 L
120.244 192 L
120.616 192 L
120.988 192 L
121.36 192 L
121.732 192 L
122.104 192 L
122.476 192 L
122.848 192 L
123.22 192 L
123.592 192 L
123.964 192 L
124.336 192 L
124.708 192 L
125.08 192 L
125.452 192 L
125.824 192 L
126.196 192 L
126.568 192 L
126.94 192 L
127.312 192 L
127.684 192 L
128.056 192 L
128.428 192 L
128.8 192 L
129.172 192 L
129.544 192 L
129.916 192 L
130.288 192 L
130.66 192 L
131.032 192 L
131.404 192 L
131.776 192 L
132.148 192 L
132.52 192 L
132.892 192 L
133.264 192 L
133.636 192 L
134.008 192 L
134.38 192 L
134.752 192 L
135.124 192 L
135.496 192 L
135.868 192 L
136.24 192 L
136.612 192 L
136.984 192 L
137.356 192 L
137.728 192 L
138.1 192 L
138.472 192 L
138.844 192 L
139.216 192 L
139.588 192 L
139.96 192 L
140.332 192 L
140.704 192 L
141.076 192 L
141.448 192 L
141.82 192 L
142.192 192 L
142.564 192 L
142.936 192 L
143.308 192 L
143.68 192 L
144.052 192 L
144.424 192 L
144.796 192 L
145.168 192 L
145.54 192 L
145.912 192 L
146.284 192 L
146.656 192 L
147.028 192 L
147.4 192 L
147.772 192 L
148.144 192 L
148.516 192 L
148.888 192 L
149.26 192 L
149.632 192 L
150.004 192 L
150.376 192 L
150.748 192 L
151.12 192 L
151.492 192 L
151.864 192 L
152.236 192 L
152.608 192 L
152.98 192 L
153.352 192 L
153.724 192 L
154.096 192 L
154.468 192 L
154.84 192 L
155.212 192 L
155.584 192 L
155.956 192 L
156.328 192 L
156.7 192 L
157.072 192 L
157.444 192 L
157.816 192 L
158.188 192 L
158.56 192 L
158.932 192 L
159.304 192 L
159.676 192 L
160.048 192 L
160.42 192 L
160.792 192 L
161.164 192 L
161.536 192 L
161.908 192 L
162.28 192 L
162.652 192 L
163.024 192 L
163.396 192 L
163.768 192 L
164.14 192 L
164.512 192 L
164.884 192 L
165.256 192 L
165.628 192 L
166 192 L
166.372 192 L
166.744 192 L
167.116 192 L
167.488 192 L
167.86 192 L
168.232 192 L
168.604 192 L
168.976 192 L
169.348 192 L
169.72 192 L
170.092 192 L
170.464 192 L
170.836 192 L
171.208 192 L
171.58 192 L
171.952 192 L
172.324 192 L
172.696 192 L
173.068 192 L
173.44 192 L
173.812 192 L
174.184 192 L
174.556 192 L
174.928 192 L
175.3 192 L
175.672 192 L
176.044 192 L
176.416 192 L
176.788 192 L
177.16 192 L
177.532 192 L
177.904 192 L
178.276 192 L
178.648 192 L
179.02 192 L
179.392 192 L
179.764 192 L
180.136 192 L
180.508 192 L
180.88 192 L
181.252 192 L
181.624 192 L
181.996 192 L
182.368 192 L
182.74 192 L
183.112 192 L
183.484 192 L
183.856 192 L
184.228 192 L
184.6 192 L
184.972 192 L
185.344 192 L
185.716 192 L
186.088 192 L
186.46 192 L
186.832 192 L
187.204 192 L
187.576 192 L
187.948 192 L
188.32 192 L
188.692 192 L
189.064 192 L
189.436 192 L
189.808 192 L
190.18 192 L
190.552 192 L
190.924 192 L
191.296 192 L
191.668 192 L
192.04 192 L
192.412 192 L
192.784 192 L
193.156 192 L
193.528 192 L
193.9 192 L
194.272 192 L
194.644 192 L
195.016 192 L
195.388 192 L
195.76 192 L
196.132 192 L
196.504 192 L
196.876 192 L
197.248 192 L
197.62 192 L
197.992 192 L
198.364 192 L
198.736 192 L
199.108 192 L
199.48 192 L
199.852 192 L
200.224 192 L
200.596 192 L
200.968 192 L
201.34 192 L
201.712 192 L
202.084 192 L
202.456 192 L
202.828 192 L
203.2 192 L
203.572 192 L
203.944 192 L
204.316 192 L
204.688 192 L
205.06 192 L
205.432 192 L
205.804 192 L
206.176 192 L
206.548 192 L
206.92 192 L
207.292 192 L
207.664 192 L
208.036 192 L
208.408 192 L
208.78 192 L
209.152 192 L
209.524 192 L
209.896 192 L
210.268 192 L
210.64 192 L
211.012 192 L
211.384 192 L
211.756 192 L
212.128 192 L
212.5 192 L
212.872 192 L
213.244 192 L
213.616 192 L
213.988 192 L
214.36 192 L
214.732 192 L
215.104 192 L
215.476 192 L
215.848 192 L
216.22 192 L
216.592 192 L
216.964 192 L
217.336 192 L
217.708 192 L
218.08 192 L
218.452 192 L
218.824 192 L
219.196 192 L
219.568 192 L
219.94 192 L
220.312 192 L
220.684 192 L
221.056 192 L
221.428 192 L
221.8 192 L
222.172 192 L
222.544 192 L
222.916 192 L
223.288 192 L
223.66 192 L
224.032 192 L
224.404 192 L
224.776 192 L
225.148 192 L
225.52 192 L
225.892 192 L
226.264 192 L
226.636 192 L
227.008 192 L
227.38 192 L
227.752 192 L
228.124 192 L
228.496 192 L
228.868 192 L
229.24 192 L
229.612 192 L
229.984 192 L
230.356 192 L
230.728 192 L
231.1 192 L
231.472 192 L
231.844 192 L
232.216 192 L
232.588 192 L
232.96 192 L
233.332 192 L
233.704 192 L
234.076 192 L
234.448 192 L
234.82 192 L
235.192 192 L
235.564 192 L
235.936 192 L
236.308 192 L
236.68 192 L
237.052 192 L
237.424 192 L
237.796 192 L
238.168 192 L
238.54 192 L
238.912 192 L
239.284 192 L
239.656 192 L
240.028 192 L
240.4 192 L
240.772 192 L
241.144 192 L
241.516 192 L
241.888 192 L
242.26 192 L
242.632 192 L
243.004 192 L
243.376 192 L
243.748 192 L
244.12 192 L
244.492 192 L
244.864 192 L
245.236 192 L
245.608 192 L
245.98 192 L
246.352 192 L
246.724 192 L
247.096 192 L
247.468 192 L
247.84 192 L
248.212 192 L
248.584 192 L
248.956 192 L
249.328 192 L
249.7 192 L
250.072 192 L
250.444 192 L
250.816 192 L
251.188 192 L
251.56 192 L
251.932 192 L
252.304 192 L
252.676 192 L
253.048 192 L
253.42 192 L
253.792 192 L
254.164 192 L
254.536 192 L
254.908 192 L
255.28 192 L
255.652 192 L
256.024 192 L
256.396 192 L
256.768 192 L
257.14 192 L
257.512 192 L
257.884 192 L
258.256 192 L
258.628 192 L
259 192 L
S
GR
GS
[0.75 0 0 0.75 0 0] CT
1 GC
N
73 353 M
259 353 L
259 283 L
73 283 L
cp
f
GR
GS
[0.75 0 0 0.75 0 0] CT
0.149 GC
2 setlinecap
1 LJ
0.667 LW
N
73 353 M
259 353 L
S
GR
GS
[0.75 0 0 0.75 0 0] CT
0.149 GC
2 setlinecap
1 LJ
0.667 LW
N
73 283 M
259 283 L
S
GR
GS
[0.75 0 0 0.75 0 0] CT
0.149 GC
2 setlinecap
1 LJ
0.667 LW
N
73 353 M
73 351.14 L
S
GR
GS
[0.75 0 0 0.75 0 0] CT
0.149 GC
2 setlinecap
1 LJ
0.667 LW
N
110.2 353 M
110.2 351.14 L
S
GR
GS
[0.75 0 0 0.75 0 0] CT
0.149 GC
2 setlinecap
1 LJ
0.667 LW
N
147.4 353 M
147.4 351.14 L
S
GR
GS
[0.75 0 0 0.75 0 0] CT
0.149 GC
2 setlinecap
1 LJ
0.667 LW
N
184.6 353 M
184.6 351.14 L
S
GR
GS
[0.75 0 0 0.75 0 0] CT
0.149 GC
2 setlinecap
1 LJ
0.667 LW
N
221.8 353 M
221.8 351.14 L
S
GR
GS
[0.75 0 0 0.75 0 0] CT
0.149 GC
2 setlinecap
1 LJ
0.667 LW
N
259 353 M
259 351.14 L
S
GR
GS
[0.75 0 0 0.75 0 0] CT
0.149 GC
2 setlinecap
1 LJ
0.667 LW
N
73 283 M
73 284.86 L
S
GR
GS
[0.75 0 0 0.75 0 0] CT
0.149 GC
2 setlinecap
1 LJ
0.667 LW
N
110.2 283 M
110.2 284.86 L
S
GR
GS
[0.75 0 0 0.75 0 0] CT
0.149 GC
2 setlinecap
1 LJ
0.667 LW
N
147.4 283 M
147.4 284.86 L
S
GR
GS
[0.75 0 0 0.75 0 0] CT
0.149 GC
2 setlinecap
1 LJ
0.667 LW
N
184.6 283 M
184.6 284.86 L
S
GR
GS
[0.75 0 0 0.75 0 0] CT
0.149 GC
2 setlinecap
1 LJ
0.667 LW
N
221.8 283 M
221.8 284.86 L
S
GR
GS
[0.75 0 0 0.75 0 0] CT
0.149 GC
2 setlinecap
1 LJ
0.667 LW
N
259 283 M
259 284.86 L
S
GR
GS
[0.75 0 0 0.75 54.75 268.75001] CT
0.149 GC
/Helvetica 13.333 F
GS
[1 0 0 1 0 0] CT
-4 14 moveto 
1 -1 scale
(0) t 
GR
GR
GS
[0.75 0 0 0.75 82.65 268.75001] CT
0.149 GC
/Helvetica 13.333 F
GS
[1 0 0 1 0 0] CT
-11 14 moveto 
1 -1 scale
(100) t 
GR
GR
GS
[0.75 0 0 0.75 110.55 268.75001] CT
0.149 GC
/Helvetica 13.333 F
GS
[1 0 0 1 0 0] CT
-11 14 moveto 
1 -1 scale
(200) t 
GR
GR
GS
[0.75 0 0 0.75 138.45 268.75001] CT
0.149 GC
/Helvetica 13.333 F
GS
[1 0 0 1 0 0] CT
-11 14 moveto 
1 -1 scale
(300) t 
GR
GR
GS
[0.75 0 0 0.75 166.35 268.75001] CT
0.149 GC
/Helvetica 13.333 F
GS
[1 0 0 1 0 0] CT
-11 14 moveto 
1 -1 scale
(400) t 
GR
GR
GS
[0.75 0 0 0.75 194.25 268.75001] CT
0.149 GC
/Helvetica 13.333 F
GS
[1 0 0 1 0 0] CT
-11 14 moveto 
1 -1 scale
(500) t 
GR
GR
GS
[0.75 0 0 0.75 124.50007 282.49999] CT
0.149 GC
/Helvetica 14.667 F
GS
[1 0 0 1 0 0] CT
-4 16 moveto 
1 -1 scale
(k) t 
GR
GR
GS
[0.75 0 0 0.75 0 0] CT
0.149 GC
2 setlinecap
1 LJ
0.667 LW
N
73 353 M
73 283 L
S
GR
GS
[0.75 0 0 0.75 0 0] CT
0.149 GC
2 setlinecap
1 LJ
0.667 LW
N
259 353 M
259 283 L
S
GR
GS
[0.75 0 0 0.75 0 0] CT
0.149 GC
2 setlinecap
1 LJ
0.667 LW
N
73 353 M
74.86 353 L
S
GR
GS
[0.75 0 0 0.75 0 0] CT
0.149 GC
2 setlinecap
1 LJ
0.667 LW
N
73 318 M
74.86 318 L
S
GR
GS
[0.75 0 0 0.75 0 0] CT
0.149 GC
2 setlinecap
1 LJ
0.667 LW
N
73 283 M
74.86 283 L
S
GR
GS
[0.75 0 0 0.75 0 0] CT
0.149 GC
2 setlinecap
1 LJ
0.667 LW
N
259 353 M
257.14 353 L
S
GR
GS
[0.75 0 0 0.75 0 0] CT
0.149 GC
2 setlinecap
1 LJ
0.667 LW
N
259 318 M
257.14 318 L
S
GR
GS
[0.75 0 0 0.75 0 0] CT
0.149 GC
2 setlinecap
1 LJ
0.667 LW
N
259 283 M
257.14 283 L
S
GR
GS
[0.75 0 0 0.75 50.75 264.75] CT
0.149 GC
/Helvetica 13.333 F
GS
[1 0 0 1 0 0] CT
-12 5.5 moveto 
1 -1 scale
(-5) t 
GR
GR
GS
[0.75 0 0 0.75 50.75 238.5] CT
0.149 GC
/Helvetica 13.333 F
GS
[1 0 0 1 0 0] CT
-8 5.5 moveto 
1 -1 scale
(0) t 
GR
GR
GS
[0.75 0 0 0.75 50.75 212.25] CT
0.149 GC
/Helvetica 13.333 F
GS
[1 0 0 1 0 0] CT
-8 5.5 moveto 
1 -1 scale
(5) t 
GR
GR
GS
[0 -0.75 0.75 0 38.75 238.49998] CT
0.149 GC
/Helvetica 14.667 F
GS
[1 0 0 1 0 0] CT
-4 -4 moveto 
1 -1 scale
(y) t 
GR
GR
GS
[0.75 0 0 0.75 0 0] CT
0 0.447 0.741 RC
1 LJ
0.667 LW
N
73.372 311.906 M
73.744 315.685 L
74.116 327.435 L
74.488 307.165 L
74.86 322.316 L
75.232 322.89 L
75.604 327.965 L
75.976 318.767 L
76.348 318.719 L
76.72 320.259 L
77.092 323.877 L
77.464 329.624 L
77.836 296.913 L
78.208 307.494 L
78.58 320.513 L
78.952 318.804 L
79.324 315.488 L
79.696 318.085 L
80.068 321.993 L
80.44 311.462 L
80.812 325.968 L
81.184 304.299 L
81.556 330.343 L
81.928 320.263 L
82.3 311.892 L
82.672 317.175 L
83.044 328.521 L
83.416 311.547 L
83.788 316.857 L
84.16 323.703 L
84.532 315.174 L
84.904 312.707 L
85.276 302.709 L
85.648 318.656 L
86.02 320.059 L
86.392 321.534 L
86.764 331.489 L
87.136 314.35 L
87.508 332.381 L
87.88 319.889 L
88.252 319.925 L
88.624 312.084 L
88.996 337.398 L
89.368 311.573 L
89.74 321.635 L
90.112 327.051 L
90.484 318.061 L
90.856 316.367 L
91.228 320.969 L
91.6 328.286 L
91.972 309.555 L
92.344 316.619 L
92.716 322.948 L
93.088 309.485 L
93.46 315.43 L
93.832 326.873 L
94.204 313.653 L
94.576 330.568 L
94.948 325.405 L
95.32 316.939 L
95.692 315.121 L
96.064 317.507 L
96.436 331.531 L
96.808 312.269 L
97.18 309.168 L
97.552 309.829 L
97.924 321.992 L
98.296 320.757 L
98.668 325.122 L
99.04 316.249 L
99.412 316.235 L
99.784 323.4 L
100.156 311.563 L
100.528 312.035 L
100.9 313.4 L
101.272 323.274 L
101.644 327.37 L
102.016 313.434 L
102.388 307.869 L
102.76 327.031 L
103.132 333.457 L
103.504 307.947 L
103.876 318.432 L
104.248 309.755 L
104.62 311.101 L
104.992 326.53 L
105.364 321.023 L
105.736 323.845 L
106.108 316.742 L
106.48 309.836 L
106.852 317.608 L
107.224 332.7 L
107.596 309.353 L
107.968 317.981 L
108.34 321.217 L
108.712 332.722 L
109.084 315.383 L
109.456 316.284 L
109.828 315.63 L
110.2 325.546 L
110.572 323.111 L
110.944 324.414 L
111.316 305.487 L
111.688 323.743 L
112.06 319.377 L
112.432 324.231 L
112.804 311.625 L
113.176 318.086 L
113.548 317.49 L
113.92 311.424 L
114.292 313.273 L
114.664 312.498 L
115.036 332.929 L
115.408 316.46 L
115.78 311.236 L
116.152 315.55 L
116.524 311.687 L
116.896 303.152 L
117.268 309.26 L
117.64 325.862 L
118.012 323.811 L
118.384 318.852 L
118.756 322.498 L
119.128 318.553 L
119.5 309.403 L
119.872 321.72 L
120.244 320.003 L
120.616 319.593 L
120.988 313.278 L
121.36 310.742 L
121.732 319.046 L
122.104 320.22 L
122.476 311.465 L
122.848 312.937 L
123.22 314.583 L
123.592 295.137 L
123.964 317.778 L
124.336 315.611 L
124.708 318.585 L
125.08 313.685 L
125.452 321.675 L
125.824 310.946 L
126.196 305.196 L
126.568 317.403 L
126.94 318.478 L
127.312 321.944 L
127.684 321.315 L
128.056 329.925 L
128.428 318.376 L
128.8 324.169 L
129.172 309.209 L
129.544 316.909 L
129.916 317.615 L
130.288 308.21 L
130.66 330.43 L
131.032 315.692 L
131.404 325.405 L
131.776 322.504 L
132.148 316.191 L
132.52 311.758 L
132.892 323.856 L
133.264 314.128 L
133.636 307.791 L
134.008 323.986 L
134.38 324.945 L
134.752 318.082 L
135.124 313.612 L
135.496 317.99 L
135.868 323.714 L
136.24 317.194 L
136.612 316.551 L
136.984 321.112 L
137.356 325.843 L
137.728 314.952 L
138.1 317.88 L
138.472 320.541 L
138.844 322.419 L
139.216 321.502 L
139.588 324.07 L
139.96 325.281 L
140.332 309.142 L
140.704 319.69 L
141.076 330.103 L
141.448 321.418 L
141.82 310.577 L
142.192 321.767 L
142.564 305.559 L
142.936 323.457 L
143.308 323.271 L
143.68 325.232 L
144.052 309.853 L
144.424 322.061 L
144.796 315.079 L
145.168 329.537 L
145.54 322.009 L
145.912 313.385 L
146.284 326.963 L
146.656 317.649 L
147.028 314.161 L
147.4 305.551 L
147.772 313.512 L
148.144 311.373 L
148.516 320.48 L
148.888 322.052 L
149.26 317.605 L
149.632 324.253 L
150.004 310.145 L
150.376 312.569 L
150.748 311.263 L
151.12 309.174 L
151.492 318.755 L
151.864 322.04 L
152.236 314.321 L
152.608 309.936 L
152.98 311.991 L
153.352 311.381 L
153.724 307.457 L
154.096 315.933 L
154.468 309.571 L
154.84 318.083 L
155.212 312.474 L
155.584 327.825 L
155.956 307.205 L
156.328 330.424 L
156.7 316.56 L
157.072 320.423 L
157.444 326.113 L
157.816 315.649 L
158.188 315.674 L
158.56 308.122 L
158.932 317.042 L
159.304 313.957 L
159.676 316.298 L
160.048 307.726 L
160.42 310.086 L
160.792 317.925 L
161.164 317.13 L
161.536 305.544 L
161.908 319.676 L
162.28 311.994 L
162.652 324.148 L
163.024 323.334 L
163.396 311.961 L
163.768 313.462 L
164.14 310.593 L
164.512 322.432 L
164.884 310.874 L
165.256 316.797 L
165.628 318.332 L
166 306.176 L
166.372 307.941 L
166.744 333.758 L
167.116 315.505 L
167.488 323.952 L
167.86 320.097 L
168.232 322.44 L
168.604 306.629 L
168.976 309.313 L
169.348 314.113 L
169.72 313.076 L
170.092 314.793 L
170.464 313.212 L
170.836 316.241 L
171.208 319.25 L
171.58 314.446 L
171.952 320.169 L
172.324 320.761 L
172.696 319.888 L
173.068 318.617 L
173.44 317.944 L
173.812 300.277 L
174.184 326.563 L
174.556 325.502 L
174.928 316.278 L
175.3 318.354 L
175.672 323.111 L
176.044 315.711 L
176.416 312.729 L
176.788 326.076 L
177.16 320.855 L
177.532 327.015 L
177.904 317.415 L
178.276 316.853 L
178.648 313.222 L
179.02 325.605 L
179.392 315.918 L
179.764 319.003 L
180.136 308.256 L
180.508 315.853 L
180.88 321.76 L
181.252 319.603 L
181.624 321.754 L
181.996 307.927 L
182.368 321.578 L
182.74 329.248 L
183.112 319.409 L
183.484 309.995 L
183.856 313.357 L
184.228 316.851 L
184.6 305.502 L
184.972 322.114 L
185.344 316.187 L
185.716 324.103 L
186.088 323.515 L
186.46 320.41 L
186.832 313.467 L
187.204 303.621 L
187.576 312.407 L
187.948 325.498 L
188.32 319.436 L
188.692 321.881 L
189.064 320.051 L
189.436 309.738 L
189.808 315.358 L
190.18 311.059 L
190.552 313.776 L
190.924 323.55 L
191.296 311.484 L
191.668 327.453 L
192.04 312.401 L
192.412 313.803 L
192.784 310.297 L
193.156 327.938 L
193.528 319.425 L
193.9 317.875 L
194.272 317.298 L
194.644 311.866 L
195.016 313.095 L
195.388 313.436 L
195.76 316.75 L
196.132 306.268 L
196.504 320.276 L
196.876 317.292 L
197.248 322.037 L
197.62 318.431 L
197.992 312.921 L
198.364 326.591 L
198.736 316.663 L
199.108 323.144 L
199.48 312.481 L
199.852 331.758 L
200.224 331.689 L
200.596 306.63 L
200.968 319.046 L
201.34 331.778 L
201.712 329.803 L
202.084 318.608 L
202.456 315.848 L
202.828 315.637 L
203.2 310.531 L
203.572 315.669 L
203.944 318.514 L
204.316 310.666 L
204.688 303.588 L
205.06 317.813 L
205.432 319.684 L
205.804 310.731 L
206.176 321.551 L
206.548 328.382 L
206.92 318.745 L
207.292 316.283 L
207.664 316.979 L
208.036 325.827 L
208.408 322.179 L
208.78 322.756 L
209.152 311.315 L
209.524 318.916 L
209.896 313.454 L
210.268 313.81 L
210.64 319.348 L
211.012 331.866 L
211.384 315.459 L
211.756 313.072 L
212.128 323.268 L
212.5 318.118 L
212.872 321.092 L
213.244 306.091 L
213.616 318.214 L
213.988 316.573 L
214.36 325.335 L
214.732 323.148 L
215.104 327.496 L
215.476 312.9 L
215.848 313.75 L
216.22 323.798 L
216.592 297.786 L
216.964 311.566 L
217.336 315.159 L
217.708 304.587 L
218.08 335.19 L
218.452 318.637 L
218.824 318.173 L
219.196 316.6 L
219.568 325.268 L
219.94 314.294 L
220.312 333.52 L
220.684 317.248 L
221.056 314.928 L
221.428 318.287 L
221.8 315.45 L
222.172 323.346 L
222.544 314.153 L
222.916 320.622 L
223.288 329.614 L
223.66 320.172 L
224.032 322.34 L
224.404 325.172 L
224.776 314.465 L
225.148 317.717 L
225.52 319.783 L
225.892 321.834 L
226.264 306.264 L
226.636 309.789 L
227.008 319.323 L
227.38 317.394 L
227.752 307.412 L
228.124 305.447 L
228.496 310.282 L
228.868 320.281 L
229.24 322.08 L
229.612 312.739 L
229.984 324.046 L
230.356 325.496 L
230.728 320.487 L
231.1 311.309 L
231.472 316.885 L
231.844 316.285 L
232.216 310.127 L
232.588 316.358 L
232.96 325.97 L
233.332 312.105 L
233.704 314.666 L
234.076 318.619 L
234.448 320.891 L
234.82 321.812 L
235.192 318.168 L
235.564 323.604 L
235.936 321.585 L
236.308 328.407 L
236.68 321.63 L
237.052 322.853 L
237.424 313.956 L
237.796 307.815 L
238.168 310.752 L
238.54 310.672 L
238.912 313.267 L
239.284 314.174 L
239.656 312.75 L
240.028 323.109 L
240.4 312.168 L
240.772 326.39 L
241.144 313.669 L
241.516 323.827 L
241.888 324.793 L
242.26 321.175 L
242.632 327.119 L
243.004 317.888 L
243.376 310.225 L
243.748 319.746 L
244.12 314.53 L
244.492 316.866 L
244.864 309.517 L
245.236 319.108 L
245.608 315.949 L
245.98 300.726 L
246.352 309.976 L
246.724 324.537 L
247.096 310.161 L
247.468 324.47 L
247.84 317.931 L
248.212 315.974 L
248.584 311.91 L
248.956 320.781 L
249.328 314.235 L
249.7 305.612 L
250.072 331.338 L
250.444 325.537 L
250.816 309.635 L
251.188 320.058 L
251.56 318.267 L
251.932 311.532 L
252.304 302.439 L
252.676 327.113 L
253.048 324.363 L
253.42 318.543 L
253.792 317.996 L
254.164 317.252 L
254.536 320.187 L
254.908 309.462 L
255.28 324.367 L
255.652 316.572 L
256.024 311.072 L
256.396 315.374 L
256.768 322.355 L
257.14 317.156 L
257.512 320.222 L
257.884 322.198 L
258.256 308.528 L
258.628 319.384 L
259 322.046 L
S
GR
GS
[0.75 0 0 0.75 0 0] CT
1 GC
N
319 101 M
506 101 L
506 31 L
319 31 L
cp
f
GR
GS
[0.75 0 0 0.75 0 0] CT
0.149 GC
2 setlinecap
1 LJ
0.667 LW
N
319 101 M
506 101 L
S
GR
GS
[0.75 0 0 0.75 0 0] CT
0.149 GC
2 setlinecap
1 LJ
0.667 LW
N
319 31 M
506 31 L
S
GR
GS
[0.75 0 0 0.75 0 0] CT
0.149 GC
2 setlinecap
1 LJ
0.667 LW
N
319 101 M
319 99.13 L
S
GR
GS
[0.75 0 0 0.75 0 0] CT
0.149 GC
2 setlinecap
1 LJ
0.667 LW
N
356.4 101 M
356.4 99.13 L
S
GR
GS
[0.75 0 0 0.75 0 0] CT
0.149 GC
2 setlinecap
1 LJ
0.667 LW
N
393.8 101 M
393.8 99.13 L
S
GR
GS
[0.75 0 0 0.75 0 0] CT
0.149 GC
2 setlinecap
1 LJ
0.667 LW
N
431.2 101 M
431.2 99.13 L
S
GR
GS
[0.75 0 0 0.75 0 0] CT
0.149 GC
2 setlinecap
1 LJ
0.667 LW
N
468.6 101 M
468.6 99.13 L
S
GR
GS
[0.75 0 0 0.75 0 0] CT
0.149 GC
2 setlinecap
1 LJ
0.667 LW
N
506 101 M
506 99.13 L
S
GR
GS
[0.75 0 0 0.75 0 0] CT
0.149 GC
2 setlinecap
1 LJ
0.667 LW
N
319 31 M
319 32.87 L
S
GR
GS
[0.75 0 0 0.75 0 0] CT
0.149 GC
2 setlinecap
1 LJ
0.667 LW
N
356.4 31 M
356.4 32.87 L
S
GR
GS
[0.75 0 0 0.75 0 0] CT
0.149 GC
2 setlinecap
1 LJ
0.667 LW
N
393.8 31 M
393.8 32.87 L
S
GR
GS
[0.75 0 0 0.75 0 0] CT
0.149 GC
2 setlinecap
1 LJ
0.667 LW
N
431.2 31 M
431.2 32.87 L
S
GR
GS
[0.75 0 0 0.75 0 0] CT
0.149 GC
2 setlinecap
1 LJ
0.667 LW
N
468.6 31 M
468.6 32.87 L
S
GR
GS
[0.75 0 0 0.75 0 0] CT
0.149 GC
2 setlinecap
1 LJ
0.667 LW
N
506 31 M
506 32.87 L
S
GR
GS
[0.75 0 0 0.75 239.25 79.75] CT
0.149 GC
/Helvetica 13.333 F
GS
[1 0 0 1 0 0] CT
-4 14 moveto 
1 -1 scale
(0) t 
GR
GR
GS
[0.75 0 0 0.75 267.3 79.75] CT
0.149 GC
/Helvetica 13.333 F
GS
[1 0 0 1 0 0] CT
-11 14 moveto 
1 -1 scale
(100) t 
GR
GR
GS
[0.75 0 0 0.75 295.34999 79.75] CT
0.149 GC
/Helvetica 13.333 F
GS
[1 0 0 1 0 0] CT
-11 14 moveto 
1 -1 scale
(200) t 
GR
GR
GS
[0.75 0 0 0.75 323.40001 79.75] CT
0.149 GC
/Helvetica 13.333 F
GS
[1 0 0 1 0 0] CT
-11 14 moveto 
1 -1 scale
(300) t 
GR
GR
GS
[0.75 0 0 0.75 351.45 79.75] CT
0.149 GC
/Helvetica 13.333 F
GS
[1 0 0 1 0 0] CT
-11 14 moveto 
1 -1 scale
(400) t 
GR
GR
GS
[0.75 0 0 0.75 379.5 79.75] CT
0.149 GC
/Helvetica 13.333 F
GS
[1 0 0 1 0 0] CT
-11 14 moveto 
1 -1 scale
(500) t 
GR
GR
GS
[0.75 0 0 0.75 309.37507 93.5] CT
0.149 GC
/Helvetica 14.667 F
GS
[1 0 0 1 0 0] CT
-4 16 moveto 
1 -1 scale
(k) t 
GR
GR
GS
[0.75 0 0 0.75 0 0] CT
0.149 GC
2 setlinecap
1 LJ
0.667 LW
N
319 101 M
319 31 L
S
GR
GS
[0.75 0 0 0.75 0 0] CT
0.149 GC
2 setlinecap
1 LJ
0.667 LW
N
506 101 M
506 31 L
S
GR
GS
[0.75 0 0 0.75 0 0] CT
0.149 GC
2 setlinecap
1 LJ
0.667 LW
N
319 101 M
320.87 101 L
S
GR
GS
[0.75 0 0 0.75 0 0] CT
0.149 GC
2 setlinecap
1 LJ
0.667 LW
N
319 66 M
320.87 66 L
S
GR
GS
[0.75 0 0 0.75 0 0] CT
0.149 GC
2 setlinecap
1 LJ
0.667 LW
N
319 31 M
320.87 31 L
S
GR
GS
[0.75 0 0 0.75 0 0] CT
0.149 GC
2 setlinecap
1 LJ
0.667 LW
N
506 101 M
504.13 101 L
S
GR
GS
[0.75 0 0 0.75 0 0] CT
0.149 GC
2 setlinecap
1 LJ
0.667 LW
N
506 66 M
504.13 66 L
S
GR
GS
[0.75 0 0 0.75 0 0] CT
0.149 GC
2 setlinecap
1 LJ
0.667 LW
N
506 31 M
504.13 31 L
S
GR
GS
[0.75 0 0 0.75 235.24999 75.75] CT
0.149 GC
/Helvetica 13.333 F
GS
[1 0 0 1 0 0] CT
-12 5.5 moveto 
1 -1 scale
(-5) t 
GR
GR
GS
[0.75 0 0 0.75 235.24999 49.5] CT
0.149 GC
/Helvetica 13.333 F
GS
[1 0 0 1 0 0] CT
-8 5.5 moveto 
1 -1 scale
(0) t 
GR
GR
GS
[0.75 0 0 0.75 235.24999 23.25] CT
0.149 GC
/Helvetica 13.333 F
GS
[1 0 0 1 0 0] CT
-8 5.5 moveto 
1 -1 scale
(5) t 
GR
GR
GS
[0 -0.75 0.75 0 223.24999 49.49998] CT
0.149 GC
/Helvetica 14.667 F
GS
[1 0 0 1 0 0] CT
-4 -4 moveto 
1 -1 scale
(y) t 
GR
GR
GS
[0.75 0 0 0.75 309.3753 21.1875] CT
/Helvetica-Bold 14.667 F
GS
[1 0 0 1 0 0] CT
-29.5 -4 moveto 
1 -1 scale
(V\375stupy) t 
GR
GR
GS
[0.75 0 0 0.75 0 0] CT
0 0.447 0.741 RC
1 LJ
0.667 LW
N
319.374 66 M
319.748 58.852 L
320.122 72.897 L
320.496 80.971 L
320.87 72.135 L
321.244 78.096 L
321.618 74.847 L
321.992 64.996 L
322.366 59.043 L
322.74 51.71 L
323.114 65.922 L
323.488 59.964 L
323.862 60.705 L
324.236 54.585 L
324.61 58.752 L
324.984 56.669 L
325.358 53.359 L
325.732 62.561 L
326.106 67.508 L
326.48 76.057 L
326.854 71.641 L
327.228 66.332 L
327.602 71.368 L
327.976 68.18 L
328.35 69.585 L
328.724 70.814 L
329.098 62.952 L
329.472 58.762 L
329.846 54.343 L
330.22 67.766 L
330.594 67.836 L
330.968 62.332 L
331.342 73.22 L
331.716 56.123 L
332.09 59.429 L
332.464 66.53 L
332.838 59.035 L
333.212 59.878 L
333.586 62.174 L
333.96 68.848 L
334.334 79.782 L
334.708 79.636 L
335.082 77.337 L
335.456 68.501 L
335.83 62.949 L
336.204 69.972 L
336.578 62.189 L
336.952 59.422 L
337.326 63.59 L
337.7 71.453 L
338.074 62.482 L
338.448 65.149 L
338.822 72.669 L
339.196 67.569 L
339.57 63.119 L
339.944 74.791 L
340.318 57.331 L
340.692 76.709 L
341.066 82.801 L
341.44 65.832 L
341.814 63.64 L
342.188 67.822 L
342.562 66.83 L
342.936 61.296 L
343.31 69.724 L
343.684 61.365 L
344.058 58.801 L
344.432 62.717 L
344.806 63.02 L
345.18 68.911 L
345.554 73.452 L
345.928 72.447 L
346.302 62.024 L
346.676 65.69 L
347.05 69.006 L
347.424 74.358 L
347.798 78.113 L
348.172 71.902 L
348.546 61.669 L
348.92 55.214 L
349.294 56.686 L
349.668 63.506 L
350.042 67.326 L
350.416 64.104 L
350.79 58.49 L
351.164 55.425 L
351.538 75.545 L
351.912 71.098 L
352.286 75.316 L
352.66 73.957 L
353.034 57.832 L
353.408 67.359 L
353.782 78.466 L
354.156 70.994 L
354.53 69.368 L
354.904 70.593 L
355.278 62.14 L
355.652 60.107 L
356.026 60.422 L
356.4 65.15 L
356.774 63.124 L
357.148 66.601 L
357.522 64.998 L
357.896 61.463 L
358.27 61.354 L
358.644 68.387 L
359.018 70.952 L
359.392 75.757 L
359.766 63.898 L
360.14 65.131 L
360.514 70.165 L
360.888 63.338 L
361.262 68.245 L
361.636 64 L
362.01 54.384 L
362.384 53.628 L
362.758 60.935 L
363.132 64.264 L
363.506 51.572 L
363.88 59.982 L
364.254 60.883 L
364.628 61.159 L
365.002 57.106 L
365.376 60.046 L
365.75 60.459 L
366.124 60.975 L
366.498 44.664 L
366.872 49.2 L
367.246 63.735 L
367.62 73.39 L
367.994 80.999 L
368.368 60.619 L
368.742 69.042 L
369.116 60.576 L
369.49 59.551 L
369.864 73.463 L
370.238 55.571 L
370.612 56.92 L
370.986 48.719 L
371.36 54.961 L
371.734 59.224 L
372.108 69.747 L
372.482 67.61 L
372.856 65.845 L
373.23 76.57 L
373.604 71.417 L
373.978 67.566 L
374.352 71.831 L
374.726 66.041 L
375.1 74.509 L
375.474 74.271 L
375.848 69.398 L
376.222 71.934 L
376.596 66.015 L
376.97 68.547 L
377.344 73.392 L
377.718 63.175 L
378.092 60.387 L
378.466 59.194 L
378.84 57.801 L
379.214 54.835 L
379.588 53.481 L
379.962 59.505 L
380.336 65.904 L
380.71 66.727 L
381.084 57.698 L
381.458 70.234 L
381.832 72.068 L
382.206 61.731 L
382.58 57.943 L
382.954 65.44 L
383.328 67.168 L
383.702 67.675 L
384.076 68.765 L
384.45 84.485 L
384.824 78.234 L
385.198 69.954 L
385.572 50.816 L
385.946 68.646 L
386.32 71.772 L
386.694 71.584 L
387.068 75.388 L
387.442 75.41 L
387.816 84.175 L
388.19 75.874 L
388.564 74.567 L
388.938 66.539 L
389.312 65.867 L
389.686 58.473 L
390.06 50.891 L
390.434 57.593 L
390.808 70.463 L
391.182 66.522 L
391.556 56.473 L
391.93 61.905 L
392.304 61.239 L
392.678 70.384 L
393.052 57.628 L
393.426 58.987 L
393.8 65.448 L
394.174 77.442 L
394.548 76.535 L
394.922 78.458 L
395.296 75.677 L
395.67 68.411 L
396.044 61.4 L
396.418 62.611 L
396.792 63.719 L
397.166 62.237 L
397.54 45.546 L
397.914 53.444 L
398.288 58.737 L
398.662 51.323 L
399.036 58.035 L
399.41 66.728 L
399.784 59.841 L
400.158 65.426 L
400.532 64.298 L
400.906 59.015 L
401.28 56.852 L
401.654 72.649 L
402.028 85.859 L
402.402 80.841 L
402.776 61.857 L
403.15 62.283 L
403.524 65.204 L
403.898 66.693 L
404.272 59.079 L
404.646 60.226 L
405.02 59.783 L
405.394 77.525 L
405.768 72.981 L
406.142 69.356 L
406.516 73.698 L
406.89 70.01 L
407.264 72.221 L
407.638 63.021 L
408.012 68.506 L
408.386 58.12 L
408.76 62.359 L
409.134 57.911 L
409.508 45.961 L
409.882 55.513 L
410.256 50.294 L
410.63 65.654 L
411.004 53.064 L
411.378 67.991 L
411.752 67.453 L
412.126 69.014 L
412.5 75.551 L
412.874 79.932 L
413.248 68.441 L
413.622 76.945 L
413.996 80.857 L
414.37 65.527 L
414.744 65.751 L
415.118 63.218 L
415.492 70.918 L
415.866 69.837 L
416.24 65.77 L
416.614 64.713 L
416.988 52.84 L
417.362 63.788 L
417.736 65.944 L
418.11 60.146 L
418.484 56.437 L
418.858 75.034 L
419.232 73.26 L
419.606 74.367 L
419.98 70.296 L
420.354 64.542 L
420.728 62.157 L
421.102 56.092 L
421.476 57.912 L
421.85 59.748 L
422.224 56.255 L
422.598 58.127 L
422.972 71.336 L
423.346 67.899 L
423.72 78.533 L
424.094 64.492 L
424.468 80.001 L
424.842 76.849 L
425.216 70.765 L
425.59 68.65 L
425.964 54.144 L
426.338 59.684 L
426.712 67.139 L
427.086 62.461 L
427.46 72.677 L
427.834 65.521 L
428.208 64.004 L
428.582 67.751 L
428.956 71.23 L
429.33 76.948 L
429.704 84.623 L
430.078 78.28 L
430.452 66.699 L
430.826 71.347 L
431.2 57.581 L
431.574 68.009 L
431.948 52.019 L
432.322 63.855 L
432.696 64.232 L
433.07 55.071 L
433.444 51.902 L
433.818 64.254 L
434.192 59.957 L
434.566 70.779 L
434.94 80.331 L
435.314 68.537 L
435.688 79.376 L
436.062 87.655 L
436.436 77.248 L
436.81 61.924 L
437.184 55.437 L
437.558 71.184 L
437.932 68.331 L
438.306 61.545 L
438.68 56.956 L
439.054 50.553 L
439.428 47.173 L
439.802 50.592 L
440.176 68.267 L
440.55 66.856 L
440.924 76.087 L
441.298 62.412 L
441.672 52.012 L
442.046 73.016 L
442.42 63.66 L
442.794 67.23 L
443.168 69.961 L
443.542 74.204 L
443.916 61.258 L
444.29 60.947 L
444.664 64.305 L
445.038 62.232 L
445.412 57.023 L
445.786 67.598 L
446.16 72.362 L
446.534 64.361 L
446.908 54.081 L
447.282 51.289 L
447.656 59.454 L
448.03 72.049 L
448.404 85.424 L
448.778 82.198 L
449.152 66.192 L
449.526 69.94 L
449.9 65.984 L
450.274 64.502 L
450.648 80.671 L
451.022 64.578 L
451.396 51.116 L
451.77 58.83 L
452.144 55.425 L
452.518 66.014 L
452.892 61.834 L
453.266 49.054 L
453.64 48.345 L
454.014 62.072 L
454.388 71.173 L
454.762 68.215 L
455.136 68.767 L
455.51 67.822 L
455.884 58.013 L
456.258 60.459 L
456.632 51.581 L
457.006 59.091 L
457.38 63.478 L
457.754 59.187 L
458.128 59.609 L
458.502 64.274 L
458.876 76.254 L
459.25 78.942 L
459.624 68.153 L
459.998 63.272 L
460.372 74.911 L
460.746 69.616 L
461.12 64.103 L
461.494 73.278 L
461.868 76.627 L
462.242 62.955 L
462.616 76.753 L
462.99 68.251 L
463.364 60.279 L
463.738 75.678 L
464.112 71.75 L
464.486 77.102 L
464.86 70.921 L
465.234 71.416 L
465.608 80.264 L
465.982 68.806 L
466.356 63.23 L
466.73 68.944 L
467.104 63.777 L
467.478 74.299 L
467.852 78.793 L
468.226 80.47 L
468.6 74.001 L
468.974 73.67 L
469.348 56.456 L
469.722 61.726 L
470.096 59.93 L
470.47 58.946 L
470.844 59.871 L
471.218 61.594 L
471.592 55.088 L
471.966 68.693 L
472.34 55.9 L
472.714 56.146 L
473.088 69.119 L
473.462 59.788 L
473.836 54.616 L
474.21 48.357 L
474.584 60.121 L
474.958 51.585 L
475.332 56.948 L
475.706 71.718 L
476.08 74.292 L
476.454 63.64 L
476.828 52.269 L
477.202 67.417 L
477.576 67.487 L
477.95 71.341 L
478.324 55.512 L
478.698 67.029 L
479.072 57.194 L
479.446 65.969 L
479.82 60.548 L
480.194 72.544 L
480.568 58.77 L
480.942 77.805 L
481.316 69.645 L
481.69 64.875 L
482.064 71.183 L
482.438 75.357 L
482.812 66.413 L
483.186 73.46 L
483.56 69.928 L
483.934 87.702 L
484.308 91.418 L
484.682 79.022 L
485.056 64.686 L
485.43 76.889 L
485.804 66.694 L
486.178 62.887 L
486.552 68.563 L
486.926 67.449 L
487.3 51.385 L
487.674 68.497 L
488.048 63.888 L
488.422 63.491 L
488.796 62.491 L
489.17 64.287 L
489.544 63.174 L
489.918 66.346 L
490.292 78.027 L
490.666 76.102 L
491.04 69.41 L
491.414 65.893 L
491.788 61.721 L
492.162 48.314 L
492.536 68.736 L
492.91 62.605 L
493.284 63.352 L
493.658 64.942 L
494.032 70.323 L
494.406 69.054 L
494.78 62.765 L
495.154 61.399 L
495.528 74.939 L
495.902 64.126 L
496.276 63.316 L
496.65 51.399 L
497.024 66.486 L
497.398 71.297 L
497.772 80.914 L
498.146 73.432 L
498.52 62.75 L
498.894 67.728 L
499.268 70.498 L
499.642 70.311 L
500.016 69.28 L
500.39 60.475 L
500.764 63.126 L
501.138 67.942 L
501.512 62.528 L
501.886 73.815 L
502.26 65.717 L
502.634 67.304 L
503.008 51.676 L
503.382 63.38 L
503.756 61.725 L
504.13 63.037 L
504.504 72.084 L
504.878 62.913 L
505.252 80.041 L
505.626 86.643 L
506 85.489 L
S
GR
GS
[0.75 0 0 0.75 0 0] CT
1 GC
N
319 227 M
506 227 L
506 157 L
319 157 L
cp
f
GR
GS
[0.75 0 0 0.75 0 0] CT
0.149 GC
2 setlinecap
1 LJ
0.667 LW
N
319 227 M
506 227 L
S
GR
GS
[0.75 0 0 0.75 0 0] CT
0.149 GC
2 setlinecap
1 LJ
0.667 LW
N
319 157 M
506 157 L
S
GR
GS
[0.75 0 0 0.75 0 0] CT
0.149 GC
2 setlinecap
1 LJ
0.667 LW
N
319 227 M
319 225.13 L
S
GR
GS
[0.75 0 0 0.75 0 0] CT
0.149 GC
2 setlinecap
1 LJ
0.667 LW
N
356.4 227 M
356.4 225.13 L
S
GR
GS
[0.75 0 0 0.75 0 0] CT
0.149 GC
2 setlinecap
1 LJ
0.667 LW
N
393.8 227 M
393.8 225.13 L
S
GR
GS
[0.75 0 0 0.75 0 0] CT
0.149 GC
2 setlinecap
1 LJ
0.667 LW
N
431.2 227 M
431.2 225.13 L
S
GR
GS
[0.75 0 0 0.75 0 0] CT
0.149 GC
2 setlinecap
1 LJ
0.667 LW
N
468.6 227 M
468.6 225.13 L
S
GR
GS
[0.75 0 0 0.75 0 0] CT
0.149 GC
2 setlinecap
1 LJ
0.667 LW
N
506 227 M
506 225.13 L
S
GR
GS
[0.75 0 0 0.75 0 0] CT
0.149 GC
2 setlinecap
1 LJ
0.667 LW
N
319 157 M
319 158.87 L
S
GR
GS
[0.75 0 0 0.75 0 0] CT
0.149 GC
2 setlinecap
1 LJ
0.667 LW
N
356.4 157 M
356.4 158.87 L
S
GR
GS
[0.75 0 0 0.75 0 0] CT
0.149 GC
2 setlinecap
1 LJ
0.667 LW
N
393.8 157 M
393.8 158.87 L
S
GR
GS
[0.75 0 0 0.75 0 0] CT
0.149 GC
2 setlinecap
1 LJ
0.667 LW
N
431.2 157 M
431.2 158.87 L
S
GR
GS
[0.75 0 0 0.75 0 0] CT
0.149 GC
2 setlinecap
1 LJ
0.667 LW
N
468.6 157 M
468.6 158.87 L
S
GR
GS
[0.75 0 0 0.75 0 0] CT
0.149 GC
2 setlinecap
1 LJ
0.667 LW
N
506 157 M
506 158.87 L
S
GR
GS
[0.75 0 0 0.75 239.25 174.25] CT
0.149 GC
/Helvetica 13.333 F
GS
[1 0 0 1 0 0] CT
-4 14 moveto 
1 -1 scale
(0) t 
GR
GR
GS
[0.75 0 0 0.75 267.3 174.25] CT
0.149 GC
/Helvetica 13.333 F
GS
[1 0 0 1 0 0] CT
-11 14 moveto 
1 -1 scale
(100) t 
GR
GR
GS
[0.75 0 0 0.75 295.34999 174.25] CT
0.149 GC
/Helvetica 13.333 F
GS
[1 0 0 1 0 0] CT
-11 14 moveto 
1 -1 scale
(200) t 
GR
GR
GS
[0.75 0 0 0.75 323.40001 174.25] CT
0.149 GC
/Helvetica 13.333 F
GS
[1 0 0 1 0 0] CT
-11 14 moveto 
1 -1 scale
(300) t 
GR
GR
GS
[0.75 0 0 0.75 351.45 174.25] CT
0.149 GC
/Helvetica 13.333 F
GS
[1 0 0 1 0 0] CT
-11 14 moveto 
1 -1 scale
(400) t 
GR
GR
GS
[0.75 0 0 0.75 379.5 174.25] CT
0.149 GC
/Helvetica 13.333 F
GS
[1 0 0 1 0 0] CT
-11 14 moveto 
1 -1 scale
(500) t 
GR
GR
GS
[0.75 0 0 0.75 309.37507 187.99999] CT
0.149 GC
/Helvetica 14.667 F
GS
[1 0 0 1 0 0] CT
-4 16 moveto 
1 -1 scale
(k) t 
GR
GR
GS
[0.75 0 0 0.75 0 0] CT
0.149 GC
2 setlinecap
1 LJ
0.667 LW
N
319 227 M
319 157 L
S
GR
GS
[0.75 0 0 0.75 0 0] CT
0.149 GC
2 setlinecap
1 LJ
0.667 LW
N
506 227 M
506 157 L
S
GR
GS
[0.75 0 0 0.75 0 0] CT
0.149 GC
2 setlinecap
1 LJ
0.667 LW
N
319 227 M
320.87 227 L
S
GR
GS
[0.75 0 0 0.75 0 0] CT
0.149 GC
2 setlinecap
1 LJ
0.667 LW
N
319 192 M
320.87 192 L
S
GR
GS
[0.75 0 0 0.75 0 0] CT
0.149 GC
2 setlinecap
1 LJ
0.667 LW
N
319 157 M
320.87 157 L
S
GR
GS
[0.75 0 0 0.75 0 0] CT
0.149 GC
2 setlinecap
1 LJ
0.667 LW
N
506 227 M
504.13 227 L
S
GR
GS
[0.75 0 0 0.75 0 0] CT
0.149 GC
2 setlinecap
1 LJ
0.667 LW
N
506 192 M
504.13 192 L
S
GR
GS
[0.75 0 0 0.75 0 0] CT
0.149 GC
2 setlinecap
1 LJ
0.667 LW
N
506 157 M
504.13 157 L
S
GR
GS
[0.75 0 0 0.75 235.24999 170.25] CT
0.149 GC
/Helvetica 13.333 F
GS
[1 0 0 1 0 0] CT
-12 5.5 moveto 
1 -1 scale
(-5) t 
GR
GR
GS
[0.75 0 0 0.75 235.24999 144] CT
0.149 GC
/Helvetica 13.333 F
GS
[1 0 0 1 0 0] CT
-8 5.5 moveto 
1 -1 scale
(0) t 
GR
GR
GS
[0.75 0 0 0.75 235.24999 117.75] CT
0.149 GC
/Helvetica 13.333 F
GS
[1 0 0 1 0 0] CT
-8 5.5 moveto 
1 -1 scale
(5) t 
GR
GR
GS
[0 -0.75 0.75 0 223.24999 143.99998] CT
0.149 GC
/Helvetica 14.667 F
GS
[1 0 0 1 0 0] CT
-4 -4 moveto 
1 -1 scale
(y) t 
GR
GR
GS
[0.75 0 0 0.75 0 0] CT
0 0.447 0.741 RC
1 LJ
0.667 LW
N
319.374 192 M
319.748 184.852 L
320.122 192.597 L
320.496 197.521 L
320.87 187.11 L
321.244 192.284 L
321.618 188.641 L
321.992 178.593 L
322.366 172.541 L
322.74 165.159 L
323.114 179.346 L
323.488 173.376 L
323.862 174.111 L
324.236 167.988 L
324.61 172.153 L
324.984 170.07 L
325.358 166.759 L
325.732 175.962 L
326.106 180.908 L
326.48 189.457 L
326.854 185.041 L
327.228 179.732 L
327.602 184.768 L
327.976 181.58 L
328.35 182.985 L
328.724 184.214 L
329.098 176.352 L
329.472 172.162 L
329.846 167.743 L
330.22 181.166 L
330.594 181.236 L
330.968 175.732 L
331.342 186.62 L
331.716 169.523 L
332.09 172.829 L
332.464 179.93 L
332.838 172.435 L
333.212 173.278 L
333.586 175.574 L
333.96 182.248 L
334.334 193.182 L
334.708 193.036 L
335.082 190.737 L
335.456 181.901 L
335.83 176.349 L
336.204 183.372 L
336.578 175.589 L
336.952 172.822 L
337.326 176.99 L
337.7 184.853 L
338.074 175.882 L
338.448 178.549 L
338.822 186.069 L
339.196 180.969 L
339.57 176.519 L
339.944 188.191 L
340.318 170.731 L
340.692 190.109 L
341.066 196.201 L
341.44 179.232 L
341.814 177.04 L
342.188 181.222 L
342.562 180.23 L
342.936 174.696 L
343.31 183.124 L
343.684 174.765 L
344.058 172.201 L
344.432 176.117 L
344.806 176.42 L
345.18 182.311 L
345.554 186.852 L
345.928 185.847 L
346.302 175.424 L
346.676 179.09 L
347.05 182.406 L
347.424 187.758 L
347.798 191.513 L
348.172 185.302 L
348.546 175.069 L
348.92 168.614 L
349.294 170.086 L
349.668 176.906 L
350.042 180.726 L
350.416 177.504 L
350.79 171.89 L
351.164 168.825 L
351.538 188.945 L
351.912 184.498 L
352.286 188.716 L
352.66 187.357 L
353.034 171.232 L
353.408 180.759 L
353.782 191.866 L
354.156 184.394 L
354.53 182.768 L
354.904 183.993 L
355.278 175.54 L
355.652 173.507 L
356.026 173.822 L
356.4 178.55 L
356.774 176.524 L
357.148 180.001 L
357.522 178.398 L
357.896 174.863 L
358.27 174.754 L
358.644 181.787 L
359.018 184.352 L
359.392 189.157 L
359.766 177.298 L
360.14 178.531 L
360.514 183.565 L
360.888 176.738 L
361.262 181.645 L
361.636 177.4 L
362.01 167.784 L
362.384 167.028 L
362.758 174.335 L
363.132 177.664 L
363.506 164.972 L
363.88 173.382 L
364.254 174.283 L
364.628 174.559 L
365.002 170.506 L
365.376 173.446 L
365.75 173.859 L
366.124 174.375 L
366.498 158.064 L
366.872 162.6 L
367.246 177.135 L
367.62 186.79 L
367.994 194.399 L
368.368 174.019 L
368.742 182.442 L
369.116 173.976 L
369.49 172.951 L
369.864 186.863 L
370.238 168.971 L
370.612 170.32 L
370.986 162.119 L
371.36 168.361 L
371.734 172.624 L
372.108 183.147 L
372.482 181.01 L
372.856 179.245 L
373.23 189.97 L
373.604 184.817 L
373.978 180.966 L
374.352 185.231 L
374.726 179.441 L
375.1 187.909 L
375.474 187.671 L
375.848 182.798 L
376.222 185.334 L
376.596 179.415 L
376.97 181.947 L
377.344 186.792 L
377.718 176.575 L
378.092 173.787 L
378.466 172.594 L
378.84 171.201 L
379.214 168.235 L
379.588 166.881 L
379.962 172.905 L
380.336 179.304 L
380.71 180.127 L
381.084 171.098 L
381.458 183.634 L
381.832 185.468 L
382.206 175.131 L
382.58 171.343 L
382.954 178.84 L
383.328 180.568 L
383.702 181.075 L
384.076 182.165 L
384.45 197.885 L
384.824 191.634 L
385.198 183.354 L
385.572 164.216 L
385.946 182.046 L
386.32 185.172 L
386.694 184.984 L
387.068 188.788 L
387.442 188.81 L
387.816 197.575 L
388.19 189.274 L
388.564 187.967 L
388.938 179.939 L
389.312 179.267 L
389.686 171.873 L
390.06 164.291 L
390.434 170.993 L
390.808 183.863 L
391.182 179.922 L
391.556 169.873 L
391.93 175.305 L
392.304 174.639 L
392.678 183.784 L
393.052 171.028 L
393.426 172.387 L
393.8 178.848 L
394.174 190.842 L
394.548 189.935 L
394.922 191.858 L
395.296 189.077 L
395.67 181.811 L
396.044 174.8 L
396.418 176.011 L
396.792 177.119 L
397.166 175.637 L
397.54 158.946 L
397.914 166.844 L
398.288 172.137 L
398.662 164.723 L
399.036 171.435 L
399.41 180.128 L
399.784 173.241 L
400.158 178.826 L
400.532 177.698 L
400.906 172.415 L
401.28 170.252 L
401.654 186.049 L
402.028 199.259 L
402.402 194.241 L
402.776 175.257 L
403.15 175.683 L
403.524 178.604 L
403.898 180.093 L
404.272 172.479 L
404.646 173.626 L
405.02 173.183 L
405.394 190.925 L
405.768 186.381 L
406.142 182.756 L
406.516 187.098 L
406.89 183.41 L
407.264 185.621 L
407.638 176.421 L
408.012 181.906 L
408.386 171.52 L
408.76 175.759 L
409.134 171.311 L
409.508 159.361 L
409.882 168.913 L
410.256 163.694 L
410.63 179.054 L
411.004 166.464 L
411.378 181.391 L
411.752 180.853 L
412.126 182.414 L
412.5 188.951 L
412.874 193.332 L
413.248 181.841 L
413.622 190.345 L
413.996 194.257 L
414.37 178.927 L
414.744 179.151 L
415.118 176.618 L
415.492 184.318 L
415.866 183.237 L
416.24 179.17 L
416.614 178.113 L
416.988 166.24 L
417.362 177.188 L
417.736 179.344 L
418.11 173.546 L
418.484 169.837 L
418.858 188.434 L
419.232 186.66 L
419.606 187.767 L
419.98 183.696 L
420.354 177.942 L
420.728 175.557 L
421.102 169.492 L
421.476 171.312 L
421.85 173.148 L
422.224 169.655 L
422.598 171.527 L
422.972 184.736 L
423.346 181.299 L
423.72 191.933 L
424.094 177.892 L
424.468 193.401 L
424.842 190.249 L
425.216 184.165 L
425.59 182.05 L
425.964 167.544 L
426.338 173.084 L
426.712 180.539 L
427.086 175.861 L
427.46 186.077 L
427.834 178.921 L
428.208 177.404 L
428.582 181.151 L
428.956 184.63 L
429.33 190.348 L
429.704 198.023 L
430.078 191.68 L
430.452 180.099 L
430.826 184.747 L
431.2 170.981 L
431.574 181.409 L
431.948 165.419 L
432.322 177.255 L
432.696 177.632 L
433.07 168.471 L
433.444 165.302 L
433.818 177.654 L
434.192 173.357 L
434.566 184.179 L
434.94 193.731 L
435.314 181.937 L
435.688 192.776 L
436.062 201.055 L
436.436 190.648 L
436.81 175.324 L
437.184 168.837 L
437.558 184.584 L
437.932 181.731 L
438.306 174.945 L
438.68 170.356 L
439.054 163.953 L
439.428 160.573 L
439.802 163.992 L
440.176 181.667 L
440.55 180.256 L
440.924 189.487 L
441.298 175.812 L
441.672 165.412 L
442.046 186.416 L
442.42 177.06 L
442.794 180.63 L
443.168 183.361 L
443.542 187.604 L
443.916 174.658 L
444.29 174.347 L
444.664 177.705 L
445.038 175.632 L
445.412 170.423 L
445.786 180.998 L
446.16 185.762 L
446.534 177.761 L
446.908 167.481 L
447.282 164.689 L
447.656 172.854 L
448.03 185.449 L
448.404 198.824 L
448.778 195.598 L
449.152 179.592 L
449.526 183.34 L
449.9 179.384 L
450.274 177.902 L
450.648 194.071 L
451.022 177.978 L
451.396 164.516 L
451.77 172.23 L
452.144 168.825 L
452.518 179.414 L
452.892 175.234 L
453.266 162.454 L
453.64 161.745 L
454.014 175.472 L
454.388 184.573 L
454.762 181.615 L
455.136 182.167 L
455.51 181.222 L
455.884 171.413 L
456.258 173.859 L
456.632 164.981 L
457.006 172.491 L
457.38 176.878 L
457.754 172.587 L
458.128 173.009 L
458.502 177.674 L
458.876 189.654 L
459.25 192.342 L
459.624 181.553 L
459.998 176.672 L
460.372 188.311 L
460.746 183.016 L
461.12 177.503 L
461.494 186.678 L
461.868 190.027 L
462.242 176.355 L
462.616 190.153 L
462.99 181.651 L
463.364 173.679 L
463.738 189.078 L
464.112 185.15 L
464.486 190.502 L
464.86 184.321 L
465.234 184.816 L
465.608 193.664 L
465.982 182.206 L
466.356 176.63 L
466.73 182.344 L
467.104 177.177 L
467.478 187.699 L
467.852 192.193 L
468.226 193.87 L
468.6 187.401 L
468.974 187.07 L
469.348 169.856 L
469.722 175.126 L
470.096 173.33 L
470.47 172.346 L
470.844 173.271 L
471.218 174.994 L
471.592 168.488 L
471.966 182.093 L
472.34 169.3 L
472.714 169.546 L
473.088 182.519 L
473.462 173.188 L
473.836 168.016 L
474.21 161.757 L
474.584 173.521 L
474.958 164.985 L
475.332 170.348 L
475.706 185.118 L
476.08 187.692 L
476.454 177.04 L
476.828 165.669 L
477.202 180.817 L
477.576 180.887 L
477.95 184.741 L
478.324 168.912 L
478.698 180.429 L
479.072 170.594 L
479.446 179.369 L
479.82 173.948 L
480.194 185.944 L
480.568 172.17 L
480.942 191.205 L
481.316 183.045 L
481.69 178.275 L
482.064 184.583 L
482.438 188.757 L
482.812 179.813 L
483.186 186.86 L
483.56 183.328 L
483.934 201.102 L
484.308 204.818 L
484.682 192.422 L
485.056 178.086 L
485.43 190.289 L
485.804 180.094 L
486.178 176.287 L
486.552 181.963 L
486.926 180.849 L
487.3 164.785 L
487.674 181.897 L
488.048 177.288 L
488.422 176.891 L
488.796 175.891 L
489.17 177.687 L
489.544 176.574 L
489.918 179.746 L
490.292 191.427 L
490.666 189.502 L
491.04 182.81 L
491.414 179.293 L
491.788 175.121 L
492.162 161.714 L
492.536 182.136 L
492.91 176.005 L
493.284 176.752 L
493.658 178.342 L
494.032 183.723 L
494.406 182.454 L
494.78 176.165 L
495.154 174.799 L
495.528 188.339 L
495.902 177.526 L
496.276 176.716 L
496.65 164.799 L
497.024 179.886 L
497.398 184.697 L
497.772 194.314 L
498.146 186.832 L
498.52 176.15 L
498.894 181.128 L
499.268 183.898 L
499.642 183.711 L
500.016 182.68 L
500.39 173.875 L
500.764 176.526 L
501.138 181.342 L
501.512 175.928 L
501.886 187.215 L
502.26 179.117 L
502.634 180.704 L
503.008 165.076 L
503.382 176.78 L
503.756 175.125 L
504.13 176.437 L
504.504 185.484 L
504.878 176.313 L
505.252 193.441 L
505.626 200.043 L
506 198.889 L
S
GR
GS
[0.75 0 0 0.75 0 0] CT
1 GC
N
319 353 M
506 353 L
506 283 L
319 283 L
cp
f
GR
GS
[0.75 0 0 0.75 0 0] CT
0.149 GC
2 setlinecap
1 LJ
0.667 LW
N
319 353 M
506 353 L
S
GR
GS
[0.75 0 0 0.75 0 0] CT
0.149 GC
2 setlinecap
1 LJ
0.667 LW
N
319 283 M
506 283 L
S
GR
GS
[0.75 0 0 0.75 0 0] CT
0.149 GC
2 setlinecap
1 LJ
0.667 LW
N
319 353 M
319 351.13 L
S
GR
GS
[0.75 0 0 0.75 0 0] CT
0.149 GC
2 setlinecap
1 LJ
0.667 LW
N
356.4 353 M
356.4 351.13 L
S
GR
GS
[0.75 0 0 0.75 0 0] CT
0.149 GC
2 setlinecap
1 LJ
0.667 LW
N
393.8 353 M
393.8 351.13 L
S
GR
GS
[0.75 0 0 0.75 0 0] CT
0.149 GC
2 setlinecap
1 LJ
0.667 LW
N
431.2 353 M
431.2 351.13 L
S
GR
GS
[0.75 0 0 0.75 0 0] CT
0.149 GC
2 setlinecap
1 LJ
0.667 LW
N
468.6 353 M
468.6 351.13 L
S
GR
GS
[0.75 0 0 0.75 0 0] CT
0.149 GC
2 setlinecap
1 LJ
0.667 LW
N
506 353 M
506 351.13 L
S
GR
GS
[0.75 0 0 0.75 0 0] CT
0.149 GC
2 setlinecap
1 LJ
0.667 LW
N
319 283 M
319 284.87 L
S
GR
GS
[0.75 0 0 0.75 0 0] CT
0.149 GC
2 setlinecap
1 LJ
0.667 LW
N
356.4 283 M
356.4 284.87 L
S
GR
GS
[0.75 0 0 0.75 0 0] CT
0.149 GC
2 setlinecap
1 LJ
0.667 LW
N
393.8 283 M
393.8 284.87 L
S
GR
GS
[0.75 0 0 0.75 0 0] CT
0.149 GC
2 setlinecap
1 LJ
0.667 LW
N
431.2 283 M
431.2 284.87 L
S
GR
GS
[0.75 0 0 0.75 0 0] CT
0.149 GC
2 setlinecap
1 LJ
0.667 LW
N
468.6 283 M
468.6 284.87 L
S
GR
GS
[0.75 0 0 0.75 0 0] CT
0.149 GC
2 setlinecap
1 LJ
0.667 LW
N
506 283 M
506 284.87 L
S
GR
GS
[0.75 0 0 0.75 239.25 268.75001] CT
0.149 GC
/Helvetica 13.333 F
GS
[1 0 0 1 0 0] CT
-4 14 moveto 
1 -1 scale
(0) t 
GR
GR
GS
[0.75 0 0 0.75 267.3 268.75001] CT
0.149 GC
/Helvetica 13.333 F
GS
[1 0 0 1 0 0] CT
-11 14 moveto 
1 -1 scale
(100) t 
GR
GR
GS
[0.75 0 0 0.75 295.34999 268.75001] CT
0.149 GC
/Helvetica 13.333 F
GS
[1 0 0 1 0 0] CT
-11 14 moveto 
1 -1 scale
(200) t 
GR
GR
GS
[0.75 0 0 0.75 323.40001 268.75001] CT
0.149 GC
/Helvetica 13.333 F
GS
[1 0 0 1 0 0] CT
-11 14 moveto 
1 -1 scale
(300) t 
GR
GR
GS
[0.75 0 0 0.75 351.45 268.75001] CT
0.149 GC
/Helvetica 13.333 F
GS
[1 0 0 1 0 0] CT
-11 14 moveto 
1 -1 scale
(400) t 
GR
GR
GS
[0.75 0 0 0.75 379.5 268.75001] CT
0.149 GC
/Helvetica 13.333 F
GS
[1 0 0 1 0 0] CT
-11 14 moveto 
1 -1 scale
(500) t 
GR
GR
GS
[0.75 0 0 0.75 309.37507 282.49999] CT
0.149 GC
/Helvetica 14.667 F
GS
[1 0 0 1 0 0] CT
-4 16 moveto 
1 -1 scale
(k) t 
GR
GR
GS
[0.75 0 0 0.75 0 0] CT
0.149 GC
2 setlinecap
1 LJ
0.667 LW
N
319 353 M
319 283 L
S
GR
GS
[0.75 0 0 0.75 0 0] CT
0.149 GC
2 setlinecap
1 LJ
0.667 LW
N
506 353 M
506 283 L
S
GR
GS
[0.75 0 0 0.75 0 0] CT
0.149 GC
2 setlinecap
1 LJ
0.667 LW
N
319 353 M
320.87 353 L
S
GR
GS
[0.75 0 0 0.75 0 0] CT
0.149 GC
2 setlinecap
1 LJ
0.667 LW
N
319 318 M
320.87 318 L
S
GR
GS
[0.75 0 0 0.75 0 0] CT
0.149 GC
2 setlinecap
1 LJ
0.667 LW
N
319 283 M
320.87 283 L
S
GR
GS
[0.75 0 0 0.75 0 0] CT
0.149 GC
2 setlinecap
1 LJ
0.667 LW
N
506 353 M
504.13 353 L
S
GR
GS
[0.75 0 0 0.75 0 0] CT
0.149 GC
2 setlinecap
1 LJ
0.667 LW
N
506 318 M
504.13 318 L
S
GR
GS
[0.75 0 0 0.75 0 0] CT
0.149 GC
2 setlinecap
1 LJ
0.667 LW
N
506 283 M
504.13 283 L
S
GR
GS
[0.75 0 0 0.75 235.24999 264.75] CT
0.149 GC
/Helvetica 13.333 F
GS
[1 0 0 1 0 0] CT
-12 5.5 moveto 
1 -1 scale
(-5) t 
GR
GR
GS
[0.75 0 0 0.75 235.24999 238.5] CT
0.149 GC
/Helvetica 13.333 F
GS
[1 0 0 1 0 0] CT
-8 5.5 moveto 
1 -1 scale
(0) t 
GR
GR
GS
[0.75 0 0 0.75 235.24999 212.25] CT
0.149 GC
/Helvetica 13.333 F
GS
[1 0 0 1 0 0] CT
-8 5.5 moveto 
1 -1 scale
(5) t 
GR
GR
GS
[0 -0.75 0.75 0 223.24999 238.49998] CT
0.149 GC
/Helvetica 14.667 F
GS
[1 0 0 1 0 0] CT
-4 -4 moveto 
1 -1 scale
(y) t 
GR
GR
GS
[0.75 0 0 0.75 0 0] CT
0 0.447 0.741 RC
1 LJ
0.667 LW
N
319.374 318 M
319.748 311.667 L
320.122 323.221 L
320.496 340.625 L
320.87 318.211 L
321.244 331.019 L
321.618 331.709 L
321.992 328.395 L
322.366 317.433 L
322.74 307.552 L
323.114 321.876 L
323.488 319.23 L
323.862 326.8 L
324.236 294.654 L
324.61 295.331 L
324.984 303.221 L
325.358 303.358 L
325.732 311.3 L
326.106 317.954 L
326.48 330.874 L
326.854 319.165 L
327.228 323.266 L
327.602 313.504 L
327.976 326.356 L
328.35 326.71 L
328.724 319.879 L
329.098 312.742 L
329.472 319.126 L
329.846 304.717 L
330.22 317.925 L
330.594 324.048 L
330.968 313.895 L
331.342 320.238 L
331.716 291.87 L
332.09 303.893 L
332.464 316.615 L
332.838 313.258 L
333.212 325.129 L
333.586 317.515 L
333.96 335.462 L
334.334 340.789 L
334.708 337.872 L
335.082 327.131 L
335.456 336.856 L
335.83 317.343 L
336.204 326.44 L
336.578 324.569 L
336.952 316.667 L
337.326 316.742 L
337.7 326.702 L
338.074 325.364 L
338.448 314.99 L
338.822 322.346 L
339.196 322.86 L
339.57 309.102 L
339.944 321.469 L
340.318 314.655 L
340.692 327.458 L
341.066 345.487 L
341.44 329.84 L
341.814 320.689 L
342.188 319.756 L
342.562 318.353 L
342.936 325.235 L
343.31 322.536 L
343.684 305.822 L
344.058 299.675 L
344.432 312.747 L
344.806 316.516 L
345.18 328.069 L
345.554 327.455 L
345.928 323.86 L
346.302 318.591 L
346.676 314.18 L
347.05 313.883 L
347.424 318.656 L
347.798 331.009 L
348.172 332.782 L
348.546 314 L
348.92 298.262 L
349.294 312.338 L
349.668 331.244 L
350.042 318.148 L
350.416 315.903 L
350.79 302.969 L
351.164 297.456 L
351.538 330.238 L
351.912 327.165 L
352.286 334.61 L
352.66 328.472 L
353.034 303.742 L
353.408 315.961 L
353.782 341.997 L
354.156 320.977 L
354.53 320.343 L
354.904 324.975 L
355.278 328.582 L
355.652 316.972 L
356.026 313.31 L
356.4 315.461 L
356.774 321.071 L
357.148 326.175 L
357.522 326.558 L
357.896 306.981 L
358.27 315.281 L
358.644 322.59 L
359.018 329.662 L
359.392 325.374 L
359.766 314.783 L
360.14 316.115 L
360.514 315.738 L
360.888 307.871 L
361.262 311.56 L
361.636 325.094 L
362.01 309.545 L
362.384 301.121 L
362.758 308.477 L
363.132 308.354 L
363.506 286.253 L
363.88 295.456 L
364.254 311.696 L
364.628 317.796 L
365.002 312.191 L
365.376 317.637 L
365.75 315.752 L
366.124 306.884 L
366.498 296.967 L
366.872 303.153 L
367.246 318.146 L
367.62 322.346 L
367.994 324.945 L
368.368 309.533 L
368.742 321.497 L
369.116 306.922 L
369.49 304.167 L
369.864 318.695 L
370.238 283.611 L
370.612 296.74 L
370.986 292.479 L
371.36 303.367 L
371.734 305.543 L
372.108 322.214 L
372.482 313.495 L
372.856 303.264 L
373.23 320.742 L
373.604 319.934 L
373.978 321.374 L
374.352 327.719 L
374.726 330.717 L
375.1 333.186 L
375.474 335.161 L
375.848 317.931 L
376.222 321.219 L
376.596 316.311 L
376.97 310.884 L
377.344 331.748 L
377.718 316.276 L
378.092 319.602 L
378.466 318.855 L
378.84 312.004 L
379.214 302.318 L
379.588 308.494 L
379.962 309.526 L
380.336 307.727 L
380.71 319.025 L
381.084 316.098 L
381.458 325.508 L
381.832 321.755 L
382.206 312.565 L
382.58 314.503 L
382.954 318.995 L
383.328 318.641 L
383.702 322.212 L
384.076 329.093 L
384.45 337.906 L
384.824 330.837 L
385.198 324.542 L
385.572 308.087 L
385.946 326.434 L
386.32 332.129 L
386.694 334.315 L
387.068 324.781 L
387.442 327.628 L
387.816 347.177 L
388.19 336.451 L
388.564 324.175 L
388.938 320.733 L
389.312 307.767 L
389.686 310.334 L
390.06 307.566 L
390.434 318.439 L
390.808 319.553 L
391.182 320.722 L
391.556 306.944 L
391.93 323.524 L
392.304 321.656 L
392.678 322.439 L
393.052 317.722 L
393.426 314.718 L
393.8 315.859 L
394.174 317.444 L
394.548 318.496 L
394.922 319.474 L
395.296 324.417 L
395.67 322.427 L
396.044 314.052 L
396.418 320.565 L
396.792 311.627 L
397.166 307.304 L
397.54 288.016 L
397.914 292.736 L
398.288 305.062 L
398.662 304.122 L
399.036 307.123 L
399.41 310.015 L
399.784 302.076 L
400.158 306.586 L
400.532 301.39 L
400.906 301.701 L
401.28 296.609 L
401.654 318.602 L
402.028 329.862 L
402.402 337.685 L
402.776 306.564 L
403.15 321.818 L
403.524 319.676 L
403.898 322.11 L
404.272 320.09 L
404.646 314.616 L
405.02 310.884 L
405.394 320.185 L
405.768 319.448 L
406.142 314.951 L
406.516 320.964 L
406.89 310.396 L
407.264 311.292 L
407.638 308.49 L
408.012 316.457 L
408.386 296.885 L
408.76 309.25 L
409.134 301.951 L
409.508 299.515 L
409.882 313.09 L
410.256 299.647 L
410.63 312.247 L
411.004 295.694 L
411.378 319.295 L
411.752 312.692 L
412.126 316.551 L
412.5 325.618 L
412.874 320.324 L
413.248 305.584 L
413.622 335.698 L
413.996 333.988 L
414.37 323.448 L
414.744 322.599 L
415.118 321.638 L
415.492 315.894 L
415.866 310.506 L
416.24 308.606 L
416.614 307.699 L
416.988 297.447 L
417.362 307.783 L
417.736 312.358 L
418.11 310.478 L
418.484 304.404 L
418.858 326.97 L
419.232 327.713 L
419.606 329.293 L
419.98 324.314 L
420.354 317.5 L
420.728 298.686 L
421.102 308.063 L
421.476 316.65 L
421.85 313.567 L
422.224 309.483 L
422.598 315.341 L
422.972 323.883 L
423.346 315.429 L
423.72 335.566 L
424.094 321.578 L
424.468 342.658 L
424.842 333.651 L
425.216 324.134 L
425.59 317.034 L
425.964 311.181 L
426.338 312.328 L
426.712 320.364 L
427.086 306.304 L
427.46 318.666 L
427.834 317.9 L
428.208 317.636 L
428.582 323.945 L
428.956 316.261 L
429.33 328.684 L
429.704 346.614 L
430.078 336.543 L
430.452 314.627 L
430.826 317.132 L
431.2 305.44 L
431.574 306.69 L
431.948 301.062 L
432.322 312.744 L
432.696 320.17 L
433.07 314.004 L
433.444 309.537 L
433.818 314.992 L
434.192 298.385 L
434.566 310.96 L
434.94 333.169 L
435.314 322.249 L
435.688 335.725 L
436.062 343.674 L
436.436 323.822 L
436.81 308.834 L
437.184 298.645 L
437.558 314.986 L
437.932 321.227 L
438.306 308.129 L
438.68 314.755 L
439.054 300.414 L
439.428 294.325 L
439.802 293.236 L
440.176 324.534 L
440.55 322.272 L
440.924 329.682 L
441.298 314.578 L
441.672 298.573 L
442.046 317.883 L
442.42 307.985 L
442.794 314.268 L
443.168 308.921 L
443.542 321.732 L
443.916 310.385 L
444.29 315.143 L
444.664 317.791 L
445.038 310.404 L
445.412 314.842 L
445.786 321.305 L
446.16 329.844 L
446.534 314.136 L
446.908 317.35 L
447.282 321.244 L
447.656 310.198 L
448.03 324.363 L
448.404 349.981 L
448.778 351.099 L
449.152 327.19 L
449.526 324.502 L
449.9 317.139 L
450.274 309.358 L
450.648 327.001 L
451.022 314.206 L
451.396 295.329 L
451.77 293.966 L
452.144 298.825 L
452.518 315.229 L
452.892 305.899 L
453.266 300.283 L
453.64 309.303 L
454.014 319.222 L
454.388 324.203 L
454.762 319.811 L
455.136 327.609 L
455.51 327.004 L
455.884 317.885 L
456.258 310.378 L
456.632 303.365 L
457.006 306.892 L
457.38 309.608 L
457.754 309.464 L
458.128 323.227 L
458.502 319.796 L
458.876 325.58 L
459.25 334.346 L
459.624 321.962 L
459.998 318.959 L
460.372 318.036 L
460.746 317.371 L
461.12 312.696 L
461.494 330.176 L
461.868 335.708 L
462.242 327.042 L
462.616 330.207 L
462.99 317.152 L
463.364 315.948 L
463.738 311.321 L
464.112 309.781 L
464.486 319.561 L
464.86 306.079 L
465.234 330.465 L
465.608 336.363 L
465.982 323.011 L
466.356 315.073 L
466.73 327.407 L
467.104 315.673 L
467.478 340.215 L
467.852 337.074 L
468.226 332.846 L
468.6 326.447 L
468.974 323.597 L
469.348 312.231 L
469.722 312.151 L
470.096 313.503 L
470.47 322.186 L
470.844 319.445 L
471.218 321.286 L
471.592 317.389 L
471.966 322.662 L
472.34 308.629 L
472.714 310.115 L
473.088 325.555 L
473.462 303.444 L
473.836 295.054 L
474.21 295.767 L
474.584 309.28 L
474.958 292.635 L
475.332 292.176 L
475.706 308.386 L
476.08 320.679 L
476.454 316.505 L
476.828 299.967 L
477.202 322.707 L
477.576 327.878 L
477.95 329.774 L
478.324 304.707 L
478.698 316.623 L
479.072 306.448 L
479.446 309.51 L
479.82 306.84 L
480.194 328.863 L
480.568 307.624 L
480.942 325.231 L
481.316 319.915 L
481.69 318.613 L
482.064 327.482 L
482.438 329.658 L
482.812 324.607 L
483.186 331.784 L
483.56 334.456 L
483.934 349.234 L
484.308 352.551 L
484.682 331.95 L
485.056 307.983 L
485.43 318.014 L
485.804 306.662 L
486.178 304.61 L
486.552 311.981 L
486.926 310.433 L
487.3 303.475 L
487.674 315.293 L
488.048 320.836 L
488.422 314.067 L
488.796 319.023 L
489.17 324.667 L
489.544 322.221 L
489.918 330.077 L
490.292 335.792 L
490.666 323.987 L
491.04 320.923 L
491.414 314.527 L
491.788 311.017 L
492.162 291.327 L
492.536 317.24 L
492.91 311.011 L
493.284 298.008 L
493.658 301.049 L
494.032 320.26 L
494.406 312.968 L
494.78 316.544 L
495.154 314.226 L
495.528 325.53 L
495.902 309.94 L
496.276 314.726 L
496.65 299.715 L
497.024 305.495 L
497.398 328.806 L
497.772 342.452 L
498.146 322.673 L
498.52 315.222 L
498.894 320.204 L
499.268 316.915 L
499.642 305.515 L
500.016 321.083 L
500.39 318.104 L
500.764 318.429 L
501.138 321.59 L
501.512 314.679 L
501.886 327.859 L
502.26 311.055 L
502.634 321.703 L
503.008 303.591 L
503.382 309.102 L
503.756 308.222 L
504.13 316.205 L
504.504 323.909 L
504.878 316.825 L
505.252 336.775 L
505.626 332.485 L
506 335.655 L
S
GR
%%Trailer
%%Pages: 1
%%EOF
