%!PS-Adobe-3.0 EPSF-3.0
%%Creator: (MATLAB, The Mathworks, Inc. Version 9.0.0.341360 \(R2016a\). Operating System: Windows 8)
%%Title: C:/Users/Jan/Documents/JC.ISF/isf1/valC.eps
%%CreationDate: 2017-03-29T10:45:00
%%Pages: (atend)
%%BoundingBox: 0 0 420 315
%%LanguageLevel: 3
%%EndComments
%%BeginProlog
%%BeginResource: procset (Apache XML Graphics Std ProcSet) 1.2 0
%%Version: 1.2 0
%%Copyright: (Copyright 2001-2003,2010 The Apache Software Foundation. License terms: http://www.apache.org/licenses/LICENSE-2.0)
/bd{bind def}bind def
/ld{load def}bd
/GR/grestore ld
/M/moveto ld
/LJ/setlinejoin ld
/C/curveto ld
/f/fill ld
/LW/setlinewidth ld
/GC/setgray ld
/t/show ld
/N/newpath ld
/CT/concat ld
/cp/closepath ld
/S/stroke ld
/L/lineto ld
/CC/setcmykcolor ld
/A/ashow ld
/GS/gsave ld
/RC/setrgbcolor ld
/RM/rmoveto ld
/ML/setmiterlimit ld
/re {4 2 roll M
1 index 0 rlineto
0 exch rlineto
neg 0 rlineto
cp } bd
/_ctm matrix def
/_tm matrix def
/BT { _ctm currentmatrix pop matrix _tm copy pop 0 0 moveto } bd
/ET { _ctm setmatrix } bd
/iTm { _ctm setmatrix _tm concat } bd
/Tm { _tm astore pop iTm 0 0 moveto } bd
/ux 0.0 def
/uy 0.0 def
/F {
  /Tp exch def
  /Tf exch def
  Tf findfont Tp scalefont setfont
  /cf Tf def  /cs Tp def
} bd
/ULS {currentpoint /uy exch def /ux exch def} bd
/ULE {
  /Tcx currentpoint pop def
  gsave
  newpath
  cf findfont cs scalefont dup
  /FontMatrix get 0 get /Ts exch def /FontInfo get dup
  /UnderlinePosition get Ts mul /To exch def
  /UnderlineThickness get Ts mul /Tt exch def
  ux uy To add moveto  Tcx uy To add lineto
  Tt setlinewidth stroke
  grestore
} bd
/OLE {
  /Tcx currentpoint pop def
  gsave
  newpath
  cf findfont cs scalefont dup
  /FontMatrix get 0 get /Ts exch def /FontInfo get dup
  /UnderlinePosition get Ts mul /To exch def
  /UnderlineThickness get Ts mul /Tt exch def
  ux uy To add cs add moveto Tcx uy To add cs add lineto
  Tt setlinewidth stroke
  grestore
} bd
/SOE {
  /Tcx currentpoint pop def
  gsave
  newpath
  cf findfont cs scalefont dup
  /FontMatrix get 0 get /Ts exch def /FontInfo get dup
  /UnderlinePosition get Ts mul /To exch def
  /UnderlineThickness get Ts mul /Tt exch def
  ux uy To add cs 10 mul 26 idiv add moveto Tcx uy To add cs 10 mul 26 idiv add lineto
  Tt setlinewidth stroke
  grestore
} bd
/QT {
/Y22 exch store
/X22 exch store
/Y21 exch store
/X21 exch store
currentpoint
/Y21 load 2 mul add 3 div exch
/X21 load 2 mul add 3 div exch
/X21 load 2 mul /X22 load add 3 div
/Y21 load 2 mul /Y22 load add 3 div
/X22 load /Y22 load curveto
} bd
/SSPD {
dup length /d exch dict def
{
/v exch def
/k exch def
currentpagedevice k known {
/cpdv currentpagedevice k get def
v cpdv ne {
/upd false def
/nullv v type /nulltype eq def
/nullcpdv cpdv type /nulltype eq def
nullv nullcpdv or
{
/upd true def
} {
/sametype v type cpdv type eq def
sametype {
v type /arraytype eq {
/vlen v length def
/cpdvlen cpdv length def
vlen cpdvlen eq {
0 1 vlen 1 sub {
/i exch def
/obj v i get def
/cpdobj cpdv i get def
obj cpdobj ne {
/upd true def
exit
} if
} for
} {
/upd true def
} ifelse
} {
v type /dicttype eq {
v {
/dv exch def
/dk exch def
/cpddv cpdv dk get def
dv cpddv ne {
/upd true def
exit
} if
} forall
} {
/upd true def
} ifelse
} ifelse
} if
} ifelse
upd true eq {
d k v put
} if
} if
} if
} forall
d length 0 gt {
d setpagedevice
} if
} bd
%%EndResource
%%BeginResource: procset (Apache XML Graphics EPS ProcSet) 1.0 0
%%Version: 1.0 0
%%Copyright: (Copyright 2002-2003 The Apache Software Foundation. License terms: http://www.apache.org/licenses/LICENSE-2.0)
/BeginEPSF { %def
/b4_Inc_state save def         % Save state for cleanup
/dict_count countdictstack def % Count objects on dict stack
/op_count count 1 sub def      % Count objects on operand stack
userdict begin                 % Push userdict on dict stack
/showpage { } def              % Redefine showpage, { } = null proc
0 setgray 0 setlinecap         % Prepare graphics state
1 setlinewidth 0 setlinejoin
10 setmiterlimit [ ] 0 setdash newpath
/languagelevel where           % If level not equal to 1 then
{pop languagelevel             % set strokeadjust and
1 ne                           % overprint to their defaults.
{false setstrokeadjust false setoverprint
} if
} if
} bd
/EndEPSF { %def
count op_count sub {pop} repeat            % Clean up stacks
countdictstack dict_count sub {end} repeat
b4_Inc_state restore
} bd
%%EndResource
%FOPBeginFontDict
%%IncludeResource: font Courier-Bold
%%IncludeResource: font Helvetica
%%IncludeResource: font Courier-BoldOblique
%%IncludeResource: font Courier-Oblique
%%IncludeResource: font Times-Roman
%%IncludeResource: font Helvetica-BoldOblique
%%IncludeResource: font Helvetica-Bold
%%IncludeResource: font Helvetica-Oblique
%%IncludeResource: font Times-BoldItalic
%%IncludeResource: font Courier
%%IncludeResource: font Times-Italic
%%IncludeResource: font Times-Bold
%%IncludeResource: font Symbol
%%IncludeResource: font ZapfDingbats
%FOPEndFontDict
%%BeginResource: encoding WinAnsiEncoding
/WinAnsiEncoding [
/.notdef /.notdef /.notdef /.notdef /.notdef
/.notdef /.notdef /.notdef /.notdef /.notdef
/.notdef /.notdef /.notdef /.notdef /.notdef
/.notdef /.notdef /.notdef /.notdef /.notdef
/.notdef /.notdef /.notdef /.notdef /.notdef
/.notdef /.notdef /.notdef /.notdef /.notdef
/.notdef /.notdef /space /exclam /quotedbl
/numbersign /dollar /percent /ampersand /quotesingle
/parenleft /parenright /asterisk /plus /comma
/hyphen /period /slash /zero /one
/two /three /four /five /six
/seven /eight /nine /colon /semicolon
/less /equal /greater /question /at
/A /B /C /D /E
/F /G /H /I /J
/K /L /M /N /O
/P /Q /R /S /T
/U /V /W /X /Y
/Z /bracketleft /backslash /bracketright /asciicircum
/underscore /quoteleft /a /b /c
/d /e /f /g /h
/i /j /k /l /m
/n /o /p /q /r
/s /t /u /v /w
/x /y /z /braceleft /bar
/braceright /asciitilde /bullet /Euro /bullet
/quotesinglbase /florin /quotedblbase /ellipsis /dagger
/daggerdbl /circumflex /perthousand /Scaron /guilsinglleft
/OE /bullet /Zcaron /bullet /bullet
/quoteleft /quoteright /quotedblleft /quotedblright /bullet
/endash /emdash /asciitilde /trademark /scaron
/guilsinglright /oe /bullet /zcaron /Ydieresis
/space /exclamdown /cent /sterling /currency
/yen /brokenbar /section /dieresis /copyright
/ordfeminine /guillemotleft /logicalnot /sfthyphen /registered
/macron /degree /plusminus /twosuperior /threesuperior
/acute /mu /paragraph /middot /cedilla
/onesuperior /ordmasculine /guillemotright /onequarter /onehalf
/threequarters /questiondown /Agrave /Aacute /Acircumflex
/Atilde /Adieresis /Aring /AE /Ccedilla
/Egrave /Eacute /Ecircumflex /Edieresis /Igrave
/Iacute /Icircumflex /Idieresis /Eth /Ntilde
/Ograve /Oacute /Ocircumflex /Otilde /Odieresis
/multiply /Oslash /Ugrave /Uacute /Ucircumflex
/Udieresis /Yacute /Thorn /germandbls /agrave
/aacute /acircumflex /atilde /adieresis /aring
/ae /ccedilla /egrave /eacute /ecircumflex
/edieresis /igrave /iacute /icircumflex /idieresis
/eth /ntilde /ograve /oacute /ocircumflex
/otilde /odieresis /divide /oslash /ugrave
/uacute /ucircumflex /udieresis /yacute /thorn
/ydieresis
] def
%%EndResource
%FOPBeginFontReencode
/Courier-Bold findfont
dup length dict begin
  {1 index /FID ne {def} {pop pop} ifelse} forall
  /Encoding WinAnsiEncoding def
  currentdict
end
/Courier-Bold exch definefont pop
/Helvetica findfont
dup length dict begin
  {1 index /FID ne {def} {pop pop} ifelse} forall
  /Encoding WinAnsiEncoding def
  currentdict
end
/Helvetica exch definefont pop
/Courier-BoldOblique findfont
dup length dict begin
  {1 index /FID ne {def} {pop pop} ifelse} forall
  /Encoding WinAnsiEncoding def
  currentdict
end
/Courier-BoldOblique exch definefont pop
/Courier-Oblique findfont
dup length dict begin
  {1 index /FID ne {def} {pop pop} ifelse} forall
  /Encoding WinAnsiEncoding def
  currentdict
end
/Courier-Oblique exch definefont pop
/Times-Roman findfont
dup length dict begin
  {1 index /FID ne {def} {pop pop} ifelse} forall
  /Encoding WinAnsiEncoding def
  currentdict
end
/Times-Roman exch definefont pop
/Helvetica-BoldOblique findfont
dup length dict begin
  {1 index /FID ne {def} {pop pop} ifelse} forall
  /Encoding WinAnsiEncoding def
  currentdict
end
/Helvetica-BoldOblique exch definefont pop
/Helvetica-Bold findfont
dup length dict begin
  {1 index /FID ne {def} {pop pop} ifelse} forall
  /Encoding WinAnsiEncoding def
  currentdict
end
/Helvetica-Bold exch definefont pop
/Helvetica-Oblique findfont
dup length dict begin
  {1 index /FID ne {def} {pop pop} ifelse} forall
  /Encoding WinAnsiEncoding def
  currentdict
end
/Helvetica-Oblique exch definefont pop
/Times-BoldItalic findfont
dup length dict begin
  {1 index /FID ne {def} {pop pop} ifelse} forall
  /Encoding WinAnsiEncoding def
  currentdict
end
/Times-BoldItalic exch definefont pop
/Courier findfont
dup length dict begin
  {1 index /FID ne {def} {pop pop} ifelse} forall
  /Encoding WinAnsiEncoding def
  currentdict
end
/Courier exch definefont pop
/Times-Italic findfont
dup length dict begin
  {1 index /FID ne {def} {pop pop} ifelse} forall
  /Encoding WinAnsiEncoding def
  currentdict
end
/Times-Italic exch definefont pop
/Times-Bold findfont
dup length dict begin
  {1 index /FID ne {def} {pop pop} ifelse} forall
  /Encoding WinAnsiEncoding def
  currentdict
end
/Times-Bold exch definefont pop
%FOPEndFontReencode
%%EndProlog
%%Page: 1 1
%%PageBoundingBox: 0 0 420 315
%%BeginPageSetup
[1 0 0 -1 0 315] CT
%%EndPageSetup
GS
[0.75 0 0 0.75 0 0] CT
1 GC
N
0 0 560 420 re
f
GR
GS
[0.75 0 0 0.75 0 0] CT
1 GC
N
0 0 560 420 re
f
GR
GS
[0.75 0 0 0.75 0 0] CT
1 GC
N
73 374 M
507 374 L
507 31 L
73 31 L
cp
f
GR
GS
[0.75 0 0 0.75 0 0] CT
0.873 GC
1 LJ
0.667 LW
N
73 374 M
73 31 L
S
GR
GS
[0.75 0 0 0.75 0 0] CT
0.873 GC
1 LJ
0.667 LW
N
145.333 374 M
145.333 31 L
S
GR
GS
[0.75 0 0 0.75 0 0] CT
0.873 GC
1 LJ
0.667 LW
N
217.667 374 M
217.667 31 L
S
GR
GS
[0.75 0 0 0.75 0 0] CT
0.873 GC
1 LJ
0.667 LW
N
290 374 M
290 31 L
S
GR
GS
[0.75 0 0 0.75 0 0] CT
0.873 GC
1 LJ
0.667 LW
N
362.333 374 M
362.333 31 L
S
GR
GS
[0.75 0 0 0.75 0 0] CT
0.873 GC
1 LJ
0.667 LW
N
434.667 374 M
434.667 31 L
S
GR
GS
[0.75 0 0 0.75 0 0] CT
0.873 GC
1 LJ
0.667 LW
N
507 374 M
507 31 L
S
GR
GS
[0.75 0 0 0.75 0 0] CT
0.873 GC
1 LJ
0.667 LW
N
507 374 M
73 374 L
S
GR
GS
[0.75 0 0 0.75 0 0] CT
0.873 GC
1 LJ
0.667 LW
N
507 335.889 M
73 335.889 L
S
GR
GS
[0.75 0 0 0.75 0 0] CT
0.873 GC
1 LJ
0.667 LW
N
507 297.778 M
73 297.778 L
S
GR
GS
[0.75 0 0 0.75 0 0] CT
0.873 GC
1 LJ
0.667 LW
N
507 259.667 M
73 259.667 L
S
GR
GS
[0.75 0 0 0.75 0 0] CT
0.873 GC
1 LJ
0.667 LW
N
507 221.556 M
73 221.556 L
S
GR
GS
[0.75 0 0 0.75 0 0] CT
0.873 GC
1 LJ
0.667 LW
N
507 183.444 M
73 183.444 L
S
GR
GS
[0.75 0 0 0.75 0 0] CT
0.873 GC
1 LJ
0.667 LW
N
507 145.333 M
73 145.333 L
S
GR
GS
[0.75 0 0 0.75 0 0] CT
0.873 GC
1 LJ
0.667 LW
N
507 107.222 M
73 107.222 L
S
GR
GS
[0.75 0 0 0.75 0 0] CT
0.873 GC
1 LJ
0.667 LW
N
507 69.111 M
73 69.111 L
S
GR
GS
[0.75 0 0 0.75 0 0] CT
0.873 GC
1 LJ
0.667 LW
N
507 31 M
73 31 L
S
GR
GS
[0.75 0 0 0.75 0 0] CT
0.149 GC
2 setlinecap
1 LJ
0.667 LW
N
73 374 M
507 374 L
S
GR
GS
[0.75 0 0 0.75 0 0] CT
0.149 GC
2 setlinecap
1 LJ
0.667 LW
N
73 374 M
73 369.66 L
S
GR
GS
[0.75 0 0 0.75 0 0] CT
0.149 GC
2 setlinecap
1 LJ
0.667 LW
N
145.333 374 M
145.333 369.66 L
S
GR
GS
[0.75 0 0 0.75 0 0] CT
0.149 GC
2 setlinecap
1 LJ
0.667 LW
N
217.667 374 M
217.667 369.66 L
S
GR
GS
[0.75 0 0 0.75 0 0] CT
0.149 GC
2 setlinecap
1 LJ
0.667 LW
N
290 374 M
290 369.66 L
S
GR
GS
[0.75 0 0 0.75 0 0] CT
0.149 GC
2 setlinecap
1 LJ
0.667 LW
N
362.333 374 M
362.333 369.66 L
S
GR
GS
[0.75 0 0 0.75 0 0] CT
0.149 GC
2 setlinecap
1 LJ
0.667 LW
N
434.667 374 M
434.667 369.66 L
S
GR
GS
[0.75 0 0 0.75 0 0] CT
0.149 GC
2 setlinecap
1 LJ
0.667 LW
N
507 374 M
507 369.66 L
S
GR
GS
[0.75 0 0 0.75 54.75 284.50001] CT
0.149 GC
/Helvetica 13.333 F
GS
[1 0 0 1 0 0] CT
-4 14 moveto 
1 -1 scale
(0) t 
GR
GR
GS
[0.75 0 0 0.75 109 284.50001] CT
0.149 GC
/Helvetica 13.333 F
GS
[1 0 0 1 0 0] CT
-7.5 14 moveto 
1 -1 scale
(10) t 
GR
GR
GS
[0.75 0 0 0.75 163.25 284.50001] CT
0.149 GC
/Helvetica 13.333 F
GS
[1 0 0 1 0 0] CT
-7.5 14 moveto 
1 -1 scale
(20) t 
GR
GR
GS
[0.75 0 0 0.75 217.5 284.50001] CT
0.149 GC
/Helvetica 13.333 F
GS
[1 0 0 1 0 0] CT
-7.5 14 moveto 
1 -1 scale
(30) t 
GR
GR
GS
[0.75 0 0 0.75 271.75001 284.50001] CT
0.149 GC
/Helvetica 13.333 F
GS
[1 0 0 1 0 0] CT
-7.5 14 moveto 
1 -1 scale
(40) t 
GR
GR
GS
[0.75 0 0 0.75 325.99999 284.50001] CT
0.149 GC
/Helvetica 13.333 F
GS
[1 0 0 1 0 0] CT
-7.5 14 moveto 
1 -1 scale
(50) t 
GR
GR
GS
[0.75 0 0 0.75 380.25 284.50001] CT
0.149 GC
/Helvetica 13.333 F
GS
[1 0 0 1 0 0] CT
-7.5 14 moveto 
1 -1 scale
(60) t 
GR
GR
GS
[0.75 0 0 0.75 217.50016 298.24999] CT
0.149 GC
/Helvetica 14.667 F
GS
[1 0 0 1 0 0] CT
-4 16 moveto 
1 -1 scale
(k) t 
GR
GR
GS
[0.75 0 0 0.75 0 0] CT
0.149 GC
2 setlinecap
1 LJ
0.667 LW
N
73 374 M
73 31 L
S
GR
GS
[0.75 0 0 0.75 0 0] CT
0.149 GC
2 setlinecap
1 LJ
0.667 LW
N
73 374 M
77.34 374 L
S
GR
GS
[0.75 0 0 0.75 0 0] CT
0.149 GC
2 setlinecap
1 LJ
0.667 LW
N
73 335.889 M
77.34 335.889 L
S
GR
GS
[0.75 0 0 0.75 0 0] CT
0.149 GC
2 setlinecap
1 LJ
0.667 LW
N
73 297.778 M
77.34 297.778 L
S
GR
GS
[0.75 0 0 0.75 0 0] CT
0.149 GC
2 setlinecap
1 LJ
0.667 LW
N
73 259.667 M
77.34 259.667 L
S
GR
GS
[0.75 0 0 0.75 0 0] CT
0.149 GC
2 setlinecap
1 LJ
0.667 LW
N
73 221.556 M
77.34 221.556 L
S
GR
GS
[0.75 0 0 0.75 0 0] CT
0.149 GC
2 setlinecap
1 LJ
0.667 LW
N
73 183.444 M
77.34 183.444 L
S
GR
GS
[0.75 0 0 0.75 0 0] CT
0.149 GC
2 setlinecap
1 LJ
0.667 LW
N
73 145.333 M
77.34 145.333 L
S
GR
GS
[0.75 0 0 0.75 0 0] CT
0.149 GC
2 setlinecap
1 LJ
0.667 LW
N
73 107.222 M
77.34 107.222 L
S
GR
GS
[0.75 0 0 0.75 0 0] CT
0.149 GC
2 setlinecap
1 LJ
0.667 LW
N
73 69.111 M
77.34 69.111 L
S
GR
GS
[0.75 0 0 0.75 0 0] CT
0.149 GC
2 setlinecap
1 LJ
0.667 LW
N
73 31 M
77.34 31 L
S
GR
GS
[0.75 0 0 0.75 50.75 280.5] CT
0.149 GC
/Helvetica 13.333 F
GS
[1 0 0 1 0 0] CT
-15 5.5 moveto 
1 -1 scale
(15) t 
GR
GR
GS
[0.75 0 0 0.75 50.75 251.91666] CT
0.149 GC
/Helvetica 13.333 F
GS
[1 0 0 1 0 0] CT
-15 5.5 moveto 
1 -1 scale
(20) t 
GR
GR
GS
[0.75 0 0 0.75 50.75 223.33333] CT
0.149 GC
/Helvetica 13.333 F
GS
[1 0 0 1 0 0] CT
-15 5.5 moveto 
1 -1 scale
(25) t 
GR
GR
GS
[0.75 0 0 0.75 50.75 194.74999] CT
0.149 GC
/Helvetica 13.333 F
GS
[1 0 0 1 0 0] CT
-15 5.5 moveto 
1 -1 scale
(30) t 
GR
GR
GS
[0.75 0 0 0.75 50.75 166.16667] CT
0.149 GC
/Helvetica 13.333 F
GS
[1 0 0 1 0 0] CT
-15 5.5 moveto 
1 -1 scale
(35) t 
GR
GR
GS
[0.75 0 0 0.75 50.75 137.58333] CT
0.149 GC
/Helvetica 13.333 F
GS
[1 0 0 1 0 0] CT
-15 5.5 moveto 
1 -1 scale
(40) t 
GR
GR
GS
[0.75 0 0 0.75 50.75 109] CT
0.149 GC
/Helvetica 13.333 F
GS
[1 0 0 1 0 0] CT
-15 5.5 moveto 
1 -1 scale
(45) t 
GR
GR
GS
[0.75 0 0 0.75 50.75 80.41667] CT
0.149 GC
/Helvetica 13.333 F
GS
[1 0 0 1 0 0] CT
-15 5.5 moveto 
1 -1 scale
(50) t 
GR
GR
GS
[0.75 0 0 0.75 50.75 51.83334] CT
0.149 GC
/Helvetica 13.333 F
GS
[1 0 0 1 0 0] CT
-15 5.5 moveto 
1 -1 scale
(55) t 
GR
GR
GS
[0.75 0 0 0.75 50.75 23.25] CT
0.149 GC
/Helvetica 13.333 F
GS
[1 0 0 1 0 0] CT
-15 5.5 moveto 
1 -1 scale
(60) t 
GR
GR
GS
[0 -0.75 0.75 0 36.5 151.87487] CT
0.149 GC
/Helvetica 14.667 F
GS
[1 0 0 1 0 0] CT
-12.5 -4 moveto 
1 -1 scale
(y\(k\)) t 
GR
GR
GS
[0.75 0 0 0.75 217.50021 21.1875] CT
N
-166.719 -4 M
-169.078 -4 L
-170.016 -6.438 L
-174.313 -6.438 L
-175.203 -4 L
-177.5 -4 L
-173.313 -14.734 L
-171.031 -14.734 L
-166.719 -4 L
cp
-170.719 -8.25 M
-172.203 -12.234 L
-173.641 -8.25 L
-170.719 -8.25 L
cp
-165.9 -11.781 M
-163.978 -11.781 L
-163.978 -10.641 L
-163.603 -11.219 -162.97 -11.586 QT
-162.338 -11.953 -161.556 -11.953 QT
-160.197 -11.953 -159.252 -10.891 QT
-158.306 -9.828 -158.306 -7.938 QT
-158.306 -5.984 -159.259 -4.906 QT
-160.213 -3.828 -161.572 -3.828 QT
-162.213 -3.828 -162.736 -4.086 QT
-163.259 -4.344 -163.838 -4.953 QT
-163.838 -1.047 L
-165.9 -1.047 L
-165.9 -11.781 L
cp
-163.869 -8.016 M
-163.869 -6.703 -163.345 -6.078 QT
-162.822 -5.453 -162.072 -5.453 QT
-161.353 -5.453 -160.877 -6.031 QT
-160.4 -6.609 -160.4 -7.922 QT
-160.4 -9.141 -160.892 -9.734 QT
-161.384 -10.328 -162.103 -10.328 QT
-162.869 -10.328 -163.369 -9.742 QT
-163.869 -9.156 -163.869 -8.016 QT
cp
-154.916 -4 M
-156.979 -4 L
-156.979 -11.781 L
-155.057 -11.781 L
-155.057 -10.672 L
-154.572 -11.453 -154.182 -11.703 QT
-153.791 -11.953 -153.291 -11.953 QT
-152.588 -11.953 -151.932 -11.563 QT
-152.572 -9.766 L
-153.088 -10.109 -153.541 -10.109 QT
-153.979 -10.109 -154.276 -9.867 QT
-154.572 -9.625 -154.744 -9.008 QT
-154.916 -8.391 -154.916 -6.406 QT
-154.916 -4 L
cp
-151.666 -8 M
-151.666 -9.031 -151.158 -9.984 QT
-150.65 -10.938 -149.72 -11.445 QT
-148.791 -11.953 -147.65 -11.953 QT
-145.884 -11.953 -144.759 -10.805 QT
-143.634 -9.656 -143.634 -7.906 QT
-143.634 -6.141 -144.775 -4.984 QT
-145.916 -3.828 -147.634 -3.828 QT
-148.713 -3.828 -149.681 -4.313 QT
-150.65 -4.797 -151.158 -5.727 QT
-151.666 -6.656 -151.666 -8 QT
cp
-149.556 -7.891 M
-149.556 -6.734 -149.002 -6.117 QT
-148.447 -5.5 -147.65 -5.5 QT
-146.838 -5.5 -146.291 -6.117 QT
-145.744 -6.734 -145.744 -7.906 QT
-145.744 -9.047 -146.291 -9.664 QT
-146.838 -10.281 -147.65 -10.281 QT
-148.447 -10.281 -149.002 -9.664 QT
-149.556 -9.047 -149.556 -7.891 QT
cp
-143.213 -4 M
-140.416 -8 L
-143.104 -11.781 L
-140.588 -11.781 L
-139.213 -9.641 L
-137.76 -11.781 L
-135.338 -11.781 L
-137.979 -8.094 L
-135.104 -4 L
-137.635 -4 L
-139.213 -6.406 L
-140.807 -4 L
-143.213 -4 L
cp
-134.078 -12.828 M
-134.078 -14.734 L
-132.015 -14.734 L
-132.015 -12.828 L
-134.078 -12.828 L
cp
-134.078 -4 M
-134.078 -11.781 L
-132.015 -11.781 L
-132.015 -4 L
-134.078 -4 L
cp
-128.474 -9.406 M
-130.334 -9.75 L
-130.021 -10.875 -129.256 -11.414 QT
-128.49 -11.953 -126.974 -11.953 QT
-125.584 -11.953 -124.912 -11.625 QT
-124.24 -11.297 -123.967 -10.797 QT
-123.693 -10.297 -123.693 -8.953 QT
-123.709 -6.563 L
-123.709 -5.531 -123.615 -5.047 QT
-123.521 -4.563 -123.24 -4 QT
-125.287 -4 L
-125.365 -4.203 -125.474 -4.609 QT
-125.537 -4.797 -125.553 -4.844 QT
-126.084 -4.344 -126.685 -4.086 QT
-127.287 -3.828 -127.959 -3.828 QT
-129.162 -3.828 -129.857 -4.477 QT
-130.553 -5.125 -130.553 -6.125 QT
-130.553 -6.781 -130.232 -7.297 QT
-129.912 -7.813 -129.349 -8.086 QT
-128.787 -8.359 -127.709 -8.578 QT
-126.271 -8.844 -125.709 -9.078 QT
-125.709 -9.281 L
-125.709 -9.875 -126.006 -10.125 QT
-126.303 -10.375 -127.115 -10.375 QT
-127.662 -10.375 -127.967 -10.164 QT
-128.271 -9.953 -128.474 -9.406 QT
cp
-125.709 -7.734 M
-126.115 -7.609 -126.967 -7.422 QT
-127.818 -7.234 -128.084 -7.063 QT
-128.49 -6.781 -128.49 -6.344 QT
-128.49 -5.906 -128.17 -5.594 QT
-127.849 -5.281 -127.349 -5.281 QT
-126.787 -5.281 -126.287 -5.641 QT
-125.912 -5.922 -125.803 -6.328 QT
-125.709 -6.578 -125.709 -7.328 QT
-125.709 -7.734 L
cp
-122.011 -11.781 M
-120.12 -11.781 L
-120.12 -10.719 L
-119.089 -11.953 -117.683 -11.953 QT
-116.948 -11.953 -116.394 -11.648 QT
-115.839 -11.344 -115.495 -10.719 QT
-114.98 -11.344 -114.386 -11.648 QT
-113.792 -11.953 -113.12 -11.953 QT
-112.261 -11.953 -111.667 -11.609 QT
-111.073 -11.266 -110.776 -10.578 QT
-110.573 -10.094 -110.573 -8.969 QT
-110.573 -4 L
-112.62 -4 L
-112.62 -8.453 L
-112.62 -9.609 -112.839 -9.938 QT
-113.12 -10.375 -113.714 -10.375 QT
-114.151 -10.375 -114.534 -10.117 QT
-114.917 -9.859 -115.081 -9.344 QT
-115.245 -8.828 -115.245 -7.734 QT
-115.245 -4 L
-117.308 -4 L
-117.308 -8.266 L
-117.308 -9.391 -117.417 -9.727 QT
-117.526 -10.063 -117.761 -10.219 QT
-117.995 -10.375 -118.386 -10.375 QT
-118.855 -10.375 -119.237 -10.117 QT
-119.62 -9.859 -119.784 -9.383 QT
-119.948 -8.906 -119.948 -7.781 QT
-119.948 -4 L
-122.011 -4 L
-122.011 -11.781 L
cp
-102.042 -9.484 M
-104.073 -9.109 L
-104.167 -9.719 -104.534 -10.023 QT
-104.901 -10.328 -105.479 -10.328 QT
-106.245 -10.328 -106.706 -9.805 QT
-107.167 -9.281 -107.167 -8.031 QT
-107.167 -6.641 -106.698 -6.07 QT
-106.229 -5.5 -105.448 -5.5 QT
-104.854 -5.5 -104.487 -5.836 QT
-104.12 -6.172 -103.963 -6.984 QT
-101.932 -6.641 L
-102.26 -5.25 -103.151 -4.539 QT
-104.042 -3.828 -105.542 -3.828 QT
-107.245 -3.828 -108.26 -4.906 QT
-109.276 -5.984 -109.276 -7.875 QT
-109.276 -9.813 -108.26 -10.883 QT
-107.245 -11.953 -105.51 -11.953 QT
-104.088 -11.953 -103.245 -11.344 QT
-102.401 -10.734 -102.042 -9.484 QT
cp
-96.172 -6.469 M
-94.125 -6.125 L
-94.515 -5 -95.367 -4.414 QT
-96.219 -3.828 -97.5 -3.828 QT
-99.531 -3.828 -100.5 -5.156 QT
-101.281 -6.219 -101.281 -7.828 QT
-101.281 -9.766 -100.265 -10.859 QT
-99.25 -11.953 -97.703 -11.953 QT
-95.969 -11.953 -94.969 -10.805 QT
-93.969 -9.656 -94.015 -7.297 QT
-99.172 -7.297 L
-99.14 -6.375 -98.664 -5.867 QT
-98.187 -5.359 -97.484 -5.359 QT
-97 -5.359 -96.672 -5.625 QT
-96.344 -5.891 -96.172 -6.469 QT
cp
-96.047 -8.563 M
-96.078 -9.453 -96.515 -9.914 QT
-96.953 -10.375 -97.578 -10.375 QT
-98.25 -10.375 -98.703 -9.891 QT
-99.14 -9.391 -99.125 -8.563 QT
-96.047 -8.563 L
cp
-88.511 -11.781 M
-86.589 -11.781 L
-86.589 -10.641 L
-86.214 -11.219 -85.581 -11.586 QT
-84.949 -11.953 -84.167 -11.953 QT
-82.808 -11.953 -81.863 -10.891 QT
-80.917 -9.828 -80.917 -7.938 QT
-80.917 -5.984 -81.87 -4.906 QT
-82.824 -3.828 -84.183 -3.828 QT
-84.824 -3.828 -85.347 -4.086 QT
-85.87 -4.344 -86.449 -4.953 QT
-86.449 -1.047 L
-88.511 -1.047 L
-88.511 -11.781 L
cp
-86.48 -8.016 M
-86.48 -6.703 -85.956 -6.078 QT
-85.433 -5.453 -84.683 -5.453 QT
-83.964 -5.453 -83.488 -6.031 QT
-83.011 -6.609 -83.011 -7.922 QT
-83.011 -9.141 -83.503 -9.734 QT
-83.995 -10.328 -84.714 -10.328 QT
-85.48 -10.328 -85.98 -9.742 QT
-86.48 -9.156 -86.48 -8.016 QT
cp
-79.98 -8 M
-79.98 -9.031 -79.473 -9.984 QT
-78.965 -10.938 -78.035 -11.445 QT
-77.105 -11.953 -75.965 -11.953 QT
-74.199 -11.953 -73.074 -10.805 QT
-71.949 -9.656 -71.949 -7.906 QT
-71.949 -6.141 -73.09 -4.984 QT
-74.23 -3.828 -75.949 -3.828 QT
-77.027 -3.828 -77.996 -4.313 QT
-78.965 -4.797 -79.473 -5.727 QT
-79.98 -6.656 -79.98 -8 QT
cp
-77.871 -7.891 M
-77.871 -6.734 -77.316 -6.117 QT
-76.762 -5.5 -75.965 -5.5 QT
-75.152 -5.5 -74.605 -6.117 QT
-74.058 -6.734 -74.058 -7.906 QT
-74.058 -9.047 -74.605 -9.664 QT
-75.152 -10.281 -75.965 -10.281 QT
-76.762 -10.281 -77.316 -9.664 QT
-77.871 -9.047 -77.871 -7.891 QT
cp
-70.543 -4 M
-70.543 -14.734 L
-68.481 -14.734 L
-68.481 -4 L
-70.543 -4 L
cp
-67.44 -11.781 M
-65.253 -11.781 L
-63.393 -6.25 L
-61.581 -11.781 L
-59.456 -11.781 L
-62.19 -4.297 L
-62.69 -2.938 L
-62.956 -2.25 -63.198 -1.891 QT
-63.44 -1.531 -63.76 -1.313 QT
-64.081 -1.094 -64.549 -0.969 QT
-65.018 -0.844 -65.596 -0.844 QT
-66.19 -0.844 -66.768 -0.969 QT
-66.956 -2.578 L
-66.471 -2.484 -66.081 -2.484 QT
-65.362 -2.484 -65.018 -2.906 QT
-64.674 -3.328 -64.487 -3.984 QT
-67.44 -11.781 L
cp
-59.227 -11.781 M
-58.086 -11.781 L
-58.086 -12.359 L
-58.086 -13.344 -57.875 -13.828 QT
-57.664 -14.313 -57.102 -14.617 QT
-56.539 -14.922 -55.68 -14.922 QT
-54.805 -14.922 -53.961 -14.656 QT
-54.242 -13.219 L
-54.727 -13.344 -55.18 -13.344 QT
-55.633 -13.344 -55.828 -13.133 QT
-56.023 -12.922 -56.023 -12.328 QT
-56.023 -11.781 L
-54.477 -11.781 L
-54.477 -10.156 L
-56.023 -10.156 L
-56.023 -4 L
-58.086 -4 L
-58.086 -10.156 L
-59.227 -10.156 L
-59.227 -11.781 L
cp
-53.44 -12.828 M
-53.44 -14.734 L
-51.377 -14.734 L
-51.377 -12.828 L
-53.44 -12.828 L
cp
-53.44 -4 M
-53.44 -11.781 L
-51.377 -11.781 L
-51.377 -4 L
-53.44 -4 L
cp
-45.805 -11.781 M
-45.805 -10.141 L
-47.211 -10.141 L
-47.211 -7 L
-47.211 -6.047 -47.172 -5.891 QT
-47.133 -5.734 -46.985 -5.633 QT
-46.836 -5.531 -46.633 -5.531 QT
-46.352 -5.531 -45.805 -5.734 QT
-45.633 -4.125 L
-46.352 -3.828 -47.258 -3.828 QT
-47.821 -3.828 -48.266 -4.016 QT
-48.711 -4.203 -48.922 -4.5 QT
-49.133 -4.797 -49.211 -5.297 QT
-49.274 -5.656 -49.274 -6.75 QT
-49.274 -10.141 L
-50.211 -10.141 L
-50.211 -11.781 L
-49.274 -11.781 L
-49.274 -13.328 L
-47.211 -14.531 L
-47.211 -11.781 L
-45.805 -11.781 L
cp
-39.987 -6.469 M
-37.94 -6.125 L
-38.331 -5 -39.182 -4.414 QT
-40.034 -3.828 -41.315 -3.828 QT
-43.346 -3.828 -44.315 -5.156 QT
-45.096 -6.219 -45.096 -7.828 QT
-45.096 -9.766 -44.081 -10.859 QT
-43.065 -11.953 -41.518 -11.953 QT
-39.784 -11.953 -38.784 -10.805 QT
-37.784 -9.656 -37.831 -7.297 QT
-42.987 -7.297 L
-42.956 -6.375 -42.479 -5.867 QT
-42.003 -5.359 -41.299 -5.359 QT
-40.815 -5.359 -40.487 -5.625 QT
-40.159 -5.891 -39.987 -6.469 QT
cp
-39.862 -8.563 M
-39.893 -9.453 -40.331 -9.914 QT
-40.768 -10.375 -41.393 -10.375 QT
-42.065 -10.375 -42.518 -9.891 QT
-42.956 -9.391 -42.94 -8.563 QT
-39.862 -8.563 L
cp
-36.492 -11.781 M
-34.602 -11.781 L
-34.602 -10.719 L
-33.57 -11.953 -32.164 -11.953 QT
-31.43 -11.953 -30.875 -11.648 QT
-30.32 -11.344 -29.977 -10.719 QT
-29.461 -11.344 -28.867 -11.648 QT
-28.273 -11.953 -27.602 -11.953 QT
-26.742 -11.953 -26.148 -11.609 QT
-25.555 -11.266 -25.258 -10.578 QT
-25.055 -10.094 -25.055 -8.969 QT
-25.055 -4 L
-27.102 -4 L
-27.102 -8.453 L
-27.102 -9.609 -27.32 -9.938 QT
-27.602 -10.375 -28.195 -10.375 QT
-28.633 -10.375 -29.016 -10.117 QT
-29.398 -9.859 -29.562 -9.344 QT
-29.727 -8.828 -29.727 -7.734 QT
-29.727 -4 L
-31.789 -4 L
-31.789 -8.266 L
-31.789 -9.391 -31.898 -9.727 QT
-32.008 -10.063 -32.242 -10.219 QT
-32.477 -10.375 -32.867 -10.375 QT
-33.336 -10.375 -33.719 -10.117 QT
-34.102 -9.859 -34.266 -9.383 QT
-34.43 -8.906 -34.43 -7.781 QT
-34.43 -4 L
-36.492 -4 L
-36.492 -11.781 L
cp
-19.951 -6.219 M
-17.888 -6.531 L
-17.763 -5.938 -17.357 -5.625 QT
-16.951 -5.313 -16.232 -5.313 QT
-15.435 -5.313 -15.029 -5.609 QT
-14.763 -5.813 -14.763 -6.156 QT
-14.763 -6.391 -14.904 -6.547 QT
-15.06 -6.688 -15.592 -6.813 QT
-18.076 -7.359 -18.748 -7.813 QT
-19.67 -8.453 -19.67 -9.563 QT
-19.67 -10.578 -18.873 -11.266 QT
-18.076 -11.953 -16.404 -11.953 QT
-14.795 -11.953 -14.021 -11.438 QT
-13.248 -10.922 -12.951 -9.891 QT
-14.904 -9.531 L
-15.029 -9.984 -15.373 -10.227 QT
-15.717 -10.469 -16.357 -10.469 QT
-17.17 -10.469 -17.529 -10.25 QT
-17.763 -10.094 -17.763 -9.828 QT
-17.763 -9.609 -17.56 -9.453 QT
-17.279 -9.25 -15.631 -8.875 QT
-13.982 -8.5 -13.342 -7.969 QT
-12.685 -7.406 -12.685 -6.438 QT
-12.685 -5.359 -13.584 -4.594 QT
-14.482 -3.828 -16.232 -3.828 QT
-17.826 -3.828 -18.748 -4.469 QT
-19.67 -5.109 -19.951 -6.219 QT
cp
0.069 -4 M
-1.993 -4 L
-1.993 -7.969 L
-1.993 -9.234 -2.126 -9.602 QT
-2.259 -9.969 -2.556 -10.172 QT
-2.853 -10.375 -3.275 -10.375 QT
-3.806 -10.375 -4.228 -10.086 QT
-4.65 -9.797 -4.806 -9.313 QT
-4.962 -8.828 -4.962 -7.516 QT
-4.962 -4 L
-7.025 -4 L
-7.025 -11.781 L
-5.118 -11.781 L
-5.118 -10.641 L
-4.103 -11.953 -2.556 -11.953 QT
-1.868 -11.953 -1.306 -11.711 QT
-0.743 -11.469 -0.454 -11.086 QT
-0.165 -10.703 -0.048 -10.219 QT
0.069 -9.734 0.069 -8.828 QT
0.069 -4 L
cp
6.444 -6.469 M
8.49 -6.125 L
8.1 -5 7.248 -4.414 QT
6.397 -3.828 5.115 -3.828 QT
3.084 -3.828 2.115 -5.156 QT
1.334 -6.219 1.334 -7.828 QT
1.334 -9.766 2.35 -10.859 QT
3.365 -11.953 4.912 -11.953 QT
6.647 -11.953 7.647 -10.805 QT
8.647 -9.656 8.6 -7.297 QT
3.444 -7.297 L
3.475 -6.375 3.951 -5.867 QT
4.428 -5.359 5.131 -5.359 QT
5.615 -5.359 5.944 -5.625 QT
6.272 -5.891 6.444 -6.469 QT
cp
6.569 -8.563 M
6.537 -9.453 6.1 -9.914 QT
5.662 -10.375 5.037 -10.375 QT
4.365 -10.375 3.912 -9.891 QT
3.475 -9.391 3.49 -8.563 QT
6.569 -8.563 L
cp
10.048 -12.828 M
10.048 -14.734 L
12.11 -14.734 L
12.11 -12.828 L
10.048 -12.828 L
cp
12.11 -11.781 M
12.11 -4.234 L
12.11 -2.75 11.915 -2.141 QT
11.72 -1.531 11.165 -1.188 QT
10.61 -0.844 9.751 -0.844 QT
9.454 -0.844 9.095 -0.898 QT
8.735 -0.953 8.329 -1.063 QT
8.688 -2.828 L
8.829 -2.797 8.962 -2.773 QT
9.095 -2.75 9.204 -2.75 QT
9.517 -2.75 9.72 -2.891 QT
9.923 -3.031 9.985 -3.219 QT
10.048 -3.406 10.048 -4.359 QT
10.048 -11.781 L
12.11 -11.781 L
cp
14.01 -11.781 M
15.901 -11.781 L
15.901 -10.719 L
16.932 -11.953 18.339 -11.953 QT
19.073 -11.953 19.628 -11.648 QT
20.182 -11.344 20.526 -10.719 QT
21.042 -11.344 21.635 -11.648 QT
22.229 -11.953 22.901 -11.953 QT
23.76 -11.953 24.354 -11.609 QT
24.948 -11.266 25.245 -10.578 QT
25.448 -10.094 25.448 -8.969 QT
25.448 -4 L
23.401 -4 L
23.401 -8.453 L
23.401 -9.609 23.182 -9.938 QT
22.901 -10.375 22.307 -10.375 QT
21.87 -10.375 21.487 -10.117 QT
21.104 -9.859 20.94 -9.344 QT
20.776 -8.828 20.776 -7.734 QT
20.776 -4 L
18.714 -4 L
18.714 -8.266 L
18.714 -9.391 18.604 -9.727 QT
18.495 -10.063 18.26 -10.219 QT
18.026 -10.375 17.635 -10.375 QT
17.167 -10.375 16.784 -10.117 QT
16.401 -9.859 16.237 -9.383 QT
16.073 -8.906 16.073 -7.781 QT
16.073 -4 L
14.01 -4 L
14.01 -11.781 L
cp
31.698 -6.469 M
33.745 -6.125 L
33.355 -5 32.503 -4.414 QT
31.652 -3.828 30.37 -3.828 QT
28.339 -3.828 27.37 -5.156 QT
26.589 -6.219 26.589 -7.828 QT
26.589 -9.766 27.605 -10.859 QT
28.62 -11.953 30.167 -11.953 QT
31.902 -11.953 32.902 -10.805 QT
33.902 -9.656 33.855 -7.297 QT
28.698 -7.297 L
28.73 -6.375 29.206 -5.867 QT
29.683 -5.359 30.386 -5.359 QT
30.87 -5.359 31.198 -5.625 QT
31.527 -5.891 31.698 -6.469 QT
cp
31.823 -8.563 M
31.792 -9.453 31.355 -9.914 QT
30.917 -10.375 30.292 -10.375 QT
29.62 -10.375 29.167 -9.891 QT
28.73 -9.391 28.745 -8.563 QT
31.823 -8.563 L
cp
42.428 -4 M
40.365 -4 L
40.365 -7.969 L
40.365 -9.234 40.232 -9.602 QT
40.099 -9.969 39.803 -10.172 QT
39.506 -10.375 39.084 -10.375 QT
38.553 -10.375 38.131 -10.086 QT
37.709 -9.797 37.553 -9.313 QT
37.396 -8.828 37.396 -7.516 QT
37.396 -4 L
35.334 -4 L
35.334 -11.781 L
37.24 -11.781 L
37.24 -10.641 L
38.256 -11.953 39.803 -11.953 QT
40.49 -11.953 41.053 -11.711 QT
41.615 -11.469 41.904 -11.086 QT
42.193 -10.703 42.31 -10.219 QT
42.428 -9.734 42.428 -8.828 QT
42.428 -4 L
cp
43.583 -6.219 M
45.646 -6.531 L
45.771 -5.938 46.177 -5.625 QT
46.583 -5.313 47.302 -5.313 QT
48.099 -5.313 48.505 -5.609 QT
48.771 -5.813 48.771 -6.156 QT
48.771 -6.391 48.63 -6.547 QT
48.474 -6.688 47.943 -6.813 QT
45.458 -7.359 44.786 -7.813 QT
43.865 -8.453 43.865 -9.563 QT
43.865 -10.578 44.661 -11.266 QT
45.458 -11.953 47.13 -11.953 QT
48.74 -11.953 49.513 -11.438 QT
50.286 -10.922 50.583 -9.891 QT
48.63 -9.531 L
48.505 -9.984 48.161 -10.227 QT
47.818 -10.469 47.177 -10.469 QT
46.365 -10.469 46.005 -10.25 QT
45.771 -10.094 45.771 -9.828 QT
45.771 -9.609 45.974 -9.453 QT
46.255 -9.25 47.904 -8.875 QT
49.552 -8.5 50.193 -7.969 QT
50.849 -7.406 50.849 -6.438 QT
50.849 -5.359 49.951 -4.594 QT
49.052 -3.828 47.302 -3.828 QT
45.708 -3.828 44.786 -4.469 QT
43.865 -5.109 43.583 -6.219 QT
cp
45.271 -15.156 M
46.943 -15.156 L
47.724 -14.063 L
48.583 -15.156 L
50.24 -15.156 L
48.724 -13 L
46.818 -13 L
45.271 -15.156 L
cp
52.453 -4 M
52.453 -11.781 L
54.516 -11.781 L
54.516 -4 L
52.453 -4 L
cp
52.078 -13 M
53.078 -15.188 L
55.391 -15.188 L
53.375 -13 L
52.078 -13 L
cp
67.378 -9.484 M
65.347 -9.109 L
65.253 -9.719 64.886 -10.023 QT
64.519 -10.328 63.941 -10.328 QT
63.175 -10.328 62.714 -9.805 QT
62.253 -9.281 62.253 -8.031 QT
62.253 -6.641 62.722 -6.07 QT
63.191 -5.5 63.972 -5.5 QT
64.566 -5.5 64.933 -5.836 QT
65.3 -6.172 65.457 -6.984 QT
67.488 -6.641 L
67.16 -5.25 66.269 -4.539 QT
65.378 -3.828 63.878 -3.828 QT
62.175 -3.828 61.16 -4.906 QT
60.144 -5.984 60.144 -7.875 QT
60.144 -9.813 61.16 -10.883 QT
62.175 -11.953 63.91 -11.953 QT
65.332 -11.953 66.175 -11.344 QT
67.019 -10.734 67.378 -9.484 QT
cp
70.795 -14.734 M
70.795 -10.797 L
71.795 -11.953 73.186 -11.953 QT
73.889 -11.953 74.459 -11.688 QT
75.03 -11.422 75.319 -11.016 QT
75.608 -10.609 75.717 -10.109 QT
75.826 -9.609 75.826 -8.563 QT
75.826 -4 L
73.764 -4 L
73.764 -8.109 L
73.764 -9.328 73.647 -9.656 QT
73.53 -9.984 73.233 -10.18 QT
72.936 -10.375 72.483 -10.375 QT
71.983 -10.375 71.576 -10.125 QT
71.17 -9.875 70.983 -9.375 QT
70.795 -8.875 70.795 -7.891 QT
70.795 -4 L
68.733 -4 L
68.733 -14.734 L
70.795 -14.734 L
cp
76.732 -11.781 M
78.92 -11.781 L
80.779 -6.25 L
82.592 -11.781 L
84.717 -11.781 L
81.982 -4.297 L
81.482 -2.938 L
81.217 -2.25 80.974 -1.891 QT
80.732 -1.531 80.412 -1.313 QT
80.092 -1.094 79.623 -0.969 QT
79.154 -0.844 78.576 -0.844 QT
77.982 -0.844 77.404 -0.969 QT
77.217 -2.578 L
77.701 -2.484 78.092 -2.484 QT
78.81 -2.484 79.154 -2.906 QT
79.498 -3.328 79.685 -3.984 QT
76.732 -11.781 L
cp
85.758 -4 M
85.758 -14.734 L
87.821 -14.734 L
87.821 -10.875 L
88.774 -11.953 90.071 -11.953 QT
91.493 -11.953 92.422 -10.922 QT
93.352 -9.891 93.352 -7.969 QT
93.352 -5.984 92.407 -4.906 QT
91.461 -3.828 90.102 -3.828 QT
89.446 -3.828 88.797 -4.156 QT
88.149 -4.484 87.68 -5.141 QT
87.68 -4 L
85.758 -4 L
cp
87.805 -8.063 M
87.805 -6.844 88.18 -6.266 QT
88.727 -5.453 89.602 -5.453 QT
90.289 -5.453 90.766 -6.031 QT
91.243 -6.609 91.243 -7.875 QT
91.243 -9.203 90.766 -9.789 QT
90.289 -10.375 89.524 -10.375 QT
88.789 -10.375 88.297 -9.805 QT
87.805 -9.234 87.805 -8.063 QT
cp
94.32 -8 M
94.32 -9.031 94.828 -9.984 QT
95.336 -10.938 96.266 -11.445 QT
97.195 -11.953 98.336 -11.953 QT
100.102 -11.953 101.227 -10.805 QT
102.352 -9.656 102.352 -7.906 QT
102.352 -6.141 101.211 -4.984 QT
100.07 -3.828 98.352 -3.828 QT
97.273 -3.828 96.305 -4.313 QT
95.336 -4.797 94.828 -5.727 QT
94.32 -6.656 94.32 -8 QT
cp
96.43 -7.891 M
96.43 -6.734 96.984 -6.117 QT
97.539 -5.5 98.336 -5.5 QT
99.148 -5.5 99.695 -6.117 QT
100.242 -6.734 100.242 -7.906 QT
100.242 -9.047 99.695 -9.664 QT
99.148 -10.281 98.336 -10.281 QT
97.539 -10.281 96.984 -9.664 QT
96.43 -9.047 96.43 -7.891 QT
cp
108.882 -4 M
108.882 -5.172 L
108.445 -4.547 107.757 -4.188 QT
107.07 -3.828 106.304 -3.828 QT
105.507 -3.828 104.89 -4.172 QT
104.273 -4.516 103.992 -5.141 QT
103.71 -5.766 103.71 -6.859 QT
103.71 -11.781 L
105.773 -11.781 L
105.773 -8.203 L
105.773 -6.563 105.882 -6.195 QT
105.992 -5.828 106.296 -5.609 QT
106.601 -5.391 107.054 -5.391 QT
107.585 -5.391 108.007 -5.68 QT
108.429 -5.969 108.578 -6.398 QT
108.726 -6.828 108.726 -8.5 QT
108.726 -11.781 L
110.789 -11.781 L
110.789 -4 L
108.882 -4 L
cp
120.188 -0.844 M
118.782 -0.844 L
117.657 -2.531 117.071 -4.359 QT
116.485 -6.188 116.485 -7.891 QT
116.485 -10 117.219 -11.891 QT
117.844 -13.531 118.813 -14.922 QT
120.219 -14.922 L
119.219 -12.703 118.837 -11.148 QT
118.454 -9.594 118.454 -7.844 QT
118.454 -6.641 118.68 -5.383 QT
118.907 -4.125 119.297 -2.984 QT
119.547 -2.234 120.188 -0.844 QT
cp
123.631 -4 M
121.569 -4 L
121.569 -11.781 L
123.491 -11.781 L
123.491 -10.672 L
123.975 -11.453 124.366 -11.703 QT
124.756 -11.953 125.256 -11.953 QT
125.959 -11.953 126.616 -11.563 QT
125.975 -9.766 L
125.459 -10.109 125.006 -10.109 QT
124.569 -10.109 124.272 -9.867 QT
123.975 -9.625 123.803 -9.008 QT
123.631 -8.391 123.631 -6.406 QT
123.631 -4 L
cp
121.631 -15.156 M
123.303 -15.156 L
124.084 -14.063 L
124.944 -15.156 L
126.6 -15.156 L
125.084 -13 L
123.178 -13 L
121.631 -15.156 L
cp
128.897 -9.406 M
127.038 -9.75 L
127.351 -10.875 128.116 -11.414 QT
128.882 -11.953 130.397 -11.953 QT
131.788 -11.953 132.46 -11.625 QT
133.132 -11.297 133.405 -10.797 QT
133.679 -10.297 133.679 -8.953 QT
133.663 -6.563 L
133.663 -5.531 133.757 -5.047 QT
133.851 -4.563 134.132 -4 QT
132.085 -4 L
132.007 -4.203 131.897 -4.609 QT
131.835 -4.797 131.819 -4.844 QT
131.288 -4.344 130.686 -4.086 QT
130.085 -3.828 129.413 -3.828 QT
128.21 -3.828 127.515 -4.477 QT
126.819 -5.125 126.819 -6.125 QT
126.819 -6.781 127.14 -7.297 QT
127.46 -7.813 128.022 -8.086 QT
128.585 -8.359 129.663 -8.578 QT
131.101 -8.844 131.663 -9.078 QT
131.663 -9.281 L
131.663 -9.875 131.366 -10.125 QT
131.069 -10.375 130.257 -10.375 QT
129.71 -10.375 129.405 -10.164 QT
129.101 -9.953 128.897 -9.406 QT
cp
131.663 -7.734 M
131.257 -7.609 130.405 -7.422 QT
129.554 -7.234 129.288 -7.063 QT
128.882 -6.781 128.882 -6.344 QT
128.882 -5.906 129.202 -5.594 QT
129.522 -5.281 130.022 -5.281 QT
130.585 -5.281 131.085 -5.641 QT
131.46 -5.922 131.569 -6.328 QT
131.663 -6.578 131.663 -7.328 QT
131.663 -7.734 L
cp
128.991 -13 M
129.991 -15.188 L
132.304 -15.188 L
130.288 -13 L
128.991 -13 L
cp
142.642 -4 M
140.736 -4 L
140.736 -5.141 L
140.267 -4.469 139.619 -4.148 QT
138.97 -3.828 138.314 -3.828 QT
136.97 -3.828 136.009 -4.906 QT
135.049 -5.984 135.049 -7.922 QT
135.049 -9.891 135.978 -10.922 QT
136.908 -11.953 138.33 -11.953 QT
139.642 -11.953 140.595 -10.875 QT
140.595 -14.734 L
142.642 -14.734 L
142.642 -4 L
cp
137.158 -8.063 M
137.158 -6.813 137.502 -6.25 QT
138.002 -5.453 138.892 -5.453 QT
139.595 -5.453 140.095 -6.055 QT
140.595 -6.656 140.595 -7.859 QT
140.595 -9.203 140.111 -9.789 QT
139.627 -10.375 138.877 -10.375 QT
138.142 -10.375 137.65 -9.797 QT
137.158 -9.219 137.158 -8.063 QT
cp
155.057 -5.906 M
155.057 -4 L
147.839 -4 L
147.948 -5.078 148.534 -6.055 QT
149.12 -7.031 150.854 -8.625 QT
152.245 -9.922 152.557 -10.391 QT
152.979 -11.031 152.979 -11.641 QT
152.979 -12.328 152.612 -12.703 QT
152.245 -13.078 151.589 -13.078 QT
150.948 -13.078 150.565 -12.688 QT
150.182 -12.297 150.136 -11.391 QT
148.073 -11.609 L
148.261 -13.297 149.229 -14.039 QT
150.198 -14.781 151.651 -14.781 QT
153.229 -14.781 154.143 -13.922 QT
155.057 -13.063 155.057 -11.797 QT
155.057 -11.063 154.792 -10.406 QT
154.526 -9.75 153.964 -9.047 QT
153.589 -8.563 152.62 -7.672 QT
151.651 -6.781 151.386 -6.484 QT
151.12 -6.188 150.964 -5.906 QT
155.057 -5.906 L
cp
161.521 -4 M
159.459 -4 L
159.459 -11.75 L
158.334 -10.703 156.802 -10.203 QT
156.802 -12.063 L
157.615 -12.328 158.552 -13.063 QT
159.49 -13.797 159.849 -14.781 QT
161.521 -14.781 L
161.521 -4 L
cp
164.266 -0.844 M
164.875 -2.141 165.125 -2.836 QT
165.375 -3.531 165.586 -4.445 QT
165.797 -5.359 165.899 -6.172 QT
166 -6.984 166 -7.844 QT
166 -9.594 165.633 -11.148 QT
165.266 -12.703 164.25 -14.922 QT
165.657 -14.922 L
166.766 -13.344 167.375 -11.578 QT
167.985 -9.813 167.985 -8 QT
167.985 -6.469 167.5 -4.719 QT
166.953 -2.75 165.688 -0.844 QT
164.266 -0.844 L
cp
f
GR
GS
[0.75 0 0 0.75 0 0] CT
0 0.447 0.741 RC
1 LJ
0.667 LW
N
80.233 231.252 M
87.467 198.943 L
94.7 143.14 L
101.933 120.488 L
109.167 98.393 L
116.4 81.43 L
123.633 72.992 L
130.867 68.082 L
138.1 62.87 L
145.333 58.595 L
152.567 58.169 L
159.8 62.074 L
167.033 67.714 L
174.267 71.697 L
181.5 72.393 L
188.733 70.766 L
195.967 69.278 L
203.2 70.018 L
210.433 73.404 L
217.667 78.18 L
224.9 82.441 L
232.133 84.925 L
239.367 85.741 L
246.6 86.209 L
253.833 88.025 L
261.067 92.303 L
268.3 99.076 L
275.533 107.445 L
282.767 116.239 L
290 124.704 L
297.233 132.817 L
304.467 141.08 L
311.7 149.983 L
318.933 159.56 L
326.167 169.385 L
333.4 179.002 L
340.633 188.458 L
347.867 198.399 L
355.1 209.58 L
362.333 221.837 L
369.567 233.779 L
376.8 243.258 L
384.033 249.088 L
391.267 252.693 L
398.5 257.549 L
405.733 266.323 L
412.967 278.988 L
420.2 293.615 L
427.433 310.485 L
434.667 326.557 L
441.9 365.366 L
S
GR
GS
[0.75 0 0 0.75 0 0] CT
0.851 0.325 0.098 RC
1 LJ
0.667 LW
N
80.233 255.886 M
87.467 206.081 L
94.7 155.981 L
101.933 105.684 L
109.167 100.682 L
116.4 74.007 L
123.633 74.812 L
130.867 64.645 L
138.1 63.59 L
145.333 67.761 L
152.567 77.302 L
159.8 57.747 L
167.033 65.755 L
174.267 72.524 L
181.5 67.071 L
188.733 65.978 L
195.967 71.771 L
203.2 84.761 L
210.433 86.701 L
217.667 74.976 L
224.9 83.694 L
232.133 91.81 L
239.367 66.756 L
246.6 85.809 L
253.833 90.957 L
261.067 98.327 L
268.3 111.036 L
275.533 107.549 L
282.767 110.715 L
290 122.305 L
297.233 123.606 L
304.467 144.415 L
311.7 147.934 L
318.933 168.664 L
326.167 170.5 L
333.4 175.35 L
340.633 196.399 L
347.867 180.631 L
355.1 214.538 L
362.333 212.35 L
369.567 219.236 L
376.8 234.111 L
384.033 233.679 L
391.267 251.39 L
398.5 250.732 L
405.733 274.342 L
412.967 284.549 L
420.2 286.373 L
427.433 319.35 L
434.667 320.415 L
441.9 365.115 L
S
GR
GS
[0.75 0 0 0.75 0 0] CT
1 GC
N
374 81 M
374 44 L
494 44 L
494 81 L
cp
f
GR
GS
[0.75 0 0 0.75 308.25 40.60274] CT
/Helvetica 12 F
GS
[1 0 0 1 0 0] CT
0 5 moveto 
1 -1 scale
(Odhad veliciny) t 
GR
GR
GS
[0.75 0 0 0.75 0 0] CT
0 0.447 0.741 RC
1 LJ
0.667 LW
N
378 54.137 M
408 54.137 L
S
GR
GS
[0.75 0 0 0.75 308.25 53.14726] CT
/Helvetica 12 F
GS
[1 0 0 1 0 0] CT
0 5 moveto 
1 -1 scale
(Validace) t 
GR
GR
GS
[0.75 0 0 0.75 0 0] CT
0.851 0.325 0.098 RC
1 LJ
0.667 LW
N
378 70.863 M
408 70.863 L
S
GR
GS
[0.75 0 0 0.75 0 0] CT
0.149 GC
10.0 ML
0.667 LW
N
374 81 M
374 44 L
494 44 L
494 81 L
cp
S
GR
%%Trailer
%%Pages: 1
%%EOF
