%!PS-Adobe-3.0 EPSF-3.0
%%Creator: (MATLAB, The Mathworks, Inc. Version 9.0.0.341360 \(R2016a\). Operating System: Windows 8)
%%Title: C:/Users/Jan/Documents/JC.ISF/isf3/graf1.eps
%%CreationDate: 2017-06-11T16:00:15
%%Pages: (atend)
%%BoundingBox: 0 0 420 315
%%LanguageLevel: 3
%%EndComments
%%BeginProlog
%%BeginResource: procset (Apache XML Graphics Std ProcSet) 1.2 0
%%Version: 1.2 0
%%Copyright: (Copyright 2001-2003,2010 The Apache Software Foundation. License terms: http://www.apache.org/licenses/LICENSE-2.0)
/bd{bind def}bind def
/ld{load def}bd
/GR/grestore ld
/M/moveto ld
/LJ/setlinejoin ld
/C/curveto ld
/f/fill ld
/LW/setlinewidth ld
/GC/setgray ld
/t/show ld
/N/newpath ld
/CT/concat ld
/cp/closepath ld
/S/stroke ld
/L/lineto ld
/CC/setcmykcolor ld
/A/ashow ld
/GS/gsave ld
/RC/setrgbcolor ld
/RM/rmoveto ld
/ML/setmiterlimit ld
/re {4 2 roll M
1 index 0 rlineto
0 exch rlineto
neg 0 rlineto
cp } bd
/_ctm matrix def
/_tm matrix def
/BT { _ctm currentmatrix pop matrix _tm copy pop 0 0 moveto } bd
/ET { _ctm setmatrix } bd
/iTm { _ctm setmatrix _tm concat } bd
/Tm { _tm astore pop iTm 0 0 moveto } bd
/ux 0.0 def
/uy 0.0 def
/F {
  /Tp exch def
  /Tf exch def
  Tf findfont Tp scalefont setfont
  /cf Tf def  /cs Tp def
} bd
/ULS {currentpoint /uy exch def /ux exch def} bd
/ULE {
  /Tcx currentpoint pop def
  gsave
  newpath
  cf findfont cs scalefont dup
  /FontMatrix get 0 get /Ts exch def /FontInfo get dup
  /UnderlinePosition get Ts mul /To exch def
  /UnderlineThickness get Ts mul /Tt exch def
  ux uy To add moveto  Tcx uy To add lineto
  Tt setlinewidth stroke
  grestore
} bd
/OLE {
  /Tcx currentpoint pop def
  gsave
  newpath
  cf findfont cs scalefont dup
  /FontMatrix get 0 get /Ts exch def /FontInfo get dup
  /UnderlinePosition get Ts mul /To exch def
  /UnderlineThickness get Ts mul /Tt exch def
  ux uy To add cs add moveto Tcx uy To add cs add lineto
  Tt setlinewidth stroke
  grestore
} bd
/SOE {
  /Tcx currentpoint pop def
  gsave
  newpath
  cf findfont cs scalefont dup
  /FontMatrix get 0 get /Ts exch def /FontInfo get dup
  /UnderlinePosition get Ts mul /To exch def
  /UnderlineThickness get Ts mul /Tt exch def
  ux uy To add cs 10 mul 26 idiv add moveto Tcx uy To add cs 10 mul 26 idiv add lineto
  Tt setlinewidth stroke
  grestore
} bd
/QT {
/Y22 exch store
/X22 exch store
/Y21 exch store
/X21 exch store
currentpoint
/Y21 load 2 mul add 3 div exch
/X21 load 2 mul add 3 div exch
/X21 load 2 mul /X22 load add 3 div
/Y21 load 2 mul /Y22 load add 3 div
/X22 load /Y22 load curveto
} bd
/SSPD {
dup length /d exch dict def
{
/v exch def
/k exch def
currentpagedevice k known {
/cpdv currentpagedevice k get def
v cpdv ne {
/upd false def
/nullv v type /nulltype eq def
/nullcpdv cpdv type /nulltype eq def
nullv nullcpdv or
{
/upd true def
} {
/sametype v type cpdv type eq def
sametype {
v type /arraytype eq {
/vlen v length def
/cpdvlen cpdv length def
vlen cpdvlen eq {
0 1 vlen 1 sub {
/i exch def
/obj v i get def
/cpdobj cpdv i get def
obj cpdobj ne {
/upd true def
exit
} if
} for
} {
/upd true def
} ifelse
} {
v type /dicttype eq {
v {
/dv exch def
/dk exch def
/cpddv cpdv dk get def
dv cpddv ne {
/upd true def
exit
} if
} forall
} {
/upd true def
} ifelse
} ifelse
} if
} ifelse
upd true eq {
d k v put
} if
} if
} if
} forall
d length 0 gt {
d setpagedevice
} if
} bd
%%EndResource
%%BeginResource: procset (Apache XML Graphics EPS ProcSet) 1.0 0
%%Version: 1.0 0
%%Copyright: (Copyright 2002-2003 The Apache Software Foundation. License terms: http://www.apache.org/licenses/LICENSE-2.0)
/BeginEPSF { %def
/b4_Inc_state save def         % Save state for cleanup
/dict_count countdictstack def % Count objects on dict stack
/op_count count 1 sub def      % Count objects on operand stack
userdict begin                 % Push userdict on dict stack
/showpage { } def              % Redefine showpage, { } = null proc
0 setgray 0 setlinecap         % Prepare graphics state
1 setlinewidth 0 setlinejoin
10 setmiterlimit [ ] 0 setdash newpath
/languagelevel where           % If level not equal to 1 then
{pop languagelevel             % set strokeadjust and
1 ne                           % overprint to their defaults.
{false setstrokeadjust false setoverprint
} if
} if
} bd
/EndEPSF { %def
count op_count sub {pop} repeat            % Clean up stacks
countdictstack dict_count sub {end} repeat
b4_Inc_state restore
} bd
%%EndResource
%FOPBeginFontDict
%%IncludeResource: font Courier-Bold
%%IncludeResource: font Helvetica
%%IncludeResource: font Courier-BoldOblique
%%IncludeResource: font Courier-Oblique
%%IncludeResource: font Times-Roman
%%IncludeResource: font Helvetica-BoldOblique
%%IncludeResource: font Helvetica-Bold
%%IncludeResource: font Helvetica-Oblique
%%IncludeResource: font Times-BoldItalic
%%IncludeResource: font Courier
%%IncludeResource: font Times-Italic
%%IncludeResource: font Times-Bold
%%IncludeResource: font Symbol
%%IncludeResource: font ZapfDingbats
%FOPEndFontDict
%%BeginResource: encoding WinAnsiEncoding
/WinAnsiEncoding [
/.notdef /.notdef /.notdef /.notdef /.notdef
/.notdef /.notdef /.notdef /.notdef /.notdef
/.notdef /.notdef /.notdef /.notdef /.notdef
/.notdef /.notdef /.notdef /.notdef /.notdef
/.notdef /.notdef /.notdef /.notdef /.notdef
/.notdef /.notdef /.notdef /.notdef /.notdef
/.notdef /.notdef /space /exclam /quotedbl
/numbersign /dollar /percent /ampersand /quotesingle
/parenleft /parenright /asterisk /plus /comma
/hyphen /period /slash /zero /one
/two /three /four /five /six
/seven /eight /nine /colon /semicolon
/less /equal /greater /question /at
/A /B /C /D /E
/F /G /H /I /J
/K /L /M /N /O
/P /Q /R /S /T
/U /V /W /X /Y
/Z /bracketleft /backslash /bracketright /asciicircum
/underscore /quoteleft /a /b /c
/d /e /f /g /h
/i /j /k /l /m
/n /o /p /q /r
/s /t /u /v /w
/x /y /z /braceleft /bar
/braceright /asciitilde /bullet /Euro /bullet
/quotesinglbase /florin /quotedblbase /ellipsis /dagger
/daggerdbl /circumflex /perthousand /Scaron /guilsinglleft
/OE /bullet /Zcaron /bullet /bullet
/quoteleft /quoteright /quotedblleft /quotedblright /bullet
/endash /emdash /asciitilde /trademark /scaron
/guilsinglright /oe /bullet /zcaron /Ydieresis
/space /exclamdown /cent /sterling /currency
/yen /brokenbar /section /dieresis /copyright
/ordfeminine /guillemotleft /logicalnot /sfthyphen /registered
/macron /degree /plusminus /twosuperior /threesuperior
/acute /mu /paragraph /middot /cedilla
/onesuperior /ordmasculine /guillemotright /onequarter /onehalf
/threequarters /questiondown /Agrave /Aacute /Acircumflex
/Atilde /Adieresis /Aring /AE /Ccedilla
/Egrave /Eacute /Ecircumflex /Edieresis /Igrave
/Iacute /Icircumflex /Idieresis /Eth /Ntilde
/Ograve /Oacute /Ocircumflex /Otilde /Odieresis
/multiply /Oslash /Ugrave /Uacute /Ucircumflex
/Udieresis /Yacute /Thorn /germandbls /agrave
/aacute /acircumflex /atilde /adieresis /aring
/ae /ccedilla /egrave /eacute /ecircumflex
/edieresis /igrave /iacute /icircumflex /idieresis
/eth /ntilde /ograve /oacute /ocircumflex
/otilde /odieresis /divide /oslash /ugrave
/uacute /ucircumflex /udieresis /yacute /thorn
/ydieresis
] def
%%EndResource
%FOPBeginFontReencode
/Courier-Bold findfont
dup length dict begin
  {1 index /FID ne {def} {pop pop} ifelse} forall
  /Encoding WinAnsiEncoding def
  currentdict
end
/Courier-Bold exch definefont pop
/Helvetica findfont
dup length dict begin
  {1 index /FID ne {def} {pop pop} ifelse} forall
  /Encoding WinAnsiEncoding def
  currentdict
end
/Helvetica exch definefont pop
/Courier-BoldOblique findfont
dup length dict begin
  {1 index /FID ne {def} {pop pop} ifelse} forall
  /Encoding WinAnsiEncoding def
  currentdict
end
/Courier-BoldOblique exch definefont pop
/Courier-Oblique findfont
dup length dict begin
  {1 index /FID ne {def} {pop pop} ifelse} forall
  /Encoding WinAnsiEncoding def
  currentdict
end
/Courier-Oblique exch definefont pop
/Times-Roman findfont
dup length dict begin
  {1 index /FID ne {def} {pop pop} ifelse} forall
  /Encoding WinAnsiEncoding def
  currentdict
end
/Times-Roman exch definefont pop
/Helvetica-BoldOblique findfont
dup length dict begin
  {1 index /FID ne {def} {pop pop} ifelse} forall
  /Encoding WinAnsiEncoding def
  currentdict
end
/Helvetica-BoldOblique exch definefont pop
/Helvetica-Bold findfont
dup length dict begin
  {1 index /FID ne {def} {pop pop} ifelse} forall
  /Encoding WinAnsiEncoding def
  currentdict
end
/Helvetica-Bold exch definefont pop
/Helvetica-Oblique findfont
dup length dict begin
  {1 index /FID ne {def} {pop pop} ifelse} forall
  /Encoding WinAnsiEncoding def
  currentdict
end
/Helvetica-Oblique exch definefont pop
/Times-BoldItalic findfont
dup length dict begin
  {1 index /FID ne {def} {pop pop} ifelse} forall
  /Encoding WinAnsiEncoding def
  currentdict
end
/Times-BoldItalic exch definefont pop
/Courier findfont
dup length dict begin
  {1 index /FID ne {def} {pop pop} ifelse} forall
  /Encoding WinAnsiEncoding def
  currentdict
end
/Courier exch definefont pop
/Times-Italic findfont
dup length dict begin
  {1 index /FID ne {def} {pop pop} ifelse} forall
  /Encoding WinAnsiEncoding def
  currentdict
end
/Times-Italic exch definefont pop
/Times-Bold findfont
dup length dict begin
  {1 index /FID ne {def} {pop pop} ifelse} forall
  /Encoding WinAnsiEncoding def
  currentdict
end
/Times-Bold exch definefont pop
%FOPEndFontReencode
%%EndProlog
%%Page: 1 1
%%PageBoundingBox: 0 0 420 315
%%BeginPageSetup
[1 0 0 -1 0 315] CT
%%EndPageSetup
GS
[0.75 0 0 0.75 0 0] CT
1 GC
N
0 0 560 420 re
f
GR
GS
[0.75 0 0 0.75 0 0] CT
1 GC
N
0 0 560 420 re
f
GR
GS
[0.75 0 0 0.75 0 0] CT
1 GC
N
73 374 M
507 374 L
507 31 L
73 31 L
cp
f
GR
GS
[0.75 0 0 0.75 0 0] CT
0.873 GC
1 LJ
0.667 LW
N
73 374 M
73 31 L
S
GR
GS
[0.75 0 0 0.75 0 0] CT
0.873 GC
1 LJ
0.667 LW
N
127.25 374 M
127.25 31 L
S
GR
GS
[0.75 0 0 0.75 0 0] CT
0.873 GC
1 LJ
0.667 LW
N
181.5 374 M
181.5 31 L
S
GR
GS
[0.75 0 0 0.75 0 0] CT
0.873 GC
1 LJ
0.667 LW
N
235.75 374 M
235.75 31 L
S
GR
GS
[0.75 0 0 0.75 0 0] CT
0.873 GC
1 LJ
0.667 LW
N
290 374 M
290 31 L
S
GR
GS
[0.75 0 0 0.75 0 0] CT
0.873 GC
1 LJ
0.667 LW
N
344.25 374 M
344.25 31 L
S
GR
GS
[0.75 0 0 0.75 0 0] CT
0.873 GC
1 LJ
0.667 LW
N
398.5 374 M
398.5 31 L
S
GR
GS
[0.75 0 0 0.75 0 0] CT
0.873 GC
1 LJ
0.667 LW
N
452.75 374 M
452.75 31 L
S
GR
GS
[0.75 0 0 0.75 0 0] CT
0.873 GC
1 LJ
0.667 LW
N
507 374 M
507 31 L
S
GR
GS
[0.75 0 0 0.75 0 0] CT
0.873 GC
1 LJ
0.667 LW
N
507 374 M
73 374 L
S
GR
GS
[0.75 0 0 0.75 0 0] CT
0.873 GC
1 LJ
0.667 LW
N
507 316.833 M
73 316.833 L
S
GR
GS
[0.75 0 0 0.75 0 0] CT
0.873 GC
1 LJ
0.667 LW
N
507 259.667 M
73 259.667 L
S
GR
GS
[0.75 0 0 0.75 0 0] CT
0.873 GC
1 LJ
0.667 LW
N
507 202.5 M
73 202.5 L
S
GR
GS
[0.75 0 0 0.75 0 0] CT
0.873 GC
1 LJ
0.667 LW
N
507 145.333 M
73 145.333 L
S
GR
GS
[0.75 0 0 0.75 0 0] CT
0.873 GC
1 LJ
0.667 LW
N
507 88.167 M
73 88.167 L
S
GR
GS
[0.75 0 0 0.75 0 0] CT
0.873 GC
1 LJ
0.667 LW
N
507 31 M
73 31 L
S
GR
GS
[0.75 0 0 0.75 0 0] CT
0.149 GC
2 setlinecap
1 LJ
0.667 LW
N
73 374 M
507 374 L
S
GR
GS
[0.75 0 0 0.75 0 0] CT
0.149 GC
2 setlinecap
1 LJ
0.667 LW
N
73 374 M
73 369.66 L
S
GR
GS
[0.75 0 0 0.75 0 0] CT
0.149 GC
2 setlinecap
1 LJ
0.667 LW
N
127.25 374 M
127.25 369.66 L
S
GR
GS
[0.75 0 0 0.75 0 0] CT
0.149 GC
2 setlinecap
1 LJ
0.667 LW
N
181.5 374 M
181.5 369.66 L
S
GR
GS
[0.75 0 0 0.75 0 0] CT
0.149 GC
2 setlinecap
1 LJ
0.667 LW
N
235.75 374 M
235.75 369.66 L
S
GR
GS
[0.75 0 0 0.75 0 0] CT
0.149 GC
2 setlinecap
1 LJ
0.667 LW
N
290 374 M
290 369.66 L
S
GR
GS
[0.75 0 0 0.75 0 0] CT
0.149 GC
2 setlinecap
1 LJ
0.667 LW
N
344.25 374 M
344.25 369.66 L
S
GR
GS
[0.75 0 0 0.75 0 0] CT
0.149 GC
2 setlinecap
1 LJ
0.667 LW
N
398.5 374 M
398.5 369.66 L
S
GR
GS
[0.75 0 0 0.75 0 0] CT
0.149 GC
2 setlinecap
1 LJ
0.667 LW
N
452.75 374 M
452.75 369.66 L
S
GR
GS
[0.75 0 0 0.75 0 0] CT
0.149 GC
2 setlinecap
1 LJ
0.667 LW
N
507 374 M
507 369.66 L
S
GR
GS
[0.75 0 0 0.75 54.75 284.50001] CT
0.149 GC
/Helvetica 13.333 F
GS
[1 0 0 1 0 0] CT
-9.5 14 moveto 
1 -1 scale
(-50) t 
GR
GR
GS
[0.75 0 0 0.75 95.4375 284.50001] CT
0.149 GC
/Helvetica 13.333 F
GS
[1 0 0 1 0 0] CT
-9.5 14 moveto 
1 -1 scale
(-40) t 
GR
GR
GS
[0.75 0 0 0.75 136.125 284.50001] CT
0.149 GC
/Helvetica 13.333 F
GS
[1 0 0 1 0 0] CT
-9.5 14 moveto 
1 -1 scale
(-30) t 
GR
GR
GS
[0.75 0 0 0.75 176.8125 284.50001] CT
0.149 GC
/Helvetica 13.333 F
GS
[1 0 0 1 0 0] CT
-9.5 14 moveto 
1 -1 scale
(-20) t 
GR
GR
GS
[0.75 0 0 0.75 217.5 284.50001] CT
0.149 GC
/Helvetica 13.333 F
GS
[1 0 0 1 0 0] CT
-9.5 14 moveto 
1 -1 scale
(-10) t 
GR
GR
GS
[0.75 0 0 0.75 258.1875 284.50001] CT
0.149 GC
/Helvetica 13.333 F
GS
[1 0 0 1 0 0] CT
-4 14 moveto 
1 -1 scale
(0) t 
GR
GR
GS
[0.75 0 0 0.75 298.875 284.50001] CT
0.149 GC
/Helvetica 13.333 F
GS
[1 0 0 1 0 0] CT
-7.5 14 moveto 
1 -1 scale
(10) t 
GR
GR
GS
[0.75 0 0 0.75 339.5625 284.50001] CT
0.149 GC
/Helvetica 13.333 F
GS
[1 0 0 1 0 0] CT
-7.5 14 moveto 
1 -1 scale
(20) t 
GR
GR
GS
[0.75 0 0 0.75 380.25 284.50001] CT
0.149 GC
/Helvetica 13.333 F
GS
[1 0 0 1 0 0] CT
-7.5 14 moveto 
1 -1 scale
(30) t 
GR
GR
GS
[0.75 0 0 0.75 217.50016 298.24999] CT
0.149 GC
/Helvetica 14.667 F
GS
[1 0 0 1 0 0] CT
-4 16 moveto 
1 -1 scale
(x) t 
GR
GR
GS
[0.75 0 0 0.75 0 0] CT
0.149 GC
2 setlinecap
1 LJ
0.667 LW
N
73 374 M
73 31 L
S
GR
GS
[0.75 0 0 0.75 0 0] CT
0.149 GC
2 setlinecap
1 LJ
0.667 LW
N
73 374 M
77.34 374 L
S
GR
GS
[0.75 0 0 0.75 0 0] CT
0.149 GC
2 setlinecap
1 LJ
0.667 LW
N
73 316.833 M
77.34 316.833 L
S
GR
GS
[0.75 0 0 0.75 0 0] CT
0.149 GC
2 setlinecap
1 LJ
0.667 LW
N
73 259.667 M
77.34 259.667 L
S
GR
GS
[0.75 0 0 0.75 0 0] CT
0.149 GC
2 setlinecap
1 LJ
0.667 LW
N
73 202.5 M
77.34 202.5 L
S
GR
GS
[0.75 0 0 0.75 0 0] CT
0.149 GC
2 setlinecap
1 LJ
0.667 LW
N
73 145.333 M
77.34 145.333 L
S
GR
GS
[0.75 0 0 0.75 0 0] CT
0.149 GC
2 setlinecap
1 LJ
0.667 LW
N
73 88.167 M
77.34 88.167 L
S
GR
GS
[0.75 0 0 0.75 0 0] CT
0.149 GC
2 setlinecap
1 LJ
0.667 LW
N
73 31 M
77.34 31 L
S
GR
GS
[0.75 0 0 0.75 50.74999 280.5] CT
0.149 GC
/Helvetica 13.333 F
GS
[1 0 0 1 0 0] CT
-15 5.5 moveto 
1 -1 scale
(30) t 
GR
GR
GS
[0.75 0 0 0.75 50.74999 237.62501] CT
0.149 GC
/Helvetica 13.333 F
GS
[1 0 0 1 0 0] CT
-15 5.5 moveto 
1 -1 scale
(35) t 
GR
GR
GS
[0.75 0 0 0.75 50.74999 194.74999] CT
0.149 GC
/Helvetica 13.333 F
GS
[1 0 0 1 0 0] CT
-15 5.5 moveto 
1 -1 scale
(40) t 
GR
GR
GS
[0.75 0 0 0.75 50.74999 151.875] CT
0.149 GC
/Helvetica 13.333 F
GS
[1 0 0 1 0 0] CT
-15 5.5 moveto 
1 -1 scale
(45) t 
GR
GR
GS
[0.75 0 0 0.75 50.74999 109] CT
0.149 GC
/Helvetica 13.333 F
GS
[1 0 0 1 0 0] CT
-15 5.5 moveto 
1 -1 scale
(50) t 
GR
GR
GS
[0.75 0 0 0.75 50.74999 66.125] CT
0.149 GC
/Helvetica 13.333 F
GS
[1 0 0 1 0 0] CT
-15 5.5 moveto 
1 -1 scale
(55) t 
GR
GR
GS
[0.75 0 0 0.75 50.74999 23.25] CT
0.149 GC
/Helvetica 13.333 F
GS
[1 0 0 1 0 0] CT
-15 5.5 moveto 
1 -1 scale
(60) t 
GR
GR
GS
[0 -0.75 0.75 0 36.49999 151.87487] CT
0.149 GC
/Helvetica 14.667 F
GS
[1 0 0 1 0 0] CT
-4 -4 moveto 
1 -1 scale
(y) t 
GR
GR
GS
[0.75 0 0 0.75 217.50021 21.1875] CT
/Helvetica-Bold 14.667 F
GS
[1 0 0 1 0 0] CT
-31.5 -4 moveto 
1 -1 scale
(2D mapa) t 
GR
GR
GS
[0.75 0 0 0.75 0 0] CT
1 0 0 RC
1 LJ
0.667 LW
N
462.214 79.365 M
461.712 81.277 L
460.799 83.287 L
459.843 85.253 L
458.96 87.457 L
458.318 89.64 L
457.471 91.782 L
456.658 93.872 L
455.887 96.095 L
455.095 98.11 L
454.212 100.148 L
453.463 102.252 L
452.748 104.409 L
451.951 106.433 L
451.129 108.652 L
450.377 110.793 L
449.537 112.947 L
448.754 115.006 L
447.921 117.16 L
447.184 119.364 L
446.472 121.486 L
445.736 123.636 L
445.049 125.689 L
444.34 127.868 L
443.628 129.969 L
442.739 132.039 L
441.928 134.204 L
441.167 136.372 L
440.421 138.453 L
439.626 140.48 L
438.785 142.491 L
437.982 144.637 L
437.118 146.683 L
436.308 148.785 L
435.561 150.96 L
434.827 153.195 L
434.129 155.241 L
433.359 157.366 L
432.612 159.576 L
431.851 161.625 L
431.025 163.841 L
430.269 165.949 L
429.363 168.106 L
428.639 170.202 L
427.883 172.24 L
427.1 174.39 L
426.303 176.416 L
425.574 178.593 L
424.774 180.627 L
424.092 182.982 L
423.265 185.083 L
422.73 186.128 L
422.476 186.609 L
422.252 186.671 L
422.194 186.564 L
422.009 186.515 L
421.89 186.538 L
421.701 186.589 L
421.479 186.897 L
421.208 187.182 L
420.906 187.439 L
420.698 187.843 L
420.411 188.222 L
420.119 188.6 L
419.849 188.986 L
419.574 189.39 L
419.252 189.684 L
418.902 190.004 L
418.654 190.425 L
418.399 190.755 L
418.119 190.962 L
417.858 191.209 L
417.695 191.474 L
417.496 191.742 L
417.252 191.983 L
416.972 192.353 L
416.746 192.537 L
416.493 192.846 L
416.177 193.134 L
415.936 193.508 L
415.623 193.79 L
415.405 194.09 L
415.167 194.514 L
414.907 194.738 L
414.689 195.143 L
414.436 195.342 L
414.205 195.766 L
413.838 195.927 L
413.614 196.266 L
413.385 196.527 L
413.097 196.717 L
412.872 197.05 L
412.582 197.349 L
412.271 197.527 L
411.983 197.914 L
411.769 198.274 L
411.536 198.568 L
411.298 198.834 L
411.04 199.093 L
410.8 199.298 L
410.501 199.605 L
410.249 199.874 L
410.005 200.162 L
409.769 200.434 L
409.516 200.81 L
409.295 201.17 L
409.096 201.552 L
408.808 201.784 L
408.532 201.921 L
408.287 202.324 L
408.073 202.626 L
407.785 202.945 L
407.491 203.207 L
407.226 203.53 L
407.033 203.825 L
406.82 204.221 L
406.475 204.417 L
406.207 204.75 L
405.987 205.05 L
405.691 205.34 L
405.441 205.62 L
405.205 205.966 L
405.007 206.271 L
404.812 206.587 L
404.549 206.946 L
404.217 207.161 L
403.944 207.348 L
403.721 207.565 L
403.475 207.862 L
403.164 208.095 L
402.917 208.254 L
402.736 208.644 L
402.416 209.106 L
402.174 209.456 L
401.946 209.794 L
401.723 210.058 L
401.471 210.4 L
401.247 210.658 L
400.961 210.896 L
400.717 211.326 L
400.466 211.784 L
400.248 212.043 L
399.992 212.223 L
399.753 212.52 L
399.472 212.774 L
399.175 213.101 L
398.881 213.396 L
398.633 213.647 L
398.382 213.878 L
398.052 214.167 L
397.795 214.517 L
397.554 214.71 L
397.367 215.075 L
397.126 215.318 L
396.841 215.616 L
396.638 215.937 L
396.303 216.202 L
396.111 216.543 L
395.891 216.89 L
395.559 217.128 L
395.335 217.38 L
395.105 217.648 L
394.841 217.938 L
394.558 218.284 L
394.352 218.711 L
394.035 218.842 L
393.768 219.182 L
393.585 219.467 L
393.442 219.788 L
393.153 220.059 L
392.901 220.319 L
392.581 220.533 L
392.276 220.848 L
392.048 221.231 L
391.83 221.565 L
391.54 221.856 L
390.735 221.98 L
389.539 221.959 L
388.033 221.854 L
386.495 221.645 L
384.921 221.542 L
383.345 221.436 L
381.716 221.458 L
380.174 221.464 L
378.81 221.399 L
377.497 221.372 L
376.064 221.324 L
374.718 221.253 L
373.373 221.183 L
372.034 221.086 L
370.779 221.037 L
369.584 221.036 L
368.237 220.961 L
366.938 220.915 L
365.533 220.942 L
364.201 220.713 L
362.815 220.8 L
361.448 220.684 L
360.086 220.795 L
358.72 220.819 L
357.395 220.802 L
355.967 220.802 L
354.552 220.55 L
353.202 220.512 L
351.826 220.477 L
350.482 220.506 L
349.073 220.53 L
347.641 220.47 L
346.245 220.351 L
344.905 220.29 L
343.544 220.11 L
342.268 220.094 L
340.873 220.069 L
339.544 219.961 L
338.209 219.808 L
336.807 219.87 L
335.457 219.798 L
334.08 219.733 L
332.715 219.666 L
331.347 219.659 L
329.988 219.621 L
328.588 219.512 L
327.299 219.642 L
325.9 219.615 L
324.494 219.526 L
323.117 219.398 L
321.709 219.49 L
320.316 219.31 L
318.917 219.227 L
317.567 219.265 L
316.197 219.212 L
314.863 219.097 L
313.535 219.01 L
312.196 218.831 L
310.805 218.893 L
309.44 218.796 L
308.011 218.869 L
306.589 218.818 L
305.326 218.747 L
303.963 218.749 L
302.573 218.697 L
301.242 218.668 L
299.882 218.602 L
298.53 218.585 L
297.173 218.495 L
295.739 218.529 L
294.386 218.462 L
292.909 218.448 L
291.633 218.319 L
290.225 218.196 L
288.848 218.201 L
287.413 218.222 L
286.059 218.206 L
284.698 218.057 L
283.359 218.009 L
282.04 217.973 L
280.735 217.922 L
279.371 217.909 L
277.948 217.81 L
276.623 217.735 L
275.315 217.627 L
273.838 217.566 L
272.411 217.523 L
271.075 217.408 L
269.737 217.426 L
268.365 217.429 L
267.063 217.346 L
265.68 217.331 L
264.261 217.337 L
262.842 217.313 L
261.357 217.321 L
260.008 217.165 L
258.643 217.178 L
257.326 217.14 L
255.956 217.011 L
254.499 217.094 L
253.146 217.159 L
251.836 217.11 L
250.543 216.966 L
249.16 216.935 L
247.805 216.802 L
246.472 216.735 L
245.146 216.758 L
243.758 216.589 L
242.332 216.652 L
240.957 216.564 L
239.612 216.527 L
238.163 216.576 L
236.764 216.565 L
235.398 216.441 L
234.082 216.368 L
232.729 216.431 L
231.32 216.446 L
229.911 216.419 L
228.495 216.294 L
227.145 216.291 L
225.89 216.229 L
224.432 216.213 L
223.098 216.06 L
221.802 215.943 L
220.441 215.951 L
219.061 215.875 L
217.68 215.808 L
216.304 215.76 L
214.971 215.747 L
213.586 215.711 L
212.161 215.712 L
210.753 215.702 L
209.436 215.556 L
208.035 215.6 L
206.673 215.558 L
205.3 215.504 L
203.936 215.595 L
202.59 215.525 L
201.313 215.35 L
199.865 215.295 L
198.413 215.257 L
197.081 215.249 L
195.76 215.143 L
194.336 215.134 L
193.029 214.967 L
191.575 214.985 L
190.188 214.97 L
188.812 214.98 L
187.549 214.93 L
186.183 214.945 L
184.845 214.864 L
183.394 214.935 L
182.04 214.806 L
180.728 214.769 L
179.32 214.522 L
177.963 214.519 L
176.575 214.571 L
175.175 214.604 L
173.84 214.462 L
172.518 214.528 L
171.155 214.368 L
169.802 214.258 L
168.435 214.128 L
167.034 214.136 L
165.635 214.125 L
164.185 214.228 L
162.961 214.001 L
161.566 213.96 L
160.175 213.905 L
158.885 213.738 L
157.521 213.513 L
156.153 213.396 L
154.776 213.519 L
153.439 213.459 L
152.014 213.466 L
150.609 213.418 L
149.215 213.495 L
147.829 213.402 L
146.421 213.398 L
145.088 213.3 L
143.735 213.389 L
142.36 213.298 L
140.987 213.232 L
139.617 213.278 L
138.322 213.247 L
136.965 213.046 L
135.553 213.056 L
134.14 212.987 L
132.856 212.897 L
131.453 212.877 L
130.106 212.858 L
128.785 212.826 L
127.393 212.833 L
126.051 212.871 L
124.643 212.767 L
123.274 212.778 L
121.943 212.557 L
120.525 212.586 L
119.16 212.633 L
117.866 212.451 L
117.777 213.934 L
118.487 216.402 L
119.642 219.339 L
121.119 222.221 L
122.626 225.023 L
124.098 227.888 L
125.529 230.48 L
126.848 232.844 L
127.951 235.107 L
128.917 237.363 L
129.879 239.581 L
130.8 241.88 L
131.786 243.982 L
132.674 246.445 L
133.532 248.876 L
134.52 251.304 L
135.437 253.852 L
136.412 256.278 L
137.476 258.648 L
138.49 261.01 L
139.569 263.318 L
140.548 265.921 L
141.587 268.358 L
142.671 270.861 L
143.768 273.229 L
144.813 275.83 L
145.931 278.341 L
146.94 280.665 L
147.919 283.229 L
148.94 285.627 L
148.993 287.406 L
148.343 288.959 L
147.46 290.322 L
146.297 291.747 L
145.071 293.298 L
143.921 295.013 L
142.805 296.709 L
141.81 298.559 L
140.84 300.442 L
139.974 302.304 L
139.248 304.015 L
138.525 305.781 L
137.835 307.375 L
137.084 309.269 L
136.337 310.948 L
135.593 312.742 L
134.859 314.177 L
134 315.82 L
133.118 317.581 L
132.333 319.096 L
131.51 320.743 L
130.711 322.205 L
129.927 323.678 L
129.219 325.424 L
128.422 327.034 L
127.572 328.847 L
126.6 330.696 L
125.709 332.556 L
124.865 334.205 L
124.05 335.829 L
123.197 337.386 L
122.325 338.975 L
121.5 340.567 L
120.756 342.111 L
119.894 343.98 L
119.082 345.697 L
118.185 347.386 L
117.406 349.087 L
116.625 350.85 L
115.843 352.461 L
115.023 354.117 L
114.17 355.744 L
113.314 357.612 L
112.539 359.27 L
111.722 360.83 L
110.88 362.404 L
110.044 363.977 L
109.14 365.691 L
108.327 367.341 L
S
GR
GS
[0.75 0 0 0.75 0 0] CT
0 0 1 RC
1 LJ
0.667 LW
N
462.224 79.496 M
461.625 81.153 L
460.79 83.32 L
459.863 85.327 L
458.985 87.547 L
458.348 89.723 L
457.497 91.852 L
456.681 93.923 L
455.907 96.129 L
455.111 98.125 L
454.223 100.148 L
453.467 102.242 L
452.748 104.393 L
451.947 106.414 L
451.123 108.635 L
450.37 110.778 L
449.53 112.934 L
448.746 114.996 L
447.914 117.153 L
447.179 119.36 L
446.468 121.484 L
445.733 123.636 L
445.048 125.69 L
444.339 127.869 L
443.628 129.971 L
442.739 132.041 L
441.929 134.205 L
441.168 136.373 L
440.422 138.454 L
439.627 140.48 L
438.786 142.492 L
437.983 144.637 L
437.118 146.683 L
436.308 148.785 L
435.561 150.96 L
434.827 153.195 L
434.129 155.241 L
433.358 157.366 L
432.611 159.576 L
431.851 161.625 L
431.025 163.841 L
430.269 165.949 L
429.363 168.106 L
428.639 170.202 L
427.883 172.24 L
427.1 174.39 L
426.303 176.416 L
425.574 178.593 L
424.774 180.627 L
424.092 182.982 L
423.265 185.083 L
422.73 186.128 L
422.476 186.609 L
422.252 186.671 L
422.194 186.564 L
422.009 186.515 L
421.89 186.538 L
421.701 186.589 L
421.479 186.897 L
421.208 187.182 L
420.906 187.439 L
420.698 187.843 L
420.411 188.222 L
420.119 188.6 L
419.849 188.986 L
419.574 189.39 L
419.252 189.684 L
418.902 190.004 L
418.654 190.425 L
418.399 190.755 L
418.119 190.962 L
417.858 191.209 L
417.695 191.474 L
417.496 191.742 L
417.252 191.983 L
416.972 192.353 L
416.746 192.537 L
416.493 192.846 L
416.177 193.134 L
415.936 193.508 L
415.623 193.79 L
415.405 194.09 L
415.167 194.514 L
414.907 194.738 L
414.689 195.143 L
414.436 195.342 L
414.205 195.766 L
413.838 195.927 L
413.614 196.266 L
413.385 196.527 L
413.097 196.717 L
412.872 197.05 L
412.582 197.349 L
412.271 197.527 L
411.983 197.914 L
411.769 198.274 L
411.536 198.568 L
411.298 198.834 L
411.04 199.093 L
410.8 199.298 L
410.501 199.605 L
410.249 199.874 L
410.005 200.162 L
409.769 200.434 L
409.516 200.81 L
409.295 201.17 L
409.096 201.552 L
408.808 201.784 L
408.532 201.921 L
408.287 202.324 L
408.073 202.626 L
407.785 202.945 L
407.491 203.207 L
407.226 203.53 L
407.033 203.826 L
406.82 204.221 L
406.475 204.417 L
406.207 204.75 L
405.987 205.05 L
405.691 205.34 L
405.441 205.62 L
405.205 205.966 L
405.007 206.271 L
404.812 206.587 L
404.549 206.946 L
404.217 207.161 L
403.944 207.348 L
403.721 207.566 L
403.475 207.862 L
403.164 208.095 L
402.917 208.254 L
402.736 208.644 L
402.416 209.106 L
402.174 209.456 L
401.946 209.794 L
401.723 210.058 L
401.471 210.4 L
401.247 210.658 L
400.961 210.896 L
400.717 211.326 L
400.466 211.784 L
400.248 212.043 L
399.992 212.223 L
399.753 212.52 L
399.472 212.774 L
399.175 213.101 L
398.881 213.396 L
398.633 213.647 L
398.382 213.878 L
398.052 214.167 L
397.795 214.517 L
397.554 214.71 L
397.367 215.075 L
397.126 215.318 L
396.841 215.616 L
396.638 215.937 L
396.303 216.202 L
396.111 216.543 L
395.891 216.89 L
395.559 217.128 L
395.335 217.38 L
395.105 217.648 L
394.841 217.938 L
394.558 218.285 L
394.352 218.711 L
394.035 218.842 L
393.768 219.182 L
393.585 219.467 L
393.442 219.788 L
393.153 220.059 L
392.901 220.319 L
392.581 220.533 L
392.276 220.848 L
392.048 221.231 L
391.83 221.565 L
391.54 221.856 L
390.735 221.98 L
389.539 221.959 L
388.033 221.854 L
386.495 221.645 L
384.921 221.542 L
383.345 221.436 L
381.716 221.459 L
380.174 221.464 L
378.81 221.399 L
377.497 221.372 L
376.064 221.324 L
374.718 221.253 L
373.373 221.183 L
372.034 221.086 L
370.779 221.037 L
369.584 221.036 L
368.237 220.961 L
366.938 220.915 L
365.533 220.942 L
364.201 220.713 L
362.815 220.8 L
361.448 220.684 L
360.086 220.795 L
358.72 220.819 L
357.395 220.802 L
355.967 220.802 L
354.552 220.55 L
353.202 220.512 L
351.826 220.477 L
350.482 220.506 L
349.073 220.53 L
347.641 220.47 L
346.245 220.351 L
344.905 220.29 L
343.544 220.11 L
342.268 220.094 L
340.873 220.069 L
339.544 219.961 L
338.209 219.808 L
336.807 219.87 L
335.457 219.798 L
334.08 219.733 L
332.715 219.666 L
331.347 219.659 L
329.988 219.622 L
328.588 219.512 L
327.299 219.642 L
325.9 219.615 L
324.494 219.526 L
323.117 219.398 L
321.709 219.49 L
320.316 219.31 L
318.917 219.227 L
317.567 219.265 L
316.197 219.212 L
314.863 219.097 L
313.535 219.01 L
312.196 218.831 L
310.805 218.893 L
309.44 218.796 L
308.011 218.869 L
306.589 218.818 L
305.326 218.747 L
303.963 218.749 L
302.573 218.697 L
301.242 218.668 L
299.882 218.602 L
298.53 218.585 L
297.173 218.495 L
295.739 218.529 L
294.386 218.462 L
292.909 218.448 L
291.633 218.319 L
290.225 218.196 L
288.848 218.201 L
287.413 218.222 L
286.059 218.206 L
284.698 218.057 L
283.359 218.009 L
282.04 217.974 L
280.735 217.922 L
279.371 217.909 L
277.948 217.81 L
276.623 217.736 L
275.315 217.627 L
273.838 217.566 L
272.411 217.523 L
271.075 217.408 L
269.737 217.426 L
268.365 217.429 L
267.063 217.346 L
265.68 217.331 L
264.261 217.338 L
262.842 217.313 L
261.357 217.321 L
260.008 217.165 L
258.643 217.178 L
257.326 217.14 L
255.956 217.011 L
254.499 217.094 L
253.146 217.159 L
251.836 217.11 L
250.543 216.966 L
249.16 216.935 L
247.805 216.802 L
246.472 216.735 L
245.146 216.758 L
243.758 216.589 L
242.332 216.652 L
240.957 216.565 L
239.612 216.527 L
238.163 216.576 L
236.764 216.565 L
235.398 216.441 L
234.082 216.368 L
232.729 216.431 L
231.32 216.446 L
229.911 216.419 L
228.495 216.294 L
227.145 216.291 L
225.89 216.229 L
224.432 216.213 L
223.098 216.06 L
221.802 215.943 L
220.441 215.951 L
219.061 215.875 L
217.68 215.808 L
216.304 215.76 L
214.971 215.747 L
213.586 215.711 L
212.161 215.712 L
210.753 215.702 L
209.436 215.556 L
208.035 215.6 L
206.673 215.558 L
205.3 215.504 L
203.936 215.595 L
202.59 215.525 L
201.313 215.35 L
199.865 215.295 L
198.413 215.257 L
197.081 215.249 L
195.76 215.143 L
194.336 215.134 L
193.029 214.967 L
191.575 214.985 L
190.188 214.97 L
188.812 214.98 L
187.549 214.93 L
186.183 214.945 L
184.845 214.864 L
183.394 214.935 L
182.04 214.806 L
180.728 214.769 L
179.32 214.522 L
177.963 214.519 L
176.575 214.571 L
175.175 214.604 L
173.84 214.462 L
172.518 214.528 L
171.155 214.368 L
169.802 214.258 L
168.435 214.128 L
167.034 214.136 L
165.635 214.125 L
164.185 214.228 L
162.961 214.001 L
161.566 213.96 L
160.175 213.905 L
158.885 213.738 L
157.521 213.513 L
156.153 213.396 L
154.776 213.519 L
153.439 213.459 L
152.014 213.466 L
150.609 213.418 L
149.216 213.495 L
147.829 213.402 L
146.421 213.398 L
145.088 213.3 L
143.735 213.389 L
142.36 213.298 L
140.987 213.232 L
139.617 213.278 L
138.322 213.247 L
136.965 213.046 L
135.553 213.056 L
134.14 212.987 L
132.856 212.897 L
131.453 212.877 L
130.106 212.858 L
128.785 212.826 L
127.393 212.833 L
126.051 212.871 L
124.643 212.767 L
123.274 212.778 L
121.943 212.557 L
120.525 212.586 L
119.16 212.633 L
117.866 212.451 L
117.777 213.934 L
118.487 216.402 L
119.642 219.339 L
121.119 222.221 L
122.626 225.023 L
124.098 227.888 L
125.529 230.48 L
126.848 232.844 L
127.951 235.107 L
128.917 237.363 L
129.879 239.581 L
130.8 241.88 L
131.786 243.982 L
132.674 246.445 L
133.532 248.876 L
134.52 251.305 L
135.437 253.852 L
136.412 256.278 L
137.476 258.648 L
138.49 261.01 L
139.569 263.318 L
140.548 265.921 L
141.587 268.358 L
142.671 270.861 L
143.768 273.229 L
144.813 275.83 L
145.931 278.341 L
146.94 280.665 L
147.919 283.229 L
148.94 285.627 L
148.993 287.406 L
148.343 288.959 L
147.46 290.322 L
146.297 291.747 L
145.071 293.298 L
143.921 295.013 L
142.805 296.709 L
141.81 298.559 L
140.84 300.442 L
139.974 302.304 L
139.248 304.015 L
138.525 305.781 L
137.835 307.375 L
137.084 309.269 L
136.337 310.948 L
135.593 312.742 L
134.859 314.177 L
134 315.82 L
133.118 317.581 L
132.333 319.096 L
131.51 320.743 L
130.711 322.205 L
129.927 323.678 L
129.219 325.424 L
128.422 327.034 L
127.572 328.847 L
126.6 330.696 L
125.709 332.556 L
124.865 334.205 L
124.05 335.829 L
123.197 337.386 L
122.325 338.975 L
121.5 340.567 L
120.756 342.112 L
119.894 343.98 L
119.082 345.697 L
118.185 347.386 L
117.406 349.087 L
116.625 350.85 L
115.843 352.461 L
115.023 354.117 L
114.17 355.744 L
113.314 357.612 L
112.539 359.27 L
111.722 360.83 L
110.88 362.404 L
110.044 363.977 L
109.14 365.691 L
108.327 367.341 L
S
GR
GS
[0.75 0 0 0.75 0 0] CT
1 LJ
0.667 LW
N
461.974 79.029 M
461.197 81.145 L
460.426 83.266 L
459.659 85.37 L
458.887 87.478 L
458.117 89.611 L
457.345 91.741 L
456.572 93.858 L
455.803 95.966 L
455.029 98.069 L
454.248 100.19 L
453.466 102.319 L
452.69 104.429 L
451.914 106.551 L
451.135 108.664 L
450.354 110.783 L
449.579 112.925 L
448.806 115.051 L
448.04 117.173 L
447.271 119.292 L
446.512 121.404 L
445.744 123.528 L
444.961 125.644 L
444.188 127.769 L
443.41 129.902 L
442.638 132.024 L
441.86 134.131 L
441.079 136.224 L
440.304 138.337 L
439.532 140.454 L
438.75 142.572 L
437.969 144.68 L
437.193 146.802 L
436.418 148.917 L
435.644 151.034 L
434.867 153.138 L
434.091 155.264 L
433.323 157.39 L
432.548 159.508 L
431.77 161.635 L
430.99 163.748 L
430.215 165.854 L
429.442 167.973 L
428.68 170.094 L
427.908 172.237 L
427.135 174.35 L
426.354 176.464 L
425.582 178.575 L
424.814 180.718 L
424.04 182.845 L
423.266 184.981 L
423.015 185.275 L
422.761 185.559 L
422.511 185.846 L
422.259 186.137 L
422.001 186.447 L
421.759 186.73 L
421.506 187.018 L
421.255 187.312 L
421.011 187.615 L
420.755 187.912 L
420.5 188.22 L
420.241 188.517 L
419.977 188.801 L
419.718 189.075 L
419.462 189.374 L
419.199 189.663 L
418.937 189.971 L
418.69 190.261 L
418.438 190.547 L
418.181 190.845 L
417.938 191.137 L
417.688 191.426 L
417.442 191.726 L
417.184 192.005 L
416.931 192.324 L
416.673 192.617 L
416.414 192.91 L
416.165 193.202 L
415.914 193.492 L
415.661 193.791 L
415.409 194.089 L
415.158 194.383 L
414.909 194.668 L
414.656 194.958 L
414.396 195.265 L
414.144 195.55 L
413.895 195.865 L
413.639 196.157 L
413.387 196.466 L
413.138 196.763 L
412.883 197.067 L
412.635 197.364 L
412.382 197.647 L
412.126 197.933 L
411.878 198.21 L
411.612 198.508 L
411.359 198.82 L
411.1 199.114 L
410.848 199.397 L
410.597 199.675 L
410.343 199.958 L
410.085 200.245 L
409.836 200.514 L
409.575 200.812 L
409.321 201.099 L
409.067 201.414 L
408.804 201.704 L
408.55 202.001 L
408.294 202.313 L
408.05 202.634 L
407.796 202.935 L
407.548 203.221 L
407.287 203.519 L
407.028 203.817 L
406.774 204.095 L
406.521 204.391 L
406.273 204.687 L
406.01 204.993 L
405.749 205.277 L
405.497 205.566 L
405.238 205.874 L
404.982 206.204 L
404.726 206.476 L
404.464 206.77 L
404.218 207.04 L
403.961 207.324 L
403.707 207.613 L
403.454 207.914 L
403.196 208.226 L
402.947 208.528 L
402.696 208.832 L
402.438 209.123 L
402.187 209.393 L
401.935 209.684 L
401.686 210 L
401.431 210.306 L
401.177 210.622 L
400.919 210.911 L
400.665 211.2 L
400.418 211.496 L
400.167 211.795 L
399.919 212.083 L
399.67 212.377 L
399.412 212.687 L
399.156 212.989 L
398.893 213.307 L
398.632 213.596 L
398.368 213.882 L
398.108 214.184 L
397.856 214.485 L
397.597 214.782 L
397.342 215.08 L
397.09 215.357 L
396.839 215.644 L
396.581 215.948 L
396.338 216.243 L
396.087 216.55 L
395.831 216.845 L
395.581 217.121 L
395.326 217.424 L
395.074 217.71 L
394.817 217.992 L
394.582 218.289 L
394.343 218.578 L
394.087 218.885 L
393.834 219.184 L
393.578 219.488 L
393.322 219.779 L
393.079 220.063 L
392.826 220.369 L
392.586 220.68 L
392.324 220.954 L
392.082 221.219 L
391.825 221.528 L
391.578 221.811 L
390.209 221.767 L
388.839 221.708 L
387.464 221.652 L
386.091 221.615 L
384.723 221.559 L
383.356 221.527 L
381.98 221.5 L
380.602 221.47 L
379.221 221.421 L
377.842 221.374 L
376.469 221.307 L
375.097 221.244 L
373.73 221.207 L
372.363 221.151 L
370.991 221.099 L
369.623 221.037 L
368.254 220.999 L
366.885 220.962 L
365.528 220.92 L
364.158 220.88 L
362.784 220.833 L
361.419 220.783 L
360.037 220.754 L
358.662 220.712 L
357.299 220.677 L
355.934 220.619 L
354.561 220.593 L
353.192 220.571 L
351.826 220.52 L
350.452 220.457 L
349.082 220.413 L
347.707 220.363 L
346.342 220.3 L
344.977 220.25 L
343.617 220.199 L
342.262 220.148 L
340.894 220.083 L
339.528 220.013 L
338.166 219.94 L
336.796 219.898 L
335.43 219.844 L
334.055 219.783 L
332.693 219.729 L
331.333 219.675 L
329.962 219.637 L
328.594 219.591 L
327.228 219.546 L
325.85 219.501 L
324.477 219.447 L
323.105 219.401 L
321.733 219.347 L
320.361 219.289 L
318.993 219.249 L
317.627 219.2 L
316.259 219.141 L
314.889 219.096 L
313.53 219.036 L
312.16 219.007 L
310.779 218.953 L
309.415 218.904 L
308.046 218.855 L
306.677 218.812 L
305.319 218.748 L
303.951 218.689 L
302.586 218.639 L
301.219 218.591 L
299.851 218.522 L
298.48 218.469 L
297.106 218.438 L
295.73 218.391 L
294.359 218.361 L
292.983 218.338 L
291.614 218.296 L
290.238 218.271 L
288.859 218.22 L
287.494 218.183 L
286.123 218.131 L
284.757 218.085 L
283.386 218.046 L
282.012 217.998 L
280.662 217.912 L
279.29 217.859 L
277.921 217.799 L
276.544 217.752 L
275.18 217.709 L
273.806 217.649 L
272.429 217.603 L
271.065 217.561 L
269.693 217.511 L
268.327 217.468 L
266.955 217.426 L
265.59 217.39 L
264.224 217.355 L
262.849 217.304 L
261.478 217.283 L
260.111 217.243 L
258.736 217.201 L
257.368 217.146 L
256.001 217.115 L
254.637 217.074 L
253.265 217.044 L
251.898 217.005 L
250.535 216.954 L
249.168 216.926 L
247.791 216.898 L
246.418 216.85 L
245.064 216.822 L
243.698 216.749 L
242.332 216.704 L
240.957 216.655 L
239.578 216.602 L
238.211 216.545 L
236.838 216.504 L
235.483 216.477 L
234.116 216.433 L
232.739 216.387 L
231.365 216.359 L
229.995 216.325 L
228.625 216.266 L
227.257 216.223 L
225.892 216.165 L
224.516 216.134 L
223.137 216.101 L
221.767 216.057 L
220.396 216.003 L
219.021 215.956 L
217.658 215.927 L
216.288 215.891 L
214.911 215.858 L
213.548 215.811 L
212.172 215.767 L
210.798 215.739 L
209.424 215.687 L
208.056 215.631 L
206.693 215.573 L
205.342 215.514 L
203.971 215.455 L
202.593 215.408 L
201.223 215.36 L
199.859 215.324 L
198.487 215.29 L
197.119 215.251 L
195.752 215.194 L
194.378 215.146 L
193.008 215.107 L
191.644 215.061 L
190.274 215.015 L
188.897 214.965 L
187.528 214.914 L
186.154 214.877 L
184.792 214.843 L
183.423 214.806 L
182.06 214.786 L
180.697 214.731 L
179.328 214.685 L
177.956 214.619 L
176.591 214.56 L
175.223 214.513 L
173.854 214.46 L
172.488 214.4 L
171.126 214.323 L
169.756 214.28 L
168.388 214.219 L
167.018 214.152 L
165.654 214.095 L
164.289 214.038 L
162.927 213.984 L
161.562 213.936 L
160.186 213.87 L
158.816 213.819 L
157.446 213.77 L
156.078 213.711 L
154.718 213.691 L
153.352 213.639 L
151.982 213.609 L
150.618 213.55 L
149.258 213.507 L
147.884 213.467 L
146.509 213.412 L
145.135 213.353 L
143.762 213.306 L
142.399 213.261 L
141.037 213.218 L
139.672 213.182 L
138.298 213.131 L
136.94 213.084 L
135.575 213.038 L
134.206 212.996 L
132.852 212.948 L
131.481 212.914 L
130.119 212.871 L
128.761 212.856 L
127.386 212.803 L
126.022 212.758 L
124.658 212.718 L
123.28 212.696 L
121.92 212.651 L
120.549 212.621 L
119.182 212.573 L
117.808 212.543 L
118.847 214.983 L
119.888 217.407 L
120.927 219.824 L
121.967 222.267 L
123.011 224.716 L
124.053 227.15 L
125.1 229.593 L
126.132 232.012 L
127.166 234.44 L
128.193 236.854 L
129.227 239.288 L
130.262 241.721 L
131.296 244.159 L
132.331 246.59 L
133.36 249.018 L
134.398 251.45 L
135.441 253.894 L
136.472 256.318 L
137.508 258.728 L
138.542 261.143 L
139.572 263.57 L
140.613 266.012 L
141.656 268.448 L
142.693 270.892 L
143.735 273.324 L
144.77 275.755 L
145.813 278.196 L
146.853 280.633 L
147.891 283.078 L
148.923 285.508 L
148.097 287.158 L
147.265 288.827 L
146.446 290.521 L
145.615 292.19 L
144.784 293.878 L
143.956 295.552 L
143.126 297.223 L
142.296 298.885 L
141.462 300.568 L
140.644 302.23 L
139.827 303.902 L
139.003 305.571 L
138.159 307.238 L
137.322 308.93 L
136.489 310.599 L
135.657 312.266 L
134.838 313.946 L
134.028 315.62 L
133.194 317.297 L
132.368 318.979 L
131.534 320.64 L
130.699 322.316 L
129.885 323.993 L
129.06 325.67 L
128.23 327.346 L
127.402 329.03 L
126.569 330.696 L
125.746 332.341 L
124.913 333.989 L
124.082 335.665 L
123.261 337.334 L
122.44 339.005 L
121.62 340.666 L
120.78 342.345 L
119.956 344.028 L
119.126 345.71 L
118.29 347.38 L
117.453 349.075 L
116.625 350.759 L
115.802 352.445 L
114.973 354.094 L
114.152 355.768 L
113.328 357.427 L
112.497 359.117 L
111.67 360.791 L
110.832 362.465 L
110.009 364.141 L
109.18 365.804 L
108.354 367.471 L
S
GR
GS
[0.75 0 0 0.75 0 0] CT
1 0 0 RC
1 LJ
N
466.5 79.5 M
465.736 77.149 L
463.736 75.696 L
461.264 75.696 L
459.264 77.149 L
458.5 79.5 L
459.264 81.851 L
461.264 83.304 L
463.736 83.304 L
465.736 81.851 L
cp
S
GR
GS
[0.75 0 0 0.75 0 0] CT
1 0 0 RC
1 LJ
N
105 371 M
112 364 L
S
GR
GS
[0.75 0 0 0.75 0 0] CT
1 0 0 RC
1 LJ
N
105 364 M
112 371 L
S
GR
GS
[0.75 0 0 0.75 0 0] CT
0 0 1 RC
1 LJ
N
466.5 79.5 M
465.736 77.149 L
463.736 75.696 L
461.264 75.696 L
459.264 77.149 L
458.5 79.5 L
459.264 81.851 L
461.264 83.304 L
463.736 83.304 L
465.736 81.851 L
cp
S
GR
GS
[0.75 0 0 0.75 0 0] CT
0 0 1 RC
1 LJ
N
105 371 M
112 364 L
S
GR
GS
[0.75 0 0 0.75 0 0] CT
0 0 1 RC
1 LJ
N
105 364 M
112 371 L
S
GR
GS
[0.75 0 0 0.75 0 0] CT
1 GC
N
307 108 M
307 55 L
365 55 L
365 108 L
cp
f
GR
GS
[0.75 0 0 0.75 258 48.75] CT
/Helvetica 12 F
GS
[1 0 0 1 0 0] CT
0 5 moveto 
1 -1 scale
(ekf) t 
GR
GR
GS
[0.75 0 0 0.75 0 0] CT
1 0 0 RC
1 LJ
0.667 LW
N
311 65 M
341 65 L
S
GR
GS
[0.75 0 0 0.75 258 61.125] CT
/Helvetica 12 F
GS
[1 0 0 1 0 0] CT
0 5 moveto 
1 -1 scale
(ukf) t 
GR
GR
GS
[0.75 0 0 0.75 0 0] CT
0 0 1 RC
1 LJ
0.667 LW
N
311 81.5 M
341 81.5 L
S
GR
GS
[0.75 0 0 0.75 258 73.5] CT
/Helvetica 12 F
GS
[1 0 0 1 0 0] CT
0 5 moveto 
1 -1 scale
(x) t 
GR
GR
GS
[0.75 0 0 0.75 0 0] CT
1 LJ
0.667 LW
N
311 98 M
341 98 L
S
GR
GS
[0.75 0 0 0.75 0 0] CT
0.149 GC
10.0 ML
0.667 LW
N
307 108 M
307 55 L
365 55 L
365 108 L
cp
S
GR
%%Trailer
%%Pages: 1
%%EOF
