%!PS-Adobe-3.0 EPSF-3.0
%%Creator: (MATLAB, The Mathworks, Inc. Version 9.0.0.341360 \(R2016a\). Operating System: Windows 8)
%%Title: C:/Users/Jan/Documents/JC.ISF/isf2/rmcp4.eps
%%CreationDate: 2017-04-11T12:59:32
%%Pages: (atend)
%%BoundingBox: 0 0 420 315
%%LanguageLevel: 3
%%EndComments
%%BeginProlog
%%BeginResource: procset (Apache XML Graphics Std ProcSet) 1.2 0
%%Version: 1.2 0
%%Copyright: (Copyright 2001-2003,2010 The Apache Software Foundation. License terms: http://www.apache.org/licenses/LICENSE-2.0)
/bd{bind def}bind def
/ld{load def}bd
/GR/grestore ld
/M/moveto ld
/LJ/setlinejoin ld
/C/curveto ld
/f/fill ld
/LW/setlinewidth ld
/GC/setgray ld
/t/show ld
/N/newpath ld
/CT/concat ld
/cp/closepath ld
/S/stroke ld
/L/lineto ld
/CC/setcmykcolor ld
/A/ashow ld
/GS/gsave ld
/RC/setrgbcolor ld
/RM/rmoveto ld
/ML/setmiterlimit ld
/re {4 2 roll M
1 index 0 rlineto
0 exch rlineto
neg 0 rlineto
cp } bd
/_ctm matrix def
/_tm matrix def
/BT { _ctm currentmatrix pop matrix _tm copy pop 0 0 moveto } bd
/ET { _ctm setmatrix } bd
/iTm { _ctm setmatrix _tm concat } bd
/Tm { _tm astore pop iTm 0 0 moveto } bd
/ux 0.0 def
/uy 0.0 def
/F {
  /Tp exch def
  /Tf exch def
  Tf findfont Tp scalefont setfont
  /cf Tf def  /cs Tp def
} bd
/ULS {currentpoint /uy exch def /ux exch def} bd
/ULE {
  /Tcx currentpoint pop def
  gsave
  newpath
  cf findfont cs scalefont dup
  /FontMatrix get 0 get /Ts exch def /FontInfo get dup
  /UnderlinePosition get Ts mul /To exch def
  /UnderlineThickness get Ts mul /Tt exch def
  ux uy To add moveto  Tcx uy To add lineto
  Tt setlinewidth stroke
  grestore
} bd
/OLE {
  /Tcx currentpoint pop def
  gsave
  newpath
  cf findfont cs scalefont dup
  /FontMatrix get 0 get /Ts exch def /FontInfo get dup
  /UnderlinePosition get Ts mul /To exch def
  /UnderlineThickness get Ts mul /Tt exch def
  ux uy To add cs add moveto Tcx uy To add cs add lineto
  Tt setlinewidth stroke
  grestore
} bd
/SOE {
  /Tcx currentpoint pop def
  gsave
  newpath
  cf findfont cs scalefont dup
  /FontMatrix get 0 get /Ts exch def /FontInfo get dup
  /UnderlinePosition get Ts mul /To exch def
  /UnderlineThickness get Ts mul /Tt exch def
  ux uy To add cs 10 mul 26 idiv add moveto Tcx uy To add cs 10 mul 26 idiv add lineto
  Tt setlinewidth stroke
  grestore
} bd
/QT {
/Y22 exch store
/X22 exch store
/Y21 exch store
/X21 exch store
currentpoint
/Y21 load 2 mul add 3 div exch
/X21 load 2 mul add 3 div exch
/X21 load 2 mul /X22 load add 3 div
/Y21 load 2 mul /Y22 load add 3 div
/X22 load /Y22 load curveto
} bd
/SSPD {
dup length /d exch dict def
{
/v exch def
/k exch def
currentpagedevice k known {
/cpdv currentpagedevice k get def
v cpdv ne {
/upd false def
/nullv v type /nulltype eq def
/nullcpdv cpdv type /nulltype eq def
nullv nullcpdv or
{
/upd true def
} {
/sametype v type cpdv type eq def
sametype {
v type /arraytype eq {
/vlen v length def
/cpdvlen cpdv length def
vlen cpdvlen eq {
0 1 vlen 1 sub {
/i exch def
/obj v i get def
/cpdobj cpdv i get def
obj cpdobj ne {
/upd true def
exit
} if
} for
} {
/upd true def
} ifelse
} {
v type /dicttype eq {
v {
/dv exch def
/dk exch def
/cpddv cpdv dk get def
dv cpddv ne {
/upd true def
exit
} if
} forall
} {
/upd true def
} ifelse
} ifelse
} if
} ifelse
upd true eq {
d k v put
} if
} if
} if
} forall
d length 0 gt {
d setpagedevice
} if
} bd
%%EndResource
%%BeginResource: procset (Apache XML Graphics EPS ProcSet) 1.0 0
%%Version: 1.0 0
%%Copyright: (Copyright 2002-2003 The Apache Software Foundation. License terms: http://www.apache.org/licenses/LICENSE-2.0)
/BeginEPSF { %def
/b4_Inc_state save def         % Save state for cleanup
/dict_count countdictstack def % Count objects on dict stack
/op_count count 1 sub def      % Count objects on operand stack
userdict begin                 % Push userdict on dict stack
/showpage { } def              % Redefine showpage, { } = null proc
0 setgray 0 setlinecap         % Prepare graphics state
1 setlinewidth 0 setlinejoin
10 setmiterlimit [ ] 0 setdash newpath
/languagelevel where           % If level not equal to 1 then
{pop languagelevel             % set strokeadjust and
1 ne                           % overprint to their defaults.
{false setstrokeadjust false setoverprint
} if
} if
} bd
/EndEPSF { %def
count op_count sub {pop} repeat            % Clean up stacks
countdictstack dict_count sub {end} repeat
b4_Inc_state restore
} bd
%%EndResource
%FOPBeginFontDict
%%IncludeResource: font Courier-Bold
%%IncludeResource: font Helvetica
%%IncludeResource: font Courier-BoldOblique
%%IncludeResource: font Courier-Oblique
%%IncludeResource: font Times-Roman
%%IncludeResource: font Helvetica-BoldOblique
%%IncludeResource: font Helvetica-Bold
%%IncludeResource: font Helvetica-Oblique
%%IncludeResource: font Times-BoldItalic
%%IncludeResource: font Courier
%%IncludeResource: font Times-Italic
%%IncludeResource: font Times-Bold
%%IncludeResource: font Symbol
%%IncludeResource: font ZapfDingbats
%FOPEndFontDict
%%BeginResource: encoding WinAnsiEncoding
/WinAnsiEncoding [
/.notdef /.notdef /.notdef /.notdef /.notdef
/.notdef /.notdef /.notdef /.notdef /.notdef
/.notdef /.notdef /.notdef /.notdef /.notdef
/.notdef /.notdef /.notdef /.notdef /.notdef
/.notdef /.notdef /.notdef /.notdef /.notdef
/.notdef /.notdef /.notdef /.notdef /.notdef
/.notdef /.notdef /space /exclam /quotedbl
/numbersign /dollar /percent /ampersand /quotesingle
/parenleft /parenright /asterisk /plus /comma
/hyphen /period /slash /zero /one
/two /three /four /five /six
/seven /eight /nine /colon /semicolon
/less /equal /greater /question /at
/A /B /C /D /E
/F /G /H /I /J
/K /L /M /N /O
/P /Q /R /S /T
/U /V /W /X /Y
/Z /bracketleft /backslash /bracketright /asciicircum
/underscore /quoteleft /a /b /c
/d /e /f /g /h
/i /j /k /l /m
/n /o /p /q /r
/s /t /u /v /w
/x /y /z /braceleft /bar
/braceright /asciitilde /bullet /Euro /bullet
/quotesinglbase /florin /quotedblbase /ellipsis /dagger
/daggerdbl /circumflex /perthousand /Scaron /guilsinglleft
/OE /bullet /Zcaron /bullet /bullet
/quoteleft /quoteright /quotedblleft /quotedblright /bullet
/endash /emdash /asciitilde /trademark /scaron
/guilsinglright /oe /bullet /zcaron /Ydieresis
/space /exclamdown /cent /sterling /currency
/yen /brokenbar /section /dieresis /copyright
/ordfeminine /guillemotleft /logicalnot /sfthyphen /registered
/macron /degree /plusminus /twosuperior /threesuperior
/acute /mu /paragraph /middot /cedilla
/onesuperior /ordmasculine /guillemotright /onequarter /onehalf
/threequarters /questiondown /Agrave /Aacute /Acircumflex
/Atilde /Adieresis /Aring /AE /Ccedilla
/Egrave /Eacute /Ecircumflex /Edieresis /Igrave
/Iacute /Icircumflex /Idieresis /Eth /Ntilde
/Ograve /Oacute /Ocircumflex /Otilde /Odieresis
/multiply /Oslash /Ugrave /Uacute /Ucircumflex
/Udieresis /Yacute /Thorn /germandbls /agrave
/aacute /acircumflex /atilde /adieresis /aring
/ae /ccedilla /egrave /eacute /ecircumflex
/edieresis /igrave /iacute /icircumflex /idieresis
/eth /ntilde /ograve /oacute /ocircumflex
/otilde /odieresis /divide /oslash /ugrave
/uacute /ucircumflex /udieresis /yacute /thorn
/ydieresis
] def
%%EndResource
%FOPBeginFontReencode
/Courier-Bold findfont
dup length dict begin
  {1 index /FID ne {def} {pop pop} ifelse} forall
  /Encoding WinAnsiEncoding def
  currentdict
end
/Courier-Bold exch definefont pop
/Helvetica findfont
dup length dict begin
  {1 index /FID ne {def} {pop pop} ifelse} forall
  /Encoding WinAnsiEncoding def
  currentdict
end
/Helvetica exch definefont pop
/Courier-BoldOblique findfont
dup length dict begin
  {1 index /FID ne {def} {pop pop} ifelse} forall
  /Encoding WinAnsiEncoding def
  currentdict
end
/Courier-BoldOblique exch definefont pop
/Courier-Oblique findfont
dup length dict begin
  {1 index /FID ne {def} {pop pop} ifelse} forall
  /Encoding WinAnsiEncoding def
  currentdict
end
/Courier-Oblique exch definefont pop
/Times-Roman findfont
dup length dict begin
  {1 index /FID ne {def} {pop pop} ifelse} forall
  /Encoding WinAnsiEncoding def
  currentdict
end
/Times-Roman exch definefont pop
/Helvetica-BoldOblique findfont
dup length dict begin
  {1 index /FID ne {def} {pop pop} ifelse} forall
  /Encoding WinAnsiEncoding def
  currentdict
end
/Helvetica-BoldOblique exch definefont pop
/Helvetica-Bold findfont
dup length dict begin
  {1 index /FID ne {def} {pop pop} ifelse} forall
  /Encoding WinAnsiEncoding def
  currentdict
end
/Helvetica-Bold exch definefont pop
/Helvetica-Oblique findfont
dup length dict begin
  {1 index /FID ne {def} {pop pop} ifelse} forall
  /Encoding WinAnsiEncoding def
  currentdict
end
/Helvetica-Oblique exch definefont pop
/Times-BoldItalic findfont
dup length dict begin
  {1 index /FID ne {def} {pop pop} ifelse} forall
  /Encoding WinAnsiEncoding def
  currentdict
end
/Times-BoldItalic exch definefont pop
/Courier findfont
dup length dict begin
  {1 index /FID ne {def} {pop pop} ifelse} forall
  /Encoding WinAnsiEncoding def
  currentdict
end
/Courier exch definefont pop
/Times-Italic findfont
dup length dict begin
  {1 index /FID ne {def} {pop pop} ifelse} forall
  /Encoding WinAnsiEncoding def
  currentdict
end
/Times-Italic exch definefont pop
/Times-Bold findfont
dup length dict begin
  {1 index /FID ne {def} {pop pop} ifelse} forall
  /Encoding WinAnsiEncoding def
  currentdict
end
/Times-Bold exch definefont pop
%FOPEndFontReencode
%%EndProlog
%%Page: 1 1
%%PageBoundingBox: 0 0 420 315
%%BeginPageSetup
[1 0 0 -1 0 315] CT
%%EndPageSetup
GS
[0.75 0 0 0.75 0 0] CT
1 GC
N
0 0 560 420 re
f
GR
GS
[0.75 0 0 0.75 0 0] CT
1 GC
N
0 0 560 420 re
f
GR
GS
[0.75 0 0 0.75 0 0] CT
1 GC
N
73 374 M
507 374 L
507 31 L
73 31 L
cp
f
GR
GS
[0.75 0 0 0.75 0 0] CT
0.873 GC
1 LJ
0.667 LW
N
94.893 374 M
94.893 31 L
S
GR
GS
[0.75 0 0 0.75 0 0] CT
0.873 GC
1 LJ
0.667 LW
N
143.942 374 M
143.942 31 L
S
GR
GS
[0.75 0 0 0.75 0 0] CT
0.873 GC
1 LJ
0.667 LW
N
192.99 374 M
192.99 31 L
S
GR
GS
[0.75 0 0 0.75 0 0] CT
0.873 GC
1 LJ
0.667 LW
N
242.039 374 M
242.039 31 L
S
GR
GS
[0.75 0 0 0.75 0 0] CT
0.873 GC
1 LJ
0.667 LW
N
291.087 374 M
291.087 31 L
S
GR
GS
[0.75 0 0 0.75 0 0] CT
0.873 GC
1 LJ
0.667 LW
N
340.135 374 M
340.135 31 L
S
GR
GS
[0.75 0 0 0.75 0 0] CT
0.873 GC
1 LJ
0.667 LW
N
389.184 374 M
389.184 31 L
S
GR
GS
[0.75 0 0 0.75 0 0] CT
0.873 GC
1 LJ
0.667 LW
N
438.232 374 M
438.232 31 L
S
GR
GS
[0.75 0 0 0.75 0 0] CT
0.873 GC
1 LJ
0.667 LW
N
487.28 374 M
487.28 31 L
S
GR
GS
[0.75 0 0 0.75 0 0] CT
0.873 GC
1 LJ
0.667 LW
N
507 357.677 M
73 357.677 L
S
GR
GS
[0.75 0 0 0.75 0 0] CT
0.873 GC
1 LJ
0.667 LW
N
507 318.346 M
73 318.346 L
S
GR
GS
[0.75 0 0 0.75 0 0] CT
0.873 GC
1 LJ
0.667 LW
N
507 279.015 M
73 279.015 L
S
GR
GS
[0.75 0 0 0.75 0 0] CT
0.873 GC
1 LJ
0.667 LW
N
507 239.684 M
73 239.684 L
S
GR
GS
[0.75 0 0 0.75 0 0] CT
0.873 GC
1 LJ
0.667 LW
N
507 200.353 M
73 200.353 L
S
GR
GS
[0.75 0 0 0.75 0 0] CT
0.873 GC
1 LJ
0.667 LW
N
507 161.022 M
73 161.022 L
S
GR
GS
[0.75 0 0 0.75 0 0] CT
0.873 GC
1 LJ
0.667 LW
N
507 121.691 M
73 121.691 L
S
GR
GS
[0.75 0 0 0.75 0 0] CT
0.873 GC
1 LJ
0.667 LW
N
507 82.36 M
73 82.36 L
S
GR
GS
[0.75 0 0 0.75 0 0] CT
0.873 GC
1 LJ
0.667 LW
N
507 43.029 M
73 43.029 L
S
GR
GS
[0.75 0 0 0.75 0 0] CT
0.149 GC
2 setlinecap
1 LJ
0.667 LW
N
73 374 M
507 374 L
S
GR
GS
[0.75 0 0 0.75 0 0] CT
0.149 GC
2 setlinecap
1 LJ
0.667 LW
N
94.893 374 M
94.893 369.66 L
S
GR
GS
[0.75 0 0 0.75 0 0] CT
0.149 GC
2 setlinecap
1 LJ
0.667 LW
N
143.942 374 M
143.942 369.66 L
S
GR
GS
[0.75 0 0 0.75 0 0] CT
0.149 GC
2 setlinecap
1 LJ
0.667 LW
N
192.99 374 M
192.99 369.66 L
S
GR
GS
[0.75 0 0 0.75 0 0] CT
0.149 GC
2 setlinecap
1 LJ
0.667 LW
N
242.039 374 M
242.039 369.66 L
S
GR
GS
[0.75 0 0 0.75 0 0] CT
0.149 GC
2 setlinecap
1 LJ
0.667 LW
N
291.087 374 M
291.087 369.66 L
S
GR
GS
[0.75 0 0 0.75 0 0] CT
0.149 GC
2 setlinecap
1 LJ
0.667 LW
N
340.135 374 M
340.135 369.66 L
S
GR
GS
[0.75 0 0 0.75 0 0] CT
0.149 GC
2 setlinecap
1 LJ
0.667 LW
N
389.184 374 M
389.184 369.66 L
S
GR
GS
[0.75 0 0 0.75 0 0] CT
0.149 GC
2 setlinecap
1 LJ
0.667 LW
N
438.232 374 M
438.232 369.66 L
S
GR
GS
[0.75 0 0 0.75 0 0] CT
0.149 GC
2 setlinecap
1 LJ
0.667 LW
N
487.28 374 M
487.28 369.66 L
S
GR
GS
[0.75 0 0 0.75 71.17001 284.50001] CT
0.149 GC
/Helvetica 13.333 F
GS
[1 0 0 1 0 0] CT
-4 14 moveto 
1 -1 scale
(0) t 
GR
GR
GS
[0.75 0 0 0.75 107.95631 284.50001] CT
0.149 GC
/Helvetica 13.333 F
GS
[1 0 0 1 0 0] CT
-11 14 moveto 
1 -1 scale
(100) t 
GR
GR
GS
[0.75 0 0 0.75 144.7426 284.50001] CT
0.149 GC
/Helvetica 13.333 F
GS
[1 0 0 1 0 0] CT
-11 14 moveto 
1 -1 scale
(200) t 
GR
GR
GS
[0.75 0 0 0.75 181.5289 284.50001] CT
0.149 GC
/Helvetica 13.333 F
GS
[1 0 0 1 0 0] CT
-11 14 moveto 
1 -1 scale
(300) t 
GR
GR
GS
[0.75 0 0 0.75 218.31519 284.50001] CT
0.149 GC
/Helvetica 13.333 F
GS
[1 0 0 1 0 0] CT
-11 14 moveto 
1 -1 scale
(400) t 
GR
GR
GS
[0.75 0 0 0.75 255.10149 284.50001] CT
0.149 GC
/Helvetica 13.333 F
GS
[1 0 0 1 0 0] CT
-11 14 moveto 
1 -1 scale
(500) t 
GR
GR
GS
[0.75 0 0 0.75 291.88779 284.50001] CT
0.149 GC
/Helvetica 13.333 F
GS
[1 0 0 1 0 0] CT
-11 14 moveto 
1 -1 scale
(600) t 
GR
GR
GS
[0.75 0 0 0.75 328.67406 284.50001] CT
0.149 GC
/Helvetica 13.333 F
GS
[1 0 0 1 0 0] CT
-11 14 moveto 
1 -1 scale
(700) t 
GR
GR
GS
[0.75 0 0 0.75 365.46037 284.50001] CT
0.149 GC
/Helvetica 13.333 F
GS
[1 0 0 1 0 0] CT
-11 14 moveto 
1 -1 scale
(800) t 
GR
GR
GS
[0.75 0 0 0.75 0 0] CT
0.149 GC
2 setlinecap
1 LJ
0.667 LW
N
73 374 M
73 31 L
S
GR
GS
[0.75 0 0 0.75 0 0] CT
0.149 GC
2 setlinecap
1 LJ
0.667 LW
N
73 357.677 M
77.34 357.677 L
S
GR
GS
[0.75 0 0 0.75 0 0] CT
0.149 GC
2 setlinecap
1 LJ
0.667 LW
N
73 318.346 M
77.34 318.346 L
S
GR
GS
[0.75 0 0 0.75 0 0] CT
0.149 GC
2 setlinecap
1 LJ
0.667 LW
N
73 279.015 M
77.34 279.015 L
S
GR
GS
[0.75 0 0 0.75 0 0] CT
0.149 GC
2 setlinecap
1 LJ
0.667 LW
N
73 239.684 M
77.34 239.684 L
S
GR
GS
[0.75 0 0 0.75 0 0] CT
0.149 GC
2 setlinecap
1 LJ
0.667 LW
N
73 200.353 M
77.34 200.353 L
S
GR
GS
[0.75 0 0 0.75 0 0] CT
0.149 GC
2 setlinecap
1 LJ
0.667 LW
N
73 161.022 M
77.34 161.022 L
S
GR
GS
[0.75 0 0 0.75 0 0] CT
0.149 GC
2 setlinecap
1 LJ
0.667 LW
N
73 121.691 M
77.34 121.691 L
S
GR
GS
[0.75 0 0 0.75 0 0] CT
0.149 GC
2 setlinecap
1 LJ
0.667 LW
N
73 82.36 M
77.34 82.36 L
S
GR
GS
[0.75 0 0 0.75 0 0] CT
0.149 GC
2 setlinecap
1 LJ
0.667 LW
N
73 43.029 M
77.34 43.029 L
S
GR
GS
[0.75 0 0 0.75 50.75 268.25805] CT
0.149 GC
/Helvetica 13.333 F
GS
[1 0 0 1 0 0] CT
-8 5.5 moveto 
1 -1 scale
(0) t 
GR
GR
GS
[0.75 0 0 0.75 50.75 238.7598] CT
0.149 GC
/Helvetica 13.333 F
GS
[1 0 0 1 0 0] CT
-26 5.5 moveto 
1 -1 scale
(0.02) t 
GR
GR
GS
[0.75 0 0 0.75 50.75 209.26156] CT
0.149 GC
/Helvetica 13.333 F
GS
[1 0 0 1 0 0] CT
-26 5.5 moveto 
1 -1 scale
(0.04) t 
GR
GR
GS
[0.75 0 0 0.75 50.75 179.76331] CT
0.149 GC
/Helvetica 13.333 F
GS
[1 0 0 1 0 0] CT
-26 5.5 moveto 
1 -1 scale
(0.06) t 
GR
GR
GS
[0.75 0 0 0.75 50.75 150.26506] CT
0.149 GC
/Helvetica 13.333 F
GS
[1 0 0 1 0 0] CT
-26 5.5 moveto 
1 -1 scale
(0.08) t 
GR
GR
GS
[0.75 0 0 0.75 50.75 120.7668] CT
0.149 GC
/Helvetica 13.333 F
GS
[1 0 0 1 0 0] CT
-19 5.5 moveto 
1 -1 scale
(0.1) t 
GR
GR
GS
[0.75 0 0 0.75 50.75 91.26856] CT
0.149 GC
/Helvetica 13.333 F
GS
[1 0 0 1 0 0] CT
-26 5.5 moveto 
1 -1 scale
(0.12) t 
GR
GR
GS
[0.75 0 0 0.75 50.75 61.7703] CT
0.149 GC
/Helvetica 13.333 F
GS
[1 0 0 1 0 0] CT
-26 5.5 moveto 
1 -1 scale
(0.14) t 
GR
GR
GS
[0.75 0 0 0.75 50.75 32.27206] CT
0.149 GC
/Helvetica 13.333 F
GS
[1 0 0 1 0 0] CT
-26 5.5 moveto 
1 -1 scale
(0.16) t 
GR
GR
GS
[0.75 0 0 0.75 217.50021 21.1875] CT
/Helvetica-Bold 14.667 F
GS
[1 0 0 1 0 0] CT
-121 -4 moveto 
1 -1 scale
(rekurzivni metoda chyby predikce) t 
GR
GR
GS
[0.75 0 0 0.75 0 0] CT
1 0 0 RC
1 LJ
0.667 LW
N
97.191 30.966 M
97.346 275.719 L
97.836 289.18 L
98.327 301.074 L
98.817 313.531 L
99.308 314.719 L
99.798 318.52 L
100.289 324.287 L
100.779 324.592 L
101.27 325.844 L
101.76 327.227 L
102.251 329.024 L
102.741 329.372 L
103.232 331.578 L
103.722 334.935 L
104.213 337.442 L
104.703 338.599 L
105.194 338.633 L
105.684 339.26 L
106.174 339.268 L
106.665 340.222 L
107.155 341.132 L
107.646 341.846 L
108.136 342.038 L
108.627 342.047 L
109.117 342.27 L
109.608 342.339 L
110.098 342.679 L
110.589 342.959 L
111.079 343.621 L
111.57 343.748 L
112.06 343.755 L
112.551 343.808 L
113.041 343.862 L
113.532 344.286 L
114.022 344.393 L
114.513 344.47 L
115.003 344.712 L
115.494 344.74 L
115.984 344.744 L
116.475 344.829 L
116.965 345.111 L
117.456 345.205 L
117.946 345.352 L
118.437 345.714 L
118.927 345.736 L
119.418 345.737 L
119.908 346.214 L
120.399 346.361 L
120.889 346.361 L
121.379 346.41 L
121.87 346.411 L
122.36 346.449 L
122.851 346.515 L
123.341 346.833 L
123.832 346.924 L
124.322 347.108 L
124.813 347.109 L
125.303 347.131 L
125.794 347.209 L
126.284 347.446 L
126.775 347.642 L
127.265 347.681 L
127.756 347.704 L
128.246 347.764 L
128.737 347.823 L
129.227 347.885 L
129.718 347.9 L
130.208 348.017 L
130.699 348.024 L
131.189 348.056 L
131.68 348.178 L
132.17 348.201 L
132.661 348.388 L
133.151 348.555 L
133.642 348.56 L
134.132 348.697 L
134.623 348.98 L
135.113 349.017 L
135.604 349.056 L
136.094 349.057 L
136.584 349.064 L
137.075 349.107 L
137.565 349.15 L
138.056 349.215 L
138.546 349.303 L
139.037 349.316 L
139.527 349.409 L
140.018 349.427 L
140.508 349.468 L
140.999 349.534 L
141.489 349.796 L
141.98 349.847 L
142.47 350.04 L
142.961 350.104 L
143.451 350.108 L
143.942 350.121 L
144.432 350.164 L
144.923 350.184 L
145.413 350.251 L
145.904 350.251 L
146.394 350.288 L
146.885 350.304 L
147.375 350.353 L
147.866 350.366 L
148.356 350.395 L
148.847 350.431 L
149.337 350.431 L
149.828 350.432 L
150.318 350.488 L
150.809 350.489 L
151.299 350.507 L
151.789 350.53 L
152.28 350.53 L
152.77 350.545 L
153.261 350.563 L
153.751 350.672 L
154.242 350.677 L
154.732 350.678 L
155.223 350.77 L
155.713 350.804 L
156.204 350.818 L
156.694 350.843 L
157.185 350.892 L
157.675 350.935 L
158.166 350.958 L
158.656 351.108 L
159.147 351.118 L
159.637 351.131 L
160.128 351.198 L
160.618 351.259 L
161.109 351.262 L
161.599 351.27 L
162.09 351.472 L
162.58 351.61 L
163.071 351.644 L
163.561 351.659 L
164.052 351.66 L
164.542 351.695 L
165.033 351.696 L
165.523 351.696 L
166.014 351.705 L
166.504 351.713 L
166.994 351.766 L
167.485 351.787 L
167.975 351.841 L
168.466 351.852 L
168.956 351.857 L
169.447 351.881 L
169.937 351.953 L
170.428 351.983 L
170.918 351.995 L
171.409 352.009 L
171.899 352.015 L
172.39 352.06 L
172.88 352.087 L
173.371 352.128 L
173.861 352.128 L
174.352 352.129 L
174.842 352.135 L
175.333 352.136 L
175.823 352.146 L
176.314 352.159 L
176.804 352.161 L
177.295 352.184 L
177.785 352.189 L
178.276 352.239 L
178.766 352.241 L
179.257 352.295 L
179.747 352.322 L
180.238 352.335 L
180.728 352.341 L
181.219 352.368 L
181.709 352.368 L
182.199 352.379 L
182.69 352.381 L
183.18 352.386 L
183.671 352.389 L
184.161 352.458 L
184.652 352.593 L
185.142 352.625 L
185.633 352.684 L
186.123 352.716 L
186.614 352.717 L
187.104 352.765 L
187.595 352.792 L
188.085 352.804 L
188.576 352.808 L
189.066 352.808 L
189.557 352.958 L
190.047 353.028 L
190.538 353.068 L
191.028 353.074 L
191.519 353.09 L
192.009 353.096 L
192.5 353.119 L
192.99 353.156 L
193.481 353.159 L
193.971 353.229 L
194.462 353.248 L
194.952 353.278 L
195.443 353.278 L
195.933 353.278 L
196.424 353.289 L
196.914 353.45 L
197.404 353.487 L
197.895 353.487 L
198.385 353.546 L
198.876 353.546 L
199.366 353.622 L
199.857 353.634 L
200.347 353.645 L
200.838 353.646 L
201.328 353.648 L
201.819 353.654 L
202.309 353.662 L
202.8 353.678 L
203.29 353.684 L
203.781 353.685 L
204.271 353.687 L
204.762 353.687 L
205.252 353.698 L
205.743 353.713 L
206.233 353.759 L
206.724 353.846 L
207.214 353.868 L
207.705 353.912 L
208.195 353.917 L
208.686 353.923 L
209.176 353.927 L
209.667 353.944 L
210.157 353.98 L
210.648 353.98 L
211.138 353.982 L
211.629 353.998 L
212.119 353.999 L
212.609 353.999 L
213.1 354.002 L
213.59 354.002 L
214.081 354.024 L
214.571 354.033 L
215.062 354.099 L
215.552 354.114 L
216.043 354.114 L
216.533 354.125 L
217.024 354.127 L
217.514 354.131 L
218.005 354.131 L
218.495 354.132 L
218.986 354.139 L
219.476 354.14 L
219.967 354.14 L
220.457 354.162 L
220.948 354.169 L
221.438 354.172 L
221.929 354.177 L
222.419 354.179 L
222.91 354.179 L
223.4 354.179 L
223.891 354.182 L
224.381 354.196 L
224.872 354.197 L
225.362 354.199 L
225.853 354.2 L
226.343 354.208 L
226.834 354.21 L
227.324 354.213 L
227.814 354.221 L
228.305 354.224 L
228.795 354.224 L
229.286 354.24 L
229.776 354.248 L
230.267 354.248 L
230.757 354.251 L
231.248 354.252 L
231.738 354.254 L
232.229 354.254 L
232.719 354.255 L
233.21 354.27 L
233.7 354.276 L
234.191 354.311 L
234.681 354.313 L
235.172 354.314 L
235.662 354.314 L
236.153 354.316 L
236.643 354.324 L
237.134 354.327 L
237.624 354.336 L
238.115 354.341 L
238.605 354.351 L
239.096 354.352 L
239.586 354.352 L
240.077 354.382 L
240.567 354.405 L
241.058 354.413 L
241.548 354.429 L
242.039 354.437 L
242.529 354.475 L
243.02 354.532 L
243.51 354.594 L
244 354.611 L
244.491 354.668 L
244.981 354.684 L
245.472 354.687 L
245.962 354.7 L
246.453 354.702 L
246.943 354.703 L
247.434 354.703 L
247.924 354.706 L
248.415 354.715 L
248.905 354.72 L
249.396 354.724 L
249.886 354.729 L
250.377 354.737 L
250.867 354.737 L
251.358 354.738 L
251.848 354.744 L
252.339 354.745 L
252.829 354.745 L
253.32 354.76 L
253.81 354.762 L
254.301 354.773 L
254.791 354.773 L
255.282 354.785 L
255.772 354.785 L
256.263 354.785 L
256.753 354.828 L
257.244 354.83 L
257.734 354.838 L
258.224 354.838 L
258.715 354.838 L
259.205 354.84 L
259.696 354.845 L
260.186 354.845 L
260.677 354.849 L
261.167 354.849 L
261.658 354.849 L
262.148 354.849 L
262.639 354.849 L
263.129 354.859 L
263.62 354.864 L
264.11 354.871 L
264.601 354.872 L
265.091 354.872 L
265.582 354.873 L
266.072 354.874 L
266.563 354.88 L
267.053 354.897 L
267.544 354.918 L
268.034 354.918 L
268.525 354.922 L
269.015 354.922 L
269.506 354.955 L
269.996 354.971 L
270.487 354.98 L
270.977 354.98 L
271.468 354.981 L
271.958 354.987 L
272.449 354.989 L
272.939 355.012 L
273.43 355.019 L
273.92 355.022 L
274.41 355.036 L
274.901 355.048 L
275.391 355.049 L
275.882 355.054 L
276.372 355.069 L
276.863 355.083 L
277.353 355.1 L
277.844 355.11 L
278.334 355.11 L
278.825 355.118 L
279.315 355.12 L
279.806 355.121 L
280.296 355.126 L
280.787 355.137 L
281.277 355.151 L
281.768 355.157 L
282.258 355.17 L
282.749 355.184 L
283.239 355.186 L
283.73 355.186 L
284.22 355.186 L
284.711 355.201 L
285.201 355.203 L
285.692 355.206 L
286.182 355.206 L
286.673 355.21 L
287.163 355.22 L
287.654 355.227 L
288.144 355.227 L
288.634 355.234 L
289.125 355.236 L
289.615 355.237 L
290.106 355.237 L
290.596 355.238 L
291.087 355.238 L
291.577 355.241 L
292.068 355.278 L
292.558 355.314 L
293.049 355.315 L
293.539 355.323 L
294.03 355.326 L
294.52 355.329 L
295.011 355.338 L
295.501 355.343 L
295.992 355.343 L
296.482 355.351 L
296.973 355.359 L
297.463 355.375 L
297.954 355.4 L
298.444 355.4 L
298.935 355.405 L
299.425 355.406 L
299.916 355.408 L
300.406 355.426 L
300.897 355.431 L
301.387 355.434 L
301.878 355.434 L
302.368 355.436 L
302.859 355.436 L
303.349 355.436 L
303.84 355.439 L
304.33 355.441 L
304.82 355.442 L
305.311 355.442 L
305.801 355.444 L
306.292 355.455 L
306.782 355.457 L
307.273 355.465 L
307.763 355.507 L
308.254 355.507 L
308.744 355.542 L
309.235 355.548 L
309.725 355.549 L
310.216 355.55 L
310.706 355.551 L
311.197 355.552 L
311.687 355.553 L
312.178 355.564 L
312.668 355.572 L
313.159 355.577 L
313.649 355.593 L
314.14 355.596 L
314.63 355.599 L
315.121 355.6 L
315.611 355.601 L
316.102 355.602 L
316.592 355.609 L
317.083 355.613 L
317.573 355.621 L
318.064 355.633 L
318.554 355.634 L
319.044 355.636 L
319.535 355.641 L
320.025 355.642 L
320.516 355.646 L
321.006 355.661 L
321.497 355.692 L
321.987 355.709 L
322.478 355.712 L
322.968 355.714 L
323.459 355.717 L
323.949 355.717 L
324.44 355.718 L
324.93 355.718 L
325.421 355.72 L
325.911 355.724 L
326.402 355.726 L
326.892 355.727 L
327.383 355.728 L
327.873 355.732 L
328.364 355.732 L
328.854 355.733 L
329.345 355.742 L
329.835 355.742 L
330.326 355.743 L
330.816 355.749 L
331.307 355.752 L
331.797 355.762 L
332.288 355.762 L
332.778 355.772 L
333.269 355.774 L
333.759 355.774 L
334.25 355.774 L
334.74 355.774 L
335.23 355.775 L
335.721 355.781 L
336.211 355.791 L
336.702 355.801 L
337.192 355.802 L
337.683 355.803 L
338.173 355.81 L
338.664 355.811 L
339.154 355.811 L
339.645 355.813 L
340.135 355.813 L
340.626 355.815 L
341.116 355.815 L
341.607 355.817 L
342.097 355.825 L
342.588 355.84 L
343.078 355.846 L
343.569 355.865 L
344.059 355.867 L
344.55 355.869 L
345.04 355.875 L
345.531 355.923 L
346.021 355.927 L
346.512 355.937 L
347.002 355.939 L
347.493 355.94 L
347.983 355.941 L
348.474 355.943 L
348.964 355.949 L
349.454 355.952 L
349.945 355.952 L
350.435 355.953 L
350.926 355.953 L
351.416 355.954 L
351.907 355.955 L
352.397 355.955 L
352.888 355.963 L
353.378 355.963 L
353.869 355.964 L
354.359 355.967 L
354.85 355.967 L
355.34 355.969 L
355.831 355.97 L
356.321 355.97 L
356.812 355.97 L
357.302 355.971 L
357.793 355.972 L
358.283 355.977 L
358.774 355.983 L
359.264 355.985 L
359.755 355.987 L
360.245 355.99 L
360.736 355.999 L
361.226 356 L
361.717 356 L
362.207 356.001 L
362.698 356.001 L
363.188 356.002 L
363.679 356.009 L
364.169 356.013 L
364.66 356.038 L
365.15 356.039 L
365.64 356.05 L
366.131 356.052 L
366.621 356.052 L
367.112 356.052 L
367.602 356.053 L
368.093 356.055 L
368.583 356.055 L
369.074 356.06 L
369.564 356.063 L
370.055 356.063 L
370.545 356.064 L
371.036 356.065 L
371.526 356.065 L
372.017 356.066 L
372.507 356.066 L
372.998 356.069 L
373.488 356.069 L
373.979 356.074 L
374.469 356.075 L
374.96 356.075 L
375.45 356.076 L
375.941 356.079 L
376.431 356.079 L
376.922 356.084 L
377.412 356.088 L
377.903 356.089 L
378.393 356.089 L
378.884 356.089 L
379.374 356.093 L
379.865 356.096 L
380.355 356.099 L
380.845 356.099 L
381.336 356.099 L
381.826 356.1 L
382.317 356.1 L
382.807 356.1 L
383.298 356.103 L
383.788 356.105 L
384.279 356.106 L
384.769 356.107 L
385.26 356.112 L
385.75 356.115 L
386.241 356.115 L
386.731 356.115 L
387.222 356.116 L
387.712 356.116 L
388.203 356.124 L
388.693 356.125 L
389.184 356.125 L
389.674 356.129 L
390.165 356.132 L
390.655 356.134 L
391.146 356.137 L
391.636 356.143 L
392.127 356.144 L
392.617 356.145 L
393.108 356.146 L
393.598 356.152 L
394.089 356.153 L
394.579 356.162 L
395.07 356.162 L
395.56 356.162 L
396.05 356.165 L
396.541 356.165 L
397.031 356.165 L
397.522 356.175 L
398.012 356.178 L
398.503 356.179 L
398.993 356.185 L
399.484 356.196 L
399.974 356.203 L
400.465 356.211 L
400.955 356.227 L
401.446 356.23 L
401.936 356.232 L
402.427 356.237 L
402.917 356.238 L
403.408 356.238 L
403.898 356.239 L
404.389 356.24 L
404.879 356.243 L
405.37 356.258 L
405.86 356.26 L
406.351 356.261 L
406.841 356.266 L
407.332 356.27 L
407.822 356.272 L
408.313 356.272 L
408.803 356.274 L
409.294 356.277 L
409.784 356.277 L
410.275 356.278 L
410.765 356.279 L
411.255 356.281 L
411.746 356.281 L
412.236 356.282 L
412.727 356.286 L
413.217 356.286 L
413.708 356.287 L
414.198 356.287 L
414.689 356.29 L
415.179 356.29 L
415.67 356.295 L
416.16 356.298 L
416.651 356.299 L
417.141 356.306 L
417.632 356.307 L
418.122 356.311 L
418.613 356.316 L
419.103 356.319 L
419.594 356.323 L
420.084 356.329 L
420.575 356.33 L
421.065 356.331 L
421.556 356.333 L
422.046 356.334 L
422.537 356.334 L
423.027 356.334 L
423.518 356.336 L
424.008 356.336 L
424.499 356.343 L
424.989 356.344 L
425.48 356.346 L
425.97 356.347 L
426.46 356.347 L
426.951 356.347 L
427.441 356.348 L
427.932 356.348 L
428.422 356.348 L
428.913 356.348 L
429.403 356.351 L
429.894 356.361 L
430.384 356.367 L
430.875 356.368 L
431.365 356.368 L
431.856 356.368 L
432.346 356.368 L
432.837 356.368 L
433.327 356.371 L
433.818 356.371 L
434.308 356.374 L
434.799 356.375 L
435.289 356.377 L
435.78 356.378 L
436.27 356.378 L
436.761 356.378 L
437.251 356.379 L
437.742 356.384 L
438.232 356.384 L
438.723 356.401 L
439.213 356.407 L
439.704 356.412 L
440.194 356.417 L
440.685 356.419 L
441.175 356.419 L
441.665 356.419 L
442.156 356.419 L
442.646 356.42 L
443.137 356.42 L
443.627 356.42 L
444.118 356.42 L
444.608 356.421 L
445.099 356.422 L
445.589 356.425 L
446.08 356.426 L
446.57 356.434 L
447.061 356.434 L
447.551 356.434 L
448.042 356.434 L
448.532 356.434 L
449.023 356.44 L
449.513 356.441 L
450.004 356.441 L
450.494 356.442 L
450.985 356.442 L
451.475 356.444 L
451.966 356.447 L
452.456 356.449 L
452.947 356.453 L
453.437 356.453 L
453.928 356.453 L
454.418 356.453 L
454.909 356.453 L
455.399 356.458 L
455.89 356.458 L
456.38 356.458 L
456.87 356.46 L
457.361 356.46 L
457.851 356.461 L
458.342 356.461 L
458.832 356.462 L
459.323 356.466 L
459.813 356.466 L
460.304 356.466 L
460.794 356.467 L
461.285 356.467 L
461.775 356.47 L
462.266 356.47 L
462.756 356.471 L
463.247 356.472 L
463.737 356.475 L
464.228 356.478 L
464.718 356.478 L
465.209 356.48 L
465.699 356.481 L
466.19 356.481 L
466.68 356.482 L
467.171 356.483 L
467.661 356.483 L
468.152 356.484 L
468.642 356.485 L
469.133 356.488 L
469.623 356.488 L
470.114 356.49 L
470.604 356.496 L
471.095 356.5 L
471.585 356.501 L
472.076 356.501 L
472.566 356.501 L
473.056 356.501 L
473.547 356.504 L
474.037 356.507 L
474.528 356.507 L
475.018 356.507 L
475.509 356.511 L
475.999 356.512 L
476.49 356.513 L
476.98 356.513 L
477.471 356.513 L
477.961 356.513 L
478.452 356.515 L
478.942 356.515 L
479.433 356.517 L
479.923 356.52 L
480.414 356.52 L
480.904 356.522 L
481.395 356.523 L
481.885 356.528 L
482.376 356.529 L
482.866 356.53 L
483.357 356.53 L
483.847 356.53 L
484.338 356.531 L
484.828 356.531 L
485.319 356.532 L
485.809 356.532 L
486.3 356.532 L
486.79 356.533 L
487.28 356.533 L
487.771 356.533 L
488.261 356.535 L
488.752 356.536 L
489.242 356.539 L
489.733 356.541 L
490.223 356.542 L
490.714 356.543 L
491.204 356.546 L
491.695 356.548 L
492.185 356.548 L
492.676 356.548 L
493.166 356.552 L
493.657 356.552 L
494.147 356.552 L
494.638 356.552 L
495.128 356.553 L
495.619 356.555 L
496.109 356.556 L
496.6 356.556 L
497.09 356.566 L
497.581 356.57 L
498.071 356.57 L
498.562 356.57 L
499.052 356.571 L
499.543 356.571 L
500.033 356.571 L
500.524 356.571 L
501.014 356.574 L
501.505 356.574 L
501.995 356.575 L
502.486 356.576 L
502.976 356.579 L
503.466 356.583 L
503.957 356.587 L
504.447 356.587 L
504.938 356.587 L
505.428 356.587 L
505.919 356.588 L
506.409 356.588 L
506.9 356.588 L
507.043 356.588 L
S
GR
GS
[0.75 0 0 0.75 0 0] CT
0 1 0 RC
1 LJ
0.667 LW
N
96.817 30.966 M
96.855 37.427 L
97.346 52.825 L
97.836 68.983 L
98.327 97.207 L
98.817 137.298 L
99.308 137.3 L
99.798 140.621 L
100.289 145.782 L
100.779 169.804 L
101.27 186.075 L
101.76 216.952 L
102.251 220.765 L
102.741 239.818 L
103.232 239.825 L
103.722 248.103 L
104.213 258.975 L
104.703 260.925 L
105.194 260.934 L
105.684 265.011 L
106.174 275.17 L
106.665 275.183 L
107.155 276.426 L
107.646 277.62 L
108.136 278.542 L
108.627 278.781 L
109.117 284.974 L
109.608 289.019 L
110.098 290.337 L
110.589 290.583 L
111.079 290.701 L
111.57 290.726 L
112.06 290.834 L
112.551 294.015 L
113.041 302.982 L
113.532 302.99 L
114.022 304.641 L
114.513 307.783 L
115.003 307.783 L
115.494 308.036 L
115.984 308.968 L
116.475 311.521 L
116.965 311.522 L
117.456 314.324 L
117.946 314.439 L
118.437 315.503 L
118.927 315.58 L
119.418 320.211 L
119.908 320.517 L
120.399 322.202 L
120.889 323.06 L
121.379 323.12 L
121.87 323.153 L
122.36 323.767 L
122.851 324.235 L
123.341 324.585 L
123.832 324.759 L
124.322 324.801 L
124.813 324.84 L
125.303 324.872 L
125.794 324.895 L
126.284 324.948 L
126.775 324.965 L
127.265 325.592 L
127.756 326.295 L
128.246 326.296 L
128.737 326.511 L
129.227 326.643 L
129.718 327.106 L
130.208 327.254 L
130.699 327.393 L
131.189 327.926 L
131.68 328.318 L
132.17 328.516 L
132.661 328.905 L
133.151 329.065 L
133.642 330.792 L
134.132 330.934 L
134.623 330.978 L
135.113 330.987 L
135.604 331.681 L
136.094 332.063 L
136.584 332.206 L
137.075 332.21 L
137.565 332.459 L
138.056 333.456 L
138.546 333.457 L
139.037 333.487 L
139.527 333.549 L
140.018 333.586 L
140.508 333.679 L
140.999 333.708 L
141.489 333.856 L
141.98 334.192 L
142.47 334.201 L
142.961 334.266 L
143.451 334.402 L
143.942 335.395 L
144.432 335.725 L
144.923 335.772 L
145.413 335.783 L
145.904 335.837 L
146.394 336.083 L
146.885 337.048 L
147.375 338.075 L
147.866 338.26 L
148.356 338.369 L
148.847 338.391 L
149.337 338.443 L
149.828 338.468 L
150.318 338.692 L
150.809 338.945 L
151.299 338.967 L
151.789 339.589 L
152.28 339.934 L
152.77 340.041 L
153.261 340.237 L
153.751 340.239 L
154.242 340.273 L
154.732 341.039 L
155.223 341.039 L
155.713 341.076 L
156.204 341.266 L
156.694 341.433 L
157.185 341.534 L
157.675 341.664 L
158.166 342.059 L
158.656 342.068 L
159.147 342.108 L
159.637 342.201 L
160.128 342.226 L
160.618 342.305 L
161.109 342.307 L
161.599 342.45 L
162.09 342.625 L
162.58 342.788 L
163.071 342.819 L
163.561 342.829 L
164.052 342.907 L
164.542 342.92 L
165.033 343.076 L
165.523 343.234 L
166.014 343.301 L
166.504 343.38 L
166.994 343.418 L
167.485 343.473 L
167.975 343.485 L
168.466 343.509 L
168.956 343.557 L
169.447 343.623 L
169.937 343.625 L
170.428 343.644 L
170.918 343.803 L
171.409 343.833 L
171.899 343.912 L
172.39 343.936 L
172.88 343.937 L
173.371 343.997 L
173.861 344.147 L
174.352 344.147 L
174.842 344.148 L
175.333 344.173 L
175.823 344.208 L
176.314 344.31 L
176.804 344.428 L
177.295 344.43 L
177.785 344.495 L
178.276 344.515 L
178.766 344.567 L
179.257 344.569 L
179.747 344.633 L
180.238 344.763 L
180.728 345.258 L
181.219 345.549 L
181.709 345.647 L
182.199 345.647 L
182.69 345.656 L
183.18 345.774 L
183.671 345.893 L
184.161 346.041 L
184.652 346.085 L
185.142 346.55 L
185.633 346.551 L
186.123 346.636 L
186.614 346.737 L
187.104 346.743 L
187.595 346.752 L
188.085 346.793 L
188.576 346.988 L
189.066 347.727 L
189.557 347.73 L
190.047 347.846 L
190.538 348.017 L
191.028 348.135 L
191.519 348.136 L
192.009 348.245 L
192.5 348.368 L
192.99 348.391 L
193.481 348.649 L
193.971 348.65 L
194.462 348.717 L
194.952 348.732 L
195.443 348.774 L
195.933 348.778 L
196.424 349.003 L
196.914 349.003 L
197.404 349.039 L
197.895 349.123 L
198.385 349.148 L
198.876 349.478 L
199.366 349.478 L
199.857 349.483 L
200.347 349.485 L
200.838 349.498 L
201.328 349.505 L
201.819 349.533 L
202.309 349.551 L
202.8 349.567 L
203.29 349.567 L
203.781 349.578 L
204.271 349.607 L
204.762 349.615 L
205.252 349.637 L
205.743 349.719 L
206.233 349.723 L
206.724 349.729 L
207.214 349.734 L
207.705 349.762 L
208.195 349.769 L
208.686 349.773 L
209.176 349.803 L
209.667 349.818 L
210.157 349.924 L
210.648 349.925 L
211.138 349.976 L
211.629 349.982 L
212.119 349.984 L
212.609 350.031 L
213.1 350.039 L
213.59 350.104 L
214.081 350.105 L
214.571 350.232 L
215.062 350.247 L
215.552 350.251 L
216.043 350.339 L
216.533 350.386 L
217.024 350.428 L
217.514 350.44 L
218.005 350.441 L
218.495 350.441 L
218.986 350.444 L
219.476 350.457 L
219.967 350.471 L
220.457 350.478 L
220.948 350.478 L
221.438 350.507 L
221.929 350.527 L
222.419 350.587 L
222.91 350.587 L
223.4 350.631 L
223.891 350.765 L
224.381 350.778 L
224.872 350.779 L
225.362 350.826 L
225.853 350.867 L
226.343 350.869 L
226.834 350.87 L
227.324 350.906 L
227.814 350.927 L
228.305 350.95 L
228.795 350.964 L
229.286 350.969 L
229.776 350.99 L
230.267 350.994 L
230.757 351.003 L
231.248 351.005 L
231.738 351.008 L
232.229 351.009 L
232.719 351.046 L
233.21 351.046 L
233.7 351.063 L
234.191 351.064 L
234.681 351.073 L
235.172 351.087 L
235.662 351.092 L
236.153 351.147 L
236.643 351.154 L
237.134 351.155 L
237.624 351.16 L
238.115 351.187 L
238.605 351.194 L
239.096 351.195 L
239.586 351.21 L
240.077 351.221 L
240.567 351.222 L
241.058 351.257 L
241.548 351.257 L
242.039 351.302 L
242.529 351.307 L
243.02 351.331 L
243.51 351.334 L
244 351.338 L
244.491 351.383 L
244.981 351.384 L
245.472 351.426 L
245.962 351.433 L
246.453 351.434 L
246.943 351.449 L
247.434 351.451 L
247.924 351.471 L
248.415 351.472 L
248.905 351.472 L
249.396 351.474 L
249.886 351.484 L
250.377 351.486 L
250.867 351.49 L
251.358 351.492 L
251.848 351.495 L
252.339 351.495 L
252.829 351.505 L
253.32 351.506 L
253.81 351.555 L
254.301 351.563 L
254.791 351.581 L
255.282 351.634 L
255.772 351.67 L
256.263 351.704 L
256.753 351.721 L
257.244 351.748 L
257.734 351.748 L
258.224 351.754 L
258.715 351.794 L
259.205 351.815 L
259.696 351.823 L
260.186 351.829 L
260.677 351.857 L
261.167 351.873 L
261.658 351.885 L
262.148 351.89 L
262.639 351.893 L
263.129 351.9 L
263.62 351.9 L
264.11 351.905 L
264.601 351.907 L
265.091 351.908 L
265.582 351.913 L
266.072 351.941 L
266.563 351.944 L
267.053 351.975 L
267.544 352.025 L
268.034 352.026 L
268.525 352.047 L
269.015 352.132 L
269.506 352.139 L
269.996 352.14 L
270.487 352.14 L
270.977 352.15 L
271.468 352.154 L
271.958 352.158 L
272.449 352.16 L
272.939 352.222 L
273.43 352.279 L
273.92 352.301 L
274.41 352.309 L
274.901 352.314 L
275.391 352.316 L
275.882 352.351 L
276.372 352.356 L
276.863 352.387 L
277.353 352.391 L
277.844 352.398 L
278.334 352.404 L
278.825 352.404 L
279.315 352.437 L
279.806 352.462 L
280.296 352.465 L
280.787 352.492 L
281.277 352.499 L
281.768 352.506 L
282.258 352.506 L
282.749 352.526 L
283.239 352.572 L
283.73 352.572 L
284.22 352.583 L
284.711 352.586 L
285.201 352.586 L
285.692 352.595 L
286.182 352.599 L
286.673 352.635 L
287.163 352.646 L
287.654 352.665 L
288.144 352.667 L
288.634 352.672 L
289.125 352.672 L
289.615 352.672 L
290.106 352.673 L
290.596 352.678 L
291.087 352.704 L
291.577 352.832 L
292.068 352.833 L
292.558 352.835 L
293.049 352.863 L
293.539 352.864 L
294.03 352.869 L
294.52 352.873 L
295.011 352.883 L
295.501 352.883 L
295.992 352.887 L
296.482 352.889 L
296.973 352.927 L
297.463 352.937 L
297.954 352.939 L
298.444 352.939 L
298.935 352.943 L
299.425 352.948 L
299.916 352.95 L
300.406 352.957 L
300.897 352.986 L
301.387 352.992 L
301.878 352.992 L
302.368 352.992 L
302.859 353.041 L
303.349 353.105 L
303.84 353.111 L
304.33 353.112 L
304.82 353.118 L
305.311 353.119 L
305.801 353.164 L
306.292 353.164 L
306.782 353.169 L
307.273 353.184 L
307.763 353.189 L
308.254 353.229 L
308.744 353.234 L
309.235 353.246 L
309.725 353.258 L
310.216 353.264 L
310.706 353.265 L
311.197 353.28 L
311.687 353.293 L
312.178 353.297 L
312.668 353.297 L
313.159 353.304 L
313.649 353.306 L
314.14 353.311 L
314.63 353.312 L
315.121 353.332 L
315.611 353.355 L
316.102 353.376 L
316.592 353.377 L
317.083 353.378 L
317.573 353.379 L
318.064 353.38 L
318.554 353.384 L
319.044 353.447 L
319.535 353.452 L
320.025 353.455 L
320.516 353.458 L
321.006 353.476 L
321.497 353.485 L
321.987 353.486 L
322.478 353.518 L
322.968 353.584 L
323.459 353.586 L
323.949 353.592 L
324.44 353.592 L
324.93 353.609 L
325.421 353.61 L
325.911 353.611 L
326.402 353.615 L
326.892 353.615 L
327.383 353.627 L
327.873 353.646 L
328.364 353.651 L
328.854 353.657 L
329.345 353.658 L
329.835 353.659 L
330.326 353.686 L
330.816 353.726 L
331.307 353.76 L
331.797 353.76 L
332.288 353.792 L
332.778 353.811 L
333.269 353.818 L
333.759 353.839 L
334.25 353.839 L
334.74 353.843 L
335.23 353.843 L
335.721 353.847 L
336.211 353.848 L
336.702 353.852 L
337.192 353.87 L
337.683 353.87 L
338.173 353.871 L
338.664 353.872 L
339.154 353.875 L
339.645 353.876 L
340.135 353.882 L
340.626 353.883 L
341.116 353.884 L
341.607 353.884 L
342.097 353.885 L
342.588 353.888 L
343.078 353.897 L
343.569 353.909 L
344.059 353.911 L
344.55 353.922 L
345.04 353.957 L
345.531 353.959 L
346.021 353.977 L
346.512 353.989 L
347.002 353.995 L
347.493 353.995 L
347.983 354.008 L
348.474 354.014 L
348.964 354.017 L
349.454 354.029 L
349.945 354.03 L
350.435 354.04 L
350.926 354.061 L
351.416 354.061 L
351.907 354.061 L
352.397 354.062 L
352.888 354.063 L
353.378 354.071 L
353.869 354.077 L
354.359 354.077 L
354.85 354.079 L
355.34 354.081 L
355.831 354.083 L
356.321 354.096 L
356.812 354.117 L
357.302 354.132 L
357.793 354.132 L
358.283 354.144 L
358.774 354.145 L
359.264 354.146 L
359.755 354.146 L
360.245 354.159 L
360.736 354.159 L
361.226 354.159 L
361.717 354.16 L
362.207 354.162 L
362.698 354.162 L
363.188 354.178 L
363.679 354.178 L
364.169 354.235 L
364.66 354.249 L
365.15 354.286 L
365.64 354.287 L
366.131 354.289 L
366.621 354.3 L
367.112 354.305 L
367.602 354.308 L
368.093 354.326 L
368.583 354.363 L
369.074 354.363 L
369.564 354.363 L
370.055 354.364 L
370.545 354.366 L
371.036 354.366 L
371.526 354.367 L
372.017 354.374 L
372.507 354.376 L
372.998 354.378 L
373.488 354.379 L
373.979 354.381 L
374.469 354.398 L
374.96 354.412 L
375.45 354.42 L
375.941 354.421 L
376.431 354.424 L
376.922 354.429 L
377.412 354.439 L
377.903 354.439 L
378.393 354.44 L
378.884 354.44 L
379.374 354.442 L
379.865 354.452 L
380.355 354.452 L
380.845 354.455 L
381.336 354.456 L
381.826 354.457 L
382.317 354.465 L
382.807 354.474 L
383.298 354.479 L
383.788 354.479 L
384.279 354.48 L
384.769 354.486 L
385.26 354.486 L
385.75 354.488 L
386.241 354.489 L
386.731 354.494 L
387.222 354.499 L
387.712 354.501 L
388.203 354.54 L
388.693 354.56 L
389.184 354.574 L
389.674 354.575 L
390.165 354.575 L
390.655 354.58 L
391.146 354.585 L
391.636 354.588 L
392.127 354.588 L
392.617 354.589 L
393.108 354.6 L
393.598 354.602 L
394.089 354.611 L
394.579 354.612 L
395.07 354.612 L
395.56 354.649 L
396.05 354.649 L
396.541 354.65 L
397.031 354.661 L
397.522 354.663 L
398.012 354.663 L
398.503 354.666 L
398.993 354.672 L
399.484 354.672 L
399.974 354.672 L
400.465 354.68 L
400.955 354.68 L
401.446 354.68 L
401.936 354.687 L
402.427 354.694 L
402.917 354.695 L
403.408 354.707 L
403.898 354.713 L
404.389 354.714 L
404.879 354.723 L
405.37 354.73 L
405.86 354.757 L
406.351 354.776 L
406.841 354.779 L
407.332 354.785 L
407.822 354.788 L
408.313 354.789 L
408.803 354.801 L
409.294 354.812 L
409.784 354.812 L
410.275 354.812 L
410.765 354.812 L
411.255 354.814 L
411.746 354.816 L
412.236 354.822 L
412.727 354.824 L
413.217 354.825 L
413.708 354.829 L
414.198 354.83 L
414.689 354.831 L
415.179 354.832 L
415.67 354.855 L
416.16 354.858 L
416.651 354.872 L
417.141 354.872 L
417.632 354.872 L
418.122 354.875 L
418.613 354.882 L
419.103 354.882 L
419.594 354.888 L
420.084 354.889 L
420.575 354.89 L
421.065 354.891 L
421.556 354.894 L
422.046 354.899 L
422.537 354.9 L
423.027 354.906 L
423.518 354.907 L
424.008 354.913 L
424.499 354.914 L
424.989 354.934 L
425.48 354.935 L
425.97 354.937 L
426.46 354.937 L
426.951 354.937 L
427.441 354.937 L
427.932 354.938 L
428.422 354.951 L
428.913 354.952 L
429.403 354.957 L
429.894 354.958 L
430.384 354.959 L
430.875 354.961 L
431.365 354.963 L
431.856 354.965 L
432.346 354.965 L
432.837 354.968 L
433.327 354.968 L
433.818 354.971 L
434.308 354.971 L
434.799 354.972 L
435.289 354.974 L
435.78 354.975 L
436.27 354.976 L
436.761 354.977 L
437.251 355.005 L
437.742 355.005 L
438.232 355.019 L
438.723 355.019 L
439.213 355.035 L
439.704 355.035 L
440.194 355.037 L
440.685 355.041 L
441.175 355.042 L
441.665 355.042 L
442.156 355.047 L
442.646 355.067 L
443.137 355.067 L
443.627 355.068 L
444.118 355.072 L
444.608 355.072 L
445.099 355.083 L
445.589 355.084 L
446.08 355.087 L
446.57 355.092 L
447.061 355.094 L
447.551 355.098 L
448.042 355.1 L
448.532 355.111 L
449.023 355.113 L
449.513 355.119 L
450.004 355.13 L
450.494 355.13 L
450.985 355.131 L
451.475 355.133 L
451.966 355.133 L
452.456 355.142 L
452.947 355.143 L
453.437 355.145 L
453.928 355.145 L
454.418 355.149 L
454.909 355.16 L
455.399 355.165 L
455.89 355.166 L
456.38 355.181 L
456.87 355.194 L
457.361 355.207 L
457.851 355.209 L
458.342 355.21 L
458.832 355.222 L
459.323 355.225 L
459.813 355.225 L
460.304 355.231 L
460.794 355.242 L
461.285 355.244 L
461.775 355.245 L
462.266 355.246 L
462.756 355.249 L
463.247 355.258 L
463.737 355.258 L
464.228 355.26 L
464.718 355.265 L
465.209 355.265 L
465.699 355.266 L
466.19 355.267 L
466.68 355.267 L
467.171 355.273 L
467.661 355.286 L
468.152 355.287 L
468.642 355.287 L
469.133 355.287 L
469.623 355.287 L
470.114 355.293 L
470.604 355.293 L
471.095 355.296 L
471.585 355.299 L
472.076 355.299 L
472.566 355.299 L
473.056 355.312 L
473.547 355.312 L
474.037 355.312 L
474.528 355.312 L
475.018 355.314 L
475.509 355.315 L
475.999 355.315 L
476.49 355.316 L
476.98 355.321 L
477.471 355.326 L
477.961 355.336 L
478.452 355.337 L
478.942 355.338 L
479.433 355.343 L
479.923 355.345 L
480.414 355.345 L
480.904 355.345 L
481.395 355.356 L
481.885 355.357 L
482.376 355.357 L
482.866 355.358 L
483.357 355.358 L
483.847 355.359 L
484.338 355.361 L
484.828 355.367 L
485.319 355.367 L
485.809 355.372 L
486.3 355.375 L
486.79 355.378 L
487.28 355.379 L
487.771 355.386 L
488.261 355.387 L
488.752 355.398 L
489.242 355.399 L
489.733 355.4 L
490.223 355.416 L
490.714 355.418 L
491.204 355.423 L
491.695 355.424 L
492.185 355.424 L
492.676 355.425 L
493.166 355.425 L
493.657 355.425 L
494.147 355.426 L
494.638 355.43 L
495.128 355.432 L
495.619 355.434 L
496.109 355.438 L
496.6 355.454 L
497.09 355.455 L
497.581 355.455 L
498.071 355.456 L
498.562 355.457 L
499.052 355.457 L
499.543 355.459 L
500.033 355.459 L
500.524 355.465 L
501.014 355.465 L
501.505 355.465 L
501.995 355.466 L
502.486 355.467 L
502.976 355.478 L
503.466 355.48 L
503.957 355.482 L
504.447 355.485 L
504.938 355.488 L
505.428 355.494 L
505.919 355.495 L
506.409 355.496 L
506.9 355.496 L
507.043 355.496 L
S
GR
GS
[0.75 0 0 0.75 0 0] CT
0 0 1 RC
1 LJ
0.667 LW
N
97.22 30.966 M
97.346 236.375 L
97.836 245.185 L
98.327 270.423 L
98.817 272.721 L
99.308 276.203 L
99.798 276.439 L
100.289 284.707 L
100.779 285.541 L
101.27 287.429 L
101.76 296.59 L
102.251 299.237 L
102.741 301.939 L
103.232 302.65 L
103.722 303.953 L
104.213 303.988 L
104.703 309.187 L
105.194 310.988 L
105.684 311.234 L
106.174 311.261 L
106.665 311.278 L
107.155 313.085 L
107.646 313.448 L
108.136 313.601 L
108.627 313.833 L
109.117 314.159 L
109.608 314.327 L
110.098 318.398 L
110.589 318.591 L
111.079 319.969 L
111.57 321.01 L
112.06 321.664 L
112.551 321.983 L
113.041 322.645 L
113.532 323.342 L
114.022 323.775 L
114.513 324.476 L
115.003 324.731 L
115.494 325.541 L
115.984 325.643 L
116.475 326.758 L
116.965 327.105 L
117.456 327.247 L
117.946 327.295 L
118.437 327.315 L
118.927 327.618 L
119.418 327.629 L
119.908 327.738 L
120.399 327.754 L
120.889 327.754 L
121.379 328.283 L
121.87 328.4 L
122.36 328.55 L
122.851 328.61 L
123.341 328.647 L
123.832 328.685 L
124.322 329.546 L
124.813 329.547 L
125.303 329.642 L
125.794 330.026 L
126.284 330.058 L
126.775 330.4 L
127.265 330.519 L
127.756 330.629 L
128.246 330.64 L
128.737 330.821 L
129.227 331.2 L
129.718 331.239 L
130.208 332.078 L
130.699 332.104 L
131.189 332.821 L
131.68 333.131 L
132.17 333.271 L
132.661 333.433 L
133.151 333.584 L
133.642 333.738 L
134.132 333.788 L
134.623 334.121 L
135.113 334.132 L
135.604 334.229 L
136.094 334.306 L
136.584 334.402 L
137.075 334.478 L
137.565 335.23 L
138.056 335.556 L
138.546 335.804 L
139.037 335.905 L
139.527 335.907 L
140.018 336.506 L
140.508 336.809 L
140.999 337.219 L
141.489 338.081 L
141.98 338.089 L
142.47 338.143 L
142.961 338.185 L
143.451 338.198 L
143.942 338.21 L
144.432 338.286 L
144.923 338.331 L
145.413 338.62 L
145.904 338.7 L
146.394 338.863 L
146.885 338.871 L
147.375 338.874 L
147.866 339.091 L
148.356 339.445 L
148.847 339.538 L
149.337 339.552 L
149.828 339.79 L
150.318 340.377 L
150.809 340.398 L
151.299 340.541 L
151.789 341.469 L
152.28 341.523 L
152.77 341.558 L
153.261 341.622 L
153.751 341.922 L
154.242 341.929 L
154.732 341.932 L
155.223 341.977 L
155.713 341.982 L
156.204 342.187 L
156.694 342.437 L
157.185 342.506 L
157.675 342.517 L
158.166 342.534 L
158.656 342.668 L
159.147 342.718 L
159.637 342.718 L
160.128 342.723 L
160.618 342.878 L
161.109 342.886 L
161.599 343.145 L
162.09 343.211 L
162.58 343.696 L
163.071 343.698 L
163.561 343.704 L
164.052 343.826 L
164.542 343.899 L
165.033 343.979 L
165.523 343.987 L
166.014 343.997 L
166.504 344.001 L
166.994 344.003 L
167.485 344.421 L
167.975 344.443 L
168.466 344.45 L
168.956 344.454 L
169.447 344.461 L
169.937 344.47 L
170.428 344.48 L
170.918 344.527 L
171.409 344.562 L
171.899 344.568 L
172.39 344.568 L
172.88 344.625 L
173.371 344.667 L
173.861 344.701 L
174.352 344.757 L
174.842 344.76 L
175.333 344.77 L
175.823 344.815 L
176.314 344.821 L
176.804 344.822 L
177.295 344.873 L
177.785 344.93 L
178.276 345.008 L
178.766 345.07 L
179.257 345.086 L
179.747 345.119 L
180.238 345.152 L
180.728 345.152 L
181.219 345.155 L
181.709 345.155 L
182.199 345.157 L
182.69 345.192 L
183.18 345.356 L
183.671 345.36 L
184.161 345.36 L
184.652 345.377 L
185.142 345.58 L
185.633 345.58 L
186.123 345.605 L
186.614 345.635 L
187.104 345.635 L
187.595 345.648 L
188.085 345.709 L
188.576 345.71 L
189.066 345.72 L
189.557 345.729 L
190.047 345.852 L
190.538 345.877 L
191.028 345.897 L
191.519 346.021 L
192.009 346.025 L
192.5 346.271 L
192.99 346.576 L
193.481 346.579 L
193.971 346.662 L
194.462 346.664 L
194.952 346.727 L
195.443 346.746 L
195.933 346.746 L
196.424 346.838 L
196.914 346.905 L
197.404 347.029 L
197.895 347.225 L
198.385 347.479 L
198.876 347.495 L
199.366 347.575 L
199.857 347.575 L
200.347 347.63 L
200.838 347.662 L
201.328 347.663 L
201.819 347.685 L
202.309 347.749 L
202.8 347.767 L
203.29 347.788 L
203.781 347.788 L
204.271 347.803 L
204.762 347.816 L
205.252 347.825 L
205.743 347.848 L
206.233 347.934 L
206.724 348.083 L
207.214 348.114 L
207.705 348.212 L
208.195 348.269 L
208.686 348.27 L
209.176 348.273 L
209.667 348.294 L
210.157 348.303 L
210.648 348.314 L
211.138 348.314 L
211.629 348.356 L
212.119 348.391 L
212.609 348.391 L
213.1 348.414 L
213.59 348.435 L
214.081 348.48 L
214.571 348.488 L
215.062 348.582 L
215.552 348.607 L
216.043 348.611 L
216.533 348.625 L
217.024 348.627 L
217.514 348.67 L
218.005 348.671 L
218.495 348.682 L
218.986 348.682 L
219.476 348.683 L
219.967 348.722 L
220.457 348.727 L
220.948 348.785 L
221.438 348.788 L
221.929 348.801 L
222.419 348.908 L
222.91 348.909 L
223.4 348.909 L
223.891 348.917 L
224.381 348.974 L
224.872 349.006 L
225.362 349.006 L
225.853 349.012 L
226.343 349.017 L
226.834 349.023 L
227.324 349.031 L
227.814 349.038 L
228.305 349.056 L
228.795 349.093 L
229.286 349.104 L
229.776 349.112 L
230.267 349.128 L
230.757 349.189 L
231.248 349.189 L
231.738 349.193 L
232.229 349.224 L
232.719 349.277 L
233.21 349.363 L
233.7 349.407 L
234.191 349.457 L
234.681 349.461 L
235.172 349.465 L
235.662 349.473 L
236.153 349.473 L
236.643 349.57 L
237.134 349.582 L
237.624 349.582 L
238.115 349.583 L
238.605 349.616 L
239.096 349.644 L
239.586 349.705 L
240.077 349.709 L
240.567 349.727 L
241.058 349.729 L
241.548 349.739 L
242.039 349.74 L
242.529 349.742 L
243.02 349.742 L
243.51 349.79 L
244 349.852 L
244.491 349.984 L
244.981 349.984 L
245.472 350.02 L
245.962 350.023 L
246.453 350.023 L
246.943 350.023 L
247.434 350.03 L
247.924 350.031 L
248.415 350.031 L
248.905 350.031 L
249.396 350.032 L
249.886 350.068 L
250.377 350.075 L
250.867 350.082 L
251.358 350.164 L
251.848 350.18 L
252.339 350.181 L
252.829 350.2 L
253.32 350.203 L
253.81 350.235 L
254.301 350.272 L
254.791 350.294 L
255.282 350.298 L
255.772 350.382 L
256.263 350.479 L
256.753 350.674 L
257.244 350.674 L
257.734 350.714 L
258.224 350.714 L
258.715 350.726 L
259.205 350.726 L
259.696 350.746 L
260.186 350.816 L
260.677 350.883 L
261.167 350.887 L
261.658 350.898 L
262.148 350.927 L
262.639 350.966 L
263.129 350.986 L
263.62 350.99 L
264.11 350.99 L
264.601 351.002 L
265.091 351.002 L
265.582 351.004 L
266.072 351.007 L
266.563 351.008 L
267.053 351.009 L
267.544 351.015 L
268.034 351.034 L
268.525 351.051 L
269.015 351.075 L
269.506 351.075 L
269.996 351.075 L
270.487 351.083 L
270.977 351.095 L
271.468 351.101 L
271.958 351.105 L
272.449 351.141 L
272.939 351.19 L
273.43 351.211 L
273.92 351.243 L
274.41 351.243 L
274.901 351.31 L
275.391 351.328 L
275.882 351.33 L
276.372 351.334 L
276.863 351.346 L
277.353 351.347 L
277.844 351.37 L
278.334 351.383 L
278.825 351.386 L
279.315 351.401 L
279.806 351.406 L
280.296 351.406 L
280.787 351.41 L
281.277 351.41 L
281.768 351.41 L
282.258 351.412 L
282.749 351.461 L
283.239 351.471 L
283.73 351.473 L
284.22 351.498 L
284.711 351.506 L
285.201 351.51 L
285.692 351.528 L
286.182 351.574 L
286.673 351.596 L
287.163 351.604 L
287.654 351.605 L
288.144 351.631 L
288.634 351.649 L
289.125 351.649 L
289.615 351.651 L
290.106 351.652 L
290.596 351.652 L
291.087 351.677 L
291.577 351.681 L
292.068 351.689 L
292.558 351.766 L
293.049 351.766 L
293.539 351.852 L
294.03 351.854 L
294.52 351.871 L
295.011 351.875 L
295.501 351.937 L
295.992 351.968 L
296.482 351.969 L
296.973 351.982 L
297.463 351.984 L
297.954 352.035 L
298.444 352.068 L
298.935 352.068 L
299.425 352.077 L
299.916 352.11 L
300.406 352.136 L
300.897 352.155 L
301.387 352.191 L
301.878 352.201 L
302.368 352.204 L
302.859 352.212 L
303.349 352.217 L
303.84 352.225 L
304.33 352.233 L
304.82 352.248 L
305.311 352.261 L
305.801 352.262 L
306.292 352.272 L
306.782 352.275 L
307.273 352.324 L
307.763 352.367 L
308.254 352.422 L
308.744 352.472 L
309.235 352.474 L
309.725 352.475 L
310.216 352.477 L
310.706 352.482 L
311.197 352.483 L
311.687 352.485 L
312.178 352.487 L
312.668 352.492 L
313.159 352.503 L
313.649 352.514 L
314.14 352.522 L
314.63 352.522 L
315.121 352.57 L
315.611 352.573 L
316.102 352.583 L
316.592 352.585 L
317.083 352.585 L
317.573 352.59 L
318.064 352.634 L
318.554 352.642 L
319.044 352.658 L
319.535 352.658 L
320.025 352.667 L
320.516 352.668 L
321.006 352.669 L
321.497 352.68 L
321.987 352.716 L
322.478 352.724 L
322.968 352.725 L
323.459 352.725 L
323.949 352.726 L
324.44 352.728 L
324.93 352.73 L
325.421 352.736 L
325.911 352.736 L
326.402 352.741 L
326.892 352.741 L
327.383 352.742 L
327.873 352.742 L
328.364 352.757 L
328.854 352.765 L
329.345 352.787 L
329.835 352.788 L
330.326 352.791 L
330.816 352.819 L
331.307 352.845 L
331.797 352.854 L
332.288 352.876 L
332.778 352.907 L
333.269 352.908 L
333.759 352.916 L
334.25 352.916 L
334.74 352.922 L
335.23 352.934 L
335.721 352.934 L
336.211 352.934 L
336.702 352.949 L
337.192 352.952 L
337.683 353.01 L
338.173 353.015 L
338.664 353.017 L
339.154 353.017 L
339.645 353.024 L
340.135 353.028 L
340.626 353.045 L
341.116 353.051 L
341.607 353.055 L
342.097 353.061 L
342.588 353.085 L
343.078 353.09 L
343.569 353.149 L
344.059 353.153 L
344.55 353.154 L
345.04 353.2 L
345.531 353.269 L
346.021 353.269 L
346.512 353.27 L
347.002 353.273 L
347.493 353.277 L
347.983 353.281 L
348.474 353.282 L
348.964 353.287 L
349.454 353.316 L
349.945 353.317 L
350.435 353.323 L
350.926 353.323 L
351.416 353.34 L
351.907 353.343 L
352.397 353.395 L
352.888 353.449 L
353.378 353.449 L
353.869 353.456 L
354.359 353.457 L
354.85 353.49 L
355.34 353.512 L
355.831 353.513 L
356.321 353.513 L
356.812 353.514 L
357.302 353.514 L
357.793 353.515 L
358.283 353.515 L
358.774 353.551 L
359.264 353.551 L
359.755 353.551 L
360.245 353.553 L
360.736 353.594 L
361.226 353.594 L
361.717 353.594 L
362.207 353.609 L
362.698 353.61 L
363.188 353.613 L
363.679 353.628 L
364.169 353.637 L
364.66 353.678 L
365.15 353.68 L
365.64 353.685 L
366.131 353.694 L
366.621 353.697 L
367.112 353.704 L
367.602 353.738 L
368.093 353.772 L
368.583 353.775 L
369.074 353.775 L
369.564 353.782 L
370.055 353.791 L
370.545 353.791 L
371.036 353.796 L
371.526 353.804 L
372.017 353.804 L
372.507 353.811 L
372.998 353.819 L
373.488 353.833 L
373.979 353.84 L
374.469 353.841 L
374.96 353.856 L
375.45 353.857 L
375.941 353.858 L
376.431 353.858 L
376.922 353.858 L
377.412 353.871 L
377.903 353.877 L
378.393 353.892 L
378.884 353.934 L
379.374 353.99 L
379.865 353.993 L
380.355 353.996 L
380.845 354.002 L
381.336 354.012 L
381.826 354.015 L
382.317 354.019 L
382.807 354.02 L
383.298 354.029 L
383.788 354.03 L
384.279 354.036 L
384.769 354.036 L
385.26 354.038 L
385.75 354.051 L
386.241 354.051 L
386.731 354.053 L
387.222 354.054 L
387.712 354.078 L
388.203 354.119 L
388.693 354.12 L
389.184 354.12 L
389.674 354.12 L
390.165 354.121 L
390.655 354.128 L
391.146 354.128 L
391.636 354.14 L
392.127 354.142 L
392.617 354.147 L
393.108 354.152 L
393.598 354.176 L
394.089 354.195 L
394.579 354.22 L
395.07 354.22 L
395.56 354.223 L
396.05 354.225 L
396.541 354.234 L
397.031 354.245 L
397.522 354.257 L
398.012 354.257 L
398.503 354.274 L
398.993 354.274 L
399.484 354.274 L
399.974 354.274 L
400.465 354.277 L
400.955 354.288 L
401.446 354.29 L
401.936 354.29 L
402.427 354.307 L
402.917 354.31 L
403.408 354.312 L
403.898 354.314 L
404.389 354.317 L
404.879 354.325 L
405.37 354.346 L
405.86 354.349 L
406.351 354.353 L
406.841 354.354 L
407.332 354.358 L
407.822 354.367 L
408.313 354.367 L
408.803 354.367 L
409.294 354.368 L
409.784 354.374 L
410.275 354.382 L
410.765 354.398 L
411.255 354.409 L
411.746 354.409 L
412.236 354.41 L
412.727 354.411 L
413.217 354.412 L
413.708 354.418 L
414.198 354.429 L
414.689 354.429 L
415.179 354.443 L
415.67 354.46 L
416.16 354.46 L
416.651 354.461 L
417.141 354.469 L
417.632 354.472 L
418.122 354.473 L
418.613 354.477 L
419.103 354.477 L
419.594 354.477 L
420.084 354.48 L
420.575 354.481 L
421.065 354.483 L
421.556 354.484 L
422.046 354.485 L
422.537 354.486 L
423.027 354.49 L
423.518 354.498 L
424.008 354.518 L
424.499 354.54 L
424.989 354.542 L
425.48 354.555 L
425.97 354.562 L
426.46 354.566 L
426.951 354.568 L
427.441 354.57 L
427.932 354.57 L
428.422 354.573 L
428.913 354.578 L
429.403 354.582 L
429.894 354.584 L
430.384 354.584 L
430.875 354.6 L
431.365 354.6 L
431.856 354.61 L
432.346 354.612 L
432.837 354.614 L
433.327 354.618 L
433.818 354.619 L
434.308 354.623 L
434.799 354.627 L
435.289 354.638 L
435.78 354.645 L
436.27 354.645 L
436.761 354.645 L
437.251 354.647 L
437.742 354.688 L
438.232 354.722 L
438.723 354.734 L
439.213 354.742 L
439.704 354.743 L
440.194 354.746 L
440.685 354.746 L
441.175 354.746 L
441.665 354.747 L
442.156 354.748 L
442.646 354.749 L
443.137 354.755 L
443.627 354.756 L
444.118 354.756 L
444.608 354.757 L
445.099 354.757 L
445.589 354.767 L
446.08 354.791 L
446.57 354.802 L
447.061 354.803 L
447.551 354.803 L
448.042 354.804 L
448.532 354.805 L
449.023 354.812 L
449.513 354.812 L
450.004 354.813 L
450.494 354.814 L
450.985 354.817 L
451.475 354.817 L
451.966 354.818 L
452.456 354.818 L
452.947 354.832 L
453.437 354.833 L
453.928 354.834 L
454.418 354.834 L
454.909 354.844 L
455.399 354.858 L
455.89 354.861 L
456.38 354.861 L
456.87 354.861 L
457.361 354.861 L
457.851 354.867 L
458.342 354.867 L
458.832 354.867 L
459.323 354.867 L
459.813 354.868 L
460.304 354.876 L
460.794 354.885 L
461.285 354.885 L
461.775 354.888 L
462.266 354.888 L
462.756 354.889 L
463.247 354.891 L
463.737 354.892 L
464.228 354.896 L
464.718 354.9 L
465.209 354.901 L
465.699 354.902 L
466.19 354.904 L
466.68 354.905 L
467.171 354.906 L
467.661 354.907 L
468.152 354.908 L
468.642 354.916 L
469.133 354.931 L
469.623 354.933 L
470.114 354.933 L
470.604 354.936 L
471.095 354.96 L
471.585 354.965 L
472.076 354.966 L
472.566 354.969 L
473.056 354.969 L
473.547 354.971 L
474.037 354.973 L
474.528 354.975 L
475.018 354.98 L
475.509 354.98 L
475.999 354.98 L
476.49 354.982 L
476.98 354.982 L
477.471 354.983 L
477.961 354.984 L
478.452 354.987 L
478.942 354.995 L
479.433 355.018 L
479.923 355.021 L
480.414 355.021 L
480.904 355.021 L
481.395 355.022 L
481.885 355.022 L
482.376 355.042 L
482.866 355.047 L
483.357 355.047 L
483.847 355.05 L
484.338 355.056 L
484.828 355.056 L
485.319 355.058 L
485.809 355.058 L
486.3 355.058 L
486.79 355.063 L
487.28 355.068 L
487.771 355.073 L
488.261 355.083 L
488.752 355.088 L
489.242 355.088 L
489.733 355.092 L
490.223 355.093 L
490.714 355.111 L
491.204 355.115 L
491.695 355.115 L
492.185 355.115 L
492.676 355.124 L
493.166 355.131 L
493.657 355.131 L
494.147 355.131 L
494.638 355.132 L
495.128 355.137 L
495.619 355.139 L
496.109 355.139 L
496.6 355.141 L
497.09 355.143 L
497.581 355.145 L
498.071 355.145 L
498.562 355.146 L
499.052 355.147 L
499.543 355.15 L
500.033 355.162 L
500.524 355.169 L
501.014 355.178 L
501.505 355.182 L
501.995 355.182 L
502.486 355.185 L
502.976 355.187 L
503.466 355.188 L
503.957 355.196 L
504.447 355.196 L
504.938 355.196 L
505.428 355.197 L
505.919 355.2 L
506.409 355.2 L
506.9 355.201 L
507.043 355.201 L
S
GR
GS
[0.75 0 0 0.75 0 0] CT
1 GC
N
432 97 M
432 44 L
494 44 L
494 97 L
cp
f
GR
GS
[0.75 0 0 0.75 351.75 40.5] CT
/Helvetica 12 F
GS
[1 0 0 1 0 0] CT
0 5 moveto 
1 -1 scale
(p11) t 
GR
GR
GS
[0.75 0 0 0.75 0 0] CT
1 0 0 RC
1 LJ
0.667 LW
N
436 54 M
466 54 L
S
GR
GS
[0.75 0 0 0.75 351.75 52.875] CT
/Helvetica 12 F
GS
[1 0 0 1 0 0] CT
0 5 moveto 
1 -1 scale
(p22) t 
GR
GR
GS
[0.75 0 0 0.75 0 0] CT
0 1 0 RC
1 LJ
0.667 LW
N
436 70.5 M
466 70.5 L
S
GR
GS
[0.75 0 0 0.75 351.75 65.25] CT
/Helvetica 12 F
GS
[1 0 0 1 0 0] CT
0 5 moveto 
1 -1 scale
(p33) t 
GR
GR
GS
[0.75 0 0 0.75 0 0] CT
0 0 1 RC
1 LJ
0.667 LW
N
436 87 M
466 87 L
S
GR
GS
[0.75 0 0 0.75 0 0] CT
0.149 GC
10.0 ML
0.667 LW
N
432 97 M
432 44 L
494 44 L
494 97 L
cp
S
GR
%%Trailer
%%Pages: 1
%%EOF
