%!PS-Adobe-3.0 EPSF-3.0
%%Creator: (MATLAB, The Mathworks, Inc. Version 9.0.0.341360 \(R2016a\). Operating System: Windows 8)
%%Title: C:/Users/Jan/Documents/JC.ISF/isf2/rmpp2.eps
%%CreationDate: 2017-04-11T12:57:12
%%Pages: (atend)
%%BoundingBox: 0 0 420 315
%%LanguageLevel: 3
%%EndComments
%%BeginProlog
%%BeginResource: procset (Apache XML Graphics Std ProcSet) 1.2 0
%%Version: 1.2 0
%%Copyright: (Copyright 2001-2003,2010 The Apache Software Foundation. License terms: http://www.apache.org/licenses/LICENSE-2.0)
/bd{bind def}bind def
/ld{load def}bd
/GR/grestore ld
/M/moveto ld
/LJ/setlinejoin ld
/C/curveto ld
/f/fill ld
/LW/setlinewidth ld
/GC/setgray ld
/t/show ld
/N/newpath ld
/CT/concat ld
/cp/closepath ld
/S/stroke ld
/L/lineto ld
/CC/setcmykcolor ld
/A/ashow ld
/GS/gsave ld
/RC/setrgbcolor ld
/RM/rmoveto ld
/ML/setmiterlimit ld
/re {4 2 roll M
1 index 0 rlineto
0 exch rlineto
neg 0 rlineto
cp } bd
/_ctm matrix def
/_tm matrix def
/BT { _ctm currentmatrix pop matrix _tm copy pop 0 0 moveto } bd
/ET { _ctm setmatrix } bd
/iTm { _ctm setmatrix _tm concat } bd
/Tm { _tm astore pop iTm 0 0 moveto } bd
/ux 0.0 def
/uy 0.0 def
/F {
  /Tp exch def
  /Tf exch def
  Tf findfont Tp scalefont setfont
  /cf Tf def  /cs Tp def
} bd
/ULS {currentpoint /uy exch def /ux exch def} bd
/ULE {
  /Tcx currentpoint pop def
  gsave
  newpath
  cf findfont cs scalefont dup
  /FontMatrix get 0 get /Ts exch def /FontInfo get dup
  /UnderlinePosition get Ts mul /To exch def
  /UnderlineThickness get Ts mul /Tt exch def
  ux uy To add moveto  Tcx uy To add lineto
  Tt setlinewidth stroke
  grestore
} bd
/OLE {
  /Tcx currentpoint pop def
  gsave
  newpath
  cf findfont cs scalefont dup
  /FontMatrix get 0 get /Ts exch def /FontInfo get dup
  /UnderlinePosition get Ts mul /To exch def
  /UnderlineThickness get Ts mul /Tt exch def
  ux uy To add cs add moveto Tcx uy To add cs add lineto
  Tt setlinewidth stroke
  grestore
} bd
/SOE {
  /Tcx currentpoint pop def
  gsave
  newpath
  cf findfont cs scalefont dup
  /FontMatrix get 0 get /Ts exch def /FontInfo get dup
  /UnderlinePosition get Ts mul /To exch def
  /UnderlineThickness get Ts mul /Tt exch def
  ux uy To add cs 10 mul 26 idiv add moveto Tcx uy To add cs 10 mul 26 idiv add lineto
  Tt setlinewidth stroke
  grestore
} bd
/QT {
/Y22 exch store
/X22 exch store
/Y21 exch store
/X21 exch store
currentpoint
/Y21 load 2 mul add 3 div exch
/X21 load 2 mul add 3 div exch
/X21 load 2 mul /X22 load add 3 div
/Y21 load 2 mul /Y22 load add 3 div
/X22 load /Y22 load curveto
} bd
/SSPD {
dup length /d exch dict def
{
/v exch def
/k exch def
currentpagedevice k known {
/cpdv currentpagedevice k get def
v cpdv ne {
/upd false def
/nullv v type /nulltype eq def
/nullcpdv cpdv type /nulltype eq def
nullv nullcpdv or
{
/upd true def
} {
/sametype v type cpdv type eq def
sametype {
v type /arraytype eq {
/vlen v length def
/cpdvlen cpdv length def
vlen cpdvlen eq {
0 1 vlen 1 sub {
/i exch def
/obj v i get def
/cpdobj cpdv i get def
obj cpdobj ne {
/upd true def
exit
} if
} for
} {
/upd true def
} ifelse
} {
v type /dicttype eq {
v {
/dv exch def
/dk exch def
/cpddv cpdv dk get def
dv cpddv ne {
/upd true def
exit
} if
} forall
} {
/upd true def
} ifelse
} ifelse
} if
} ifelse
upd true eq {
d k v put
} if
} if
} if
} forall
d length 0 gt {
d setpagedevice
} if
} bd
%%EndResource
%%BeginResource: procset (Apache XML Graphics EPS ProcSet) 1.0 0
%%Version: 1.0 0
%%Copyright: (Copyright 2002-2003 The Apache Software Foundation. License terms: http://www.apache.org/licenses/LICENSE-2.0)
/BeginEPSF { %def
/b4_Inc_state save def         % Save state for cleanup
/dict_count countdictstack def % Count objects on dict stack
/op_count count 1 sub def      % Count objects on operand stack
userdict begin                 % Push userdict on dict stack
/showpage { } def              % Redefine showpage, { } = null proc
0 setgray 0 setlinecap         % Prepare graphics state
1 setlinewidth 0 setlinejoin
10 setmiterlimit [ ] 0 setdash newpath
/languagelevel where           % If level not equal to 1 then
{pop languagelevel             % set strokeadjust and
1 ne                           % overprint to their defaults.
{false setstrokeadjust false setoverprint
} if
} if
} bd
/EndEPSF { %def
count op_count sub {pop} repeat            % Clean up stacks
countdictstack dict_count sub {end} repeat
b4_Inc_state restore
} bd
%%EndResource
%FOPBeginFontDict
%%IncludeResource: font Courier-Bold
%%IncludeResource: font Helvetica
%%IncludeResource: font Courier-BoldOblique
%%IncludeResource: font Courier-Oblique
%%IncludeResource: font Times-Roman
%%IncludeResource: font Helvetica-BoldOblique
%%IncludeResource: font Helvetica-Bold
%%IncludeResource: font Helvetica-Oblique
%%IncludeResource: font Times-BoldItalic
%%IncludeResource: font Courier
%%IncludeResource: font Times-Italic
%%IncludeResource: font Times-Bold
%%IncludeResource: font Symbol
%%IncludeResource: font ZapfDingbats
%FOPEndFontDict
%%BeginResource: encoding WinAnsiEncoding
/WinAnsiEncoding [
/.notdef /.notdef /.notdef /.notdef /.notdef
/.notdef /.notdef /.notdef /.notdef /.notdef
/.notdef /.notdef /.notdef /.notdef /.notdef
/.notdef /.notdef /.notdef /.notdef /.notdef
/.notdef /.notdef /.notdef /.notdef /.notdef
/.notdef /.notdef /.notdef /.notdef /.notdef
/.notdef /.notdef /space /exclam /quotedbl
/numbersign /dollar /percent /ampersand /quotesingle
/parenleft /parenright /asterisk /plus /comma
/hyphen /period /slash /zero /one
/two /three /four /five /six
/seven /eight /nine /colon /semicolon
/less /equal /greater /question /at
/A /B /C /D /E
/F /G /H /I /J
/K /L /M /N /O
/P /Q /R /S /T
/U /V /W /X /Y
/Z /bracketleft /backslash /bracketright /asciicircum
/underscore /quoteleft /a /b /c
/d /e /f /g /h
/i /j /k /l /m
/n /o /p /q /r
/s /t /u /v /w
/x /y /z /braceleft /bar
/braceright /asciitilde /bullet /Euro /bullet
/quotesinglbase /florin /quotedblbase /ellipsis /dagger
/daggerdbl /circumflex /perthousand /Scaron /guilsinglleft
/OE /bullet /Zcaron /bullet /bullet
/quoteleft /quoteright /quotedblleft /quotedblright /bullet
/endash /emdash /asciitilde /trademark /scaron
/guilsinglright /oe /bullet /zcaron /Ydieresis
/space /exclamdown /cent /sterling /currency
/yen /brokenbar /section /dieresis /copyright
/ordfeminine /guillemotleft /logicalnot /sfthyphen /registered
/macron /degree /plusminus /twosuperior /threesuperior
/acute /mu /paragraph /middot /cedilla
/onesuperior /ordmasculine /guillemotright /onequarter /onehalf
/threequarters /questiondown /Agrave /Aacute /Acircumflex
/Atilde /Adieresis /Aring /AE /Ccedilla
/Egrave /Eacute /Ecircumflex /Edieresis /Igrave
/Iacute /Icircumflex /Idieresis /Eth /Ntilde
/Ograve /Oacute /Ocircumflex /Otilde /Odieresis
/multiply /Oslash /Ugrave /Uacute /Ucircumflex
/Udieresis /Yacute /Thorn /germandbls /agrave
/aacute /acircumflex /atilde /adieresis /aring
/ae /ccedilla /egrave /eacute /ecircumflex
/edieresis /igrave /iacute /icircumflex /idieresis
/eth /ntilde /ograve /oacute /ocircumflex
/otilde /odieresis /divide /oslash /ugrave
/uacute /ucircumflex /udieresis /yacute /thorn
/ydieresis
] def
%%EndResource
%FOPBeginFontReencode
/Courier-Bold findfont
dup length dict begin
  {1 index /FID ne {def} {pop pop} ifelse} forall
  /Encoding WinAnsiEncoding def
  currentdict
end
/Courier-Bold exch definefont pop
/Helvetica findfont
dup length dict begin
  {1 index /FID ne {def} {pop pop} ifelse} forall
  /Encoding WinAnsiEncoding def
  currentdict
end
/Helvetica exch definefont pop
/Courier-BoldOblique findfont
dup length dict begin
  {1 index /FID ne {def} {pop pop} ifelse} forall
  /Encoding WinAnsiEncoding def
  currentdict
end
/Courier-BoldOblique exch definefont pop
/Courier-Oblique findfont
dup length dict begin
  {1 index /FID ne {def} {pop pop} ifelse} forall
  /Encoding WinAnsiEncoding def
  currentdict
end
/Courier-Oblique exch definefont pop
/Times-Roman findfont
dup length dict begin
  {1 index /FID ne {def} {pop pop} ifelse} forall
  /Encoding WinAnsiEncoding def
  currentdict
end
/Times-Roman exch definefont pop
/Helvetica-BoldOblique findfont
dup length dict begin
  {1 index /FID ne {def} {pop pop} ifelse} forall
  /Encoding WinAnsiEncoding def
  currentdict
end
/Helvetica-BoldOblique exch definefont pop
/Helvetica-Bold findfont
dup length dict begin
  {1 index /FID ne {def} {pop pop} ifelse} forall
  /Encoding WinAnsiEncoding def
  currentdict
end
/Helvetica-Bold exch definefont pop
/Helvetica-Oblique findfont
dup length dict begin
  {1 index /FID ne {def} {pop pop} ifelse} forall
  /Encoding WinAnsiEncoding def
  currentdict
end
/Helvetica-Oblique exch definefont pop
/Times-BoldItalic findfont
dup length dict begin
  {1 index /FID ne {def} {pop pop} ifelse} forall
  /Encoding WinAnsiEncoding def
  currentdict
end
/Times-BoldItalic exch definefont pop
/Courier findfont
dup length dict begin
  {1 index /FID ne {def} {pop pop} ifelse} forall
  /Encoding WinAnsiEncoding def
  currentdict
end
/Courier exch definefont pop
/Times-Italic findfont
dup length dict begin
  {1 index /FID ne {def} {pop pop} ifelse} forall
  /Encoding WinAnsiEncoding def
  currentdict
end
/Times-Italic exch definefont pop
/Times-Bold findfont
dup length dict begin
  {1 index /FID ne {def} {pop pop} ifelse} forall
  /Encoding WinAnsiEncoding def
  currentdict
end
/Times-Bold exch definefont pop
%FOPEndFontReencode
%%EndProlog
%%Page: 1 1
%%PageBoundingBox: 0 0 420 315
%%BeginPageSetup
[1 0 0 -1 0 315] CT
%%EndPageSetup
GS
[0.75 0 0 0.75 0 0] CT
1 GC
N
0 0 560 420 re
f
GR
GS
[0.75 0 0 0.75 0 0] CT
1 GC
N
0 0 560 420 re
f
GR
GS
[0.75 0 0 0.75 0 0] CT
1 GC
N
73 374 M
507 374 L
507 31 L
73 31 L
cp
f
GR
GS
[0.75 0 0 0.75 0 0] CT
0.873 GC
1 LJ
0.667 LW
N
81.628 374 M
81.628 31 L
S
GR
GS
[0.75 0 0 0.75 0 0] CT
0.873 GC
1 LJ
0.667 LW
N
138.361 374 M
138.361 31 L
S
GR
GS
[0.75 0 0 0.75 0 0] CT
0.873 GC
1 LJ
0.667 LW
N
195.095 374 M
195.095 31 L
S
GR
GS
[0.75 0 0 0.75 0 0] CT
0.873 GC
1 LJ
0.667 LW
N
251.829 374 M
251.829 31 L
S
GR
GS
[0.75 0 0 0.75 0 0] CT
0.873 GC
1 LJ
0.667 LW
N
308.563 374 M
308.563 31 L
S
GR
GS
[0.75 0 0 0.75 0 0] CT
0.873 GC
1 LJ
0.667 LW
N
365.296 374 M
365.296 31 L
S
GR
GS
[0.75 0 0 0.75 0 0] CT
0.873 GC
1 LJ
0.667 LW
N
422.03 374 M
422.03 31 L
S
GR
GS
[0.75 0 0 0.75 0 0] CT
0.873 GC
1 LJ
0.667 LW
N
478.764 374 M
478.764 31 L
S
GR
GS
[0.75 0 0 0.75 0 0] CT
0.873 GC
1 LJ
0.667 LW
N
507 347.139 M
73 347.139 L
S
GR
GS
[0.75 0 0 0.75 0 0] CT
0.873 GC
1 LJ
0.667 LW
N
507 306.64 M
73 306.64 L
S
GR
GS
[0.75 0 0 0.75 0 0] CT
0.873 GC
1 LJ
0.667 LW
N
507 266.141 M
73 266.141 L
S
GR
GS
[0.75 0 0 0.75 0 0] CT
0.873 GC
1 LJ
0.667 LW
N
507 225.642 M
73 225.642 L
S
GR
GS
[0.75 0 0 0.75 0 0] CT
0.873 GC
1 LJ
0.667 LW
N
507 185.143 M
73 185.143 L
S
GR
GS
[0.75 0 0 0.75 0 0] CT
0.873 GC
1 LJ
0.667 LW
N
507 144.645 M
73 144.645 L
S
GR
GS
[0.75 0 0 0.75 0 0] CT
0.873 GC
1 LJ
0.667 LW
N
507 104.146 M
73 104.146 L
S
GR
GS
[0.75 0 0 0.75 0 0] CT
0.873 GC
1 LJ
0.667 LW
N
507 63.647 M
73 63.647 L
S
GR
GS
[0.75 0 0 0.75 0 0] CT
0.149 GC
2 setlinecap
1 LJ
0.667 LW
N
73 374 M
507 374 L
S
GR
GS
[0.75 0 0 0.75 0 0] CT
0.149 GC
2 setlinecap
1 LJ
0.667 LW
N
81.628 374 M
81.628 369.66 L
S
GR
GS
[0.75 0 0 0.75 0 0] CT
0.149 GC
2 setlinecap
1 LJ
0.667 LW
N
138.361 374 M
138.361 369.66 L
S
GR
GS
[0.75 0 0 0.75 0 0] CT
0.149 GC
2 setlinecap
1 LJ
0.667 LW
N
195.095 374 M
195.095 369.66 L
S
GR
GS
[0.75 0 0 0.75 0 0] CT
0.149 GC
2 setlinecap
1 LJ
0.667 LW
N
251.829 374 M
251.829 369.66 L
S
GR
GS
[0.75 0 0 0.75 0 0] CT
0.149 GC
2 setlinecap
1 LJ
0.667 LW
N
308.563 374 M
308.563 369.66 L
S
GR
GS
[0.75 0 0 0.75 0 0] CT
0.149 GC
2 setlinecap
1 LJ
0.667 LW
N
365.296 374 M
365.296 369.66 L
S
GR
GS
[0.75 0 0 0.75 0 0] CT
0.149 GC
2 setlinecap
1 LJ
0.667 LW
N
422.03 374 M
422.03 369.66 L
S
GR
GS
[0.75 0 0 0.75 0 0] CT
0.149 GC
2 setlinecap
1 LJ
0.667 LW
N
478.764 374 M
478.764 369.66 L
S
GR
GS
[0.75 0 0 0.75 61.22078 284.50001] CT
0.149 GC
/Helvetica 13.333 F
GS
[1 0 0 1 0 0] CT
-9.5 14 moveto 
1 -1 scale
(-50) t 
GR
GR
GS
[0.75 0 0 0.75 103.77109 284.50001] CT
0.149 GC
/Helvetica 13.333 F
GS
[1 0 0 1 0 0] CT
-4 14 moveto 
1 -1 scale
(0) t 
GR
GR
GS
[0.75 0 0 0.75 146.32139 284.50001] CT
0.149 GC
/Helvetica 13.333 F
GS
[1 0 0 1 0 0] CT
-7.5 14 moveto 
1 -1 scale
(50) t 
GR
GR
GS
[0.75 0 0 0.75 188.87169 284.50001] CT
0.149 GC
/Helvetica 13.333 F
GS
[1 0 0 1 0 0] CT
-11 14 moveto 
1 -1 scale
(100) t 
GR
GR
GS
[0.75 0 0 0.75 231.42199 284.50001] CT
0.149 GC
/Helvetica 13.333 F
GS
[1 0 0 1 0 0] CT
-11 14 moveto 
1 -1 scale
(150) t 
GR
GR
GS
[0.75 0 0 0.75 273.97229 284.50001] CT
0.149 GC
/Helvetica 13.333 F
GS
[1 0 0 1 0 0] CT
-11 14 moveto 
1 -1 scale
(200) t 
GR
GR
GS
[0.75 0 0 0.75 316.52259 284.50001] CT
0.149 GC
/Helvetica 13.333 F
GS
[1 0 0 1 0 0] CT
-11 14 moveto 
1 -1 scale
(250) t 
GR
GR
GS
[0.75 0 0 0.75 359.07289 284.50001] CT
0.149 GC
/Helvetica 13.333 F
GS
[1 0 0 1 0 0] CT
-11 14 moveto 
1 -1 scale
(300) t 
GR
GR
GS
[0.75 0 0 0.75 0 0] CT
0.149 GC
2 setlinecap
1 LJ
0.667 LW
N
73 374 M
73 31 L
S
GR
GS
[0.75 0 0 0.75 0 0] CT
0.149 GC
2 setlinecap
1 LJ
0.667 LW
N
73 347.139 M
77.34 347.139 L
S
GR
GS
[0.75 0 0 0.75 0 0] CT
0.149 GC
2 setlinecap
1 LJ
0.667 LW
N
73 306.64 M
77.34 306.64 L
S
GR
GS
[0.75 0 0 0.75 0 0] CT
0.149 GC
2 setlinecap
1 LJ
0.667 LW
N
73 266.141 M
77.34 266.141 L
S
GR
GS
[0.75 0 0 0.75 0 0] CT
0.149 GC
2 setlinecap
1 LJ
0.667 LW
N
73 225.642 M
77.34 225.642 L
S
GR
GS
[0.75 0 0 0.75 0 0] CT
0.149 GC
2 setlinecap
1 LJ
0.667 LW
N
73 185.143 M
77.34 185.143 L
S
GR
GS
[0.75 0 0 0.75 0 0] CT
0.149 GC
2 setlinecap
1 LJ
0.667 LW
N
73 144.645 M
77.34 144.645 L
S
GR
GS
[0.75 0 0 0.75 0 0] CT
0.149 GC
2 setlinecap
1 LJ
0.667 LW
N
73 104.146 M
77.34 104.146 L
S
GR
GS
[0.75 0 0 0.75 0 0] CT
0.149 GC
2 setlinecap
1 LJ
0.667 LW
N
73 63.647 M
77.34 63.647 L
S
GR
GS
[0.75 0 0 0.75 50.75 260.35391] CT
0.149 GC
/Helvetica 13.333 F
GS
[1 0 0 1 0 0] CT
-19 5.5 moveto 
1 -1 scale
(0.5) t 
GR
GR
GS
[0.75 0 0 0.75 50.75 229.9798] CT
0.149 GC
/Helvetica 13.333 F
GS
[1 0 0 1 0 0] CT
-19 5.5 moveto 
1 -1 scale
(0.6) t 
GR
GR
GS
[0.75 0 0 0.75 50.75 199.60572] CT
0.149 GC
/Helvetica 13.333 F
GS
[1 0 0 1 0 0] CT
-19 5.5 moveto 
1 -1 scale
(0.7) t 
GR
GR
GS
[0.75 0 0 0.75 50.75 169.23162] CT
0.149 GC
/Helvetica 13.333 F
GS
[1 0 0 1 0 0] CT
-19 5.5 moveto 
1 -1 scale
(0.8) t 
GR
GR
GS
[0.75 0 0 0.75 50.75 138.85754] CT
0.149 GC
/Helvetica 13.333 F
GS
[1 0 0 1 0 0] CT
-19 5.5 moveto 
1 -1 scale
(0.9) t 
GR
GR
GS
[0.75 0 0 0.75 50.75 108.48343] CT
0.149 GC
/Helvetica 13.333 F
GS
[1 0 0 1 0 0] CT
-8 5.5 moveto 
1 -1 scale
(1) t 
GR
GR
GS
[0.75 0 0 0.75 50.75 78.10933] CT
0.149 GC
/Helvetica 13.333 F
GS
[1 0 0 1 0 0] CT
-19 5.5 moveto 
1 -1 scale
(1.1) t 
GR
GR
GS
[0.75 0 0 0.75 50.75 47.73523] CT
0.149 GC
/Helvetica 13.333 F
GS
[1 0 0 1 0 0] CT
-19 5.5 moveto 
1 -1 scale
(1.2) t 
GR
GR
GS
[0.75 0 0 0.75 217.50021 21.18752] CT
/Helvetica-Bold 14.667 F
GS
[1 0 0 1 0 0] CT
-136 -4 moveto 
1 -1 scale
(rekurzivni metoda pridavne promenne) t 
GR
GR
GS
[0.75 0 0 0.75 0 0] CT
1 0 0 RC
1 LJ
0.667 LW
N
140.515 374.034 M
140.631 354.141 L
140.801 374.034 L
S
GR
GS
[0.75 0 0 0.75 0 0] CT
1 0 0 RC
1 LJ
0.667 LW
N
142.402 374.034 M
142.9 285.897 L
144.035 31.133 L
144.744 374.034 L
S
GR
GS
[0.75 0 0 0.75 0 0] CT
1 0 0 RC
1 LJ
0.667 LW
N
146.796 374.034 M
147.439 350.025 L
148.574 362.147 L
149.708 251.218 L
150.843 236.503 L
151.978 271.92 L
153.112 263.728 L
154.247 258.936 L
155.382 235.534 L
156.516 248.602 L
157.651 275.636 L
158.786 266.687 L
159.92 244.45 L
161.055 270.554 L
162.19 270.847 L
163.324 250.12 L
164.459 268.542 L
165.594 262.687 L
166.728 283.604 L
167.863 289.686 L
168.998 277.94 L
170.132 283.516 L
171.267 280.618 L
172.402 274.553 L
173.536 333.296 L
174.671 346.8 L
175.806 348.001 L
176.94 358.798 L
178.075 356.783 L
179.21 356.21 L
180.344 355.15 L
181.479 343.987 L
182.614 343.665 L
183.748 341.996 L
184.883 346.145 L
186.018 318.654 L
187.152 310.012 L
188.287 290.462 L
189.422 287.593 L
190.556 283.631 L
191.691 288.963 L
192.826 289.041 L
193.961 288.956 L
195.095 286.862 L
196.23 284.055 L
197.365 286.337 L
198.499 273.698 L
199.634 275.808 L
200.769 275.939 L
201.903 271.491 L
203.038 275.253 L
204.173 279.971 L
205.307 282.776 L
206.442 279.168 L
207.577 273.781 L
208.711 275.288 L
209.846 273.414 L
210.981 272.998 L
212.115 272.515 L
213.25 280.645 L
214.385 277.182 L
215.519 277.11 L
216.654 278.154 L
217.789 282.61 L
218.923 284.396 L
220.058 282.53 L
221.193 284.606 L
222.327 291.911 L
223.462 292.826 L
224.597 294.978 L
225.731 295.746 L
226.866 291.319 L
228.001 290.629 L
229.135 287.711 L
230.27 275.927 L
231.405 275.75 L
232.539 279.044 L
233.674 284.622 L
234.809 283.365 L
235.943 277.927 L
237.078 251.982 L
238.213 251.774 L
239.347 252.298 L
240.482 256.613 L
241.617 256.27 L
242.752 254.9 L
243.886 250.865 L
245.021 252.286 L
246.156 245.215 L
247.29 242.037 L
248.425 240.392 L
249.56 240.871 L
250.694 232.132 L
251.829 232.027 L
252.964 249.781 L
254.098 248.101 L
255.233 243.719 L
256.368 245.318 L
257.502 245.111 L
258.637 243.211 L
259.772 238.471 L
260.906 238.519 L
262.041 245.122 L
263.176 247.052 L
264.31 247.706 L
265.445 245.877 L
266.58 246.246 L
267.714 250.636 L
268.849 243.884 L
269.984 244.743 L
271.118 245.099 L
272.253 244.757 L
273.388 246.066 L
274.522 246.071 L
275.657 248.018 L
276.792 248.245 L
277.926 256.071 L
279.061 259.236 L
280.196 259.845 L
281.33 259.725 L
282.465 243.783 L
283.6 247.464 L
284.734 257.599 L
285.869 253.376 L
287.004 254.704 L
288.139 253.926 L
289.273 248.341 L
290.408 248.233 L
291.543 249.161 L
292.677 249.126 L
293.812 247.472 L
294.947 247.859 L
296.081 244.99 L
297.216 253.105 L
298.351 250.38 L
299.485 249.981 L
300.62 249.988 L
301.755 246.135 L
302.889 245.813 L
304.024 245.763 L
305.159 244.601 L
306.293 242.653 L
307.428 242.36 L
308.563 242.14 L
309.697 242.152 L
310.832 252.994 L
311.967 252.723 L
313.101 253.462 L
314.236 253.409 L
315.371 253.254 L
316.505 251.559 L
317.64 251.241 L
318.775 250.914 L
319.909 248.581 L
321.044 248.332 L
322.179 248.757 L
323.313 252.266 L
324.448 252.853 L
325.583 254.539 L
326.717 258.687 L
327.852 254.983 L
328.987 253.743 L
330.121 252.773 L
331.256 248.911 L
332.391 249.429 L
333.525 244.831 L
334.66 245.005 L
335.795 245.212 L
336.93 245.101 L
338.064 243.649 L
339.199 244.969 L
340.334 245.887 L
341.468 246.147 L
342.603 246.231 L
343.738 248.747 L
344.872 253.85 L
346.007 253.214 L
347.142 256.269 L
348.276 257.67 L
349.411 257.161 L
350.546 259.116 L
351.68 258.192 L
352.815 258.73 L
353.95 259.189 L
355.084 261.209 L
356.219 261.972 L
357.354 261.855 L
358.488 259.643 L
359.623 260.94 L
360.758 260.309 L
361.892 260.14 L
363.027 259.964 L
364.162 259.854 L
365.296 260.517 L
366.431 261.044 L
367.566 257.845 L
368.7 258.192 L
369.835 258.8 L
370.97 258.712 L
372.104 259.007 L
373.239 257.984 L
374.374 262.366 L
375.508 263.117 L
376.643 262.919 L
377.778 261.011 L
378.912 259.355 L
380.047 257.217 L
381.182 257.324 L
382.316 258.421 L
383.451 259.482 L
384.586 261.31 L
385.721 260.36 L
386.855 263.312 L
387.99 263.344 L
389.125 263.883 L
390.259 263.579 L
391.394 263.802 L
392.529 259.52 L
393.663 260.531 L
394.798 264.122 L
395.933 262.849 L
397.067 266.962 L
398.202 268.359 L
399.337 270.802 L
400.471 271.33 L
401.606 271.503 L
402.741 273.079 L
403.875 273.772 L
405.01 273.549 L
406.145 273.685 L
407.279 276.32 L
408.414 274.184 L
409.549 275.838 L
410.683 275.909 L
411.818 277.015 L
412.953 278.498 L
414.087 280.053 L
415.222 278.991 L
416.357 278.347 L
417.491 278.116 L
418.626 278.182 L
419.761 277.964 L
420.895 282.004 L
422.03 282.409 L
423.165 282.417 L
424.299 283.581 L
425.434 283.916 L
426.569 283.071 L
427.703 282.733 L
428.838 279.83 L
429.973 281.342 L
431.108 281.562 L
432.242 281.838 L
433.377 281.396 L
434.512 280.378 L
435.646 280.675 L
436.781 283.063 L
437.916 283.207 L
439.05 282.568 L
440.185 282.226 L
441.32 281.962 L
442.454 279.797 L
443.589 280.598 L
444.724 286.371 L
445.858 286.507 L
446.993 286.49 L
448.128 286.237 L
449.262 286.764 L
450.397 284.619 L
451.532 285.083 L
452.666 285.18 L
453.801 285.318 L
454.936 285.996 L
456.07 287.628 L
457.205 287.406 L
458.34 287.699 L
459.474 282.917 L
460.609 287.495 L
461.744 286.285 L
462.878 279.143 L
464.013 279.406 L
465.148 275.289 L
466.282 278.46 L
467.417 276.49 L
468.552 276.702 L
469.686 276.971 L
470.821 279.068 L
471.956 278.98 L
473.09 279.236 L
474.225 279.74 L
475.36 278.675 L
476.495 279.143 L
477.629 278.969 L
478.764 277.774 L
479.899 279.168 L
481.033 278.424 L
482.168 277.96 L
483.303 274.774 L
484.437 276.925 L
485.572 276.995 L
486.707 278.119 L
487.841 276.773 L
488.976 277.986 L
490.111 277.043 L
491.245 277.647 L
492.38 279.193 L
493.515 280.237 L
494.649 280.287 L
495.784 281.476 L
496.919 279.917 L
498.053 279.414 L
499.188 279.117 L
500.323 277.93 L
501.457 276.633 L
502.592 277.297 L
503.727 276.893 L
504.861 277.534 L
505.996 284.187 L
507.043 284.523 L
S
GR
GS
[0.75 0 0 0.75 0 0] CT
1 LJ
0.667 LW
N
139.496 306.64 M
140.631 306.64 L
141.765 306.64 L
142.9 306.64 L
144.035 306.64 L
145.169 306.64 L
146.304 306.64 L
147.439 306.64 L
148.574 306.64 L
149.708 306.64 L
150.843 306.64 L
151.978 306.64 L
153.112 306.64 L
154.247 306.64 L
155.382 306.64 L
156.516 306.64 L
157.651 306.64 L
158.786 306.64 L
159.92 306.64 L
161.055 306.64 L
162.19 306.64 L
163.324 306.64 L
164.459 306.64 L
165.594 306.64 L
166.728 306.64 L
167.863 306.64 L
168.998 306.64 L
170.132 306.64 L
171.267 306.64 L
172.402 306.64 L
173.536 306.64 L
174.671 306.64 L
175.806 306.64 L
176.94 306.64 L
178.075 306.64 L
179.21 306.64 L
180.344 306.64 L
181.479 306.64 L
182.614 306.64 L
183.748 306.64 L
184.883 306.64 L
186.018 306.64 L
187.152 306.64 L
188.287 306.64 L
189.422 306.64 L
190.556 306.64 L
191.691 306.64 L
192.826 306.64 L
193.961 306.64 L
195.095 306.64 L
196.23 306.64 L
197.365 306.64 L
198.499 306.64 L
199.634 306.64 L
200.769 306.64 L
201.903 306.64 L
203.038 306.64 L
204.173 306.64 L
205.307 306.64 L
206.442 306.64 L
207.577 306.64 L
208.711 306.64 L
209.846 306.64 L
210.981 306.64 L
212.115 306.64 L
213.25 306.64 L
214.385 306.64 L
215.519 306.64 L
216.654 306.64 L
217.789 306.64 L
218.923 306.64 L
220.058 306.64 L
221.193 306.64 L
222.327 306.64 L
223.462 306.64 L
224.597 306.64 L
225.731 306.64 L
226.866 306.64 L
228.001 306.64 L
229.135 306.64 L
230.27 306.64 L
231.405 306.64 L
232.539 306.64 L
233.674 306.64 L
234.809 306.64 L
235.943 306.64 L
237.078 306.64 L
238.213 306.64 L
239.347 306.64 L
240.482 306.64 L
241.617 306.64 L
242.752 306.64 L
243.886 306.64 L
245.021 306.64 L
246.156 306.64 L
247.29 306.64 L
248.425 306.64 L
249.56 306.64 L
250.694 306.64 L
251.829 306.64 L
252.964 306.64 L
254.098 306.64 L
255.233 306.64 L
256.368 306.64 L
257.502 306.64 L
258.637 306.64 L
259.772 306.64 L
260.906 306.64 L
262.041 306.64 L
263.176 306.64 L
264.31 306.64 L
265.445 306.64 L
266.58 306.64 L
267.714 306.64 L
268.849 306.64 L
269.984 306.64 L
271.118 306.64 L
272.253 306.64 L
273.388 306.64 L
274.522 306.64 L
275.657 306.64 L
276.792 306.64 L
277.926 306.64 L
279.061 306.64 L
280.196 306.64 L
281.33 306.64 L
282.465 306.64 L
283.6 306.64 L
284.734 306.64 L
285.869 306.64 L
287.004 306.64 L
288.139 306.64 L
289.273 306.64 L
290.408 306.64 L
291.543 306.64 L
292.677 306.64 L
293.812 306.64 L
294.947 306.64 L
296.081 306.64 L
297.216 306.64 L
298.351 306.64 L
299.485 306.64 L
300.62 306.64 L
301.755 306.64 L
302.889 306.64 L
304.024 306.64 L
305.159 306.64 L
306.293 306.64 L
307.428 306.64 L
308.563 306.64 L
309.697 306.64 L
310.832 306.64 L
311.967 306.64 L
313.101 306.64 L
314.236 306.64 L
315.371 306.64 L
316.505 306.64 L
317.64 306.64 L
318.775 306.64 L
319.909 306.64 L
321.044 306.64 L
322.179 306.64 L
323.313 306.64 L
324.448 306.64 L
325.583 306.64 L
326.717 306.64 L
327.852 306.64 L
328.987 306.64 L
330.121 306.64 L
331.256 306.64 L
332.391 306.64 L
333.525 306.64 L
334.66 306.64 L
335.795 306.64 L
336.93 306.64 L
338.064 306.64 L
339.199 306.64 L
340.334 306.64 L
341.468 306.64 L
342.603 306.64 L
343.738 306.64 L
344.872 306.64 L
346.007 306.64 L
347.142 306.64 L
348.276 306.64 L
349.411 306.64 L
350.546 306.64 L
351.68 306.64 L
352.815 306.64 L
353.95 306.64 L
355.084 306.64 L
356.219 306.64 L
357.354 306.64 L
358.488 306.64 L
359.623 306.64 L
360.758 306.64 L
361.892 306.64 L
363.027 306.64 L
364.162 306.64 L
365.296 306.64 L
366.431 306.64 L
367.566 306.64 L
368.7 306.64 L
369.835 306.64 L
370.97 306.64 L
372.104 306.64 L
373.239 306.64 L
374.374 306.64 L
375.508 306.64 L
376.643 306.64 L
377.778 306.64 L
378.912 306.64 L
380.047 306.64 L
381.182 306.64 L
382.316 306.64 L
383.451 306.64 L
384.586 306.64 L
385.721 306.64 L
386.855 306.64 L
387.99 306.64 L
389.125 306.64 L
390.259 306.64 L
391.394 306.64 L
392.529 306.64 L
393.663 306.64 L
394.798 306.64 L
395.933 306.64 L
397.067 306.64 L
398.202 306.64 L
399.337 306.64 L
400.471 306.64 L
401.606 306.64 L
402.741 306.64 L
403.875 306.64 L
405.01 306.64 L
406.145 306.64 L
407.279 306.64 L
408.414 306.64 L
409.549 306.64 L
410.683 306.64 L
411.818 306.64 L
412.953 306.64 L
414.087 306.64 L
415.222 306.64 L
416.357 306.64 L
417.491 306.64 L
418.626 306.64 L
419.761 306.64 L
420.895 306.64 L
422.03 306.64 L
423.165 306.64 L
424.299 306.64 L
425.434 306.64 L
426.569 306.64 L
427.703 306.64 L
428.838 306.64 L
429.973 306.64 L
431.108 306.64 L
432.242 306.64 L
433.377 306.64 L
434.512 306.64 L
435.646 306.64 L
436.781 306.64 L
437.916 306.64 L
439.05 306.64 L
440.185 306.64 L
441.32 306.64 L
442.454 306.64 L
443.589 306.64 L
444.724 306.64 L
445.858 306.64 L
446.993 306.64 L
448.128 306.64 L
449.262 306.64 L
450.397 306.64 L
451.532 306.64 L
452.666 306.64 L
453.801 306.64 L
454.936 306.64 L
456.07 306.64 L
457.205 306.64 L
458.34 306.64 L
459.474 306.64 L
460.609 306.64 L
461.744 306.64 L
462.878 306.64 L
464.013 306.64 L
465.148 306.64 L
466.282 306.64 L
467.417 306.64 L
468.552 306.64 L
469.686 306.64 L
470.821 306.64 L
471.956 306.64 L
473.09 306.64 L
474.225 306.64 L
475.36 306.64 L
476.495 306.64 L
477.629 306.64 L
478.764 306.64 L
479.899 306.64 L
481.033 306.64 L
482.168 306.64 L
483.303 306.64 L
484.437 306.64 L
485.572 306.64 L
486.707 306.64 L
487.841 306.64 L
488.976 306.64 L
490.111 306.64 L
491.245 306.64 L
492.38 306.64 L
493.515 306.64 L
494.649 306.64 L
495.784 306.64 L
496.919 306.64 L
498.053 306.64 L
499.188 306.64 L
500.323 306.64 L
501.457 306.64 L
502.592 306.64 L
503.727 306.64 L
504.861 306.64 L
505.996 306.64 L
507.043 306.64 L
S
GR
GS
[0.75 0 0 0.75 0 0] CT
0 1 0 RC
1 LJ
0.667 LW
N
140.926 374.034 M
141.765 88.054 L
142.489 374.034 L
S
GR
GS
[0.75 0 0 0.75 0 0] CT
0 1 0 RC
1 LJ
0.667 LW
N
144.349 374.034 M
144.679 30.966 L
S
GR
GS
[0.75 0 0 0.75 0 0] CT
0 1 0 RC
1 LJ
0.667 LW
N
146.141 30.966 M
146.304 116.611 L
147.439 194.676 L
148.574 233.713 L
149.708 276.955 L
150.843 274.313 L
151.978 238.536 L
153.112 250.898 L
154.247 283.449 L
155.382 267.678 L
156.516 264.063 L
157.651 209.909 L
158.786 202.511 L
159.92 223.581 L
161.055 202.655 L
162.19 203.667 L
163.324 237.147 L
164.459 244.763 L
165.594 241.08 L
166.728 230.263 L
167.863 188.227 L
168.998 181.684 L
170.132 178.291 L
171.267 177.924 L
172.402 205.266 L
173.536 137.738 L
174.671 131.231 L
175.806 141.04 L
176.94 137.551 L
178.075 143.662 L
179.21 144.074 L
180.344 147.07 L
181.479 150.86 L
182.614 159.623 L
183.748 158.648 L
184.883 148.777 L
186.018 126.448 L
187.152 134.818 L
188.287 145.102 L
189.422 150.921 L
190.556 147.62 L
191.691 146.93 L
192.826 146.754 L
193.961 147.089 L
195.095 148.862 L
196.23 149.091 L
197.365 129.353 L
198.499 121.932 L
199.634 121.762 L
200.769 121.001 L
201.903 125.813 L
203.038 131.829 L
204.173 121.165 L
205.307 120.154 L
206.442 137.036 L
207.577 136.323 L
208.711 134.605 L
209.846 134.399 L
210.981 136.479 L
212.115 137.573 L
213.25 130.689 L
214.385 130.974 L
215.519 131.563 L
216.654 128.396 L
217.789 134.412 L
218.923 135.14 L
220.058 137.521 L
221.193 131.673 L
222.327 128.017 L
223.462 129.155 L
224.597 128.183 L
225.731 123.41 L
226.866 123.104 L
228.001 125.397 L
229.135 118.797 L
230.27 127.303 L
231.405 127.197 L
232.539 139.978 L
233.674 141.092 L
234.809 136.7 L
235.943 121.065 L
237.078 121.638 L
238.213 121.374 L
239.347 126.521 L
240.482 136.321 L
241.617 136.727 L
242.752 138.986 L
243.886 136.131 L
245.021 135.101 L
246.156 131.026 L
247.29 137.376 L
248.425 139.808 L
249.56 138.835 L
250.694 139.402 L
251.829 140.634 L
252.964 125.822 L
254.098 122.761 L
255.233 124.885 L
256.368 124.675 L
257.502 126.788 L
258.637 124.159 L
259.772 123.741 L
260.906 124.855 L
262.041 120.147 L
263.176 121.699 L
264.31 122.947 L
265.445 122.829 L
266.58 114.4 L
267.714 111.3 L
268.849 111.87 L
269.984 113.802 L
271.118 113.437 L
272.253 112.558 L
273.388 112.599 L
274.522 112.674 L
275.657 114.279 L
276.792 116.39 L
277.926 121.035 L
279.061 124.337 L
280.196 124.441 L
281.33 119.415 L
282.465 134.425 L
283.6 131.48 L
284.734 126.248 L
285.869 123.763 L
287.004 126.244 L
288.139 127.102 L
289.273 119.701 L
290.408 119.673 L
291.543 119.674 L
292.677 128.417 L
293.812 128.494 L
294.947 126.736 L
296.081 130.099 L
297.216 128.518 L
298.351 123.943 L
299.485 123.89 L
300.62 120.472 L
301.755 111.768 L
302.889 111.772 L
304.024 111.473 L
305.159 110.586 L
306.293 109.697 L
307.428 109.933 L
308.563 109.949 L
309.697 110.153 L
310.832 110.891 L
311.967 109.941 L
313.101 109.994 L
314.236 109.754 L
315.371 109.126 L
316.505 109.308 L
317.64 113.539 L
318.775 113.312 L
319.909 115.06 L
321.044 114.984 L
322.179 117.729 L
323.313 117.179 L
324.448 117.925 L
325.583 121.528 L
326.717 126.82 L
327.852 124.838 L
328.987 127.573 L
330.121 126.665 L
331.256 123.603 L
332.391 123.078 L
333.525 125.614 L
334.66 125.704 L
335.795 126.445 L
336.93 126.392 L
338.064 129.72 L
339.199 129.392 L
340.334 129.277 L
341.468 128.743 L
342.603 128.393 L
343.738 131.497 L
344.872 127.885 L
346.007 127.225 L
347.142 130.056 L
348.276 129.897 L
349.411 131.392 L
350.546 132.946 L
351.68 133.113 L
352.815 132.04 L
353.95 130.408 L
355.084 130.894 L
356.219 130.644 L
357.354 129.419 L
358.488 126.057 L
359.623 125.884 L
360.758 125.456 L
361.892 124.457 L
363.027 124.415 L
364.162 123.295 L
365.296 123.873 L
366.431 123.034 L
367.566 123.523 L
368.7 126.036 L
369.835 126.317 L
370.97 126.389 L
372.104 126.622 L
373.239 129.813 L
374.374 127.574 L
375.508 127.802 L
376.643 127.194 L
377.778 125.078 L
378.912 123.018 L
380.047 122.681 L
381.182 123.293 L
382.316 122.243 L
383.451 123.373 L
384.586 125.309 L
385.721 121.446 L
386.855 121.716 L
387.99 120.744 L
389.125 120.553 L
390.259 120.41 L
391.394 119.144 L
392.529 120.058 L
393.663 122.314 L
394.798 125.217 L
395.933 130.354 L
397.067 128.719 L
398.202 127.117 L
399.337 127.732 L
400.471 127.085 L
401.606 126.705 L
402.741 125.223 L
403.875 125.147 L
405.01 125.55 L
406.145 125.945 L
407.279 122.147 L
408.414 123.536 L
409.549 123.828 L
410.683 124.296 L
411.818 121.757 L
412.953 123.342 L
414.087 124.036 L
415.222 122.986 L
416.357 124.194 L
417.491 124.049 L
418.626 124.109 L
419.761 124.952 L
420.895 123.944 L
422.03 124.118 L
423.165 124.102 L
424.299 124.798 L
425.434 125.6 L
426.569 124.926 L
427.703 123.922 L
428.838 126.228 L
429.973 125.555 L
431.108 125.664 L
432.242 124.395 L
433.377 124.06 L
434.512 124.31 L
435.646 121.891 L
436.781 122.54 L
437.916 123.687 L
439.05 123.5 L
440.185 123.14 L
441.32 123.635 L
442.454 122.799 L
443.589 125.313 L
444.724 126.794 L
445.858 126.533 L
446.993 126.56 L
448.128 126.637 L
449.262 123.836 L
450.397 122.384 L
451.532 122.472 L
452.666 123.244 L
453.801 123.073 L
454.936 122.164 L
456.07 122.346 L
457.205 120.98 L
458.34 120.474 L
459.474 125.003 L
460.609 127.864 L
461.744 123.763 L
462.878 124.095 L
464.013 121.478 L
465.148 123.258 L
466.282 125.857 L
467.417 125.33 L
468.552 123.693 L
469.686 123.557 L
470.821 126.741 L
471.956 126.794 L
473.09 126.576 L
474.225 125.976 L
475.36 126.766 L
476.495 126.71 L
477.629 125.681 L
478.764 126.274 L
479.899 125.821 L
481.033 127.972 L
482.168 127.337 L
483.303 124.667 L
484.437 124.554 L
485.572 124.963 L
486.707 125.574 L
487.841 127.575 L
488.976 126.078 L
490.111 125.177 L
491.245 125.834 L
492.38 127.59 L
493.515 127.562 L
494.649 126.673 L
495.784 126.089 L
496.919 125.091 L
498.053 124.931 L
499.188 122.564 L
500.323 121.347 L
501.457 121.611 L
502.592 120.307 L
503.727 120.843 L
504.861 122.839 L
505.996 123.866 L
507.043 122.245 L
S
GR
GS
[0.75 0 0 0.75 0 0] CT
1 LJ
0.667 LW
N
139.496 144.645 M
140.631 144.645 L
141.765 144.645 L
142.9 144.645 L
144.035 144.645 L
145.169 144.645 L
146.304 144.645 L
147.439 144.645 L
148.574 144.645 L
149.708 144.645 L
150.843 144.645 L
151.978 144.645 L
153.112 144.645 L
154.247 144.645 L
155.382 144.645 L
156.516 144.645 L
157.651 144.645 L
158.786 144.645 L
159.92 144.645 L
161.055 144.645 L
162.19 144.645 L
163.324 144.645 L
164.459 144.645 L
165.594 144.645 L
166.728 144.645 L
167.863 144.645 L
168.998 144.645 L
170.132 144.645 L
171.267 144.645 L
172.402 144.645 L
173.536 144.645 L
174.671 144.645 L
175.806 144.645 L
176.94 144.645 L
178.075 144.645 L
179.21 144.645 L
180.344 144.645 L
181.479 144.645 L
182.614 144.645 L
183.748 144.645 L
184.883 144.645 L
186.018 144.645 L
187.152 144.645 L
188.287 144.645 L
189.422 144.645 L
190.556 144.645 L
191.691 144.645 L
192.826 144.645 L
193.961 144.645 L
195.095 144.645 L
196.23 144.645 L
197.365 144.645 L
198.499 144.645 L
199.634 144.645 L
200.769 144.645 L
201.903 144.645 L
203.038 144.645 L
204.173 144.645 L
205.307 144.645 L
206.442 144.645 L
207.577 144.645 L
208.711 144.645 L
209.846 144.645 L
210.981 144.645 L
212.115 144.645 L
213.25 144.645 L
214.385 144.645 L
215.519 144.645 L
216.654 144.645 L
217.789 144.645 L
218.923 144.645 L
220.058 144.645 L
221.193 144.645 L
222.327 144.645 L
223.462 144.645 L
224.597 144.645 L
225.731 144.645 L
226.866 144.645 L
228.001 144.645 L
229.135 144.645 L
230.27 144.645 L
231.405 144.645 L
232.539 144.645 L
233.674 144.645 L
234.809 144.645 L
235.943 144.645 L
237.078 144.645 L
238.213 144.645 L
239.347 144.645 L
240.482 144.645 L
241.617 144.645 L
242.752 144.645 L
243.886 144.645 L
245.021 144.645 L
246.156 144.645 L
247.29 144.645 L
248.425 144.645 L
249.56 144.645 L
250.694 144.645 L
251.829 144.645 L
252.964 144.645 L
254.098 144.645 L
255.233 144.645 L
256.368 144.645 L
257.502 144.645 L
258.637 144.645 L
259.772 144.645 L
260.906 144.645 L
262.041 144.645 L
263.176 144.645 L
264.31 144.645 L
265.445 144.645 L
266.58 144.645 L
267.714 144.645 L
268.849 144.645 L
269.984 144.645 L
271.118 144.645 L
272.253 144.645 L
273.388 144.645 L
274.522 144.645 L
275.657 144.645 L
276.792 144.645 L
277.926 144.645 L
279.061 144.645 L
280.196 144.645 L
281.33 144.645 L
282.465 144.645 L
283.6 144.645 L
284.734 144.645 L
285.869 144.645 L
287.004 144.645 L
288.139 144.645 L
289.273 144.645 L
290.408 144.645 L
291.543 144.645 L
292.677 144.645 L
293.812 144.645 L
294.947 144.645 L
296.081 144.645 L
297.216 144.645 L
298.351 144.645 L
299.485 144.645 L
300.62 144.645 L
301.755 144.645 L
302.889 144.645 L
304.024 144.645 L
305.159 144.645 L
306.293 144.645 L
307.428 144.645 L
308.563 144.645 L
309.697 144.645 L
310.832 144.645 L
311.967 144.645 L
313.101 144.645 L
314.236 144.645 L
315.371 144.645 L
316.505 144.645 L
317.64 144.645 L
318.775 144.645 L
319.909 144.645 L
321.044 144.645 L
322.179 144.645 L
323.313 144.645 L
324.448 144.645 L
325.583 144.645 L
326.717 144.645 L
327.852 144.645 L
328.987 144.645 L
330.121 144.645 L
331.256 144.645 L
332.391 144.645 L
333.525 144.645 L
334.66 144.645 L
335.795 144.645 L
336.93 144.645 L
338.064 144.645 L
339.199 144.645 L
340.334 144.645 L
341.468 144.645 L
342.603 144.645 L
343.738 144.645 L
344.872 144.645 L
346.007 144.645 L
347.142 144.645 L
348.276 144.645 L
349.411 144.645 L
350.546 144.645 L
351.68 144.645 L
352.815 144.645 L
353.95 144.645 L
355.084 144.645 L
356.219 144.645 L
357.354 144.645 L
358.488 144.645 L
359.623 144.645 L
360.758 144.645 L
361.892 144.645 L
363.027 144.645 L
364.162 144.645 L
365.296 144.645 L
366.431 144.645 L
367.566 144.645 L
368.7 144.645 L
369.835 144.645 L
370.97 144.645 L
372.104 144.645 L
373.239 144.645 L
374.374 144.645 L
375.508 144.645 L
376.643 144.645 L
377.778 144.645 L
378.912 144.645 L
380.047 144.645 L
381.182 144.645 L
382.316 144.645 L
383.451 144.645 L
384.586 144.645 L
385.721 144.645 L
386.855 144.645 L
387.99 144.645 L
389.125 144.645 L
390.259 144.645 L
391.394 144.645 L
392.529 144.645 L
393.663 144.645 L
394.798 144.645 L
395.933 144.645 L
397.067 144.645 L
398.202 144.645 L
399.337 144.645 L
400.471 144.645 L
401.606 144.645 L
402.741 144.645 L
403.875 144.645 L
405.01 144.645 L
406.145 144.645 L
407.279 144.645 L
408.414 144.645 L
409.549 144.645 L
410.683 144.645 L
411.818 144.645 L
412.953 144.645 L
414.087 144.645 L
415.222 144.645 L
416.357 144.645 L
417.491 144.645 L
418.626 144.645 L
419.761 144.645 L
420.895 144.645 L
422.03 144.645 L
423.165 144.645 L
424.299 144.645 L
425.434 144.645 L
426.569 144.645 L
427.703 144.645 L
428.838 144.645 L
429.973 144.645 L
431.108 144.645 L
432.242 144.645 L
433.377 144.645 L
434.512 144.645 L
435.646 144.645 L
436.781 144.645 L
437.916 144.645 L
439.05 144.645 L
440.185 144.645 L
441.32 144.645 L
442.454 144.645 L
443.589 144.645 L
444.724 144.645 L
445.858 144.645 L
446.993 144.645 L
448.128 144.645 L
449.262 144.645 L
450.397 144.645 L
451.532 144.645 L
452.666 144.645 L
453.801 144.645 L
454.936 144.645 L
456.07 144.645 L
457.205 144.645 L
458.34 144.645 L
459.474 144.645 L
460.609 144.645 L
461.744 144.645 L
462.878 144.645 L
464.013 144.645 L
465.148 144.645 L
466.282 144.645 L
467.417 144.645 L
468.552 144.645 L
469.686 144.645 L
470.821 144.645 L
471.956 144.645 L
473.09 144.645 L
474.225 144.645 L
475.36 144.645 L
476.495 144.645 L
477.629 144.645 L
478.764 144.645 L
479.899 144.645 L
481.033 144.645 L
482.168 144.645 L
483.303 144.645 L
484.437 144.645 L
485.572 144.645 L
486.707 144.645 L
487.841 144.645 L
488.976 144.645 L
490.111 144.645 L
491.245 144.645 L
492.38 144.645 L
493.515 144.645 L
494.649 144.645 L
495.784 144.645 L
496.919 144.645 L
498.053 144.645 L
499.188 144.645 L
500.323 144.645 L
501.457 144.645 L
502.592 144.645 L
503.727 144.645 L
504.861 144.645 L
505.996 144.645 L
507.043 144.645 L
S
GR
GS
[0.75 0 0 0.75 0 0] CT
1 GC
N
379 231 M
379 161 L
464 161 L
464 231 L
cp
f
GR
GS
[0.75 0 0 0.75 312 128.30396] CT
/Helvetica 12 F
GS
[1 0 0 1 0 0] CT
0 5 moveto 
1 -1 scale
(odhad a) t 
GR
GR
GS
[0.75 0 0 0.75 0 0] CT
1 0 0 RC
1 LJ
0.667 LW
N
383 171.072 M
413 171.072 L
S
GR
GS
[0.75 0 0 0.75 312 140.76798] CT
/Helvetica 12 F
GS
[1 0 0 1 0 0] CT
0 5 moveto 
1 -1 scale
(a) t 
GR
GR
GS
[0.75 0 0 0.75 0 0] CT
1 LJ
0.667 LW
N
383 187.691 M
413 187.691 L
S
GR
GS
[0.75 0 0 0.75 312 153.23202] CT
/Helvetica 12 F
GS
[1 0 0 1 0 0] CT
0 5 moveto 
1 -1 scale
(odhad b) t 
GR
GR
GS
[0.75 0 0 0.75 0 0] CT
0 1 0 RC
1 LJ
0.667 LW
N
383 204.309 M
413 204.309 L
S
GR
GS
[0.75 0 0 0.75 312 165.69604] CT
/Helvetica 12 F
GS
[1 0 0 1 0 0] CT
0 5 moveto 
1 -1 scale
(b) t 
GR
GR
GS
[0.75 0 0 0.75 0 0] CT
1 LJ
0.667 LW
N
383 220.928 M
413 220.928 L
S
GR
GS
[0.75 0 0 0.75 0 0] CT
0.149 GC
10.0 ML
0.667 LW
N
379 231 M
379 161 L
464 161 L
464 231 L
cp
S
GR
%%Trailer
%%Pages: 1
%%EOF
