{
  "scripts": {
	"pre-autoload-dump": [
	  "rm -rf vendor/bacon/bacon-qr-code/test",
	  "rm -rf vendor/dasprid/enum/test",
	  "rm -rf vendor/dragonbe/vies/bin",
	  "rm -rf vendor/dragonbe/vies/docs",
	  "rm -rf vendor/dragonbe/vies/tests",
	  "rm -rf vendor/dragonbe/vies/examples",
	  "rm -rf vendor/doctrine/collections/docs",
	  "rm -rf vendor/heureka/inflection/examples",
	  "rm -rf vendor/heureka/inflection/tests",
	  "rm -rf vendor/heureka/overeno-zakazniky/docs",
	  "rm -rf vendor/heureka/overeno-zakazniky/examples",
	  "rm -rf vendor/heureka/overeno-zakazniky/tests",
	  "rm -rf vendor/php-di/invoker/doc",
	  "rm -rf vendor/heureka/overeno-zakazniky/examples",
	  "rm -rf vendor/wpify/custom-fields/docs"
	]
  },
  "require": {
	"doctrine/collections": "^1.6",
	"dragonbe/vies": "^2.1",
	"h4kuna/ares": "^1.4",
	"heureka/inflection": "^3.0",
	"heureka/overeno-zakazniky": "^3.0",
	"spatie/array-to-xml": "^2.16",
	"wpify/core": "^4.3",
	"wpify/custom-fields": "^3.4",
	"psr/log": "1.1.4",
	"rikudou/czqrpayment": "^5.3",
	"rikudou/skqrpayment": "^4.1",
	"endroid/qr-code": "4.5.0",
	"monolog/monolog": "2.3.5",
	"wpify/model": "^3"
  }
}
