%!PS-Adobe-3.0 EPSF-3.0
%%Creator: cairo 1.14.6 (http://cairographics.org)
%%CreationDate: Tue Feb  6 22:56:34 2018
%%Pages: 1
%%DocumentData: Clean7Bit
%%LanguageLevel: 2
%%BoundingBox: 27 725 1848 1150
%%EndComments
%%BeginProlog
save
50 dict begin
/q { gsave } bind def
/Q { grestore } bind def
/cm { 6 array astore concat } bind def
/w { setlinewidth } bind def
/J { setlinecap } bind def
/j { setlinejoin } bind def
/M { setmiterlimit } bind def
/d { setdash } bind def
/m { moveto } bind def
/l { lineto } bind def
/c { curveto } bind def
/h { closepath } bind def
/re { exch dup neg 3 1 roll 5 3 roll moveto 0 rlineto
      0 exch rlineto 0 rlineto closepath } bind def
/S { stroke } bind def
/f { fill } bind def
/f* { eofill } bind def
/n { newpath } bind def
/W { clip } bind def
/W* { eoclip } bind def
/BT { } bind def
/ET { } bind def
/pdfmark where { pop globaldict /?pdfmark /exec load put }
    { globaldict begin /?pdfmark /pop load def /pdfmark
    /cleartomark load def end } ifelse
/BDC { mark 3 1 roll /BDC pdfmark } bind def
/EMC { mark /EMC pdfmark } bind def
/cairo_store_point { /cairo_point_y exch def /cairo_point_x exch def } def
/Tj { show currentpoint cairo_store_point } bind def
/TJ {
  {
    dup
    type /stringtype eq
    { show } { -0.001 mul 0 cairo_font_matrix dtransform rmoveto } ifelse
  } forall
  currentpoint cairo_store_point
} bind def
/cairo_selectfont { cairo_font_matrix aload pop pop pop 0 0 6 array astore
    cairo_font exch selectfont cairo_point_x cairo_point_y moveto } bind def
/Tf { pop /cairo_font exch def /cairo_font_matrix where
      { pop cairo_selectfont } if } bind def
/Td { matrix translate cairo_font_matrix matrix concatmatrix dup
      /cairo_font_matrix exch def dup 4 get exch 5 get cairo_store_point
      /cairo_font where { pop cairo_selectfont } if } bind def
/Tm { 2 copy 8 2 roll 6 array astore /cairo_font_matrix exch def
      cairo_store_point /cairo_font where { pop cairo_selectfont } if } bind def
/g { setgray } bind def
/rg { setrgbcolor } bind def
/d1 { setcachedevice } bind def
%%EndProlog
%%BeginSetup
%%EndSetup
%%Page: 1 1
%%BeginPageSetup
%%PageBoundingBox: 27 725 1848 1150
%%EndPageSetup
q 27 725 1821 425 rectclip q
0.8 0.133333 0.160784 rg
1383.992 1042.605 m 1369.246 1042.605 1362.352 1033.75 1361.367 1028.828
 c 1360.395 1023.906 1353.5 1014.074 1353.5 1008.168 c 1353.5 1002.273 1353.5
 989.484 1362.352 986.527 c 1371.203 983.578 1377.117 990.465 1382.027 993.414
 c 1386.949 997.344 1393.828 1002.266 1395.805 1009.152 c 1396.777 1015.047
 1398.75 1024.891 1399.734 1029.801 c 1399.742 1034.734 1398.762 1041.621
 1383.992 1042.605 c h
636.438 1109.488 m 637.422 1113.418 638.402 1120.305 629.551 1117.359 c
 619.719 1115.395 563.648 1103.586 535.129 1095.715 c 506.598 1086.863 452.496
 1070.141 404.305 1051.457 c 357.09 1032.77 302.988 1008.168 275.449 992.441
 c 257.746 1012.109 221.344 1057.359 209.547 1074.082 c 197.746 1090.801
 164.293 1134.078 159.383 1140.965 c 154.469 1148.836 150.531 1150.801 144.625
 1147.852 c 137.738 1144.906 130.852 1127.191 130.852 1116.375 c 130.852
 1105.559 133.801 1089.82 140.688 1080.969 c 146.59 1073.098 179.051 1030.805
 186.922 1018.996 c 194.789 1008.18 224.301 972.77 229.215 966.867 c 224.301
 963.918 165.277 927.52 141.668 911.789 c 118.059 896.043 44.289 843.902
 37.402 837.027 c 29.531 830.129 24.621 822.262 29.531 813.41 c 34.453 805.539
 44.289 791.766 52.156 788.828 c 60.027 784.898 69.863 784.898 76.75 789.82
 c 83.637 795.703 127.895 830.141 146.582 841.949 c 164.285 853.746 206.578
 883.25 219.371 891.121 c 231.168 898.988 261.664 918.668 269.535 921.617
 c 276.422 914.738 303.961 885.234 323.637 867.523 c 344.297 848.824 391.516
 806.531 434.793 781.93 c 478.07 757.352 525.285 735.707 578.406 728.828
 c 628.57 721.934 675.785 727.836 699.395 737.68 c 709.23 740.629 717.098
 743.566 718.082 745.551 c 719.062 748.5 723.984 755.395 722.992 759.324
 c 722.012 763.254 720.047 765.211 716.105 762.273 c 710.211 759.324 685.609
 754.402 662.996 754.402 c 639.387 755.395 606.926 757.352 580.371 766.203
 c 549.875 776.047 502.66 793.75 465.285 818.332 c 424.957 843.902 386.594
 875.383 367.906 894.078 c 349.328 911.918 331.602 930.625 314.785 950.137
 c 331.508 960.953 369.871 983.578 399.375 999.316 c 428.887 1014.074 479.051
 1038.656 518.387 1053.422 c 556.754 1067.195 598.066 1079.977 607.898 1081.941
 c 617.734 1084.898 622.656 1086.863 626.586 1090.801 c 629.551 1093.75 
634.473 1102.602 636.438 1109.488 c h
636.438 1109.488 m f*
1844.34 958.996 m 1840.41 960.961 1835.488 957.031 1830.566 953.102 c 1824.68
 948.18 1789.262 922.609 1773.535 910.809 c 1756.793 899.98 1715.492 873.418
 1709.586 870.48 c 1703.703 867.531 1694.84 864.574 1688.938 868.523 c 1683.031
 872.453 1675.16 892.121 1670.238 902.949 c 1666.309 913.754 1657.457 941.305
 1639.746 956.059 c 1622.059 971.797 1597.449 973.762 1566.965 971.797 c
 1536.48 969.832 1508.941 961.965 1480.41 944.262 c 1450.906 925.566 1436.141
 904.914 1430.258 893.113 c 1422.367 889.184 1408.613 881.316 1393.855 877.367
 c 1379.09 872.465 1362.379 869.496 1356.484 875.41 c 1351.562 881.316 1357.457
 899.992 1359.434 908.852 c 1361.387 917.703 1369.277 935.41 1370.238 944.27
 c 1371.23 952.141 1374.188 960.992 1366.309 962.957 c 1357.457 964.922 
1338.781 961.973 1323.031 955.086 c 1307.305 948.199 1291.555 937.383 1273.859
 923.609 c 1256.156 909.836 1224.672 886.219 1206.965 886.219 c 1190.246
 886.219 1185.324 892.121 1182.387 900.984 c 1180.41 910.828 1187.309 936.402
 1190.254 943.277 c 1193.203 950.164 1199.105 965.902 1200.098 969.832 c
 1214.844 970.816 1255.176 976.719 1263.043 976.719 c 1269.922 976.719 1275.824
 981.633 1277.809 985.574 c 1280.758 989.504 1286.664 1000.328 1287.637 
1006.223 c 1288.629 1012.129 1288.629 1019.996 1285.68 1019.996 c 1281.75
 1019.996 1266.984 1019.996 1256.176 1018.031 c 1245.352 1016.059 1226.656
 1012.129 1218.785 1012.129 c 1225.684 1024.91 1239.457 1049.5 1248.289 
1062.293 c 1258.133 1074.09 1268.957 1090.82 1272.887 1094.75 c 1276.816
 1098.691 1277.809 1107.535 1269.922 1108.527 c 1262.051 1109.52 1249.27
 1110.492 1239.445 1108.527 c 1228.621 1106.562 1223.699 1104.598 1218.773
 1097.711 c 1212.891 1090.82 1196.148 1073.117 1185.332 1054.434 c 1173.535
 1036.727 1158.777 1011.156 1152.863 997.383 c 1142.055 994.434 1128.281
 990.496 1121.406 989.512 c 1113.516 988.531 1103.699 983.609 1101.727 977.711
 c 1098.777 971.809 1095.84 964.922 1100.734 961.973 c 1105.656 959.027 
1109.586 957.062 1116.484 958.035 c 1123.359 960.008 1130.258 961.973 1135.16
 960.992 c 1132.211 953.121 1121.406 927.551 1118.438 918.695 c 1108.613
 903.93 1089.918 889.195 1077.137 889.195 c 1062.371 889.195 1055.492 901.977
 1046.641 915.75 c 1036.797 929.504 1027.945 942.297 1018.102 952.141 c 
1007.883 961.184 993.5 963.836 980.727 959.027 c 967.945 953.133 952.207
 940.34 933.512 929.504 c 915.797 917.703 875.48 892.133 870.555 895.078
 c 865.645 897.055 869.574 909.844 871.547 916.723 c 873.512 923.617 880.402
 945.262 882.367 952.141 c 884.332 959.027 882.367 962.957 874.496 963.949
 c 867.609 964.93 853.836 964.93 841.055 957.062 c 828.262 948.211 813.504
 931.488 802.688 921.645 c 792.855 910.836 757.445 883.289 736.785 884.273
 c 715.145 884.273 706.293 910.828 702.363 921.645 c 697.438 932.473 689.57
 957.062 683.664 963.949 c 676.777 970.836 671.867 974.766 657.109 976.73
 c 641.371 978.695 616.781 980.66 593.172 976.73 c 568.582 971.809 537.105
 960.992 506.617 932.473 c 475.141 904.922 464.312 879.352 473.176 850.828
 c 482.027 822.289 519.41 823.281 546.949 828.203 c 575.477 832.133 628.59
 850.828 655.156 870.5 c 668.93 854.77 688.598 840.004 713.188 840.996 c
 737.77 841.988 757.445 854.77 767.293 861.645 c 778.109 867.551 800.734
 885.266 807.621 888.203 c 805.656 880.332 795.82 858.699 800.734 848.855
 c 805.645 839.012 817.457 837.055 830.246 839.012 c 843.027 840.984 864.672
 851.793 877.465 859.68 c 890.246 867.551 913.863 883.281 928.609 891.141
 c 943.367 899.992 964.027 914.758 972.879 912.781 c 981.73 910.828 985.66
 903.93 989.598 895.078 c 1001.398 869.508 1009.277 838.047 1038.789 836.074
 c 1067.312 834.098 1095.84 860.652 1111.57 875.422 c 1114.52 858.699 1124.352
 837.066 1145.012 833.125 c 1165.684 829.195 1182.406 835.082 1201.082 844.926
 c 1219.777 854.77 1241.41 868.543 1253.211 876.402 c 1265.992 885.254 1296.488
 905.906 1304.375 908.852 c 1300.445 900 1292.559 871.48 1291.574 861.637
 c 1291.574 851.793 1298.473 838.039 1314.199 834.09 c 1329.949 831.141 
1350.602 835.082 1361.418 839.012 c 1373.234 841.977 1419.461 859.68 1426.336
 860.652 c 1428.312 851.801 1437.164 836.074 1457.816 831.152 c 1477.492
 827.223 1494.215 829.195 1509.941 831.152 c 1526.664 834.098 1552.258 840.996
 1566.012 847.871 c 1579.785 853.777 1604.387 864.594 1611.262 868.543 c
 1616.184 859.691 1637.82 819.352 1676.184 819.352 c 1707.66 818.359 1738.156
 844.926 1756.832 857.707 c 1772.582 869.508 1798.152 889.184 1811.93 900.984
 c 1824.711 912.781 1843.406 929.504 1845.371 935.41 c 1848.27 941.285 1848.27
 957.023 1844.34 958.996 c h
639.387 911.789 m 636.438 899.973 626.605 895.051 616.762 887.191 c 606.918
 879.332 583.32 873.418 567.578 871.461 c 551.84 870.469 536.102 867.531
 532.164 881.305 c 527.242 897.035 548.883 923.602 565.605 933.434 c 582.328
 943.258 606.918 950.145 619.707 950.145 c 627.578 950.145 637.41 948.18
 639.379 942.277 c 642.344 936.371 642.344 923.582 639.387 911.789 c h
1607.285 919.648 m 1606.293 906.867 1597.441 895.051 1585.641 886.199 c
 1573.844 876.375 1544.32 865.547 1530.566 864.555 c 1515.801 862.598 1498.094
 863.582 1490.234 878.328 c 1483.34 893.094 1515.809 925.547 1533.512 935.379
 c 1551.215 944.242 1575.809 950.137 1590.562 947.188 c 1610.23 944.242 
1608.277 932.441 1607.285 919.648 c h
1607.285 919.648 m f*
Q Q
showpage
%%Trailer
end restore
%%EOF
