%YAML 1.1
%TAG !u! tag:unity3d.com,2011:
--- !u!1045 &1
EditorBuildSettings:
  m_ObjectHideFlags: 0
  serializedVersion: 2
  m_Scenes:
  - enabled: 1
    path: Assets/Scenes/LobbyScene.unity
    guid: 3adb158719a2fde47b23f83f67d010c9
  - enabled: 1
    path: Assets/Scenes/DeathRaceScene.unity
    guid: ea47d480149388e46a323b6761edc116
  - enabled: 1
    path: Assets/Scenes/RacingScene.unity
    guid: 571495b85abc4ff44bf44ec7a805c55e
  m_configObjects: {}
