%YAML 1.1
%TAG !u! tag:unity3d.com,2011:
--- !u!29 &1
OcclusionCullingSettings:
  m_ObjectHideFlags: 0
  serializedVersion: 2
  m_OcclusionBakeSettings:
    smallestOccluder: 5
    smallestHole: 0.25
    backfaceThreshold: 100
  m_SceneGUID: 00000000000000000000000000000000
  m_OcclusionCullingData: {fileID: 0}
--- !u!104 &2
RenderSettings:
  m_ObjectHideFlags: 0
  serializedVersion: 9
  m_Fog: 0
  m_FogColor: {r: 1, g: 0.8941177, b: 0.7352941, a: 0.584}
  m_FogMode: 2
  m_FogDensity: 0.04
  m_LinearFogStart: 0
  m_LinearFogEnd: 300
  m_AmbientSkyColor: {r: 0.36862746, g: 0.34901962, b: 0.34117648, a: 1}
  m_AmbientEquatorColor: {r: 0.114, g: 0.125, b: 0.133, a: 1}
  m_AmbientGroundColor: {r: 0.047, g: 0.043, b: 0.035, a: 1}
  m_AmbientIntensity: 2
  m_AmbientMode: 0
  m_SubtractiveShadowColor: {r: 0.42, g: 0.478, b: 0.627, a: 1}
  m_SkyboxMaterial: {fileID: 10304, guid: 0000000000000000f000000000000000, type: 0}
  m_HaloStrength: 0.5
  m_FlareStrength: 1
  m_FlareFadeSpeed: 3
  m_HaloTexture: {fileID: 0}
  m_SpotCookie: {fileID: 10001, guid: 0000000000000000e000000000000000, type: 0}
  m_DefaultReflectionMode: 0
  m_DefaultReflectionResolution: 128
  m_ReflectionBounces: 1
  m_ReflectionIntensity: 1
  m_CustomReflection: {fileID: 0}
  m_Sun: {fileID: 800356373}
  m_IndirectSpecularColor: {r: 0.45110965, g: 0.5009104, b: 0.5740295, a: 1}
  m_UseRadianceAmbientProbe: 0
--- !u!157 &3
LightmapSettings:
  m_ObjectHideFlags: 0
  serializedVersion: 12
  m_GIWorkflowMode: 0
  m_GISettings:
    serializedVersion: 2
    m_BounceScale: 1
    m_IndirectOutputScale: 1
    m_AlbedoBoost: 1
    m_EnvironmentLightingMode: 0
    m_EnableBakedLightmaps: 1
    m_EnableRealtimeLightmaps: 1
  m_LightmapEditorSettings:
    serializedVersion: 12
    m_Resolution: 2
    m_BakeResolution: 40
    m_AtlasSize: 1024
    m_AO: 0
    m_AOMaxDistance: 1
    m_CompAOExponent: 1
    m_CompAOExponentDirect: 0
    m_ExtractAmbientOcclusion: 0
    m_Padding: 2
    m_LightmapParameters: {fileID: 0}
    m_LightmapsBakeMode: 1
    m_TextureCompression: 1
    m_FinalGather: 0
    m_FinalGatherFiltering: 1
    m_FinalGatherRayCount: 256
    m_ReflectionCompression: 2
    m_MixedBakeMode: 1
    m_BakeBackend: 0
    m_PVRSampling: 1
    m_PVRDirectSampleCount: 32
    m_PVRSampleCount: 512
    m_PVRBounces: 2
    m_PVREnvironmentSampleCount: 512
    m_PVREnvironmentReferencePointCount: 2048
    m_PVRFilteringMode: 0
    m_PVRDenoiserTypeDirect: 0
    m_PVRDenoiserTypeIndirect: 0
    m_PVRDenoiserTypeAO: 0
    m_PVRFilterTypeDirect: 0
    m_PVRFilterTypeIndirect: 0
    m_PVRFilterTypeAO: 0
    m_PVREnvironmentMIS: 0
    m_PVRCulling: 1
    m_PVRFilteringGaussRadiusDirect: 1
    m_PVRFilteringGaussRadiusIndirect: 5
    m_PVRFilteringGaussRadiusAO: 2
    m_PVRFilteringAtrousPositionSigmaDirect: 0.5
    m_PVRFilteringAtrousPositionSigmaIndirect: 2
    m_PVRFilteringAtrousPositionSigmaAO: 1
    m_ExportTrainingData: 0
    m_TrainingDataDestination: TrainingData
    m_LightProbeSampleCountMultiplier: 4
  m_LightingDataAsset: {fileID: 0}
  m_LightingSettings: {fileID: 4890085278179872738, guid: 8b2cd5557967871458b11c733e8a0e36, type: 2}
--- !u!196 &4
NavMeshSettings:
  serializedVersion: 2
  m_ObjectHideFlags: 0
  m_BuildSettings:
    serializedVersion: 2
    agentTypeID: 0
    agentRadius: 0.5
    agentHeight: 2
    agentSlope: 45
    agentClimb: 0.4
    ledgeDropHeight: 0
    maxJumpAcrossDistance: 0
    minRegionArea: 2
    manualCellSize: 0
    cellSize: 0.16666667
    manualTileSize: 0
    tileSize: 256
    accuratePlacement: 0
    maxJobWorkers: 0
    preserveTilesOutsideBounds: 0
    debug:
      m_Flags: 0
  m_NavMeshData: {fileID: 0}
--- !u!1001 &797950420
PrefabInstance:
  m_ObjectHideFlags: 0
  serializedVersion: 2
  m_Modification:
    m_TransformParent: {fileID: 0}
    m_Modifications:
    - target: {fileID: 100000, guid: 1f7aa4d40edff6e48b549003cad031e1, type: 3}
      propertyPath: m_IsActive
      value: 1
      objectReference: {fileID: 0}
    - target: {fileID: 400000, guid: 1f7aa4d40edff6e48b549003cad031e1, type: 3}
      propertyPath: m_RootOrder
      value: 1
      objectReference: {fileID: 0}
    - target: {fileID: 400000, guid: 1f7aa4d40edff6e48b549003cad031e1, type: 3}
      propertyPath: m_LocalPosition.x
      value: -4.2271986
      objectReference: {fileID: 0}
    - target: {fileID: 400000, guid: 1f7aa4d40edff6e48b549003cad031e1, type: 3}
      propertyPath: m_LocalPosition.y
      value: 0.78
      objectReference: {fileID: 0}
    - target: {fileID: 400000, guid: 1f7aa4d40edff6e48b549003cad031e1, type: 3}
      propertyPath: m_LocalPosition.z
      value: -15.16
      objectReference: {fileID: 0}
    - target: {fileID: 400000, guid: 1f7aa4d40edff6e48b549003cad031e1, type: 3}
      propertyPath: m_LocalRotation.w
      value: 1
      objectReference: {fileID: 0}
    - target: {fileID: 400000, guid: 1f7aa4d40edff6e48b549003cad031e1, type: 3}
      propertyPath: m_LocalRotation.x
      value: 0
      objectReference: {fileID: 0}
    - target: {fileID: 400000, guid: 1f7aa4d40edff6e48b549003cad031e1, type: 3}
      propertyPath: m_LocalRotation.y
      value: 0
      objectReference: {fileID: 0}
    - target: {fileID: 400000, guid: 1f7aa4d40edff6e48b549003cad031e1, type: 3}
      propertyPath: m_LocalRotation.z
      value: 0
      objectReference: {fileID: 0}
    - target: {fileID: 19800000, guid: 1f7aa4d40edff6e48b549003cad031e1, type: 3}
      propertyPath: prewarm
      value: 1
      objectReference: {fileID: 0}
    - target: {fileID: 19800000, guid: 1f7aa4d40edff6e48b549003cad031e1, type: 3}
      propertyPath: randomSeed
      value: -423300923
      objectReference: {fileID: 0}
    - target: {fileID: 19800000, guid: 1f7aa4d40edff6e48b549003cad031e1, type: 3}
      propertyPath: InitialModule.startSize.scalar
      value: 25
      objectReference: {fileID: 0}
    - target: {fileID: 19800000, guid: 1f7aa4d40edff6e48b549003cad031e1, type: 3}
      propertyPath: InitialModule.startSize.minScalar
      value: 15.0000
      objectReference: {fileID: 0}
    - target: {fileID: 19800000, guid: 1f7aa4d40edff6e48b549003cad031e1, type: 3}
      propertyPath: EmissionModule.rateOverTime.scalar
      value: 80
      objectReference: {fileID: 0}
    - target: {fileID: 19800000, guid: 1f7aa4d40edff6e48b549003cad031e1, type: 3}
      propertyPath: InitialModule.startColor.maxColor.b
      value: 0.6627451
      objectReference: {fileID: 0}
    - target: {fileID: 19800000, guid: 1f7aa4d40edff6e48b549003cad031e1, type: 3}
      propertyPath: InitialModule.startColor.maxColor.g
      value: 0.8235294
      objectReference: {fileID: 0}
    - target: {fileID: 19800000, guid: 1f7aa4d40edff6e48b549003cad031e1, type: 3}
      propertyPath: InitialModule.startColor.maxColor.r
      value: 0.99215686
      objectReference: {fileID: 0}
    - target: {fileID: 19800000, guid: 1f7aa4d40edff6e48b549003cad031e1, type: 3}
      propertyPath: InitialModule.startColor.minColor.b
      value: 0.40784314
      objectReference: {fileID: 0}
    - target: {fileID: 19800000, guid: 1f7aa4d40edff6e48b549003cad031e1, type: 3}
      propertyPath: InitialModule.startColor.minColor.g
      value: 0.57254905
      objectReference: {fileID: 0}
    - target: {fileID: 19800000, guid: 1f7aa4d40edff6e48b549003cad031e1, type: 3}
      propertyPath: InitialModule.startColor.minColor.r
      value: 0.6117647
      objectReference: {fileID: 0}
    - target: {fileID: 19800000, guid: 1f7aa4d40edff6e48b549003cad031e1, type: 3}
      propertyPath: InitialModule.startRotationX.scalar
      value: 3.1415927
      objectReference: {fileID: 0}
    - target: {fileID: 19800000, guid: 1f7aa4d40edff6e48b549003cad031e1, type: 3}
      propertyPath: InitialModule.startRotationY.scalar
      value: 3.1415927
      objectReference: {fileID: 0}
    - target: {fileID: 19800000, guid: 1f7aa4d40edff6e48b549003cad031e1, type: 3}
      propertyPath: InitialModule.startSizeY.minMaxState
      value: 3
      objectReference: {fileID: 0}
    - target: {fileID: 19800000, guid: 1f7aa4d40edff6e48b549003cad031e1, type: 3}
      propertyPath: InitialModule.startSizeZ.minMaxState
      value: 3
      objectReference: {fileID: 0}
    - target: {fileID: 19800000, guid: 1f7aa4d40edff6e48b549003cad031e1, type: 3}
      propertyPath: ColorModule.gradient.maxGradient.atime1
      value: 13493
      objectReference: {fileID: 0}
    - target: {fileID: 19800000, guid: 1f7aa4d40edff6e48b549003cad031e1, type: 3}
      propertyPath: ColorModule.gradient.maxGradient.atime2
      value: 44140
      objectReference: {fileID: 0}
    - target: {fileID: 19800000, guid: 1f7aa4d40edff6e48b549003cad031e1, type: 3}
      propertyPath: InitialModule.startRotationX.minMaxState
      value: 3
      objectReference: {fileID: 0}
    - target: {fileID: 19800000, guid: 1f7aa4d40edff6e48b549003cad031e1, type: 3}
      propertyPath: InitialModule.startRotationY.minMaxState
      value: 3
      objectReference: {fileID: 0}
    - target: {fileID: 19800000, guid: 1f7aa4d40edff6e48b549003cad031e1, type: 3}
      propertyPath: InitialModule.startSize.maxCurve.m_RotationOrder
      value: 0
      objectReference: {fileID: 0}
    - target: {fileID: 19800000, guid: 1f7aa4d40edff6e48b549003cad031e1, type: 3}
      propertyPath: InitialModule.startSize.minCurve.m_RotationOrder
      value: 0
      objectReference: {fileID: 0}
    - target: {fileID: 19800000, guid: 1f7aa4d40edff6e48b549003cad031e1, type: 3}
      propertyPath: InitialModule.startSizeY.maxCurve.m_RotationOrder
      value: 0
      objectReference: {fileID: 0}
    - target: {fileID: 19800000, guid: 1f7aa4d40edff6e48b549003cad031e1, type: 3}
      propertyPath: InitialModule.startSizeY.minCurve.m_RotationOrder
      value: 0
      objectReference: {fileID: 0}
    - target: {fileID: 19800000, guid: 1f7aa4d40edff6e48b549003cad031e1, type: 3}
      propertyPath: InitialModule.startSizeZ.maxCurve.m_RotationOrder
      value: 0
      objectReference: {fileID: 0}
    - target: {fileID: 19800000, guid: 1f7aa4d40edff6e48b549003cad031e1, type: 3}
      propertyPath: InitialModule.startSizeZ.minCurve.m_RotationOrder
      value: 0
      objectReference: {fileID: 0}
    - target: {fileID: 19800000, guid: 1f7aa4d40edff6e48b549003cad031e1, type: 3}
      propertyPath: InitialModule.startSizeY.maxCurve.m_Curve.Array.size
      value: 1
      objectReference: {fileID: 0}
    - target: {fileID: 19800000, guid: 1f7aa4d40edff6e48b549003cad031e1, type: 3}
      propertyPath: InitialModule.startSizeY.minCurve.m_Curve.Array.size
      value: 1
      objectReference: {fileID: 0}
    - target: {fileID: 19800000, guid: 1f7aa4d40edff6e48b549003cad031e1, type: 3}
      propertyPath: InitialModule.startSizeZ.maxCurve.m_Curve.Array.size
      value: 1
      objectReference: {fileID: 0}
    - target: {fileID: 19800000, guid: 1f7aa4d40edff6e48b549003cad031e1, type: 3}
      propertyPath: InitialModule.startSizeZ.minCurve.m_Curve.Array.size
      value: 1
      objectReference: {fileID: 0}
    - target: {fileID: 19800000, guid: 1f7aa4d40edff6e48b549003cad031e1, type: 3}
      propertyPath: InitialModule.startRotationX.maxCurve.m_RotationOrder
      value: 0
      objectReference: {fileID: 0}
    - target: {fileID: 19800000, guid: 1f7aa4d40edff6e48b549003cad031e1, type: 3}
      propertyPath: InitialModule.startRotationX.minCurve.m_RotationOrder
      value: 0
      objectReference: {fileID: 0}
    - target: {fileID: 19800000, guid: 1f7aa4d40edff6e48b549003cad031e1, type: 3}
      propertyPath: InitialModule.startRotationY.maxCurve.m_RotationOrder
      value: 0
      objectReference: {fileID: 0}
    - target: {fileID: 19800000, guid: 1f7aa4d40edff6e48b549003cad031e1, type: 3}
      propertyPath: InitialModule.startRotationY.minCurve.m_RotationOrder
      value: 0
      objectReference: {fileID: 0}
    - target: {fileID: 19800000, guid: 1f7aa4d40edff6e48b549003cad031e1, type: 3}
      propertyPath: InitialModule.startRotationX.maxCurve.m_Curve.Array.size
      value: 1
      objectReference: {fileID: 0}
    - target: {fileID: 19800000, guid: 1f7aa4d40edff6e48b549003cad031e1, type: 3}
      propertyPath: InitialModule.startRotationX.minCurve.m_Curve.Array.size
      value: 1
      objectReference: {fileID: 0}
    - target: {fileID: 19800000, guid: 1f7aa4d40edff6e48b549003cad031e1, type: 3}
      propertyPath: InitialModule.startRotationY.maxCurve.m_Curve.Array.size
      value: 1
      objectReference: {fileID: 0}
    - target: {fileID: 19800000, guid: 1f7aa4d40edff6e48b549003cad031e1, type: 3}
      propertyPath: InitialModule.startRotationY.minCurve.m_Curve.Array.size
      value: 1
      objectReference: {fileID: 0}
    - target: {fileID: 19800000, guid: 1f7aa4d40edff6e48b549003cad031e1, type: 3}
      propertyPath: InitialModule.startSize.maxCurve.m_Curve.Array.data[0].value
      value: 1
      objectReference: {fileID: 0}
    - target: {fileID: 19800000, guid: 1f7aa4d40edff6e48b549003cad031e1, type: 3}
      propertyPath: InitialModule.startSize.minCurve.m_Curve.Array.data[0].value
      value: 0.6
      objectReference: {fileID: 0}
    - target: {fileID: 19800000, guid: 1f7aa4d40edff6e48b549003cad031e1, type: 3}
      propertyPath: InitialModule.startSizeY.maxCurve.m_Curve.Array.data[1].time
      value: 1
      objectReference: {fileID: 0}
    - target: {fileID: 19800000, guid: 1f7aa4d40edff6e48b549003cad031e1, type: 3}
      propertyPath: InitialModule.startSizeY.minCurve.m_Curve.Array.data[1].time
      value: 1
      objectReference: {fileID: 0}
    - target: {fileID: 19800000, guid: 1f7aa4d40edff6e48b549003cad031e1, type: 3}
      propertyPath: InitialModule.startSizeZ.maxCurve.m_Curve.Array.data[1].time
      value: 1
      objectReference: {fileID: 0}
    - target: {fileID: 19800000, guid: 1f7aa4d40edff6e48b549003cad031e1, type: 3}
      propertyPath: InitialModule.startSizeZ.minCurve.m_Curve.Array.data[1].time
      value: 1
      objectReference: {fileID: 0}
    - target: {fileID: 19800000, guid: 1f7aa4d40edff6e48b549003cad031e1, type: 3}
      propertyPath: InitialModule.startSizeY.maxCurve.m_Curve.Array.data[1].value
      value: 1
      objectReference: {fileID: 0}
    - target: {fileID: 19800000, guid: 1f7aa4d40edff6e48b549003cad031e1, type: 3}
      propertyPath: InitialModule.startSizeZ.maxCurve.m_Curve.Array.data[1].value
      value: 1
      objectReference: {fileID: 0}
    - target: {fileID: 19800000, guid: 1f7aa4d40edff6e48b549003cad031e1, type: 3}
      propertyPath: InitialModule.startRotationX.maxCurve.m_Curve.Array.data[1].time
      value: 1
      objectReference: {fileID: 0}
    - target: {fileID: 19800000, guid: 1f7aa4d40edff6e48b549003cad031e1, type: 3}
      propertyPath: InitialModule.startRotationX.minCurve.m_Curve.Array.data[1].time
      value: 1
      objectReference: {fileID: 0}
    - target: {fileID: 19800000, guid: 1f7aa4d40edff6e48b549003cad031e1, type: 3}
      propertyPath: InitialModule.startRotationY.maxCurve.m_Curve.Array.data[1].time
      value: 1
      objectReference: {fileID: 0}
    - target: {fileID: 19800000, guid: 1f7aa4d40edff6e48b549003cad031e1, type: 3}
      propertyPath: InitialModule.startRotationY.minCurve.m_Curve.Array.data[1].time
      value: 1
      objectReference: {fileID: 0}
    - target: {fileID: 19800000, guid: 1f7aa4d40edff6e48b549003cad031e1, type: 3}
      propertyPath: InitialModule.startRotationX.maxCurve.m_Curve.Array.data[0].value
      value: 0
      objectReference: {fileID: 0}
    - target: {fileID: 19800000, guid: 1f7aa4d40edff6e48b549003cad031e1, type: 3}
      propertyPath: InitialModule.startRotationX.maxCurve.m_Curve.Array.data[1].value
      value: 1
      objectReference: {fileID: 0}
    - target: {fileID: 19800000, guid: 1f7aa4d40edff6e48b549003cad031e1, type: 3}
      propertyPath: InitialModule.startRotationY.maxCurve.m_Curve.Array.data[0].value
      value: 0
      objectReference: {fileID: 0}
    - target: {fileID: 19800000, guid: 1f7aa4d40edff6e48b549003cad031e1, type: 3}
      propertyPath: InitialModule.startRotationY.maxCurve.m_Curve.Array.data[1].value
      value: 1
      objectReference: {fileID: 0}
    - target: {fileID: 19900000, guid: 1f7aa4d40edff6e48b549003cad031e1, type: 3}
      propertyPath: m_SelectedEditorRenderState
      value: 0
      objectReference: {fileID: 0}
    m_RemovedComponents: []
  m_SourcePrefab: {fileID: 100100000, guid: 1f7aa4d40edff6e48b549003cad031e1, type: 3}
--- !u!108 &800356373 stripped
Light:
  m_CorrespondingSourceObject: {fileID: 7919319162104219624, guid: f8fa23fff605188469099b8da1043fa6, type: 3}
  m_PrefabInstance: {fileID: 7919319162900381693}
  m_PrefabAsset: {fileID: 0}
--- !u!1 &977081644
GameObject:
  m_ObjectHideFlags: 0
  m_CorrespondingSourceObject: {fileID: 0}
  m_PrefabInstance: {fileID: 0}
  m_PrefabAsset: {fileID: 0}
  serializedVersion: 6
  m_Component:
  - component: {fileID: 977081646}
  - component: {fileID: 977081645}
  m_Layer: 0
  m_Name: CameraHolder
  m_TagString: Untagged
  m_Icon: {fileID: 0}
  m_NavMeshLayer: 0
  m_StaticEditorFlags: 0
  m_IsActive: 1
--- !u!114 &977081645
MonoBehaviour:
  m_ObjectHideFlags: 0
  m_CorrespondingSourceObject: {fileID: 0}
  m_PrefabInstance: {fileID: 0}
  m_PrefabAsset: {fileID: 0}
  m_GameObject: {fileID: 977081644}
  m_Enabled: 1
  m_EditorHideFlags: 0
  m_Script: {fileID: 11500000, guid: ee931deb318cba84cba907784f8b7f66, type: 3}
  m_Name: 
  m_EditorClassIdentifier: 
  moveUnitsPerSecond:
    value: {x: 0, y: 0, z: 0}
    space: 1
  rotateDegreesPerSecond:
    value: {x: 0, y: 5, z: 0}
    space: 1
  ignoreTimescale: 1
--- !u!4 &977081646
Transform:
  m_ObjectHideFlags: 0
  m_CorrespondingSourceObject: {fileID: 0}
  m_PrefabInstance: {fileID: 0}
  m_PrefabAsset: {fileID: 0}
  m_GameObject: {fileID: 977081644}
  m_LocalRotation: {x: 0, y: 0.99904823, z: 0, w: 0.0436195}
  m_LocalPosition: {x: -2.44, y: 0, z: -6.38}
  m_LocalScale: {x: 1, y: 1, z: 1}
  m_Children:
  - {fileID: 1551241909}
  m_Father: {fileID: 0}
  m_RootOrder: 0
  m_LocalEulerAnglesHint: {x: 0, y: 175, z: 0}
--- !u!1 &1551241901
GameObject:
  m_ObjectHideFlags: 0
  m_CorrespondingSourceObject: {fileID: 0}
  m_PrefabInstance: {fileID: 0}
  m_PrefabAsset: {fileID: 0}
  serializedVersion: 6
  m_Component:
  - component: {fileID: 1551241909}
  - component: {fileID: 1551241908}
  - component: {fileID: 1551241906}
  - component: {fileID: 1551241905}
  - component: {fileID: 1551241903}
  - component: {fileID: 1551241914}
  - component: {fileID: 1551241915}
  - component: {fileID: 1551241902}
  - component: {fileID: 1551241904}
  m_Layer: 0
  m_Name: Main Camera
  m_TagString: MainCamera
  m_Icon: {fileID: 0}
  m_NavMeshLayer: 0
  m_StaticEditorFlags: 0
  m_IsActive: 1
--- !u!114 &1551241902
MonoBehaviour:
  m_ObjectHideFlags: 0
  m_CorrespondingSourceObject: {fileID: 0}
  m_PrefabInstance: {fileID: 0}
  m_PrefabAsset: {fileID: 0}
  m_GameObject: {fileID: 1551241901}
  m_Enabled: 1
  m_EditorHideFlags: 0
  m_Script: {fileID: 11500000, guid: 7fceaeb339b971b429c4cc600acabd13, type: 3}
  m_Name: 
  m_EditorClassIdentifier: 
  tweakMode: 0
  screenBlendMode: 1
  hdr: 0
  sepBlurSpread: 2.5
  quality: 1
  bloomIntensity: 0.1
  bloomThreshold: 0.5
  bloomThresholdColor: {r: 1, g: 1, b: 1, a: 1}
  bloomBlurIterations: 2
  hollywoodFlareBlurIterations: 2
  flareRotation: 0
  lensflareMode: 1
  hollyStretchWidth: 2.5
  lensflareIntensity: 0
  lensflareThreshold: 0.3
  lensFlareSaturation: 0.75
  flareColorA: {r: 0.4, g: 0.4, b: 0.8, a: 0.75}
  flareColorB: {r: 0.4, g: 0.8, b: 0.8, a: 0.75}
  flareColorC: {r: 0.8, g: 0.4, b: 0.8, a: 0.75}
  flareColorD: {r: 0.8, g: 0.4, b: 0, a: 0.75}
  lensFlareVignetteMask: {fileID: 2800000, guid: 95ef4804fe0be4c999ddaa383536cde8, type: 3}
  lensFlareShader: {fileID: 4800000, guid: 459fe69d2f6d74ddb92f04dbf45a866b, type: 3}
  screenBlendShader: {fileID: 4800000, guid: 7856cbff0a0ca45c787d5431eb805bb0, type: 3}
  blurAndFlaresShader: {fileID: 4800000, guid: be6e39cf196f146d5be72fbefb18ed75, type: 3}
  brightPassFilterShader: {fileID: 4800000, guid: 0aeaa4cb29f5d4e9c8455f04c8575c8c, type: 3}
--- !u!114 &1551241903
MonoBehaviour:
  m_ObjectHideFlags: 0
  m_CorrespondingSourceObject: {fileID: 0}
  m_PrefabInstance: {fileID: 0}
  m_PrefabAsset: {fileID: 0}
  m_GameObject: {fileID: 1551241901}
  m_Enabled: 1
  m_EditorHideFlags: 0
  m_Script: {fileID: 11500000, guid: b0923359e9e352a4b9b11c7b7161ad67, type: 3}
  m_Name: 
  m_EditorClassIdentifier: 
  m_Radius: 0.327
  m_SampleCount: 1
  m_OcclusionIntensity: 1
  m_Blur: 2
  m_Downsampling: 2
  m_OcclusionAttenuation: 1
  m_MinZ: 0.01
  m_SSAOShader: {fileID: 4800000, guid: 43ca18288c424f645aaa1e9e07f04c50, type: 3}
  m_RandomTexture: {fileID: 2800000, guid: a181ca8e3c62f3e4b8f183f6c586b032, type: 3}
--- !u!114 &1551241904
MonoBehaviour:
  m_ObjectHideFlags: 0
  m_CorrespondingSourceObject: {fileID: 0}
  m_PrefabInstance: {fileID: 0}
  m_PrefabAsset: {fileID: 0}
  m_GameObject: {fileID: 1551241901}
  m_Enabled: 1
  m_EditorHideFlags: 0
  m_Script: {fileID: 11500000, guid: bd70d448b18cfbc46af26466f752332c, type: 3}
  m_Name: 
  m_EditorClassIdentifier: 
  visualizeFocus: 0
  focalLength: 40.07
  focalSize: 0.05
  aperture: 0.59
  focalTransform: {fileID: 0}
  maxBlurSize: 2
  highResolution: 0
  blurType: 0
  blurSampleCount: 2
  nearBlur: 0
  foregroundOverlap: 1
  dofHdrShader: {fileID: 4800000, guid: acd613035ff3e455e8abf23fdc8c8c24, type: 3}
  dx11BokehShader: {fileID: 4800000, guid: d8e82664aa8686642a424c88ab10164a, type: 3}
  dx11BokehThreshold: 0.5
  dx11SpawnHeuristic: 0.0875
  dx11BokehTexture: {fileID: 2800000, guid: a4cdca73d61814d33ac1587f6c163bca, type: 3}
  dx11BokehScale: 1.2
  dx11BokehIntensity: 2.5
--- !u!81 &1551241905
AudioListener:
  m_ObjectHideFlags: 0
  m_CorrespondingSourceObject: {fileID: 0}
  m_PrefabInstance: {fileID: 0}
  m_PrefabAsset: {fileID: 0}
  m_GameObject: {fileID: 1551241901}
  m_Enabled: 1
--- !u!124 &1551241906
Behaviour:
  m_ObjectHideFlags: 0
  m_CorrespondingSourceObject: {fileID: 0}
  m_PrefabInstance: {fileID: 0}
  m_PrefabAsset: {fileID: 0}
  m_GameObject: {fileID: 1551241901}
  m_Enabled: 1
--- !u!20 &1551241908
Camera:
  m_ObjectHideFlags: 0
  m_CorrespondingSourceObject: {fileID: 0}
  m_PrefabInstance: {fileID: 0}
  m_PrefabAsset: {fileID: 0}
  m_GameObject: {fileID: 1551241901}
  m_Enabled: 1
  serializedVersion: 2
  m_ClearFlags: 1
  m_BackGroundColor: {r: 0.19215687, g: 0.3019608, b: 0.4745098, a: 0}
  m_projectionMatrixMode: 1
  m_GateFitMode: 2
  m_FOVAxisMode: 0
  m_SensorSize: {x: 36, y: 24}
  m_LensShift: {x: 0, y: 0}
  m_FocalLength: 50
  m_NormalizedViewPortRect:
    serializedVersion: 2
    x: 0
    y: 0
    width: 1
    height: 1
  near clip plane: 0.3
  far clip plane: 5000
  field of view: 30
  orthographic: 0
  orthographic size: 10.68
  m_Depth: -1
  m_CullingMask:
    serializedVersion: 2
    m_Bits: 4294967295
  m_RenderingPath: 1
  m_TargetTexture: {fileID: 0}
  m_TargetDisplay: 0
  m_TargetEye: 3
  m_HDR: 0
  m_AllowMSAA: 1
  m_AllowDynamicResolution: 0
  m_ForceIntoRT: 0
  m_OcclusionCulling: 1
  m_StereoConvergence: 10
  m_StereoSeparation: 0.022
--- !u!4 &1551241909
Transform:
  m_ObjectHideFlags: 0
  m_CorrespondingSourceObject: {fileID: 0}
  m_PrefabInstance: {fileID: 0}
  m_PrefabAsset: {fileID: 0}
  m_GameObject: {fileID: 1551241901}
  m_LocalRotation: {x: 0.084515974, y: -0.89641416, z: 0.19471966, w: 0.38907978}
  m_LocalPosition: {x: 29.61003, y: 18.95, z: 29.319996}
  m_LocalScale: {x: 1, y: 1, z: 1}
  m_Children: []
  m_Father: {fileID: 977081646}
  m_RootOrder: 0
  m_LocalEulerAnglesHint: {x: 29.983002, y: -135.24901, z: 0}
--- !u!114 &1551241914
MonoBehaviour:
  m_ObjectHideFlags: 0
  m_CorrespondingSourceObject: {fileID: 0}
  m_PrefabInstance: {fileID: 0}
  m_PrefabAsset: {fileID: 0}
  m_GameObject: {fileID: 1551241901}
  m_Enabled: 1
  m_EditorHideFlags: 0
  m_Script: {fileID: 11500000, guid: 76b5ec6153a1d55438228df10fe66844, type: 3}
  m_Name: 
  m_EditorClassIdentifier: 
  distanceFog: 1
  excludeFarPixels: 1
  useRadialDistance: 0
  heightFog: 1
  height: 2
  heightDensity: 2
  startDistance: 38
  fogShader: {fileID: 4800000, guid: 70d8568987ac0499f952b54c7c13e265, type: 3}
--- !u!114 &1551241915
MonoBehaviour:
  m_ObjectHideFlags: 0
  m_CorrespondingSourceObject: {fileID: 0}
  m_PrefabInstance: {fileID: 0}
  m_PrefabAsset: {fileID: 0}
  m_GameObject: {fileID: 1551241901}
  m_Enabled: 1
  m_EditorHideFlags: 0
  m_Script: {fileID: 11500000, guid: 1fd999d1b2cf94a45a5b0a47ce074bef, type: 3}
  m_Name: 
  m_EditorClassIdentifier: 
  redChannel:
    serializedVersion: 2
    m_Curve:
    - serializedVersion: 3
      time: 0
      value: 0
      inSlope: 0.8355409
      outSlope: 0.8355409
      tangentMode: 34
      weightedMode: 0
      inWeight: 0.33333334
      outWeight: 0.33333334
    - serializedVersion: 3
      time: 0.32609344
      value: 0.2724644
      inSlope: 0.98856634
      outSlope: 0.98856634
      tangentMode: 34
      weightedMode: 0
      inWeight: 0.33333334
      outWeight: 0.33333334
    - serializedVersion: 3
      time: 0.48282513
      value: 0.451388
      inSlope: 1.2835301
      outSlope: 1.2835301
      tangentMode: 34
      weightedMode: 0
      inWeight: 0.33333334
      outWeight: 0.33333334
    - serializedVersion: 3
      time: 0.69572747
      value: 0.7548736
      inSlope: 1.1155416
      outSlope: 1.1155416
      tangentMode: 34
      weightedMode: 0
      inWeight: 0.33333334
      outWeight: 0.33333334
    - serializedVersion: 3
      time: 1
      value: 1
      inSlope: 0.8056147
      outSlope: 0.8056147
      tangentMode: 34
      weightedMode: 0
      inWeight: 0.33333334
      outWeight: 0.33333334
    m_PreInfinity: 2
    m_PostInfinity: 2
    m_RotationOrder: 0
  greenChannel:
    serializedVersion: 2
    m_Curve:
    - serializedVersion: 3
      time: 0
      value: 0
      inSlope: 0.6161223
      outSlope: 0.6161223
      tangentMode: 34
      weightedMode: 0
      inWeight: 0.33333334
      outWeight: 0.33333334
    - serializedVersion: 3
      time: 0.31850186
      value: 0.1962361
      inSlope: 0.8324723
      outSlope: 0.8324723
      tangentMode: 34
      weightedMode: 0
      inWeight: 0.33333334
      outWeight: 0.33333334
    - serializedVersion: 3
      time: 0.5741206
      value: 0.46433473
      inSlope: 1.2750638
      outSlope: 1.2750638
      tangentMode: 34
      weightedMode: 0
      inWeight: 0.33333334
      outWeight: 0.33333334
    - serializedVersion: 3
      time: 0.81148344
      value: 0.82068884
      inSlope: 1.2262373
      outSlope: 1.2262373
      tangentMode: 34
      weightedMode: 0
      inWeight: 0.33333334
      outWeight: 0.33333334
    - serializedVersion: 3
      time: 1
      value: 1
      inSlope: 0.95116925
      outSlope: 0.95116925
      tangentMode: 34
      weightedMode: 0
      inWeight: 0.33333334
      outWeight: 0.33333334
    m_PreInfinity: 2
    m_PostInfinity: 2
    m_RotationOrder: 0
  blueChannel:
    serializedVersion: 2
    m_Curve:
    - serializedVersion: 3
      time: 0
      value: 0
      inSlope: 0.965184
      outSlope: 0.965184
      tangentMode: 34
      weightedMode: 0
      inWeight: 0.33333334
      outWeight: 0.33333334
    - serializedVersion: 3
      time: 0.16922064
      value: 0.16332905
      inSlope: 0.8319765
      outSlope: 0.8319765
      tangentMode: 34
      weightedMode: 0
      inWeight: 0.33333334
      outWeight: 0.33333334
    - serializedVersion: 3
      time: 0.5164789
      value: 0.40598235
      inSlope: 0.9646048
      outSlope: 0.9646048
      tangentMode: 34
      weightedMode: 0
      inWeight: 0.33333334
      outWeight: 0.33333334
    - serializedVersion: 3
      time: 0.80278414
      value: 0.75826395
      inSlope: 1.2280921
      outSlope: 1.2280921
      tangentMode: 34
      weightedMode: 0
      inWeight: 0.33333334
      outWeight: 0.33333334
    - serializedVersion: 3
      time: 1
      value: 1
      inSlope: 1.2257435
      outSlope: 1.2257435
      tangentMode: 34
      weightedMode: 0
      inWeight: 0.33333334
      outWeight: 0.33333334
    m_PreInfinity: 2
    m_PostInfinity: 2
    m_RotationOrder: 0
  useDepthCorrection: 0
  zCurve:
    serializedVersion: 2
    m_Curve:
    - serializedVersion: 3
      time: 0
      value: 0
      inSlope: 0
      outSlope: 0
      tangentMode: 0
      weightedMode: 0
      inWeight: 0.33333334
      outWeight: 0.33333334
    - serializedVersion: 3
      time: 1
      value: 1
      inSlope: 0
      outSlope: 0
      tangentMode: 0
      weightedMode: 0
      inWeight: 0.33333334
      outWeight: 0.33333334
    m_PreInfinity: 2
    m_PostInfinity: 2
    m_RotationOrder: 4
  depthRedChannel:
    serializedVersion: 2
    m_Curve:
    - serializedVersion: 3
      time: 0
      value: 0
      inSlope: 0
      outSlope: 0
      tangentMode: 0
      weightedMode: 0
      inWeight: 0.33333334
      outWeight: 0.33333334
    - serializedVersion: 3
      time: 1
      value: 1
      inSlope: 0
      outSlope: 0
      tangentMode: 0
      weightedMode: 0
      inWeight: 0.33333334
      outWeight: 0.33333334
    m_PreInfinity: 2
    m_PostInfinity: 2
    m_RotationOrder: 4
  depthGreenChannel:
    serializedVersion: 2
    m_Curve:
    - serializedVersion: 3
      time: 0
      value: 0
      inSlope: 0
      outSlope: 0
      tangentMode: 0
      weightedMode: 0
      inWeight: 0.33333334
      outWeight: 0.33333334
    - serializedVersion: 3
      time: 1
      value: 1
      inSlope: 0
      outSlope: 0
      tangentMode: 0
      weightedMode: 0
      inWeight: 0.33333334
      outWeight: 0.33333334
    m_PreInfinity: 2
    m_PostInfinity: 2
    m_RotationOrder: 4
  depthBlueChannel:
    serializedVersion: 2
    m_Curve:
    - serializedVersion: 3
      time: 0
      value: 0
      inSlope: 0
      outSlope: 0
      tangentMode: 0
      weightedMode: 0
      inWeight: 0.33333334
      outWeight: 0.33333334
    - serializedVersion: 3
      time: 1
      value: 1
      inSlope: 0
      outSlope: 0
      tangentMode: 0
      weightedMode: 0
      inWeight: 0.33333334
      outWeight: 0.33333334
    m_PreInfinity: 2
    m_PostInfinity: 2
    m_RotationOrder: 4
  saturation: 0.86
  selectiveCc: 0
  selectiveFromColor: {r: 1, g: 1, b: 1, a: 1}
  selectiveToColor: {r: 1, g: 1, b: 1, a: 1}
  mode: 0
  updateTextures: 1
  colorCorrectionCurvesShader: {fileID: 4800000, guid: 62bcade1028c24ca1a39760ed84b9487, type: 3}
  simpleColorCorrectionCurvesShader: {fileID: 4800000, guid: 438ddd58d82c84d9eb1fdc56111702e1, type: 3}
  colorCorrectionSelectiveShader: {fileID: 4800000, guid: e515e0f94cefc4c0db54b45cba621544, type: 3}
--- !u!1001 &4917172862580465445
PrefabInstance:
  m_ObjectHideFlags: 0
  serializedVersion: 2
  m_Modification:
    m_TransformParent: {fileID: 0}
    m_Modifications:
    - target: {fileID: 4917172862836842097, guid: 262e0130ab98ab94ebd11e9ca9318ef7, type: 3}
      propertyPath: m_RootOrder
      value: 2
      objectReference: {fileID: 0}
    - target: {fileID: 4917172862836842097, guid: 262e0130ab98ab94ebd11e9ca9318ef7, type: 3}
      propertyPath: m_LocalPosition.x
      value: 0
      objectReference: {fileID: 0}
    - target: {fileID: 4917172862836842097, guid: 262e0130ab98ab94ebd11e9ca9318ef7, type: 3}
      propertyPath: m_LocalPosition.y
      value: 0
      objectReference: {fileID: 0}
    - target: {fileID: 4917172862836842097, guid: 262e0130ab98ab94ebd11e9ca9318ef7, type: 3}
      propertyPath: m_LocalPosition.z
      value: 0
      objectReference: {fileID: 0}
    - target: {fileID: 4917172862836842097, guid: 262e0130ab98ab94ebd11e9ca9318ef7, type: 3}
      propertyPath: m_LocalRotation.w
      value: 1
      objectReference: {fileID: 0}
    - target: {fileID: 4917172862836842097, guid: 262e0130ab98ab94ebd11e9ca9318ef7, type: 3}
      propertyPath: m_LocalRotation.x
      value: -0
      objectReference: {fileID: 0}
    - target: {fileID: 4917172862836842097, guid: 262e0130ab98ab94ebd11e9ca9318ef7, type: 3}
      propertyPath: m_LocalRotation.y
      value: -0
      objectReference: {fileID: 0}
    - target: {fileID: 4917172862836842097, guid: 262e0130ab98ab94ebd11e9ca9318ef7, type: 3}
      propertyPath: m_LocalRotation.z
      value: -0
      objectReference: {fileID: 0}
    - target: {fileID: 4917172862836842097, guid: 262e0130ab98ab94ebd11e9ca9318ef7, type: 3}
      propertyPath: m_LocalEulerAnglesHint.x
      value: 0
      objectReference: {fileID: 0}
    - target: {fileID: 4917172862836842097, guid: 262e0130ab98ab94ebd11e9ca9318ef7, type: 3}
      propertyPath: m_LocalEulerAnglesHint.y
      value: 0
      objectReference: {fileID: 0}
    - target: {fileID: 4917172862836842097, guid: 262e0130ab98ab94ebd11e9ca9318ef7, type: 3}
      propertyPath: m_LocalEulerAnglesHint.z
      value: 0
      objectReference: {fileID: 0}
    - target: {fileID: 4917172862836842102, guid: 262e0130ab98ab94ebd11e9ca9318ef7, type: 3}
      propertyPath: m_Name
      value: World
      objectReference: {fileID: 0}
    m_RemovedComponents: []
  m_SourcePrefab: {fileID: 100100000, guid: 262e0130ab98ab94ebd11e9ca9318ef7, type: 3}
--- !u!1001 &7919319162900381693
PrefabInstance:
  m_ObjectHideFlags: 0
  serializedVersion: 2
  m_Modification:
    m_TransformParent: {fileID: 0}
    m_Modifications:
    - target: {fileID: 7919319161092368204, guid: f8fa23fff605188469099b8da1043fa6, type: 3}
      propertyPath: m_RootOrder
      value: 3
      objectReference: {fileID: 0}
    - target: {fileID: 7919319161092368204, guid: f8fa23fff605188469099b8da1043fa6, type: 3}
      propertyPath: m_LocalPosition.x
      value: 0
      objectReference: {fileID: 0}
    - target: {fileID: 7919319161092368204, guid: f8fa23fff605188469099b8da1043fa6, type: 3}
      propertyPath: m_LocalPosition.y
      value: 0
      objectReference: {fileID: 0}
    - target: {fileID: 7919319161092368204, guid: f8fa23fff605188469099b8da1043fa6, type: 3}
      propertyPath: m_LocalPosition.z
      value: 0
      objectReference: {fileID: 0}
    - target: {fileID: 7919319161092368204, guid: f8fa23fff605188469099b8da1043fa6, type: 3}
      propertyPath: m_LocalRotation.w
      value: 1
      objectReference: {fileID: 0}
    - target: {fileID: 7919319161092368204, guid: f8fa23fff605188469099b8da1043fa6, type: 3}
      propertyPath: m_LocalRotation.x
      value: 0
      objectReference: {fileID: 0}
    - target: {fileID: 7919319161092368204, guid: f8fa23fff605188469099b8da1043fa6, type: 3}
      propertyPath: m_LocalRotation.y
      value: 0
      objectReference: {fileID: 0}
    - target: {fileID: 7919319161092368204, guid: f8fa23fff605188469099b8da1043fa6, type: 3}
      propertyPath: m_LocalRotation.z
      value: 0
      objectReference: {fileID: 0}
    - target: {fileID: 7919319161092368204, guid: f8fa23fff605188469099b8da1043fa6, type: 3}
      propertyPath: m_LocalEulerAnglesHint.x
      value: 0
      objectReference: {fileID: 0}
    - target: {fileID: 7919319161092368204, guid: f8fa23fff605188469099b8da1043fa6, type: 3}
      propertyPath: m_LocalEulerAnglesHint.y
      value: 0
      objectReference: {fileID: 0}
    - target: {fileID: 7919319161092368204, guid: f8fa23fff605188469099b8da1043fa6, type: 3}
      propertyPath: m_LocalEulerAnglesHint.z
      value: 0
      objectReference: {fileID: 0}
    - target: {fileID: 7919319161092368205, guid: f8fa23fff605188469099b8da1043fa6, type: 3}
      propertyPath: m_Name
      value: Lights
      objectReference: {fileID: 0}
    m_RemovedComponents: []
  m_SourcePrefab: {fileID: 100100000, guid: f8fa23fff605188469099b8da1043fa6, type: 3}
