[
    {
        "name": "Create a new ODM Form",
        "request": {
            "headers": {},
            "method": "POST",
            "request": {
                "library_name": "Sponsor",
                "name": "name1",
                "oid": "oid1",
                "sdtm_version": "0.1",
                "repeating": "No",
                "descriptions": [
                    "odm_description2",
                    "odm_description3"
                ],
                "alias_uids": [
                    "odm_alias1"
                ]
            },
            "url": "concepts/odms/forms"
        },
        "response": {
            "code": 201,
            "headers": {
                "content-length": "459",
                "content-type": "application/json"
            },
            "result": {
                "uid": "OdmForm_000001",
                "name": "name1",
                "library_name": "Sponsor",
                "oid": "oid1",
                "repeating": "No",
                "start_date": "2022-03-03T11:17:56.799074",
                "end_date": null,
                "status": "Draft",
                "version": "0.1",
                "change_description": "Initial version",
                "user_initials": "TODO user initials",
                "sdtm_version": "0.1",
                "scope": null,
                "descriptions": [
                    {
                        "uid": "odm_description2",
                        "name": "name2",
                        "language": "language2",
                        "description": "description2",
                        "instruction": "instruction2",
                        "sponsor_instruction": "sponsor_instruction2",
                        "version": "0.1"
                    },
                    {
                        "uid": "odm_description3",
                        "name": "name3",
                        "language": "ENG",
                        "description": "description3",
                        "instruction": "instruction3",
                        "sponsor_instruction": "sponsor_instruction3",
                        "version": "0.1"
                    }
                ],
                "aliases": [
                    {
                        "uid": "odm_alias1",
                        "context": "context1",
                        "name": "name1",
                        "version": "0.1"
                    }
                ],
                "activity_groups": [],
                "item_groups": [],
                "vendor_elements": [],
                "vendor_attributes": [],
                "vendor_element_attributes": [],
                "possible_actions": [
                    "approve",
                    "delete",
                    "edit"
                ]
            }
        }
    },
    {
        "name": "Test cannot add ODM Vendor Attribute with an invalid value to an ODM Form",
        "request": {
            "headers": {},
            "method": "POST",
            "request": [
                {
                    "uid": "odm_vendor_attribute3",
                    "value": "3423"
                }
            ],
            "url": "concepts/odms/forms/OdmForm_000001/vendor-attributes"
        },
        "response": {
            "code": 400,
            "headers": {
                "content-length": "459",
                "content-type": "application/json"
            },
            "result": {
                "type": "BusinessLogicException",
                "message": "Provided values for following attributes don't match their regex pattern:\n\n{'odm_vendor_attribute3': '^[a-zA-Z]+$'}",
                "time": "2022-12-07T07: 23: 26.057208",
                "path": "http://testserver/concepts/odms/forms/OdmForm_000001/vendor-attributes",
                "method": "POST"
            }
        }
    },
    {
        "name": "Test cannot add ODM Vendor Element Attribute with an invalid value to an ODM Form",
        "request": {
            "headers": {},
            "method": "POST",
            "request": [
                {
                    "uid": "odm_vendor_attribute1",
                    "value": "3423"
                }
            ],
            "url": "concepts/odms/forms/OdmForm_000001/vendor-element-attributes"
        },
        "response": {
            "code": 400,
            "headers": {
                "content-length": "459",
                "content-type": "application/json"
            },
            "result": {
                "type": "BusinessLogicException",
                "message": "Provided values for following attributes don't match their regex pattern:\n\n{'odm_vendor_attribute1': '^[a-zA-Z]+$'}",
                "time": "2022-12-07T07: 23: 26.057208",
                "path": "http://testserver/concepts/odms/forms/OdmForm_000001/vendor-element-attributes",
                "method": "POST"
            }
        }
    },
    {
        "name": "Add ODM Vendor Element to an ODM Form",
        "request": {
            "headers": {},
            "method": "POST",
            "request": [
                {
                    "uid": "odm_vendor_element1",
                    "value": "value1"
                }
            ],
            "url": "concepts/odms/forms/OdmForm_000001/vendor-elements"
        },
        "response": {
            "code": 201,
            "headers": {
                "content-length": "459",
                "content-type": "application/json"
            },
            "result": {
                "uid": "OdmForm_000001",
                "name": "name1",
                "library_name": "Sponsor",
                "oid": "oid1",
                "repeating": "No",
                "start_date": "2022-03-03T11:17:56.799074",
                "end_date": null,
                "status": "Draft",
                "version": "0.1",
                "change_description": "Initial version",
                "user_initials": "TODO user initials",
                "sdtm_version": "0.1",
                "scope": null,
                "descriptions": [
                    {
                        "uid": "odm_description2",
                        "name": "name2",
                        "language": "language2",
                        "description": "description2",
                        "instruction": "instruction2",
                        "sponsor_instruction": "sponsor_instruction2",
                        "version": "0.1"
                    },
                    {
                        "uid": "odm_description3",
                        "name": "name3",
                        "language": "ENG",
                        "description": "description3",
                        "instruction": "instruction3",
                        "sponsor_instruction": "sponsor_instruction3",
                        "version": "0.1"
                    }
                ],
                "aliases": [
                    {
                        "uid": "odm_alias1",
                        "context": "context1",
                        "name": "name1",
                        "version": "0.1"
                    }
                ],
                "activity_groups": [],
                "item_groups": [],
                "vendor_elements": [
                    {
                        "uid": "odm_vendor_element1",
                        "name": "nameOne",
                        "value": "value1"
                    }
                ],
                "vendor_attributes": [],
                "vendor_element_attributes": [],
                "possible_actions": [
                    "approve",
                    "delete",
                    "edit"
                ]
            }
        }
    },
    {
        "name": "Add ODM Vendor Element Attribute to an ODM Form",
        "request": {
            "headers": {},
            "method": "POST",
            "request": [
                {
                    "uid": "odm_vendor_attribute1",
                    "value": "valueOne"
                }
            ],
            "url": "concepts/odms/forms/OdmForm_000001/vendor-element-attributes"
        },
        "response": {
            "code": 201,
            "headers": {
                "content-length": "459",
                "content-type": "application/json"
            },
            "result": {
                "uid": "OdmForm_000001",
                "name": "name1",
                "library_name": "Sponsor",
                "oid": "oid1",
                "repeating": "No",
                "start_date": "2022-03-03T11:17:56.799074",
                "end_date": null,
                "status": "Draft",
                "version": "0.1",
                "change_description": "Initial version",
                "user_initials": "TODO user initials",
                "sdtm_version": "0.1",
                "scope": null,
                "descriptions": [
                    {
                        "uid": "odm_description2",
                        "name": "name2",
                        "language": "language2",
                        "description": "description2",
                        "instruction": "instruction2",
                        "sponsor_instruction": "sponsor_instruction2",
                        "version": "0.1"
                    },
                    {
                        "uid": "odm_description3",
                        "name": "name3",
                        "language": "ENG",
                        "description": "description3",
                        "instruction": "instruction3",
                        "sponsor_instruction": "sponsor_instruction3",
                        "version": "0.1"
                    }
                ],
                "aliases": [
                    {
                        "uid": "odm_alias1",
                        "context": "context1",
                        "name": "name1",
                        "version": "0.1"
                    }
                ],
                "activity_groups": [],
                "item_groups": [],
                "vendor_elements": [
                    {
                        "uid": "odm_vendor_element1",
                        "name": "nameOne",
                        "value": "value1"
                    }
                ],
                "vendor_attributes": [],
                "vendor_element_attributes": [
                    {
                        "uid": "odm_vendor_attribute1",
                        "name": "nameOne",
                        "data_type": "string",
                        "value_regex": "^[a-zA-Z]+$",
                        "value": "valueOne",
                        "vendor_element_uid": "odm_vendor_element1"
                    }
                ],
                "possible_actions": [
                    "approve",
                    "delete",
                    "edit"
                ]
            }
        }
    },
    {
        "name": "Test cannot create a new ODM Form with existing name and oid",
        "request": {
            "headers": {},
            "method": "POST",
            "request": {
                "library_name": "Sponsor",
                "name": "name1",
                "oid": "oid1",
                "sdtm_version": "0.1",
                "repeating": "No",
                "descriptions": [
                    "odm_description3"
                ],
                "alias_uids": []
            },
            "url": "concepts/odms/forms"
        },
        "response": {
            "code": 400,
            "headers": {
                "content-length": "459",
                "content-type": "application/json"
            },
            "result": {
                "message": "ODM Form with ['name: name1', 'OID: oid1'] already exists.",
                "time": "2022-03-07T12: 14: 18.116363",
                "path": "http://testserver/concepts/odms/forms",
                "method": "POST",
                "type": "BusinessLogicException"
            }
        }
    },
    {
        "name": "Test cannot create an ODM Form connected to non-existing Scope",
        "request": {
            "headers": {},
            "method": "POST",
            "request": {
                "library_name": "Sponsor",
                "name": "new name",
                "oid": "new oid",
                "sdtm_version": "0.1",
                "repeating": "No",
                "scope_uid": "wrong_uid",
                "descriptions": [],
                "alias_uids": []
            },
            "url": "concepts/odms/forms"
        },
        "response": {
            "code": 400,
            "headers": {
                "content-length": "459",
                "content-type": "application/json"
            },
            "result": {
                "message": "ODM Form tried to connect to non existing Scope identified by uid (wrong_uid).",
                "time": "2022-03-07T12: 14: 18.116363",
                "path": "http://testserver/concepts/odms/forms",
                "method": "POST",
                "type": "BusinessLogicException"
            }
        }
    },
    {
        "name": "Test cannot create an ODM Form connected to non-existing concepts",
        "request": {
            "headers": {},
            "method": "POST",
            "request": {
                "library_name": "Sponsor",
                "name": "new name",
                "oid": "new oid",
                "sdtm_version": "0.1",
                "repeating": "No",
                "descriptions": [
                    "wrong_uid"
                ],
                "alias_uids": [
                    "wrong_uid"
                ]
            },
            "url": "concepts/odms/forms"
        },
        "response": {
            "code": 400,
            "headers": {
                "content-length": "459",
                "content-type": "application/json"
            },
            "result": {
                "message": "ODM Form tried to connect to non existing concepts [('Concept Name: ODM Description', \"uids: {'wrong_uid'}\"), ('Concept Name: ODM Alias', \"uids: {'wrong_uid'}\")].",
                "time": "2022-03-07T12: 14: 18.116363",
                "path": "http://testserver/concepts/odms/forms",
                "method": "POST",
                "type": "BusinessLogicException"
            }
        }
    },
    {
        "name": "Test getting error for retrieving non existing ODM Form",
        "request": {
            "headers": {},
            "method": "GET",
            "request": {},
            "url": "concepts/odms/forms/OdmForm_000002"
        },
        "response": {
            "code": 404,
            "headers": {
                "content-length": "340",
                "content-type": "application/json"
            },
            "result": {
                "message": "OdmFormAR with uid OdmForm_000002 does not exist or there's no version with requested status or version number.",
                "time": "2022-03-07T12:20:39.613764",
                "path": "http://testserver/concepts/odms/forms/OdmForm_000002",
                "method": "GET",
                "type": "NotFoundException"
            }
        }
    },
    {
        "name": "Test cannot inactivate an ODM Form that is in Draft status",
        "request": {
            "headers": {},
            "method": "DELETE",
            "request": {},
            "url": "concepts/odms/forms/OdmForm_000001/activations"
        },
        "response": {
            "code": 400,
            "headers": {
                "content-length": "459",
                "content-type": "application/json"
            },
            "result": {
                "message": "Cannot retire draft version.",
                "time": "2022-03-07T12:24:39.980123",
                "path": "http://testserver/concepts/odms/forms/OdmForm_000001/activations",
                "method": "DELETE",
                "type": "BusinessLogicException"
            }
        }
    },
    {
        "name": "Test cannot reactivate an ODM Form that is not retired",
        "request": {
            "headers": {},
            "method": "POST",
            "request": {},
            "url": "concepts/odms/forms/OdmForm_000001/activations"
        },
        "response": {
            "code": 400,
            "headers": {
                "content-length": "459",
                "content-type": "application/json"
            },
            "result": {
                "message": "Only RETIRED version can be reactivated.",
                "time": "2022-03-07T12:27:17.572613",
                "path": "http://testserver/concepts/odms/forms/OdmForm_000001/activations",
                "method": "POST",
                "type": "BusinessLogicException"
            }
        }
    },
    {
        "name": "Test cannot override ODM Vendor Element that has attributes connected this ODM Form",
        "request": {
            "headers": {},
            "method": "POST",
            "request": [
                {
                    "uid": "odm_vendor_element2",
                    "value": "value"
                }
            ],
            "url": "concepts/odms/forms/OdmForm_000001/vendor-elements?override=true"
        },
        "response": {
            "code": 400,
            "headers": {
                "content-length": "459",
                "content-type": "application/json"
            },
            "result": {
                "message": "Cannot remove an ODM Vendor Element whose attributes are connected to this ODM element.",
                "time": "2022-03-07T12:30:50.195156",
                "path": "http://testserver/concepts/odms/forms/OdmForm_000001/vendor-elements?override=true",
                "method": "POST",
                "type": "BusinessLogicException"
            }
        }
    },
    {
        "name": "Test cannot add ODM Vendor Element Attribute to an ODM Form as an ODM Vendor Attribute",
        "request": {
            "headers": {},
            "method": "POST",
            "request": [
                {
                    "uid": "odm_vendor_attribute1",
                    "value": "value"
                }
            ],
            "url": "concepts/odms/forms/OdmForm_000001/vendor-attributes"
        },
        "response": {
            "code": 400,
            "headers": {
                "content-length": "459",
                "content-type": "application/json"
            },
            "result": {
                "message": "ODM Vendor Attribute identified by (odm_vendor_attribute1) cannot not be added as an Vendor Attribute.",
                "time": "2022-03-07T12:30:50.195156",
                "path": "http://testserver/concepts/odms/forms/OdmForm_000001/vendor-attributes",
                "method": "POST",
                "type": "BusinessLogicException"
            }
        }
    },
    {
        "name": "Test cannot add ODM Vendor Attribute to an ODM Form as an ODM Vendor Element Attribute",
        "request": {
            "headers": {},
            "method": "POST",
            "request": [
                {
                    "uid": "odm_vendor_attribute3",
                    "value": "value"
                }
            ],
            "url": "concepts/odms/forms/OdmForm_000001/vendor-element-attributes"
        },
        "response": {
            "code": 400,
            "headers": {
                "content-length": "459",
                "content-type": "application/json"
            },
            "result": {
                "message": "ODM Vendor Attribute identified by (odm_vendor_attribute3) cannot not be added as an Vendor Element Attribute.",
                "time": "2022-03-07T12:30:50.195156",
                "path": "http://testserver/concepts/odms/forms/OdmForm_000001/vendor-element-attributes",
                "method": "POST",
                "type": "BusinessLogicException"
            }
        }
    },
    {
        "name": "Approve ODM Form",
        "request": {
            "headers": {},
            "method": "POST",
            "request": {},
            "url": "concepts/odms/forms/OdmForm_000001/approvals"
        },
        "response": {
            "code": 201,
            "headers": {
                "content-length": "459",
                "content-type": "application/json"
            },
            "result": {
                "uid": "OdmForm_000001",
                "name": "name1",
                "library_name": "Sponsor",
                "oid": "oid1",
                "repeating": "No",
                "start_date": "2022-03-03T11:17:56.799074",
                "end_date": null,
                "status": "Final",
                "version": "1.0",
                "change_description": "Approved version",
                "user_initials": "TODO user initials",
                "sdtm_version": "0.1",
                "scope": null,
                "descriptions": [
                    {
                        "uid": "odm_description2",
                        "name": "name2",
                        "language": "language2",
                        "description": "description2",
                        "instruction": "instruction2",
                        "sponsor_instruction": "sponsor_instruction2",
                        "version": "0.1"
                    },
                    {
                        "uid": "odm_description3",
                        "name": "name3",
                        "language": "ENG",
                        "description": "description3",
                        "instruction": "instruction3",
                        "sponsor_instruction": "sponsor_instruction3",
                        "version": "0.1"
                    }
                ],
                "aliases": [
                    {
                        "uid": "odm_alias1",
                        "context": "context1",
                        "name": "name1",
                        "version": "0.1"
                    }
                ],
                "activity_groups": [],
                "item_groups": [],
                "vendor_elements": [
                    {
                        "uid": "odm_vendor_element1",
                        "name": "nameOne",
                        "value": "value1"
                    }
                ],
                "vendor_attributes": [],
                "vendor_element_attributes": [
                    {
                        "uid": "odm_vendor_attribute1",
                        "name": "nameOne",
                        "data_type": "string",
                        "value_regex": "^[a-zA-Z]+$",
                        "value": "valueOne",
                        "vendor_element_uid": "odm_vendor_element1"
                    }
                ],
                "possible_actions": [
                    "inactivate",
                    "new_version"
                ]
            }
        }
    },
    {
        "name": "Test cannot add ODM Item Groups with an invalid value to an ODM Form",
        "request": {
            "headers": {},
            "method": "POST",
            "request": [
                {
                    "uid": "odm_item_group1",
                    "order_number": 1,
                    "mandatory": "Yes",
                    "locked": "Yes",
                    "collection_exception_condition_oid": "collection_exception_condition_oid1",
                    "vendor": {
                        "attributes": [
                            {
                                "uid": "odm_vendor_attribute3",
                                "value": "3423"
                            }
                        ]
                    }
                }
            ],
            "url": "concepts/odms/forms/OdmForm_000001/item-groups"
        },
        "response": {
            "code": 400,
            "headers": {
                "content-length": "459",
                "content-type": "application/json"
            },
            "result": {
                "type": "BusinessLogicException",
                "message": "Provided values for following attributes don't match their regex pattern:\n\n{'odm_vendor_attribute3': '^[a-zA-Z]+$'}",
                "time": "2022-12-07T07: 23: 26.057208",
                "path": "http://testserver/concepts/odms/forms/OdmForm_000001/item-groups",
                "method": "POST"
            }
        }
    },
    {
        "name": "Test cannot add anon-compatible ODM Vendor Attribute to an ODM Form",
        "request": {
            "headers": {},
            "method": "POST",
            "request": [
                {
                    "uid": "odm_vendor_attribute5",
                    "value": "value"
                }
            ],
            "url": "concepts/odms/forms/OdmForm_000001/vendor-attributes"
        },
        "response": {
            "code": 400,
            "headers": {
                "content-length": "459",
                "content-type": "application/json"
            },
            "result": {
                "message": "Trying to add non-compatible ODM Vendor:\n\n{'odm_vendor_attribute5': ['NonCompatibleVendor']}",
                "time": "2022-03-07T12:30:50.195156",
                "path": "http://testserver/concepts/odms/forms/OdmForm_000001/vendor-attributes",
                "method": "POST",
                "type": "BusinessLogicException"
            }
        }
    },
    {
        "name": "Test cannot add ODM Item Groups with non-compatible ODM Vendor Attribute to a specific ODM Form",
        "request": {
            "headers": {},
            "method": "POST",
            "request": [
                {
                    "uid": "odm_item_group1",
                    "order_number": 1,
                    "mandatory": "Yes",
                    "locked": "No",
                    "collection_exception_condition_oid": "collection_exception_condition_oid1",
                    "vendor": {
                        "attributes": [
                            {
                                "uid": "odm_vendor_attribute5",
                                "value": "No"
                            }
                        ]
                    }
                }
            ],
            "url": "concepts/odms/forms/OdmForm_000001/item-groups"
        },
        "response": {
            "code": 400,
            "headers": {
                "content-length": "459",
                "content-type": "application/json"
            },
            "result": {
                "message": "Trying to add non-compatible ODM Vendor:\n\n{'odm_vendor_attribute5': ['NonCompatibleVendor']}",
                "time": "2022-03-07T12:30:50.195156",
                "path": "http://testserver/concepts/odms/forms/OdmForm_000001/item-groups",
                "method": "POST",
                "type": "BusinessLogicException"
            }
        }
    },
    {
        "name": "Inactivate ODM Form",
        "request": {
            "headers": {},
            "method": "DELETE",
            "request": {},
            "url": "concepts/odms/forms/OdmForm_000001/activations"
        },
        "response": {
            "code": 200,
            "headers": {
                "content-length": "459",
                "content-type": "application/json"
            },
            "result": {
                "uid": "OdmForm_000001",
                "name": "name1",
                "library_name": "Sponsor",
                "oid": "oid1",
                "repeating": "No",
                "start_date": "2022-03-03T11:17:56.799074",
                "end_date": null,
                "status": "Retired",
                "version": "1.0",
                "change_description": "Inactivated version",
                "user_initials": "TODO user initials",
                "sdtm_version": "0.1",
                "scope": null,
                "descriptions": [
                    {
                        "uid": "odm_description2",
                        "name": "name2",
                        "language": "language2",
                        "description": "description2",
                        "instruction": "instruction2",
                        "sponsor_instruction": "sponsor_instruction2",
                        "version": "0.1"
                    },
                    {
                        "uid": "odm_description3",
                        "name": "name3",
                        "language": "ENG",
                        "description": "description3",
                        "instruction": "instruction3",
                        "sponsor_instruction": "sponsor_instruction3",
                        "version": "0.1"
                    }
                ],
                "aliases": [
                    {
                        "uid": "odm_alias1",
                        "context": "context1",
                        "name": "name1",
                        "version": "0.1"
                    }
                ],
                "activity_groups": [],
                "item_groups": [],
                "vendor_elements": [
                    {
                        "uid": "odm_vendor_element1",
                        "name": "nameOne",
                        "value": "value1"
                    }
                ],
                "vendor_attributes": [],
                "vendor_element_attributes": [
                    {
                        "uid": "odm_vendor_attribute1",
                        "name": "nameOne",
                        "data_type": "string",
                        "value_regex": "^[a-zA-Z]+$",
                        "value": "valueOne",
                        "vendor_element_uid": "odm_vendor_element1"
                    }
                ],
                "possible_actions": [
                    "delete",
                    "reactivate"
                ]
            }
        }
    },
    {
        "name": "Test cannot add ODM Item Groups to an ODM Form that is in Retired status",
        "request": {
            "headers": {},
            "method": "POST",
            "request": [
                {
                    "uid": "odm_item_group1",
                    "order_number": 1,
                    "mandatory": "Yes",
                    "locked": "Yes",
                    "collection_exception_condition_oid": "collection_exception_condition_oid1",
                    "vendor": {
                        "attributes": []
                    }
                }
            ],
            "url": "concepts/odms/forms/OdmForm_000001/item-groups"
        },
        "response": {
            "code": 400,
            "headers": {
                "content-length": "459",
                "content-type": "application/json"
            },
            "result": {
                "message": "The object is inactive",
                "time": "2022-03-07T12:30:50.195156",
                "path": "http://testserver/concepts/odms/forms/OdmForm_000001/item-groups",
                "method": "POST",
                "type": "BusinessLogicException"
            }
        }
    },
    {
        "name": "Test cannot add ODM Activity Groups to an ODM Form that is in Retired status",
        "request": {
            "headers": {},
            "method": "POST",
            "request": [
                {
                    "uid": "activity_group_root1"
                }
            ],
            "url": "concepts/odms/forms/OdmForm_000001/activity-groups"
        },
        "response": {
            "code": 400,
            "headers": {
                "content-length": "459",
                "content-type": "application/json"
            },
            "result": {
                "message": "The object is inactive",
                "time": "2022-03-07T12:30:50.195156",
                "path": "http://testserver/concepts/odms/forms/OdmForm_000001/activity-groups",
                "method": "POST",
                "type": "BusinessLogicException"
            }
        }
    },
    {
        "name": "Test cannot add ODM Vendor Element to an ODM Form that is in Retired status",
        "request": {
            "headers": {},
            "method": "POST",
            "request": [
                {
                    "uid": "odm_vendor_element1",
                    "value": "value"
                }
            ],
            "url": "concepts/odms/forms/OdmForm_000001/vendor-elements"
        },
        "response": {
            "code": 400,
            "headers": {
                "content-length": "459",
                "content-type": "application/json"
            },
            "result": {
                "message": "The object is inactive",
                "time": "2022-03-07T12:30:50.195156",
                "path": "http://testserver/concepts/odms/forms/OdmForm_000001/vendor-elements",
                "method": "POST",
                "type": "BusinessLogicException"
            }
        }
    },
    {
        "name": "Test cannot add ODM Vendor Attribute to an ODM Form that is in Retired status",
        "request": {
            "headers": {},
            "method": "POST",
            "request": [
                {
                    "uid": "odm_vendor_attribute1",
                    "value": "value"
                }
            ],
            "url": "concepts/odms/forms/OdmForm_000001/vendor-attributes"
        },
        "response": {
            "code": 400,
            "headers": {
                "content-length": "459",
                "content-type": "application/json"
            },
            "result": {
                "message": "The object is inactive",
                "time": "2022-03-07T12:30:50.195156",
                "path": "http://testserver/concepts/odms/forms/OdmForm_000001/vendor-attributes",
                "method": "POST",
                "type": "BusinessLogicException"
            }
        }
    },
    {
        "name": "Test cannot add ODM Vendor Element Attribute to an ODM Form that is in Retired status",
        "request": {
            "headers": {},
            "method": "POST",
            "request": [
                {
                    "uid": "odm_vendor_attribute1",
                    "value": "value"
                }
            ],
            "url": "concepts/odms/forms/OdmForm_000001/vendor-element-attributes"
        },
        "response": {
            "code": 400,
            "headers": {
                "content-length": "459",
                "content-type": "application/json"
            },
            "result": {
                "message": "The object is inactive",
                "time": "2022-03-07T12:30:50.195156",
                "path": "http://testserver/concepts/odms/forms/OdmForm_000001/vendor-element-attributes",
                "method": "POST",
                "type": "BusinessLogicException"
            }
        }
    }
]