CT_CD_LIST_SUBMVAL,CT_NAME,NAME_SENTENSE_CASE,CT_SUBMVAL,DEFINITION,ORDER,CT_CD,NCI_PREFERRED_NAME
REGISTID,ClinicalTrials.gov ID,clinicaltrials.gov id,CLINICALTRIALS.GOV,Sponsor terminology for Registry Identifier (FDA),1,,ClinicalTrials.gov ID
REGISTID,EUDRACT ID,eudract id,EUDRACTID,Sponsor terminology for Registry Identifier (EMA),2,,EUDRACT ID
REGISTID,Universal Trial Number (UTN),universal trial number (utn),UNIVERSALTRIALNUMBER,Sponsor terminology for Registry Identifier (UTN),3,,Universal Trial Number (UTN)
REGISTID,Japanese Trial Registry ID (JAPIC),japanese trial registry id (japic),JAPANTRIALREGISTRYID,Sponsor terminology for Registry Identifier (PMDA),4,,Japanese Trial Registry ID (JAPIC)
REGISTID,Investigational New Drug Application (IND) Number,investigational new drug application (ind) number,INVESTIGATIONALNEWDRUGAPPLICATION,Sponsor terminology for Registry Identifier (FDA),5,,Investigational New Drug Application (IND) Number
REGISTID,WHO ID,who id,WHOID,Sponsor terminology for Registry Identifier (WHO),6,,WHO ID