[
   {
      "name": "Test POST time point",
      "request": {
         "headers": {},
         "method": "POST",
         "request": {
            "name_sentence_case": "time_point_name_sentence_case1",
            "definition": "time_point_definition1",
            "abbreviation": "abbv",
            "template_parameter": true,
            "library_name": "Sponsor",
            "numeric_value_uid": "NumericValue_000001",
            "unit_definition_uid": "UnitDefinition_000001",
            "time_reference_uid": "term_root_final"
         },
         "url": "/concepts/time-points"
      },
      "response": {
         "code": 201,
         "headers": {},
         "result": {
            "uid": "TimePoint_000001",
            "name": "1.23 name_1 after term_value_name1",
            "name_sentence_case": "time_point_name_sentence_case1",
            "definition": "time_point_definition1",
            "abbreviation": "abbv",
            "template_parameter": true,
            "library_name": "Sponsor",
            "status": null,
            "version": null,
            "change_description": null,
            "user_initials": null,
            "start_date": null,
            "end_date": null,
            "numeric_value_uid": "NumericValue_000001",
            "unit_definition_uid": "UnitDefinition_000001",
            "time_reference_uid": "term_root_final"
         }
      }
   },
   {
      "name": "Test POST non existing numeric value",
      "request": {
         "headers": {},
         "method": "POST",
         "request": {
            "name_sentence_case": "time_point_name_sentence_case1",
            "definition": "time_point_definition1",
            "library_name": "Sponsor",
            "numeric_value_uid": "NumericValue_NON_EXISTING",
            "unit_definition_uid": "UnitDefinition_000001",
            "time_reference_uid": "term_root_final"
         },
         "url": "/concepts/time-points"
      },
      "response": {
         "code": 400,
         "result": {
            "message": "TimePointVO tried to connect to non existing numeric value identified by uid (NumericValue_NON_EXISTING)",
            "method": "POST",
            "path": "http://testserver/concepts/time-points",
            "time": "2020-11-10T01:51:17.884429",
            "type": "ValidationException"
         }
      }
   },
   {
      "name": "Test POST non existing unit definition",
      "request": {
         "headers": {},
         "method": "POST",
         "request": {
            "name_sentence_case": "time_point_name_sentence_case1",
            "definition": "time_point_definition1",
            "library_name": "Sponsor",
            "numeric_value_uid": "NumericValue_000001",
            "unit_definition_uid": "UnitDefinition_NON_EXISTING",
            "time_reference_uid": "term_root_final"
         },
         "url": "/concepts/time-points"
      },
      "response": {
         "code": 400,
         "result": {
            "message": "TimePointVO tried to connect to non existing unit definition identified by uid (UnitDefinition_NON_EXISTING)",
            "method": "POST",
            "path": "http://testserver/concepts/time-points",
            "time": "2020-11-10T01:51:17.884429",
            "type": "ValidationException"
         }
      }
   },
   {
      "name": "Test POST non existing time reference",
      "request": {
         "headers": {},
         "method": "POST",
         "request": {
            "name_sentence_case": "time_point_name_sentence_case1",
            "definition": "time_point_definition1",
            "library_name": "Sponsor",
            "numeric_value_uid": "NumericValue_000001",
            "unit_definition_uid": "UnitDefinition_000001",
            "time_reference_uid": "TimeReference_NON_EXISTING"
         },
         "url": "/concepts/time-points"
      },
      "response": {
         "code": 400,
         "result": {
            "message": "TimePointVO tried to connect to non existing CTTermRoot identified by uid (TimeReference_NON_EXISTING)",
            "method": "POST",
            "path": "http://testserver/concepts/time-points",
            "time": "2020-11-10T01:51:17.884429",
            "type": "ValidationException"
         }
      }
   }
]