[
    {
        "name": "Test POST brand",
        "request": {
            "headers": {},
            "method": "POST",
            "request": {
                "name": "Brand A"
            },
            "url": "/brands"
        },
        "response": {
            "code": 201,
            "headers": {},
            "result": {
                "uid": "Brand_000001",
                "name": "Brand A"
            }
        }
    },
    {
        "name": "Test POST brand",
        "request": {
            "headers": {},
            "method": "POST",
            "request": {
                "name": "Brand B"
            },
            "url": "/brands"
        },
        "response": {
            "code": 201,
            "headers": {},
            "result": {
                "uid": "Brand_000002",
                "name": "Brand B"
            }
        }
    },
    {
        "name": "Test POST lag time",
        "request": {
            "headers": {},
            "method": "POST",
            "request": {
                "value": 7.5,
                "unit_definition_uid": "UnitDefinition_000001",
                "sdtm_domain_uid": "sdtm_domain_uid1",
                "definition": "lag_time_definition1",
                "abbreviation": "abbv",
                "template_parameter": true,
                "library_name": "Sponsor"
            },
            "url": "/concepts/lag-times"
        },
        "response": {
            "code": 201,
            "headers": {},
            "result": {
                "uid": "LagTime_000001",
                "name": "7.5 [UnitDefinition_000001] for SDTM domain [sdtm_domain_uid1]",
                "value": 7.5,
                "unit_definition_uid": "UnitDefinition_000001",
                "sdtm_domain_uid": "sdtm_domain_uid1",
                "name_sentence_case": "7.5",
                "definition": "lag_time_definition1",
                "abbreviation": "abbv",
                "template_parameter": true,
                "library_name": "Sponsor",
                "status": null,
                "version": null,
                "change_description": null,
                "user_initials": null,
                "start_date": null,
                "end_date": null
            }
        }
    },
    {
        "name": "Test POST create compound",
        "request": {
            "headers": {},
            "method": "POST",
            "request": {
                "name": "compound_name1",
                "name_sentence_case": "compound_name_sentence_case1",
                "definition": "compound_definition1",
                "abbreviation": "abbv",
                "dose_values_uids": [
                    "NumericValueWithUnit_000001",
                    "NumericValueWithUnit_000002"
                ],
                "strength_values_uids": [
                    "NumericValueWithUnit_000001",
                    "NumericValueWithUnit_000002"
                ],
                "lag_times_uids": [
                    "LagTime_000001"
                ],
                "delivery_devices_uids": [
                    "delivery_device_uid1",
                    "delivery_device_uid2"
                ],
                "dispensers_uids": [
                    "dispenser_uid1",
                    "dispenser_uid2"
                ],
                "projects_uids": [
                    "project_uid1",
                    "project_uid2"
                ],
                "brands_uids": [
                    "Brand_000001",
                    "Brand_000002"
                ],
                "dose_frequency_uids": [
                    "dose_frequency_uid1"
                ],
                "dosage_form_uids": [
                    "dosage_form_uid1"
                ],
                "route_of_administration_uids": [
                    "route_of_administration_uid1"
                ],
                "half_life_uid": "NumericValueWithUnit_000001",
                "analyte_number": "analyte_number",
                "nnc_short_number": "nnc_short_number",
                "nnc_long_number": "nnc_long_number",
                "is_sponsor_compound": true,
                "is_name_inn": true,
                "library_name": "Sponsor"
            },
            "url": "/concepts/compounds"
        },
        "response": {
            "code": 201,
            "headers": {},
            "result": {
                "uid": "Compound_000001",
                "name": "compound_name1",
                "name_sentence_case": "compound_name_sentence_case1",
                "definition": "compound_definition1",
                "abbreviation": "abbv",
                "dose_values": [
                    {
                        "uid": "NumericValueWithUnit_000001",
                        "value": 1.23,
                        "unit_definition_uid": "UnitDefinition_000001",
                        "unit_label": "name_1"
                    },
                    {
                        "uid": "NumericValueWithUnit_000002",
                        "value": 3.21,
                        "unit_definition_uid": "UnitDefinition_000001",
                        "unit_label": "name_1"
                    }
                ],
                "strength_values": [
                    {
                        "uid": "NumericValueWithUnit_000001",
                        "value": 1.23,
                        "unit_definition_uid": "UnitDefinition_000001",
                        "unit_label": "name_1"
                    },
                    {
                        "uid": "NumericValueWithUnit_000002",
                        "value": 3.21,
                        "unit_definition_uid": "UnitDefinition_000001",
                        "unit_label": "name_1"
                    }
                ],
                "lag_times": [
                    {
                        "value": 7.5,
                        "unit_definition_uid": "UnitDefinition_000001",
                        "unit_label": "name_1",
                        "sdtm_domain_uid": "sdtm_domain_uid1",
                        "sdtm_domain_label": "sdtm_domain_name1"
                    }
                ],
                "delivery_devices": [
                    {
                        "term_uid": "delivery_device_uid1",
                        "name": "delivery_device_name1"
                    },
                    {
                        "term_uid": "delivery_device_uid2",
                        "name": "delivery_device_name2"
                    }
                ],
                "dispensers": [
                    {
                        "term_uid": "dispenser_uid1",
                        "name": "dispenser_name1"
                    },
                    {
                        "term_uid": "dispenser_uid2",
                        "name": "dispenser_name2"
                    }
                ],
                "projects": [
                    {
                        "uid": "project_uid1",
                        "project_number": "PRJ-001",
                        "clinical_programme": {
                            "uid": "cp_001",
                            "name": "CP"
                        },
                        "name": "Project 1",
                        "description": "Description 1"
                    },
                    {
                        "uid": "project_uid2",
                        "project_number": "PRJ-002",
                        "clinical_programme": {
                            "uid": "cp_001",
                            "name": "CP"
                        },
                        "name": "Project 2",
                        "description": "Description 2"
                    }
                ],
                "brands": [
                    {
                        "uid": "Brand_000001",
                        "name": "Brand A"
                    },
                    {
                        "uid": "Brand_000002",
                        "name": "Brand B"
                    }
                ],
                "half_life": {
                    "uid": "NumericValueWithUnit_000001",
                    "value": 1.23,
                    "unit_definition_uid": "UnitDefinition_000001",
                    "unit_label": "name_1"
                },
                "dose_frequencies": [
                    {
                        "term_uid": "dose_frequency_uid1",
                        "name": "dose_frequency_name1"
                    }
                ],
                "dosage_forms": [
                    {
                        "term_uid": "dosage_form_uid1",
                        "name": "dosage_form_name1"
                    }
                ],
                "routes_of_administration": [
                    {
                        "term_uid": "route_of_administration_uid1",
                        "name": "route_of_administration_name1"
                    }
                ],
                "analyte_number": "analyte_number",
                "nnc_short_number": "nnc_short_number",
                "nnc_long_number": "nnc_long_number",
                "is_sponsor_compound": true,
                "is_name_inn": true,
                "substances": [],
                "library_name": "Sponsor",
                "status": "Draft",
                "version": "0.1",
                "change_description": "Initial version",
                "user_initials": "TODO user initials",
                "start_date": null,
                "end_date": null,
                "possible_actions": [
                    "approve",
                    "delete",
                    "edit"
                ]
            }
        }
    },
    {
        "name": "Test POST create compound alias (preferred synonym)",
        "request": {
            "headers": {},
            "method": "POST",
            "request": {
                "name": "compound_alias_name1",
                "name_sentence_case": "compound_alias_name_sentence_case1",
                "definition": "compound_alias_definition1",
                "abbreviation": "abbv",
                "compound_uid": "Compound_000001",
                "is_preferred_synonym": true,
                "library_name": "Sponsor"
            },
            "url": "/concepts/compound-aliases"
        },
        "response": {
            "code": 201,
            "headers": {},
            "result": {
                "uid": "CompoundAlias_000001",
                "name": "compound_alias_name1",
                "name_sentence_case": "compound_alias_name_sentence_case1",
                "definition": "compound_alias_definition1",
                "abbreviation": "abbv",
                "compound": {
                    "uid": "Compound_000001",
                    "name": "compound_name1"
                },
                "is_preferred_synonym": true,
                "library_name": "Sponsor",
                "status": "Draft",
                "version": "0.1",
                "change_description": "Initial version",
                "user_initials": "TODO user initials",
                "start_date": null,
                "end_date": null,
                "possible_actions": [
                    "approve",
                    "delete",
                    "edit"
                ]
            }
        }
    },
    {
        "name": "Test POST create second compound alias (not preferred synonym)",
        "request": {
            "headers": {},
            "method": "POST",
            "request": {
                "name": "compound_alias_name2",
                "name_sentence_case": "compound_alias_name_sentence_case2",
                "definition": "compound_alias_definition2",
                "abbreviation": "abbv2",
                "compound_uid": "Compound_000001",
                "is_preferred_synonym": false,
                "library_name": "Sponsor"
            },
            "url": "/concepts/compound-aliases"
        },
        "response": {
            "code": 201,
            "headers": {},
            "result": {
                "uid": "CompoundAlias_000002",
                "name": "compound_alias_name2",
                "name_sentence_case": "compound_alias_name_sentence_case2",
                "definition": "compound_alias_definition2",
                "abbreviation": "abbv2",
                "compound": {
                    "uid": "Compound_000001",
                    "name": "compound_name1"
                },
                "is_preferred_synonym": false,
                "library_name": "Sponsor",
                "status": "Draft",
                "version": "0.1",
                "change_description": "Initial version",
                "user_initials": "TODO user initials",
                "start_date": null,
                "end_date": null,
                "possible_actions": [
                    "approve",
                    "delete",
                    "edit"
                ]
            }
        }
    },
    {
        "name": "Test POST compound alias as second preferred synonym",
        "request": {
            "headers": {},
            "method": "POST",
            "request": {
                "name": "synonym_x",
                "name_sentence_case": "synonym_x",
                "definition": "synonym_x",
                "abbreviation": "abbv_XYZ",
                "compound_uid": "Compound_000001",
                "is_preferred_synonym": true,
                "library_name": "Sponsor"
            },
            "url": "/concepts/compound-aliases"
        },
        "response": {
            "code": 400,
            "result": {
                "message": "Preferred synonym(s) already defined for compound with uid 'Compound_000001'",
                "method": "POST",
                "path": "http://testserver/concepts/compound-aliases",
                "time": "2020-11-10T01:51:17.884429",
                "type": "ValidationException"
            }
        }
    },
    {
        "name": "Test PATCH compound alias as second preferred synonym",
        "request": {
            "headers": {},
            "method": "PATCH",
            "request": {
                "name": "synonym_x",
                "name_sentence_case": "synonym_x",
                "definition": "synonym_x",
                "abbreviation": "abbv2",
                "compound_uid": "Compound_000001",
                "is_preferred_synonym": true,
                "library_name": "Sponsor",
                "change_description": "patched"
            },
            "url": "/concepts/compound-aliases/CompoundAlias_000002"
        },
        "response": {
            "code": 400,
            "result": {
                "message": "Preferred synonym(s) already defined for compound with uid 'Compound_000001'",
                "method": "PATCH",
                "path": "http://testserver/concepts/compound-aliases/CompoundAlias_000002",
                "time": "2020-11-10T01:51:17.884429",
                "type": "ValidationException"
            }
        }
    },
    {
        "name": "Test GET all compound alias not existing Library passed",
        "request": {
            "headers": {},
            "method": "GET",
            "request": {},
            "url": "/concepts/compound-aliases?library=not_existing"
        },
        "response": {
            "code": 400,
            "result": {
                "message": "There is no library identified by provided library name (not_existing)",
                "method": "GET",
                "path": "http://testserver/concepts/compound-aliases?library=not_existing",
                "time": "2020-11-10T01:51:17.884429",
                "type": "BusinessLogicException"
            }
        }
    },
    {
        "name": "Test DELETE activations non FINAL compound alias",
        "request": {
            "headers": {},
            "method": "DELETE",
            "request": {},
            "url": "/concepts/compound-aliases/CompoundAlias_000001/activations"
        },
        "response": {
            "code": 400,
            "result": {
                "message": "Cannot retire draft version.",
                "method": "DELETE",
                "path": "http://testserver/concepts/compound-aliases/CompoundAlias_000001/activations",
                "time": "2020-11-10T01:51:17.884429",
                "type": "BusinessLogicException"
            }
        }
    },
    {
        "name": "Test POST approve compound alias",
        "request": {
            "headers": {},
            "method": "POST",
            "request": {},
            "url": "concepts/compound-aliases/CompoundAlias_000001/approvals"
        },
        "response": {
            "code": 201,
            "headers": {},
            "result": {
                "uid": "CompoundAlias_000001",
                "compound": {
                    "uid": "Compound_000001",
                    "name": "compound_name1"
                },
                "is_preferred_synonym": true,
                "name": "compound_alias_name1",
                "name_sentence_case": "compound_alias_name_sentence_case1",
                "definition": "compound_alias_definition1",
                "abbreviation": "abbv",
                "library_name": "Sponsor",
                "status": "Final",
                "version": "1.0",
                "change_description": "Approved version",
                "user_initials": "TODO user initials",
                "start_date": null,
                "end_date": null,
                "possible_actions": [
                    "inactivate",
                    "new_version"
                ]
            }
        }
    },
    {
        "name": "Test POST approve non DRAFT compound alias",
        "request": {
            "headers": {},
            "method": "POST",
            "request": {},
            "url": "/concepts/compound-aliases/CompoundAlias_000001/approvals"
        },
        "response": {
            "code": 400,
            "result": {
                "message": "The object is not in draft status.",
                "method": "POST",
                "path": "http://testserver/concepts/compound-aliases/CompoundAlias_000001/approvals",
                "time": "2020-11-10T01:51:17.884429",
                "type": "BusinessLogicException"
            }
        }
    },
    {
        "name": "Test POST activations non retired compound alias",
        "request": {
            "headers": {},
            "method": "POST",
            "request": {},
            "url": "/concepts/compound-aliases/CompoundAlias_000001/activations"
        },
        "response": {
            "code": 400,
            "result": {
                "message": "Only RETIRED version can be reactivated.",
                "method": "POST",
                "path": "http://testserver/concepts/compound-aliases/CompoundAlias_000001/activations",
                "time": "2020-11-10T01:51:17.884429",
                "type": "BusinessLogicException"
            }
        }
    },
    {
        "name": "Test DELETE accepted object",
        "request": {
            "headers": {},
            "method": "DELETE",
            "request": {},
            "url": "/concepts/compound-aliases/CompoundAlias_000001"
        },
        "response": {
            "code": 400,
            "result": {
                "message": "Object has been accepted",
                "method": "DELETE",
                "path": "http://testserver/concepts/compound-aliases/CompoundAlias_000001",
                "time": "2020-11-10T01:51:17.884429",
                "type": "BusinessLogicException"
            }
        }
    },
    {
        "name": "Test CREATE compound alias with name that already exists",
        "request": {
            "headers": {},
            "method": "POST",
            "request": {
                "name": "compound_alias_name1",
                "name_sentence_case": "compound_alias_name_sentence_case1_XYZ",
                "definition": "compound_alias_definition1_XYZ",
                "abbreviation": "abbv_XYZ",
                "compound_uid": "Compound_000001",
                "is_preferred_synonym": true,
                "library_name": "Sponsor"
            },
            "url": "/concepts/compound-aliases"
        },
        "response": {
            "code": 400,
            "result": {
                "message": "Compound alias with name (compound_alias_name1) already exists",
                "method": "POST",
                "path": "http://testserver/concepts/compound-aliases",
                "time": "2020-11-10T01:51:17.884429",
                "type": "ValidationException"
            }
        }
    },
    {
        "name": "Test CREATE compound alias with name sentence case that already exists",
        "request": {
            "headers": {},
            "method": "POST",
            "request": {
                "name": "compound_alias_name1_XYZ",
                "name_sentence_case": "compound_alias_name_sentence_case1",
                "definition": "compound_alias_definition1_XYZ",
                "abbreviation": "abbv_XYZ",
                "compound_uid": "Compound_000001",
                "is_preferred_synonym": true,
                "library_name": "Sponsor"
            },
            "url": "/concepts/compound-aliases"
        },
        "response": {
            "code": 400,
            "result": {
                "message": "Compound alias with name sentence case (compound_alias_name_sentence_case1) already exists",
                "method": "POST",
                "path": "http://testserver/concepts/compound-aliases",
                "time": "2020-11-10T01:51:17.884429",
                "type": "ValidationException"
            }
        }
    },
    {
        "name": "Test CREATE compound alias with abbreviation that already exists",
        "request": {
            "headers": {},
            "method": "POST",
            "request": {
                "name": "compound_alias_name1_XYZ",
                "name_sentence_case": "compound_alias_name_sentence_case1_XYZ",
                "definition": "compound_alias_definition1_XYZ",
                "abbreviation": "abbv",
                "compound_uid": "Compound_000001",
                "is_preferred_synonym": true,
                "library_name": "Sponsor"
            },
            "url": "/concepts/compound-aliases"
        },
        "response": {
            "code": 400,
            "result": {
                "message": "Compound alias with abbreviation (abbv) already exists",
                "method": "POST",
                "path": "http://testserver/concepts/compound-aliases",
                "time": "2020-11-10T01:51:17.884429",
                "type": "ValidationException"
            }
        }
    },
    {
        "name": "Test CREATE compound alias with non-existing compound",
        "request": {
            "headers": {},
            "method": "POST",
            "request": {
                "name": "compound_alias_name3",
                "name_sentence_case": "compound_alias_name_sentence_case3",
                "definition": "compound_alias_definition3",
                "abbreviation": "abbv3",
                "compound_uid": "non-existing-uid",
                "is_preferred_synonym": true,
                "library_name": "Sponsor"
            },
            "url": "/concepts/compound-aliases"
        },
        "response": {
            "code": 400,
            "result": {
                "message": "CompoundAliasVO tried to connect to non existing compound identified by uid (non-existing-uid)",
                "method": "POST",
                "path": "http://testserver/concepts/compound-aliases",
                "time": "2020-11-10T01:51:17.884429",
                "type": "ValidationException"
            }
        }
    }
]