{
    "variables": {
      "vsphere_server":"vcsa01",
      "vsphere_username":"administrator@vsphere.local",
      "vsphere_password": "secure_password",
      "vsphere_datacenter": "Demo-Datacenter",
      "vsphere_cluster": "Cluster01",
      "vsphere_datastore": "LOCAL01",
      "vsphere_network": "VM Network",
      "template_folder": "Templates",
        
      "vm_name": "Win2019-Template-Base-Thin",
      "vm_cpu_num": "2",
      "vm_mem_size": "4096",
      "vm_disk_size": "40960",
      "winadmin_password": "S3cr3t0!",
      "os_iso_path": "[LOCAL01] ISOs/Server2019.iso"
      },    

    "builders": [
      {
        "ip_wait_timeout": "1h",
        "type": "vsphere-iso",
  
        "vcenter_server": "{{user `vsphere_server`}}",
        "username": "{{user `vsphere_username`}}",
        "password": "{{user `vsphere_password`}}",
        "insecure_connection": "true",
  
        "datacenter": "{{user `vsphere_datacenter`}}",
        "cluster": "{{user `vsphere_cluster`}}",
        "datastore": "{{user `vsphere_datastore`}}",
        "folder": "{{user `template_folder`}}",
  
        "communicator": "winrm",
        "winrm_username": "Administrator",
        "winrm_password": "{{user `winadmin_password`}}",
  
        "convert_to_template": "true",

        "vm_name": "{{user `vm_name`}}",
        "guest_os_type": "windows9Server64Guest",
  
        "CPUs": "{{user `vm_cpu_num`}}",
        "RAM": "{{user `vm_mem_size`}}",
        "RAM_reserve_all": true,
        "firmware": "bios",
  
        "disk_controller_type": "lsilogic-sas",
        "storage": [
          {
            "disk_size": "{{user `vm_disk_size`}}",
            "disk_thin_provisioned": true
          }
        ],
  
        "network_adapters": [
          {
            "network": "{{user `vsphere_network`}}",
            "network_card": "vmxnet3"
          }
        ],
  
        "iso_paths": [
          "{{user `os_iso_path`}}",
          "[] /vmimages/tools-isoimages/windows.iso"
        ],
  
        "floppy_files": [
            "autounattend.xml",
            "../scripts/disable-network-discovery.cmd",
            "../scripts/enable-rdp.cmd",
            "../scripts/enable-winrm.ps1",
            "../scripts/install-vm-tools.cmd",
            "../scripts/set-temp.ps1"
        ]
      }
    ],
  
    "provisioners": [
      {
        "type": "windows-shell",
        "inline": ["ipconfig"]
      }
    ]
   
  }
