%YAML 1.1
%TAG !u! tag:unity3d.com,2011:
--- !u!1045 &1
EditorBuildSettings:
  m_ObjectHideFlags: 0
  serializedVersion: 2
  m_Scenes:
  - enabled: 1
    path: Assets/Scenes/MENU_FINAL.unity
    guid: a477c14a5c625294ab0dca3ac867a22c
  - enabled: 1
    path: Assets/Scenes/MAIN_SCENE.unity
    guid: c1d15c3ae4c326342a8f421d3222192d
  m_configObjects: {}
