%YAML 1.1
%TAG !u! tag:unity3d.com,2011:
--- !u!114 &11400000
MonoBehaviour:
  m_ObjectHideFlags: 0
  m_CorrespondingSourceObject: {fileID: 0}
  m_PrefabInstance: {fileID: 0}
  m_PrefabAsset: {fileID: 0}
  m_GameObject: {fileID: 0}
  m_Enabled: 1
  m_EditorHideFlags: 0
  m_Script: {fileID: 11500000, guid: faf7b9df1c29d424c8d121e986b27c37, type: 3}
  m_Name: 14
  m_EditorClassIdentifier: 
  dialogue: {fileID: 2480198943629176163, guid: 4809ef44fa6d0cd499d281decae51f20,
    type: 3}
  nbLost: 0
  startNode: 14
  illustartions:
  - Node: 14
    Illustration: {fileID: 4156963532967749509, guid: 3fb5a7ce13582064f86346a953162bac,
      type: 3}
