%YAML 1.1
%TAG !u! tag:unity3d.com,2011:
--- !u!114 &11400000
MonoBehaviour:
  m_ObjectHideFlags: 0
  m_CorrespondingSourceObject: {fileID: 0}
  m_PrefabInstance: {fileID: 0}
  m_PrefabAsset: {fileID: 0}
  m_GameObject: {fileID: 0}
  m_Enabled: 1
  m_EditorHideFlags: 0
  m_Script: {fileID: 11500000, guid: faf7b9df1c29d424c8d121e986b27c37, type: 3}
  m_Name: 2
  m_EditorClassIdentifier: 
  dialogue: {fileID: 2480198943629176163, guid: 34a7f33b4b1139f47aad64de96214cc4,
    type: 3}
  nbLost: 0
  startNode: 2
  illustartions:
  - Node: 2
    Illustration: {fileID: 3598964601045551361, guid: cf50c05f60c16b74e9552b2f30ee6bf1,
      type: 3}
