%YAML 1.1
%TAG !u! tag:unity3d.com,2011:
--- !u!114 &11400000
MonoBehaviour:
  m_ObjectHideFlags: 0
  m_CorrespondingSourceObject: {fileID: 0}
  m_PrefabInstance: {fileID: 0}
  m_PrefabAsset: {fileID: 0}
  m_GameObject: {fileID: 0}
  m_Enabled: 1
  m_EditorHideFlags: 0
  m_Script: {fileID: 11500000, guid: faf7b9df1c29d424c8d121e986b27c37, type: 3}
  m_Name: 25_2
  m_EditorClassIdentifier: 
  dialogue: {fileID: 2480198943629176163, guid: 759ae2b3893b7aa4a90b1b7b6c44095c,
    type: 3}
  nbLost: 0
  startNode: 25_2
  illustartions:
  - Node: 25_2
    Illustration: {fileID: 9072471143939152289, guid: 94e89abe7b15afc4785be1aa89d2a54f,
      type: 3}
