%YAML 1.1
%TAG !u! tag:unity3d.com,2011:
--- !u!114 &11400000
MonoBehaviour:
  m_ObjectHideFlags: 0
  m_CorrespondingSourceObject: {fileID: 0}
  m_PrefabInstance: {fileID: 0}
  m_PrefabAsset: {fileID: 0}
  m_GameObject: {fileID: 0}
  m_Enabled: 1
  m_EditorHideFlags: 0
  m_Script: {fileID: 11500000, guid: faf7b9df1c29d424c8d121e986b27c37, type: 3}
  m_Name: 23_1
  m_EditorClassIdentifier: 
  dialogue: {fileID: 2480198943629176163, guid: 72b8303c53c8e884da58bcc01aba5b63,
    type: 3}
  nbLost: 0
  startNode: Soin_fils
  illustartions:
  - Node: Soin_fils
    Illustration: {fileID: 0}
