%YAML 1.1
%TAG !u! tag:unity3d.com,2011:
--- !u!114 &11400000
MonoBehaviour:
  m_ObjectHideFlags: 0
  m_CorrespondingSourceObject: {fileID: 0}
  m_PrefabInstance: {fileID: 0}
  m_PrefabAsset: {fileID: 0}
  m_GameObject: {fileID: 0}
  m_Enabled: 1
  m_EditorHideFlags: 0
  m_Script: {fileID: 11500000, guid: faf7b9df1c29d424c8d121e986b27c37, type: 3}
  m_Name: 5
  m_EditorClassIdentifier: 
  dialogue: {fileID: 2480198943629176163, guid: b51640eee948e5f488fd38b9aae27c84,
    type: 3}
  nbLost: 0
  startNode: 5
  illustartions:
  - Node: 5
    Illustration: {fileID: -2571711080832878009, guid: 3f45b792c3d9c2b4d80acadb7e1d119d,
      type: 3}
