%YAML 1.1
%TAG !u! tag:unity3d.com,2011:
--- !u!114 &11400000
MonoBehaviour:
  m_ObjectHideFlags: 0
  m_CorrespondingSourceObject: {fileID: 0}
  m_PrefabInstance: {fileID: 0}
  m_PrefabAsset: {fileID: 0}
  m_GameObject: {fileID: 0}
  m_Enabled: 1
  m_EditorHideFlags: 0
  m_Script: {fileID: 11500000, guid: faf7b9df1c29d424c8d121e986b27c37, type: 3}
  m_Name: 20
  m_EditorClassIdentifier: 
  dialogue: {fileID: 2480198943629176163, guid: 6213017336fcdd745a91c046f2087160,
    type: 3}
  nbLost: 0
  startNode: 20
  illustartions:
  - Node: 20
    Illustration: {fileID: 5509231359467258335, guid: 26478cf991a65b34ea821e0b689c2425,
      type: 3}
