%YAML 1.1
%TAG !u! tag:unity3d.com,2011:
--- !u!114 &11400000
MonoBehaviour:
  m_ObjectHideFlags: 0
  m_CorrespondingSourceObject: {fileID: 0}
  m_PrefabInstance: {fileID: 0}
  m_PrefabAsset: {fileID: 0}
  m_GameObject: {fileID: 0}
  m_Enabled: 1
  m_EditorHideFlags: 0
  m_Script: {fileID: 11500000, guid: faf7b9df1c29d424c8d121e986b27c37, type: 3}
  m_Name: 28
  m_EditorClassIdentifier: 
  dialogue: {fileID: 2480198943629176163, guid: 27befa74802b8bd48aa6f595b532d05d,
    type: 3}
  nbLost: 0
  startNode: 28
  illustartions:
  - Node: 28
    Illustration: {fileID: 21300000, guid: b341e59978555e14c93d7146bfce5d9d, type: 3}
