{
  "function": {
    "narzedziowniaaec2c52d": {
      "build": true,
      "providerPlugin": "awscloudformation",
      "service": "Lambda"
    }
  },
  "api": {
    "api138f3cd2": {
      "service": "API Gateway",
      "providerPlugin": "awscloudformation",
      "dependsOn": [
        {
          "category": "function",
          "resourceName": "narzedziowniaaec2c52d",
          "attributes": [
            "Name",
            "Arn"
          ]
        }
      ]
    }
  }
}