{
    "type": "service_account",
    "project_id": "logs-286819",
    "private_key_id": "079b1077ec129bbe9537e2c946e11e5ca3d67f2a",
    "private_key": "-----BEGIN PRIVATE KEY-----\nMIIEvgIBADANBgkqhkiG9w0BAQEFAASCBKgwggSkAgEAAoIBAQC9kLspMqrVcWYz\nqlNahfPYWspUsWNkRtUp4H/O+saxzCyMjtTJ5wOHhaILu4FSbjZend3vYfW4nlww\nSk/6a81B82QFgIFLCnQDUgbiVCXFuXYD0tQcRwVbhsDYj1Y8SUwoD5IUOMxXZfYe\nM6AFWc0TBkBYcDZVsR0TLlSD/wi0bulClRUfYbZx0aBfi8F9gOm7X0MscuDvhG/j\nemgaubHPedaBF2ndswSvYNWb3IbpHJ4IUsDT07NVO6QASbmrpaUDXufl/eZhXkng\n4faxR0xsQx8A/F8a9YVz4PzR/nvppWUumcL90OHq72KT2QikZLIhuZ9V1dvwuEu0\nSFHtPflFAgMBAAECggEAByfCJMs0jxN1deBJPqq9Ok6tAfbjJ0sUKz093chx/Q6V\npOWUSx208KXe6L32Yu/ljfs8ABfswD/7/1eivrNYf1OKVDnWR4iYufJb76mY9mZq\nebj4yCt3HI4Q0+vPJ73licKSs0A0mFzxJhExSlpqJvxuq9fqeSATFqECUCwtfi/7\n6Q7iXU3+Q9OaxmcCAKHwfghH6iet34EAWdYyJYxT+ir5dZ/LwHT0acV0hVjoDjwQ\n7fHyjMU7MfCCXzi5lXvYlBICGJz6XbiBFaMLZamSBXXFTDV1afH7EJ8cGWDeud2w\ny/kjfdmr+D+OhRPOwTjNAyhLqHqRJUm+2emSudhCkQKBgQDmIKqDdm7BYyNSwoXk\npF4c1wgBgcQMQ7cH78N/23GYvm0an6hFSZTZVSm5bpSXXBUo+FSoLKj3EYIxjJZq\nRsZQhopu6Uql/9wmFiyEurEV2v2SHqTK7ybBxpCYMWEnKr9jHZpHpxJTybYvlfRx\n9J46SMxDIcbr4fdp/2NXvY36VQKBgQDS4KMydWbNpcjqItqC+z2kZ96zOVr6Uj9p\nXadwDFEtHhgUER1z+nh5kJxx6PzDRRflCKhiUBsI7jKLwaRF4KZNbu2NBmuW0smx\n8SQEYBhAPYVSug8tXfvU7D3fPAC+t6m8dGdO8bl6I6cTACK/7EiGzjXYg53DIjG+\nyhdVx8nTMQKBgF41LzjEKhEXEaXWplN0imaKDOf5BJX0vqAMIl9cKYPbKPUGOS+s\nMLhL6dnUkBXqh2sPRjDWn5ENZNv97rGxKYxbl55R+NI+DRS2bSElAEuvK7E+xD2j\na51WOWlkhZ4wHMtpmfgNSC5u3Btc6wYfmwrHNH+i+zkjd1K4TyXjHpVFAoGBAJp4\nsTM6KsdDxOw2Acjmz53J9Klmv00UyJyfXRLIAwLAw7SXYPLfLDcohmEu4VENINbG\nQ8pYkaU2D1Ku023YhRm9w0eFx3QhDlxJny+RUNJl/m6+GnYKHXo4X45R/t213iFN\nR4vdqBdfXHifpdTe+bW+AlWK/Bq/xp7SnMtaYW5RAoGBALRoZQAycbE1vDCdHF6M\n3TtbDXIj1/r9i9Y2pSvrtCsmZ0Vv8YOIbYgJnxMpmHjnGdsA5EPP+k5KDyCjN9DI\nhJQoO0TCkvX8kJc/aBZEmUXAtpWJWwC22+Og1U7pjFD9dwjIWmnFnBZZrOR9MUKv\ndvbJECn5nH7NVf04xzOblTHV\n-----END PRIVATE KEY-----\n",
    "client_email": "node-js-test@logs-286819.iam.gserviceaccount.com",
    "client_id": "110648929044919661021",
    "auth_uri": "https://accounts.google.com/o/oauth2/auth",
    "token_uri": "https://oauth2.googleapis.com/token",
    "auth_provider_x509_cert_url": "https://www.googleapis.com/oauth2/v1/certs",
    "client_x509_cert_url": "https://www.googleapis.com/robot/v1/metadata/x509/node-js-test%40logs-286819.iam.gserviceaccount.com"
}
