%YAML 1.1
%TAG !u! tag:unity3d.com,2011:
--- !u!1 &4413348024180613000
GameObject:
  m_ObjectHideFlags: 0
  m_CorrespondingSourceObject: {fileID: 0}
  m_PrefabInstance: {fileID: 0}
  m_PrefabAsset: {fileID: 0}
  serializedVersion: 6
  m_Component:
  - component: {fileID: 3244158400883129803}
  - component: {fileID: 5773968684957797694}
  m_Layer: 0
  m_Name: TilemapInteractor
  m_TagString: Untagged
  m_Icon: {fileID: 0}
  m_NavMeshLayer: 0
  m_StaticEditorFlags: 0
  m_IsActive: 1
--- !u!4 &3244158400883129803
Transform:
  m_ObjectHideFlags: 0
  m_CorrespondingSourceObject: {fileID: 0}
  m_PrefabInstance: {fileID: 0}
  m_PrefabAsset: {fileID: 0}
  m_GameObject: {fileID: 4413348024180613000}
  m_LocalRotation: {x: 0, y: 0, z: 0, w: 1}
  m_LocalPosition: {x: -0.42153108, y: -0.6271783, z: -8.336426}
  m_LocalScale: {x: 1, y: 1, z: 1}
  m_Children: []
  m_Father: {fileID: 0}
  m_RootOrder: 0
  m_LocalEulerAnglesHint: {x: 0, y: 0, z: 0}
--- !u!114 &5773968684957797694
MonoBehaviour:
  m_ObjectHideFlags: 0
  m_CorrespondingSourceObject: {fileID: 0}
  m_PrefabInstance: {fileID: 0}
  m_PrefabAsset: {fileID: 0}
  m_GameObject: {fileID: 4413348024180613000}
  m_Enabled: 1
  m_EditorHideFlags: 0
  m_Script: {fileID: 11500000, guid: 7a11828a1e8256741afe6c3c30f63523, type: 3}
  m_Name: 
  m_EditorClassIdentifier: 
  normal: {fileID: 11400000, guid: 771050a0e9e6cdc4792eacf18f684f2b, type: 2}
  higlighted: {fileID: 11400000, guid: bc6dfbc3dc2dd144b8657499b1ae92ba, type: 2}
  gameplayMap: {fileID: 0}
