%YAML 1.1
%TAG !u! tag:unity3d.com,2011:
--- !u!114 &11400000
MonoBehaviour:
  m_ObjectHideFlags: 0
  m_CorrespondingSourceObject: {fileID: 0}
  m_PrefabInstance: {fileID: 0}
  m_PrefabAsset: {fileID: 0}
  m_GameObject: {fileID: 0}
  m_Enabled: 1
  m_EditorHideFlags: 0
  m_Script: {fileID: 11500000, guid: 600ef906999d5b24bbd342cad6a198de, type: 3}
  m_Name: Leaf4
  m_EditorClassIdentifier: 
  nextTrue: {fileID: 0}
  nextFalse: {fileID: 0}
  sentence: 'Ending 4.

'
