1201196233769050112;2019-12-01 17:47:53;"Listen to this. Joe sounds more and more like Chauncey Gardner in ""Being There.""  I'm just not sure Joe is really there. https://t.co/KglJLzTWVB"
1200967572352573440;2019-12-01 02:39:16;"You will be surprised what I'm thankful for...check it out from this week's https://t.co/MTf4xbnNsG on @tbn 
https://t.co/tJiFbMOKTm"
1200792340400680960;2019-11-30 15:02:58;"Is there really a threat to personal freedoms in this country? @PacificJustice CEO Brad Dacus explains YES, @LuLuRoman70 tells her incredible story &amp; @RubenStuddard wows w/ his music 2nite https://t.co/MTf4xbnNsG on @tbn 8/11pm ET. https://t.co/tlmvJ5ANMJ"
1200391778777665536;2019-11-29 12:31:16;"Joe and Hunter Biden reveal the new photo that will grace the cover of the re-released album ""Smell the Glove"" by the iconic rock band ""Spinal Tap,"" which just announced 2020 North American Tour schedule to 14 Chuck E. Cheese locations. https://t.co/3pMr8SeNum"
1200177053137620993;2019-11-28 22:18:02;"Great example of fake news &amp; biased, disgusting, Trump-hating media making fools of themselves.  Actually, @realDonaldTrump was in Afghanistan serving food to US troops on Thanksgiving.  Media was soiling their pants by making stuff up and looking worse than their usual stupid. https://t.co/LIufU45WH6"
1200045012374999042;2019-11-28 13:33:21;A little levity from https://t.co/MTf4xbnNsG on this Thanksgiving Day.  It's intentionally cringe-worthy humor that will cause the trolls who follow me for spite to wretch violently and miss their Thanksgiving dinner!  https://t.co/GhfpYPCNrZ
1200028009115377664;2019-11-28 12:25:47;"Happy Thanksgiving!  Turkeys are injected w/ special secret marinade &amp; in my @Masterbuilt smoker.  Booyah! https://t.co/Dty6oZINhO"
1200022212163584001;2019-11-28 12:02:45;"It's not stunning that ""Nanny Boy"" Bloomberg believes gov't should control poor people w/ higher taxes, but stunning that he unflinchingly said it publicly.  He wants to be Pres of wrong country-he ought to try Venezuela. https://t.co/lAL4CtGPEL"
1199778727829397506;2019-11-27 19:55:14;Thankful that Adam the Schiff's little impeachment enterprise is going over about like surprising your family with tofu for Thanksgiving dinner.  https://t.co/91VyzbwPmH
1201216511836340225;2019-12-01 19:08:28;Its time #christmas2019 https://t.co/8T21XzceFn
1200536595310555137;2019-11-29 22:06:43;Truckstop treat https://t.co/k621DFnDwS
1200138073683701760;2019-11-28 19:43:08;Making meringue w Momma! Happy #Thanksgiving2019 https://t.co/ZngJaeyAll
1199834709905354753;2019-11-27 23:37:41;"A great way to begin the #Thanksgiving2019 weekend. @realDonaldTrump has signed the #hongkong Human Rights &amp; Democracy Act! https://t.co/UdFwOQ6ooe"
1199808258938220544;2019-11-27 21:52:34;"Ahead of Thanksgiving, Erin and Elijah, Blaise and I got to go give away cookies with @ipourlife, a nonprofit based in Springfield that helps at-risk youth achieve personal wellness &amp; independence. A real joy to meet many of their staff &amp; help them celebrate the youth they serve https://t.co/uqutBcH4NG"
1199716497016446976;2019-11-27 15:47:57;.@realDonaldTrump decision to designate Mexican cartels as Foreign Terrorist Organizations is absolutely right. And I continue to believe we should impose sanctions on Mexican officials unwilling to confront them https://t.co/GmSSHHR5AO
1199471263971979265;2019-11-26 23:33:29;You dont say https://t.co/CUyPpDKVzR
1199417944096362497;2019-11-26 20:01:36;"New data shows US life expectancy falling since 2014 thanks to deaths of despair - suicides, drug overdoses, &amp; alcohol-related deaths. Hardest hit are working Americans w/ less education in heartland - but all Americans are suffering https://t.co/TzoaXBkb6h"
1199345278559510531;2019-11-26 15:12:51;"This morning I spoke w/ @SecretaryCarson about the deplorable living conditions at Bridgeport Crossing in St Louis &amp; the TEH Realty properties in KC. Told him what I saw firsthand. He pledged that HUD would get engaged"
1199070407615303680;2019-11-25 21:00:37;"We dont need to be the worlds police force. And we shouldnt be. We need to focus on securing the prosperity &amp; security of Americans. And that means standing up to #China &amp; expecting our allies to do more in Europe https://t.co/6oor1s02kN"
1201497126083190786;2019-12-02 13:43:32;If the #JudiciaryCommittee votes on articles of impeachment after only a hearing with constitutional scholars, a presentation of Adam Schiffs report on Schiffs terms, and a quick markup, that will be a massive failure. https://t.co/3vjU3MTiqA
1201159340633329664;2019-12-01 15:21:17;"Its easy to hide behind a gavel. Adam Schiff needs to testify in Judiciary, answering questions from Democrats, Republicans, and the White Housejust like Ken Starr did.
 
This is crucial since Schiff has refused to share evidence that all House Members should be able to see. https://t.co/DoUoBIUU2m"
1200851410042138624;2019-11-30 18:57:41;"The least Chairman Nadler can do to show an ounce of fairness to the American peopleand indicate that Judiciary proceedings will be more than raw political theateris allow an equal distribution of witnesses for Wednesdays impeachment hearing.

https://t.co/MA5hYfumcd"
1200028397398888449;2019-11-28 12:27:20;"Today we give thanks for our many blessings. As we celebrate with family and friends, I encourage everyone to take a moment to give thanks for the things that we often overlook.

From our family to yours, Happy Thanksgiving!"
1199757352918016000;2019-11-27 18:30:18;"Chairman Nadlers hearing next week shows Democrats would rather replay a baseless June hearing than hear from fact witnesses Republicans have requested. 

Get ready for a show without substance. https://t.co/AqNH7mFJWT"
1199668464979447808;2019-11-27 12:37:05;"For Democrats to claim next weeks hearing gives @realDonaldTrump a chance to defend himself is a joke. 

Instead of bringing in Adam Schiff under oath, we are bringing in academics whose minds are already set against POTUS to give their opinion on this sham impeachment."
1199341981500989446;2019-11-26 14:59:45;Please join Lisa and me in praying for Jay's family. #gapol
1199341516994400259;2019-11-26 14:57:54;"If I had only known it was the last time I would hear his voice and get that needed bear hug, I would have held on just a little bit longer.

I will miss you, my friend."
1199341348534382592;2019-11-26 14:57:14;I saw Jay last Friday night for what I now know was the last time. We talked, we laughed, and we picked on each other as only friends can do. When it came time for the event to start, he hugged me and said, 'I love you man, let's talk again soon.'
1201489249738133505;2019-12-02 13:12:14;TUNE IN: Im minutes away from joining @foxandfriends to talk about the latest developments in the Democrats never-ending, partisan impeachment inquisition of @POTUS @realDonaldTrump. Watch @FoxNews at 8:15 EST. #AZ05
1201476018273431553;2019-12-02 12:19:39;COMING UP: Ill be joining @SteveDoocy on @foxandfriends to preview what will be an eventful week in the Democrats partisan efforts to impeach @POTUS @realDonaldTrump. Watch @FoxNews at 8:15 EST. #AZ05
1201338619174146048;2019-12-02 03:13:41;TOMORROW: Ill be on @foxandfriends with @SteveDoocy to preview the week ahead with the Democrats partisan impeachment efforts. Watch @FoxNews at 8:15 EST. #AZ05
1201323245254795266;2019-12-02 02:12:35;"It's awfully late in the proceedings to try to rehabilitate this sham of a process - especially since Chairman Nadler hasn't even disclosed to the committee who his witnesses will be &amp; the Intel report hasn't even been seen by members of that committee. https://t.co/y4481IqxZT"
1200045332207472640;2019-11-28 13:34:37;"#HappyThanksgiving! I am incredibly thankful for the honor to serve each of my #NY21 constituents every day. Earlier this week I had the opportunity to serve dinner to constituents at the Salvation Army. 

Enjoy this Thanksgiving with friends &amp; family!  https://t.co/zBS7eHsTKB"
1199083217124560896;2019-11-25 21:51:31;I'm honored that @POTUS signed my legislation, the Womens Suffrage Centennial Commemorative Coin Act, into law today! It is my hope that this legislation will encourage women to continue to be active participants in civic life. Read more https://t.co/R15s9KJfSS
1199007797343588352;2019-11-25 16:51:50;I applaud the people of Hong Kong and will continue to work with my colleagues to protect Hong Kongs voice from authoritarian regimes like China that continue to stifle democracy and suppress human rights.
1199007796571918336;2019-11-25 16:51:49;I am proud to have voted in support of the Hong Kong Human Rights and Democracy Act of 2019, which holds Hong Kong accountable to ensure that voters were able to freely enjoy the right to elect their officials by universal suffrage.
1199007795489705985;2019-11-25 16:51:49;After several months of protests and growing violence, the people of Hong Kong were finally heard when they cast their ballots giving pro-democracy candidates a sweeping majority of 389 of 452 elected seats. This strong ember of democracy is one that we must continue to stoke.
1199007794667630592;2019-11-25 16:51:49;THREAD: America continues to stand with Hong Kong and their fight to obtain freedom, democracy, and the right to self-governance.
1197871652689862657;2019-11-22 13:37:12;"I am proud to co-lead the Social Workers Safety Act along with @RepBrownley. Strengthening workplace safety will deliver support for critical social and health service employees in our communities. Read more
https://t.co/mN5lyKVlJR"
1197647766765408256;2019-11-21 22:47:33;I proudly submitted these remarks to the Congressional Record honoring the 125th anniversary of the @AdkEnterprise  a remarkable achievement! Thank you for continuing to deliver important local news to keep the community informed. https://t.co/WvQAnDrT0t
1197620758702428160;2019-11-21 21:00:14;Part 2  https://t.co/iexSJcRbtI
1197619613330219008;2019-11-21 20:55:41;"In my final questioning of the week, I focused on the FACTS that every American watching must know:

1. Defensive lethal aid to Ukraine was provided by the Trump Administration, NOT the Obama Administration.
2. There was NO investigation into Hunter Biden. 

Watch part 1  https://t.co/1YWlbExc4H"
