1200537397395505152;2019-11-29 22:09:55;In honor of #blackfriday, #fbf to getting through night shoots on Terminator with @laddersport. At 3 in the morning, even machines need fuel. 30% off - our only sale of the year - https://t.co/AUeq9z1m89 https://t.co/5voYJLpFy2
1200459417050763264;2019-11-29 17:00:03;@HRubinWest @laddersport I love hearing that!
1200454423605985280;2019-11-29 16:40:12;Skip the Black Friday anxiety, @laddersport is having our only sale of the year and you can order from home and then head straight to the gym to burn off the mashed potatoes. 30% off: https://t.co/wp98kbvGd3 https://t.co/RmH24jk1Ad
1200127856891715584;2019-11-28 19:02:33;Happy Thanksgiving! I am thankful for every opportunity that this great country has given me. Always remember, none of us are self-made, so take time this year to give back and help your community. https://t.co/Kwa55dx8ix
1197027879189532673;2019-11-20 05:44:20;Today, my friend Jusup Wilkosz, one of the great German bodybuilders, passed away. He was a champion and Ill miss him. My thoughts and prayers are with his family and all of his fans. https://t.co/nKq3qe1SQe
1195067686851469312;2019-11-14 19:55:14;One of the best documentaries of the year. The story of Paradise is devastating, but when I visited I also found hope in the heroic citizens and firefighters who showed the best of America. https://t.co/jY4fCK1vrQ https://t.co/6D6LCkXzKI
1193977343447945216;2019-11-11 19:42:36;Thank you, thank you, thank you, to our veterans. #VeteransDay https://t.co/kjYV0M0tZl
1191767007533776896;2019-11-05 17:19:31;Proud to be the first four time @CigarAficMag cover model! On newsstands now. https://t.co/BDjjkjX54X
1201274896204079106;2019-12-01 23:00:28;"In 2001, the HIV/AIDS crisis in #Africa had reached new heights. Death tolls were in the tens of millions. Today on #WAD2019, we celebrate that 15.7 million people living with HIV have access to life-saving treatment thanks to @PEPFAR
https://t.co/pZKgBl1Wcl"
1201206888349732864;2019-12-01 18:30:14;"""Holiday in the National Parks: Christmas at the White House 2007"" is open! Visit the special exhibit to see elegant decorations that adorned the White House in 2007, including mixed greenery, gold ribbons, and white flowers. https://t.co/csPovmQjc6"
1201199548489707522;2019-12-01 18:01:04;"In honor of #WAD2019, Bush Institute's Manager of Global Health @crystalcazier reflects on the progress we've made in the fight against HIV/AIDS and on what we have left to accomplish:
https://t.co/NYM0K322Sk"
1201161577187225601;2019-12-01 15:30:11;Can free trade survive a trade war? Nicholas Saliba explains. https://t.co/XGpicr9gUe
1201154303462907904;2019-12-01 15:01:16;"Did you know that women living with HIV are 5x more likely to develop cervical cancer? Together with @PEPFAR @UNAIDS &amp; @Merck we developed @GoFurther to help end AIDS and cervical cancer in Sub-Saharan Africa within a generation. #WAD2019
https://t.co/3CSp9jathQ"
1200829398888439808;2019-11-30 17:30:13;"""Holiday in the National Parks: Christmas at the White House 2007"" is open! Come visit to see decorations from the White House in 2007, models of historic sites, and behind-the-scenes photos of Mrs. @laurawbush's 31 visits to national parks. https://t.co/bb7dGLq5FY"
1200784095883726849;2019-11-30 14:30:12;"""Young people are coming of age at a time when many of our notions about work, identity, opportunity, and mobility are undergoing profound change."" - @scraigwatkins https://t.co/7poxJQPwnK"
1200482138791002113;2019-11-29 18:30:20;Dallas Holiday Guide  the Best Things to Do, From Christmas Villages to Snow Wonderlands via @PaperCityMag https://t.co/oCeSdZDN6h
1200847847702384640;2019-11-30 18:43:32;If you missed the big Trump interview, it is posted on https://t.co/rryWmyXe7C. Get or give a Premium Membership, youll receive The United States of Trump or any Killing book FREE.
1200438440447348737;2019-11-29 15:36:41;"You are crazy to go to stores today! Its the zombie apocalypse everywhere. But we have you covered: the https://t.co/rryWmyXe7C Christmas store has tremendous gifts; including The United States of Trump, a book that sets the record straight about the President."
1200111194478186496;2019-11-28 17:56:20;Happy Thanksgiving! Hope everyone heard the interview with the President, https://t.co/rryWmyXe7C has it. https://t.co/q6TEWEI8Cs
1199512080329646082;2019-11-27 02:15:40;President @realDonaldTrump tells me he is 90 days into the process of designating Mexican drug cartels as Foreign Terrorist Organizations - which would give US forces more leverage in taking them out. https://t.co/ewSJMkt6rr
1200933802295648258;2019-12-01 00:25:05;Great moment during pre-game of #FSUvsUF. The two bands played our national anthem together. https://t.co/Vgis1lByy3
1200764128022933504;2019-11-30 13:10:51;"Read here:
Conservatives debate over their future is going to be bitter and fierce https://t.co/htcoOb02Mh"
1200747158569472002;2019-11-30 12:03:26;"Some rely on chariots, others on horses,but we on the name of the LORD our God. They collapse and fall,but we stand strong and firm.

Psalms 20:8-9"
1200427372761223168;2019-11-29 14:52:43;"I saw coming with the clouds of heaven One like a son of man. When he reached the Ancient of Days &amp; was presented before him,
He received dominion, splendor,&amp;kingship; all nations, peoples &amp; tongues will serve him.His dominion is an everlasting dominion...

Daniel 7:13-14"
1200084519371624448;2019-11-28 16:10:20;"#instagramdown on #Thanksgiving. 

Do not panic! We will make it through this together."
1200057615243460608;2019-11-28 14:23:26;"Thank you @realDonaldTrump @potus for signing into law my #HongKongHumanRightsandDemocracyAct

And thank you to the bicameral/bipartisan coalition that made this possible 

#HongKong  https://t.co/bSRCDvYvg0"
1200056431401218049;2019-11-28 14:18:43;Report finds that #TikTok is helping #Chinas Communist government campaign of repression in #Xinjiang  https://t.co/enuo78HCh8
1200047814958632960;2019-11-28 13:44:29;"I #givethanks to God for my family, our health &amp; allowing me to be an American, a citizen of the greatest nation in history.

And I #givethanks to God for those who protect our nation, especially those away from their families on this #Thanksgiving2019 https://t.co/AQwpk4DrjM"
1200045340885426176;2019-11-28 13:34:39;"All your works give you thanks, LORD and your faithful bless you.

Psalms 145:10"
