1201480029265367040;2019-12-02 12:35:36;The United States has outperformed the rest of the world in an eye popping fashion. I dont think weve seen numbers like that. Mohamed El-Erian, Allianz Chief Economic Adviser. But despite this there is tremendous potential for growth, far greater than most have understood!
1201476231759302656;2019-12-02 12:20:30;The American people are going to see this for what it is. It is a political effort by the Democrats, and the President certainly doesnt have to aid in the Impeachment effort. Robert Ray @MariaBartiromo  Democrats are getting killed in their home districts. 2020!
1201472919299338240;2019-12-02 12:07:20;The process has been unfair. Republicans cant even get their own witnesses. It gets me that Adam Schiff is not punishable for lying, in any way. @MariaBartiromo
1201458758934781953;2019-12-02 11:11:04;U.S. Markets are up as much as 21% since the announcement of Tariffs on 3/1/2018 - and the U.S. is taking in massive amounts of money (and giving some to our farmers, who have been targeted by China)!
1201455859731238912;2019-12-02 10:59:33;".....Reserve should likewise act so that countries, of which there are many, no longer take advantage of our strong dollar by further devaluing their currencies. This makes it very hard for our manufactures &amp; farmers to fairly export their goods. Lower Rates &amp; Loosen - Fed!"
1201455858636472320;2019-12-02 10:59:33;"Brazil and Argentina have been presiding over a massive devaluation of their currencies. which is not good for our farmers. Therefore, effective immediately, I will restore the Tariffs on all Steel &amp; Aluminum that is shipped into the U.S. from those countries. The Federal...."
1201454816033198080;2019-12-02 10:55:24;It is clear that there is none of the bipartisan support that Speaker Pelosi said for months was essential for Impeachment. Chris Wallace @FoxNews
1201449855991910400;2019-12-02 10:35:42;Trump Economy Breaks Holiday Shopping Records. @FoxNews
1201485054876237825;2019-12-02 12:55:34;"""...this is an existential threat to civilization. No amount of economic costbenefit analysis is going to help us. We need to change our approach to the climate problem....""

Point.

https://t.co/0sq5sx9Vci

#climatechange #climatecrisis #environment #politics #ClimateAction https://t.co/aT5xnVeH5D"
1201484258788790272;2019-12-02 12:52:24;"Follow on Instagram : 
https://t.co/4cXh3PqdZf

#FunniestTweets #Politics #BJP #Karnataka #KarnatakaPolitics   
#funnyposts #funnymemes #kannadanews #KarnatakaByElection #byelections2019 #VoteCongressSaveKarnataka https://t.co/TNn5hUBRJw"
