1201196233769050112;2019-12-01 17:47:53;"Listen to this. Joe sounds more and more like Chauncey Gardner in ""Being There.""  I'm just not sure Joe is really there. https://t.co/KglJLzTWVB"
1200967572352573440;2019-12-01 02:39:16;"You will be surprised what I'm thankful for...check it out from this week's https://t.co/MTf4xbnNsG on @tbn 
https://t.co/tJiFbMOKTm"
1200792340400680960;2019-11-30 15:02:58;"Is there really a threat to personal freedoms in this country? @PacificJustice CEO Brad Dacus explains YES, @LuLuRoman70 tells her incredible story &amp; @RubenStuddard wows w/ his music 2nite https://t.co/MTf4xbnNsG on @tbn 8/11pm ET. https://t.co/tlmvJ5ANMJ"
1200391778777665536;2019-11-29 12:31:16;"Joe and Hunter Biden reveal the new photo that will grace the cover of the re-released album ""Smell the Glove"" by the iconic rock band ""Spinal Tap,"" which just announced 2020 North American Tour schedule to 14 Chuck E. Cheese locations. https://t.co/3pMr8SeNum"
1200177053137620993;2019-11-28 22:18:02;"Great example of fake news &amp; biased, disgusting, Trump-hating media making fools of themselves.  Actually, @realDonaldTrump was in Afghanistan serving food to US troops on Thanksgiving.  Media was soiling their pants by making stuff up and looking worse than their usual stupid. https://t.co/LIufU45WH6"
1200045012374999042;2019-11-28 13:33:21;A little levity from https://t.co/MTf4xbnNsG on this Thanksgiving Day.  It's intentionally cringe-worthy humor that will cause the trolls who follow me for spite to wretch violently and miss their Thanksgiving dinner!  https://t.co/GhfpYPCNrZ
1200028009115377664;2019-11-28 12:25:47;"Happy Thanksgiving!  Turkeys are injected w/ special secret marinade &amp; in my @Masterbuilt smoker.  Booyah! https://t.co/Dty6oZINhO"
1200022212163584001;2019-11-28 12:02:45;"It's not stunning that ""Nanny Boy"" Bloomberg believes gov't should control poor people w/ higher taxes, but stunning that he unflinchingly said it publicly.  He wants to be Pres of wrong country-he ought to try Venezuela. https://t.co/lAL4CtGPEL"
1199778727829397506;2019-11-27 19:55:14;Thankful that Adam the Schiff's little impeachment enterprise is going over about like surprising your family with tofu for Thanksgiving dinner.  https://t.co/91VyzbwPmH
1201216511836340225;2019-12-01 19:08:28;Its time #christmas2019 https://t.co/8T21XzceFn
1200536595310555137;2019-11-29 22:06:43;Truckstop treat https://t.co/k621DFnDwS
1200138073683701760;2019-11-28 19:43:08;Making meringue w Momma! Happy #Thanksgiving2019 https://t.co/ZngJaeyAll
1199834709905354753;2019-11-27 23:37:41;"A great way to begin the #Thanksgiving2019 weekend. @realDonaldTrump has signed the #hongkong Human Rights &amp; Democracy Act! https://t.co/UdFwOQ6ooe"
1199808258938220544;2019-11-27 21:52:34;"Ahead of Thanksgiving, Erin and Elijah, Blaise and I got to go give away cookies with @ipourlife, a nonprofit based in Springfield that helps at-risk youth achieve personal wellness &amp; independence. A real joy to meet many of their staff &amp; help them celebrate the youth they serve https://t.co/uqutBcH4NG"
1199716497016446976;2019-11-27 15:47:57;.@realDonaldTrump decision to designate Mexican cartels as Foreign Terrorist Organizations is absolutely right. And I continue to believe we should impose sanctions on Mexican officials unwilling to confront them https://t.co/GmSSHHR5AO
1199471263971979265;2019-11-26 23:33:29;You dont say https://t.co/CUyPpDKVzR
1199417944096362497;2019-11-26 20:01:36;"New data shows US life expectancy falling since 2014 thanks to deaths of despair - suicides, drug overdoses, &amp; alcohol-related deaths. Hardest hit are working Americans w/ less education in heartland - but all Americans are suffering https://t.co/TzoaXBkb6h"
1199345278559510531;2019-11-26 15:12:51;"This morning I spoke w/ @SecretaryCarson about the deplorable living conditions at Bridgeport Crossing in St Louis &amp; the TEH Realty properties in KC. Told him what I saw firsthand. He pledged that HUD would get engaged"
1199070407615303680;2019-11-25 21:00:37;"We dont need to be the worlds police force. And we shouldnt be. We need to focus on securing the prosperity &amp; security of Americans. And that means standing up to #China &amp; expecting our allies to do more in Europe https://t.co/6oor1s02kN"
1201497126083190786;2019-12-02 13:43:32;If the #JudiciaryCommittee votes on articles of impeachment after only a hearing with constitutional scholars, a presentation of Adam Schiffs report on Schiffs terms, and a quick markup, that will be a massive failure. https://t.co/3vjU3MTiqA
1201159340633329664;2019-12-01 15:21:17;"Its easy to hide behind a gavel. Adam Schiff needs to testify in Judiciary, answering questions from Democrats, Republicans, and the White Housejust like Ken Starr did.
 
This is crucial since Schiff has refused to share evidence that all House Members should be able to see. https://t.co/DoUoBIUU2m"
1200851410042138624;2019-11-30 18:57:41;"The least Chairman Nadler can do to show an ounce of fairness to the American peopleand indicate that Judiciary proceedings will be more than raw political theateris allow an equal distribution of witnesses for Wednesdays impeachment hearing.

https://t.co/MA5hYfumcd"
1200028397398888449;2019-11-28 12:27:20;"Today we give thanks for our many blessings. As we celebrate with family and friends, I encourage everyone to take a moment to give thanks for the things that we often overlook.

From our family to yours, Happy Thanksgiving!"
1199757352918016000;2019-11-27 18:30:18;"Chairman Nadlers hearing next week shows Democrats would rather replay a baseless June hearing than hear from fact witnesses Republicans have requested. 

Get ready for a show without substance. https://t.co/AqNH7mFJWT"
1199668464979447808;2019-11-27 12:37:05;"For Democrats to claim next weeks hearing gives @realDonaldTrump a chance to defend himself is a joke. 

Instead of bringing in Adam Schiff under oath, we are bringing in academics whose minds are already set against POTUS to give their opinion on this sham impeachment."
1199341981500989446;2019-11-26 14:59:45;Please join Lisa and me in praying for Jay's family. #gapol
1199341516994400259;2019-11-26 14:57:54;"If I had only known it was the last time I would hear his voice and get that needed bear hug, I would have held on just a little bit longer.

I will miss you, my friend."
1199341348534382592;2019-11-26 14:57:14;I saw Jay last Friday night for what I now know was the last time. We talked, we laughed, and we picked on each other as only friends can do. When it came time for the event to start, he hugged me and said, 'I love you man, let's talk again soon.'
1201489249738133505;2019-12-02 13:12:14;TUNE IN: Im minutes away from joining @foxandfriends to talk about the latest developments in the Democrats never-ending, partisan impeachment inquisition of @POTUS @realDonaldTrump. Watch @FoxNews at 8:15 EST. #AZ05
1201476018273431553;2019-12-02 12:19:39;COMING UP: Ill be joining @SteveDoocy on @foxandfriends to preview what will be an eventful week in the Democrats partisan efforts to impeach @POTUS @realDonaldTrump. Watch @FoxNews at 8:15 EST. #AZ05
1201338619174146048;2019-12-02 03:13:41;TOMORROW: Ill be on @foxandfriends with @SteveDoocy to preview the week ahead with the Democrats partisan impeachment efforts. Watch @FoxNews at 8:15 EST. #AZ05
1201323245254795266;2019-12-02 02:12:35;"It's awfully late in the proceedings to try to rehabilitate this sham of a process - especially since Chairman Nadler hasn't even disclosed to the committee who his witnesses will be &amp; the Intel report hasn't even been seen by members of that committee. https://t.co/y4481IqxZT"
1200045332207472640;2019-11-28 13:34:37;"#HappyThanksgiving! I am incredibly thankful for the honor to serve each of my #NY21 constituents every day. Earlier this week I had the opportunity to serve dinner to constituents at the Salvation Army. 

Enjoy this Thanksgiving with friends &amp; family!  https://t.co/zBS7eHsTKB"
1199083217124560896;2019-11-25 21:51:31;I'm honored that @POTUS signed my legislation, the Womens Suffrage Centennial Commemorative Coin Act, into law today! It is my hope that this legislation will encourage women to continue to be active participants in civic life. Read more https://t.co/R15s9KJfSS
1199007797343588352;2019-11-25 16:51:50;I applaud the people of Hong Kong and will continue to work with my colleagues to protect Hong Kongs voice from authoritarian regimes like China that continue to stifle democracy and suppress human rights.
1199007796571918336;2019-11-25 16:51:49;I am proud to have voted in support of the Hong Kong Human Rights and Democracy Act of 2019, which holds Hong Kong accountable to ensure that voters were able to freely enjoy the right to elect their officials by universal suffrage.
1199007795489705985;2019-11-25 16:51:49;After several months of protests and growing violence, the people of Hong Kong were finally heard when they cast their ballots giving pro-democracy candidates a sweeping majority of 389 of 452 elected seats. This strong ember of democracy is one that we must continue to stoke.
1199007794667630592;2019-11-25 16:51:49;THREAD: America continues to stand with Hong Kong and their fight to obtain freedom, democracy, and the right to self-governance.
1197871652689862657;2019-11-22 13:37:12;"I am proud to co-lead the Social Workers Safety Act along with @RepBrownley. Strengthening workplace safety will deliver support for critical social and health service employees in our communities. Read more
https://t.co/mN5lyKVlJR"
1197647766765408256;2019-11-21 22:47:33;I proudly submitted these remarks to the Congressional Record honoring the 125th anniversary of the @AdkEnterprise  a remarkable achievement! Thank you for continuing to deliver important local news to keep the community informed. https://t.co/WvQAnDrT0t
1197620758702428160;2019-11-21 21:00:14;Part 2  https://t.co/iexSJcRbtI
1197619613330219008;2019-11-21 20:55:41;"In my final questioning of the week, I focused on the FACTS that every American watching must know:

1. Defensive lethal aid to Ukraine was provided by the Trump Administration, NOT the Obama Administration.
2. There was NO investigation into Hunter Biden. 

Watch part 1  https://t.co/1YWlbExc4H"
1201342411978543104;2019-12-02 03:28:45;"This impeachment effort by House Dems is certain to go down in US history as one of the most epic face plants ever to take place in American politics &amp; its amazing the # of ppl so blinded w/ hate for the Pres to have absolutely ZERO clue at all of that reality. Its quite sad."
1201192758481997824;2019-12-01 17:34:05;"Great to kick off the holiday season w/my family last night at the Village of Patchogues 57th Annual Christmas Parade &amp; mark #SmallBusinessSaturday w/ so many successful small businesses that line the parade route &amp; have revitalized Patchogues beautiful downtown in recent yrs https://t.co/ZS7hG5y9NF"
1201024990692421632;2019-12-01 06:27:26;The whistleblower should testify. Dems say no, claiming his role was only to pull a fire alarm. The problem is (1) he seems to have pulled it w/bad intentions (2) it looks like Schiffs team told him to pull it (3) he never saw a fire. We want to know who told him there was one
1200944427746902017;2019-12-01 01:07:18;"365 days ago today, Pres Trump signed USMCA, which is estimated to add 176k new US jobs, and increase US GDP &amp; investment. If Pelosi &amp; House Dems don't see the value in delivering this win ASAP for the American worker, they don't even deserve to be in office, let alone in charge."
1200897229835382785;2019-11-30 21:59:45;Good observation by @JakeSherman. The opposition is bipartisan. There are even Congressional Democrats now publicly opposed to this absurd impeachment circus. The fact remains that the President did NOTHING at all to possibly impeach him for doing. Period. The end. https://t.co/1hAIm21hYf
1200566081208954885;2019-11-30 00:03:53;Next week in DC would be perfect for passing USMCA or the hugely bipartisan proposals to lower prescription drug costs. Sucking up that bandwidth to instead rip our country in half with insane articles of impeachment is an entirely wrong direction to take America.
1200208752181469189;2019-11-29 00:23:59;"My family &amp; I started this Thanksgiving off right w/ @LongIslandCares, the Harry Chapin Food Bank, in Hauppauge, alongside so many other LIers who volunteered to put together Thanksgiving meals for those in need. TY to all who gave so many LIers so much to be thankful for today https://t.co/uzS0R7RCfb"
1200097099456626689;2019-11-28 17:00:19;"This #Thanksgiving, we have so much to be thankful for - our great nation, our family &amp; friends, our men &amp; women in uniform, and, of course, all of you.  #HappyThanksgiving &amp; lots of love from the Zeldin family!"
1199845984961998848;2019-11-28 00:22:29;"The ppl of Hong Kong are fighting for freedoms &amp; liberties just like those we cherish in our great country. Grateful POTUS just signed legislation to stand strong w/the ppl of Hong Kong who have taken to the streets &amp; ballot box w/dreams of a better future &amp; love of democracy."
1201489442009239552;2019-12-02 13:13:00;The Hong Kong Human Rights and Democracy Act and my PROTECT Act were signed into law. This sends a clear message to the Hong Kong freedom fighters  the most powerful country on earth stands with you in your fight against Communist China. #StandwithHK # https://t.co/3OyZ65HTL9
1201328526273720322;2019-12-02 02:33:34;My prayers are with the family of Bishop William Graves. Bishop Graves tore down barriers, serving as the first African American on the @TVAnews board of directors. His leadership will be greatly missed. https://t.co/8zu7bK7tAb
1201290632007864320;2019-12-02 00:03:00;Millions of rural Americans lack access to high speed internet. My bipartisan Internet Exchange Act will help bridge the digital divide by offsetting the costs of establishing and maintaining broadband connections. https://t.co/qBtPIgVP2h
1200845947577806851;2019-11-30 18:35:59;"Bill Whitson was a lifelong public servant, instrumental in Nashvilles growth. Our prayers are with his family, including his son State Rep. Sam Whitson.
https://t.co/lnDZvN1MZV"
1200816420730261510;2019-11-30 16:38:39;Small businesses are the backbone of our economy. Employing over 1 million people, Tennessee small businesses make up around 99% of the companies in our state. #ShopSmall https://t.co/EbLCf1BtF5
1200605714533642240;2019-11-30 02:41:23;"This is what happens when American lawmakers stand up for human rights abuses in Hong Kong. 

American businesspeople should watch closely, defy President Xis Communist agenda, and who knows whatll happen. https://t.co/itv0Lx2hNh"
1200567618026893312;2019-11-30 00:10:00;"The United States will not allow Communist China to continue to violate the basic human rights and freedoms of the Hong Kong people. 

Thank you @realDonaldTrump for signing my PROTECT Act and @marcorubios #HKHumanRightsandDemocracyAct into law! # #FreeHongKong #StandwithHK https://t.co/bXjV2H6ana"
1200513259817750528;2019-11-29 20:34:00;"Songwriters deserve to be compensated for their incredible creativity and talent; but currently, radio stations are allowed to circumvent the copyright system and not pay songwriters whose work they choose to spin on air. The AM-FM Act will fix that. https://t.co/eYZNJDifQU"
1200136746706460672;2019-11-28 19:37:52;https://t.co/IGh4hDyysr
1201493724766908416;2019-12-02 13:30:01;Biden Described Allowing Children To Play With His Wet Leg Hair In Resurfaced Clip: Ive Loved Kids Jumping On My Lap. https://t.co/eo3Yg6dWZ4
1201489968574672896;2019-12-02 13:15:05;Joe Sestak Ends Presidential Bid. https://t.co/URixQx7fxs
1201486226546712583;2019-12-02 13:00:13;Klobuchar Says She Sees Trump Impeachment As A Global Watergate. https://t.co/t7rxBnw44G
1201482427966906368;2019-12-02 12:45:07;9-Year-Old Kid Entices Trump To Be Vegan For A Month. https://t.co/Wfhu0Kn9YF
1201478633170382848;2019-12-02 12:30:03;Juan Williams: Trumps Afghanistan Trip A Photo-Op. https://t.co/OTWEvKsdPi
1201471233134616577;2019-12-02 12:00:38;Some People Like To Project Themselves: Ed Henry Criticizes Joy Reid For Injecting Race Into Discussion About Trump Support. https://t.co/KyrvRb6cwG
1201467298210562048;2019-12-02 11:45:00;Cory Booker Releases Campaign Ad Hyping Love And Unity, Suggests Trump Is A Bigot And Demagogue. https://t.co/ZPDZc7YHzY
1201463537132036096;2019-12-02 11:30:04;Ratcliffe Says He Knows The Reason Schiff Wont Release ICIG Michael Atkinsons Transcript. https://t.co/bOdoyo2PaD
1201455997665103872;2019-12-02 11:00:06;Blizzards Threaten To Wreak Havoc On Millions Returning From Thanksgiving Holiday https://t.co/6BX0j7Mn1M
1201494794142441476;2019-12-02 13:34:16;"I dont have to take orders from you. Im a U.S. Attorney - Elite Liberal Bianca Forde to lowly peasant police officer

https://t.co/BuyMF00Y7k"
1201489170310598659;2019-12-02 13:11:55;"Do you believe this was yet another attempt by MSNBC to paint Trump as a ""white supremacist?""

...or was it an honest mistake?

https://t.co/Xt0a0Z7Ar3"
1201479606613807105;2019-12-02 12:33:55;"This is what happens when two TDS infected fake news peddlers get together. It's ""Dumb and Dumber 4"" 

https://t.co/HpdHqlP3J7"
1201472080874811394;2019-12-02 12:04:01;"Folks, don't you agree -- her editor should have been fired. 

https://t.co/f0bw27lsRN"
1201464508797116416;2019-12-02 11:33:55;"Thank you, Eric for finally calling this guy out and telling him to put up or shut up! 

https://t.co/bPI04rgeeJ"
1201456981715947520;2019-12-02 11:04:01;"God Bless this farmer for refusing to bow to this phony liberal elite 

https://t.co/yaSNn23669"
1201449445658972160;2019-12-02 10:34:04;"Clarence Thomas speaking some raw and real truth. 

https://t.co/A0R6GsK6yd"
1201441857651298304;2019-12-02 10:03:55;"Honestly, folks, this should disqualify him from running. It's that disgusting. 

https://t.co/qjJrA7QtSz"
1201433595879075840;2019-12-02 09:31:05;"I know this isn't about black voters on the Dem plantation but I am honored to share this beautiful story of a man who became a father figure for these 50-plus boys

.....in Brooklyn, New York

https://t.co/aQBqRV9Wqu"
1201426007699398656;2019-12-02 09:00:56;"Everybody that shares this wonderful story just shows how huge YOUR heart is

https://t.co/D2F3fmQXJa"
1201496473139122178;2019-12-02 13:40:56;Lisa Page, the former FBI lawyer who opposed Donald Trumps presidential candidacy while the agency conducted critical investigations surrounding the 2016 campaign, has spoken out for the first time. https://t.co/Z4rbb8ShUY
1201491104677400576;2019-12-02 13:19:36;"WATCH: @FLOTUS Melania Trump shows off the White House's patriotic Spirit of America-themed Christmas decorations. 

https://t.co/6X39PvipK2"
1201488653958164482;2019-12-02 13:09:52;"Montana Gov. Steve Bullock Quits Presidential Race 
https://t.co/QC6Z8OzuyQ"
1201487230864367616;2019-12-02 13:04:13;Roseanne Barr Set to Appear at Trumpettes Gala at Mar-a-Lago on Super Bowl Weekend https://t.co/y9OwF08vbs
1201481784980070401;2019-12-02 12:42:34;Democrats are doubting Joe Bidens advantage in South Carolina will hold if he comes up short in the first three nominating contests. https://t.co/2V0EZc9vXI
1201476466267086848;2019-12-02 12:21:26;This is wild. https://t.co/TuhVK4t4Oz
1201471382216941569;2019-12-02 12:01:14;Not a good look. https://t.co/AQ3Gllg5FN
1201361832176504835;2019-12-02 04:45:55;Santa Helps Volunteer Firefighters Put Out Fire During Parade https://t.co/kj0wMvbVof
1201356558887723008;2019-12-02 04:24:58;Obama had EIGHT YEARS to address Global Warming. Besides, if you're not talking about China then you're not serious about tackling pollution. https://t.co/w0oZGZz8Jd
1201351238060822528;2019-12-02 04:03:49;".@MarkLevinShow: ""Looks like Georgia Governor Kemp is another Romney. Hes about to appoint a RINO to the Senate. His surrogates are trashing conservative critics like Gaetz."" https://t.co/yP0o2YG7Vw"
1201492092582866944;2019-12-02 13:23:32;Rep. Ratcliffe Explains Why Adam Schiff Continues to Hold Back Transcript of ICIG Atkinson's Testimony https://t.co/pDvTSusf5e
1201488703539032064;2019-12-02 13:10:04;"Redefining ""Standards"" In Education (via @JoePCunningham) https://t.co/rLlUiLjabH"
1201482901931614210;2019-12-02 12:47:00;New Study: Trump Supporters Are Insecure, Impotent, and Their Wives Are Possibly Sleeping Around on Them @streiffredstate https://t.co/PNemNAhvGe
1201477117403267073;2019-12-02 12:24:01;Conservatives, Lets Stop Pretending We Hate Identity Politics @JeffOnTheRight https://t.co/ZU2hRzFP2L
1201476860250595334;2019-12-02 12:23:00;Conservatives, Lets Stop Pretending We Hate Identity Politics @JeffOnTheRight https://t.co/ZU2hRzoebd
1201474847118970880;2019-12-02 12:15:00;The Real Question Is Not Whether the Military Trusts President Trump but Whether the Nation Can Still Trust the Military @streiffredstate https://t.co/ivKbUDf4Ov
1201472047530041344;2019-12-02 12:03:53;Trumps Black Approval Ratings Are Not as Relevant as We Might Think https://t.co/AASWkZSiYm
1201471288801402880;2019-12-02 12:00:52;Trumps Black Approval Ratings Are Not as Relevant as We Might Think https://t.co/IlVOE6q9c2
1201471090427678721;2019-12-02 12:00:04;ICE Arrests Sexual Predator Released by Sanctuary City https://t.co/BUb8Fdhnsw
1201350781456306177;2019-12-02 04:02:00;Ohio State vs. Michigan Announcer Tells Story of Player Almost Being Aborted, Leftists Lose Their Ever Loving Minds https://t.co/YAN71WbEsD
1201350304689774593;2019-12-02 04:00:07;In case you needed a refresher. https://t.co/LIUJK7FJrY
1201335180616753152;2019-12-02 03:00:01;It was... bad, to say the least. https://t.co/LFWk0NKXHu
1201320117113671680;2019-12-02 02:00:10;Which will he choose? https://t.co/HrVZbO9ccO
1201312579005628417;2019-12-02 01:30:12;Ouch. https://t.co/JgVUte2Dtl
1201308757449465856;2019-12-02 01:15:01;"This just in ---&gt; https://t.co/8KBCgRZzKp"
1201305107020894210;2019-12-02 01:00:31;He needs to rethink that strategy. https://t.co/sosZOymF6L
1201297469092646913;2019-12-02 00:30:10;Oh, geez. https://t.co/sEFgLvA0cq
1201289919110488070;2019-12-02 00:00:10;"""Once again, though, they have overreached and miscalculated."" https://t.co/jrc2BGibC9"
1201282328779247617;2019-12-01 23:30:00;This can really throw a wrench in things. https://t.co/Xp8QCGDO1F
1201274813509251072;2019-12-01 23:00:08;Let's dive a little deeper, shall we? https://t.co/3p5VhzTwAW
