timestamp,holiday_name
2018-01-01,New Year's Day
2018-01-15,Dr. Martin Luther King Jr. Day
2018-02-12,Lincoln's Birthday
2018-02-19,Washington's Birthday
2018-05-28,Memorial Day
2018-07-04,Independence Day
2018-09-03,Labor Day
2018-10-08,Columbus Day
2018-11-06,Election Day
2018-11-12,Veterans' Day
2018-11-22,Thanksgiving Day
2018-12-25,Christmas Day
