{
  "products": [
    {
      "name": "Table",
      "img": "table.jpeg",
      "price": 123,
      "description": "A table is an item of furniture with a flat top and one or more legs, used as a surface for working at, eating from or on which to place things."
    },
    {
      "name": "Chair",
      "img": "chair.jpg",
      "price": 79,
      "description": "One of the basic pieces of furniture, a chair is a type of seat. Its primary features are two pieces of a durable material, attached as back and seat to one another at a 90° or slightly greater angle, with usually the four corners of the horizontal seat attached in turn to four legs—or other parts of the seat's underside attached to three legs or to a shaft about which a four-arm turnstile on rollers can turn—strong enough to support the weight of a person who sits on the seat (usually wide and broad enough to hold the lower body from the buttocks almost to the knees) and leans against the vertical back (usually high and wide enough to support the back to the shoulder blades)."
    },
    {
      "name": "Sofa",
      "img": "sofa.jpg",
      "price": 799,
      "description": "A couch (British English, U.S. English), also known as a sofa or settee (Canadian English and British English), is a piece of furniture for seating two or three people in the form of a bench, with armrests, which is partially or entirely upholstered, and often fitted with springs and tailored cushions."
    }
  ]
}
