%!PS-Adobe-3.0 EPSF-3.0
%%Creator: (MATLAB, The Mathworks, Inc. Version 23.2.0.2409890 \(R2023b\) Update 3. Operating System: Mac OS X)
%%Title: /Users/jakub/Projects/modeling-and-identification/report-03/images/lab7/100.eps
%%CreationDate: 2023-12-22T23:53:17
%%Pages: (atend)
%%BoundingBox:     0     0   560   420
%%LanguageLevel: 3
%%EndComments
%%BeginProlog
%%BeginResource: procset (Apache XML Graphics Std ProcSet) 1.2 0
%%Version: 1.2 0
%%Copyright: (Copyright 2001-2003,2010 The Apache Software Foundation. License terms: http://www.apache.org/licenses/LICENSE-2.0)
/bd{bind def}bind def
/ld{load def}bd
/GR/grestore ld
/GS/gsave ld
/RM/rmoveto ld
/C/curveto ld
/t/show ld
/L/lineto ld
/ML/setmiterlimit ld
/CT/concat ld
/f/fill ld
/N/newpath ld
/S/stroke ld
/CC/setcmykcolor ld
/A/ashow ld
/cp/closepath ld
/RC/setrgbcolor ld
/LJ/setlinejoin ld
/GC/setgray ld
/LW/setlinewidth ld
/M/moveto ld
/re {4 2 roll M
1 index 0 rlineto
0 exch rlineto
neg 0 rlineto
cp } bd
/_ctm matrix def
/_tm matrix def
/BT { _ctm currentmatrix pop matrix _tm copy pop 0 0 moveto } bd
/ET { _ctm setmatrix } bd
/iTm { _ctm setmatrix _tm concat } bd
/Tm { _tm astore pop iTm 0 0 moveto } bd
/ux 0.0 def
/uy 0.0 def
/F {
  /Tp exch def
  /Tf exch def
  Tf findfont Tp scalefont setfont
  /cf Tf def  /cs Tp def
} bd
/ULS {currentpoint /uy exch def /ux exch def} bd
/ULE {
  /Tcx currentpoint pop def
  gsave
  newpath
  cf findfont cs scalefont dup
  /FontMatrix get 0 get /Ts exch def /FontInfo get dup
  /UnderlinePosition get Ts mul /To exch def
  /UnderlineThickness get Ts mul /Tt exch def
  ux uy To add moveto  Tcx uy To add lineto
  Tt setlinewidth stroke
  grestore
} bd
/OLE {
  /Tcx currentpoint pop def
  gsave
  newpath
  cf findfont cs scalefont dup
  /FontMatrix get 0 get /Ts exch def /FontInfo get dup
  /UnderlinePosition get Ts mul /To exch def
  /UnderlineThickness get Ts mul /Tt exch def
  ux uy To add cs add moveto Tcx uy To add cs add lineto
  Tt setlinewidth stroke
  grestore
} bd
/SOE {
  /Tcx currentpoint pop def
  gsave
  newpath
  cf findfont cs scalefont dup
  /FontMatrix get 0 get /Ts exch def /FontInfo get dup
  /UnderlinePosition get Ts mul /To exch def
  /UnderlineThickness get Ts mul /Tt exch def
  ux uy To add cs 10 mul 26 idiv add moveto Tcx uy To add cs 10 mul 26 idiv add lineto
  Tt setlinewidth stroke
  grestore
} bd
/QT {
/Y22 exch store
/X22 exch store
/Y21 exch store
/X21 exch store
currentpoint
/Y21 load 2 mul add 3 div exch
/X21 load 2 mul add 3 div exch
/X21 load 2 mul /X22 load add 3 div
/Y21 load 2 mul /Y22 load add 3 div
/X22 load /Y22 load curveto
} bd
/SSPD {
dup length /d exch dict def
{
/v exch def
/k exch def
currentpagedevice k known {
/cpdv currentpagedevice k get def
v cpdv ne {
/upd false def
/nullv v type /nulltype eq def
/nullcpdv cpdv type /nulltype eq def
nullv nullcpdv or
{
/upd true def
} {
/sametype v type cpdv type eq def
sametype {
v type /arraytype eq {
/vlen v length def
/cpdvlen cpdv length def
vlen cpdvlen eq {
0 1 vlen 1 sub {
/i exch def
/obj v i get def
/cpdobj cpdv i get def
obj cpdobj ne {
/upd true def
exit
} if
} for
} {
/upd true def
} ifelse
} {
v type /dicttype eq {
v {
/dv exch def
/dk exch def
/cpddv cpdv dk get def
dv cpddv ne {
/upd true def
exit
} if
} forall
} {
/upd true def
} ifelse
} ifelse
} if
} ifelse
upd true eq {
d k v put
} if
} if
} if
} forall
d length 0 gt {
d setpagedevice
} if
} bd
/RE { % /NewFontName [NewEncodingArray] /FontName RE -
  findfont dup length dict begin
  {
    1 index /FID ne
    {def} {pop pop} ifelse
  } forall
  /Encoding exch def
  /FontName 1 index def
  currentdict definefont pop
  end
} bind def
%%EndResource
%%BeginResource: procset (Apache XML Graphics EPS ProcSet) 1.0 0
%%Version: 1.0 0
%%Copyright: (Copyright 2002-2003 The Apache Software Foundation. License terms: http://www.apache.org/licenses/LICENSE-2.0)
/BeginEPSF { %def
/b4_Inc_state save def         % Save state for cleanup
/dict_count countdictstack def % Count objects on dict stack
/op_count count 1 sub def      % Count objects on operand stack
userdict begin                 % Push userdict on dict stack
/showpage { } def              % Redefine showpage, { } = null proc
0 setgray 0 setlinecap         % Prepare graphics state
1 setlinewidth 0 setlinejoin
10 setmiterlimit [ ] 0 setdash newpath
/languagelevel where           % If level not equal to 1 then
{pop languagelevel             % set strokeadjust and
1 ne                           % overprint to their defaults.
{false setstrokeadjust false setoverprint
} if
} if
} bd
/EndEPSF { %def
count op_count sub {pop} repeat            % Clean up stacks
countdictstack dict_count sub {end} repeat
b4_Inc_state restore
} bd
%%EndResource
%FOPBeginFontDict
%%IncludeResource: font Courier-Oblique
%%IncludeResource: font Courier-BoldOblique
%%IncludeResource: font Courier-Bold
%%IncludeResource: font ZapfDingbats
%%IncludeResource: font Symbol
%%IncludeResource: font Helvetica
%%IncludeResource: font Helvetica-Oblique
%%IncludeResource: font Helvetica-Bold
%%IncludeResource: font Helvetica-BoldOblique
%%IncludeResource: font Times-Roman
%%IncludeResource: font Times-Italic
%%IncludeResource: font Times-Bold
%%IncludeResource: font Times-BoldItalic
%%IncludeResource: font Courier
%FOPEndFontDict
%%BeginResource: encoding WinAnsiEncoding
/WinAnsiEncoding [
/.notdef /.notdef /.notdef /.notdef /.notdef
/.notdef /.notdef /.notdef /.notdef /.notdef
/.notdef /.notdef /.notdef /.notdef /.notdef
/.notdef /.notdef /.notdef /.notdef /.notdef
/.notdef /.notdef /.notdef /.notdef /.notdef
/.notdef /.notdef /.notdef /.notdef /.notdef
/.notdef /.notdef /space /exclam /quotedbl
/numbersign /dollar /percent /ampersand /quotesingle
/parenleft /parenright /asterisk /plus /comma
/hyphen /period /slash /zero /one
/two /three /four /five /six
/seven /eight /nine /colon /semicolon
/less /equal /greater /question /at
/A /B /C /D /E
/F /G /H /I /J
/K /L /M /N /O
/P /Q /R /S /T
/U /V /W /X /Y
/Z /bracketleft /backslash /bracketright /asciicircum
/underscore /quoteleft /a /b /c
/d /e /f /g /h
/i /j /k /l /m
/n /o /p /q /r
/s /t /u /v /w
/x /y /z /braceleft /bar
/braceright /asciitilde /bullet /Euro /bullet
/quotesinglbase /florin /quotedblbase /ellipsis /dagger
/daggerdbl /circumflex /perthousand /Scaron /guilsinglleft
/OE /bullet /Zcaron /bullet /bullet
/quoteleft /quoteright /quotedblleft /quotedblright /bullet
/endash /emdash /asciitilde /trademark /scaron
/guilsinglright /oe /bullet /zcaron /Ydieresis
/space /exclamdown /cent /sterling /currency
/yen /brokenbar /section /dieresis /copyright
/ordfeminine /guillemotleft /logicalnot /sfthyphen /registered
/macron /degree /plusminus /twosuperior /threesuperior
/acute /mu /paragraph /middot /cedilla
/onesuperior /ordmasculine /guillemotright /onequarter /onehalf
/threequarters /questiondown /Agrave /Aacute /Acircumflex
/Atilde /Adieresis /Aring /AE /Ccedilla
/Egrave /Eacute /Ecircumflex /Edieresis /Igrave
/Iacute /Icircumflex /Idieresis /Eth /Ntilde
/Ograve /Oacute /Ocircumflex /Otilde /Odieresis
/multiply /Oslash /Ugrave /Uacute /Ucircumflex
/Udieresis /Yacute /Thorn /germandbls /agrave
/aacute /acircumflex /atilde /adieresis /aring
/ae /ccedilla /egrave /eacute /ecircumflex
/edieresis /igrave /iacute /icircumflex /idieresis
/eth /ntilde /ograve /oacute /ocircumflex
/otilde /odieresis /divide /oslash /ugrave
/uacute /ucircumflex /udieresis /yacute /thorn
/ydieresis
] def
%%EndResource
%FOPBeginFontReencode
/Courier-Oblique findfont
dup length dict begin
  {1 index /FID ne {def} {pop pop} ifelse} forall
  /Encoding WinAnsiEncoding def
  currentdict
end
/Courier-Oblique exch definefont pop
/Courier-BoldOblique findfont
dup length dict begin
  {1 index /FID ne {def} {pop pop} ifelse} forall
  /Encoding WinAnsiEncoding def
  currentdict
end
/Courier-BoldOblique exch definefont pop
/Courier-Bold findfont
dup length dict begin
  {1 index /FID ne {def} {pop pop} ifelse} forall
  /Encoding WinAnsiEncoding def
  currentdict
end
/Courier-Bold exch definefont pop
/Helvetica findfont
dup length dict begin
  {1 index /FID ne {def} {pop pop} ifelse} forall
  /Encoding WinAnsiEncoding def
  currentdict
end
/Helvetica exch definefont pop
/Helvetica-Oblique findfont
dup length dict begin
  {1 index /FID ne {def} {pop pop} ifelse} forall
  /Encoding WinAnsiEncoding def
  currentdict
end
/Helvetica-Oblique exch definefont pop
/Helvetica-Bold findfont
dup length dict begin
  {1 index /FID ne {def} {pop pop} ifelse} forall
  /Encoding WinAnsiEncoding def
  currentdict
end
/Helvetica-Bold exch definefont pop
/Helvetica-BoldOblique findfont
dup length dict begin
  {1 index /FID ne {def} {pop pop} ifelse} forall
  /Encoding WinAnsiEncoding def
  currentdict
end
/Helvetica-BoldOblique exch definefont pop
/Times-Roman findfont
dup length dict begin
  {1 index /FID ne {def} {pop pop} ifelse} forall
  /Encoding WinAnsiEncoding def
  currentdict
end
/Times-Roman exch definefont pop
/Times-Italic findfont
dup length dict begin
  {1 index /FID ne {def} {pop pop} ifelse} forall
  /Encoding WinAnsiEncoding def
  currentdict
end
/Times-Italic exch definefont pop
/Times-Bold findfont
dup length dict begin
  {1 index /FID ne {def} {pop pop} ifelse} forall
  /Encoding WinAnsiEncoding def
  currentdict
end
/Times-Bold exch definefont pop
/Times-BoldItalic findfont
dup length dict begin
  {1 index /FID ne {def} {pop pop} ifelse} forall
  /Encoding WinAnsiEncoding def
  currentdict
end
/Times-BoldItalic exch definefont pop
/Courier findfont
dup length dict begin
  {1 index /FID ne {def} {pop pop} ifelse} forall
  /Encoding WinAnsiEncoding def
  currentdict
end
/Courier exch definefont pop
%FOPEndFontReencode
%%EndProlog
%%Page: 1 1
%%PageBoundingBox: 0 0 560 420
%%BeginPageSetup
[1 0 0 -1 0 420] CT
%%EndPageSetup
GS
1 GC
N
0 0 560 420 re
f
GR
GS
1 GC
N
0 0 560 420 re
f
GR
GS
1 GC
N
73 175 M
260 175 L
260 31.5 L
73 31.5 L
cp
f
GR
GS
0.873 GC
1 LJ
0.5 LW
N
73 175 M
73 31.5 L
S
GR
GS
0.873 GC
1 LJ
0.5 LW
N
110.4 175 M
110.4 31.5 L
S
GR
GS
0.873 GC
1 LJ
0.5 LW
N
147.8 175 M
147.8 31.5 L
S
GR
GS
0.873 GC
1 LJ
0.5 LW
N
185.2 175 M
185.2 31.5 L
S
GR
GS
0.873 GC
1 LJ
0.5 LW
N
222.6 175 M
222.6 31.5 L
S
GR
GS
0.873 GC
1 LJ
0.5 LW
N
260 175 M
260 31.5 L
S
GR
GS
0.873 GC
1 LJ
0.5 LW
N
260 175 M
73 175 L
S
GR
GS
0.873 GC
1 LJ
0.5 LW
N
260 151.083 M
73 151.083 L
S
GR
GS
0.873 GC
1 LJ
0.5 LW
N
260 127.167 M
73 127.167 L
S
GR
GS
0.873 GC
1 LJ
0.5 LW
N
260 103.25 M
73 103.25 L
S
GR
GS
0.873 GC
1 LJ
0.5 LW
N
260 79.333 M
73 79.333 L
S
GR
GS
0.873 GC
1 LJ
0.5 LW
N
260 55.417 M
73 55.417 L
S
GR
GS
0.873 GC
1 LJ
0.5 LW
N
260 31.5 M
73 31.5 L
S
GR
GS
0.149 GC
2 setlinecap
1 LJ
0.5 LW
N
73 175 M
260 175 L
S
GR
GS
0.149 GC
2 setlinecap
1 LJ
0.5 LW
N
73 175 M
73 173.13 L
S
GR
GS
0.149 GC
2 setlinecap
1 LJ
0.5 LW
N
110.4 175 M
110.4 173.13 L
S
GR
GS
0.149 GC
2 setlinecap
1 LJ
0.5 LW
N
147.8 175 M
147.8 173.13 L
S
GR
GS
0.149 GC
2 setlinecap
1 LJ
0.5 LW
N
185.2 175 M
185.2 173.13 L
S
GR
GS
0.149 GC
2 setlinecap
1 LJ
0.5 LW
N
222.6 175 M
222.6 173.13 L
S
GR
GS
0.149 GC
2 setlinecap
1 LJ
0.5 LW
N
260 175 M
260 173.13 L
S
GR
GS
[1 0 0 1 73 179] CT
0.149 GC
/Helvetica 10 F
GS
[1 0 0 1 0 0] CT
-3 10 moveto 
1 -1 scale
(0) t 
GR
GR
GS
[1 0 0 1 110.4 179] CT
0.149 GC
/Helvetica 10 F
GS
[1 0 0 1 0 0] CT
-6 10 moveto 
1 -1 scale
(20) t 
GR
GR
GS
[1 0 0 1 147.8 179] CT
0.149 GC
/Helvetica 10 F
GS
[1 0 0 1 0 0] CT
-6 10 moveto 
1 -1 scale
(40) t 
GR
GR
GS
[1 0 0 1 185.2 179] CT
0.149 GC
/Helvetica 10 F
GS
[1 0 0 1 0 0] CT
-6 10 moveto 
1 -1 scale
(60) t 
GR
GR
GS
[1 0 0 1 222.60001 179] CT
0.149 GC
/Helvetica 10 F
GS
[1 0 0 1 0 0] CT
-6 10 moveto 
1 -1 scale
(80) t 
GR
GR
GS
[1 0 0 1 260 179] CT
0.149 GC
/Helvetica 10 F
GS
[1 0 0 1 0 0] CT
-8.5 10 moveto 
1 -1 scale
(100) t 
GR
GR
GS
[1 0 0 1 166.50009 192.5] CT
0.149 GC
/Helvetica 11 F
GS
[1 0 0 1 0 0] CT
-30.5 11 moveto 
1 -1 scale
(Number of k) t 
GR
GR
GS
0.149 GC
2 setlinecap
1 LJ
0.5 LW
N
73 175 M
73 31.5 L
S
GR
GS
0.149 GC
2 setlinecap
1 LJ
0.5 LW
N
73 175 M
74.87 175 L
S
GR
GS
0.149 GC
2 setlinecap
1 LJ
0.5 LW
N
73 151.083 M
74.87 151.083 L
S
GR
GS
0.149 GC
2 setlinecap
1 LJ
0.5 LW
N
73 127.167 M
74.87 127.167 L
S
GR
GS
0.149 GC
2 setlinecap
1 LJ
0.5 LW
N
73 103.25 M
74.87 103.25 L
S
GR
GS
0.149 GC
2 setlinecap
1 LJ
0.5 LW
N
73 79.333 M
74.87 79.333 L
S
GR
GS
0.149 GC
2 setlinecap
1 LJ
0.5 LW
N
73 55.417 M
74.87 55.417 L
S
GR
GS
0.149 GC
2 setlinecap
1 LJ
0.5 LW
N
73 31.5 M
74.87 31.5 L
S
GR
GS
[1 0 0 1 69 175] CT
0.149 GC
/Helvetica 10 F
GS
[1 0 0 1 0 0] CT
-14 3.5 moveto 
1 -1 scale
(1.5) t 
GR
GR
GS
[1 0 0 1 69 151.08333] CT
0.149 GC
/Helvetica 10 F
GS
[1 0 0 1 0 0] CT
-6 3.5 moveto 
1 -1 scale
(2) t 
GR
GR
GS
[1 0 0 1 69 127.16666] CT
0.149 GC
/Helvetica 10 F
GS
[1 0 0 1 0 0] CT
-14 3.5 moveto 
1 -1 scale
(2.5) t 
GR
GR
GS
[1 0 0 1 69 103.25] CT
0.149 GC
/Helvetica 10 F
GS
[1 0 0 1 0 0] CT
-6 3.5 moveto 
1 -1 scale
(3) t 
GR
GR
GS
[1 0 0 1 69 79.33334] CT
0.149 GC
/Helvetica 10 F
GS
[1 0 0 1 0 0] CT
-14 3.5 moveto 
1 -1 scale
(3.5) t 
GR
GR
GS
[1 0 0 1 69 55.41667] CT
0.149 GC
/Helvetica 10 F
GS
[1 0 0 1 0 0] CT
-6 3.5 moveto 
1 -1 scale
(4) t 
GR
GR
GS
[1 0 0 1 69 31.5] CT
0.149 GC
/Helvetica 10 F
GS
[1 0 0 1 0 0] CT
-14 3.5 moveto 
1 -1 scale
(4.5) t 
GR
GR
GS
[0 -1 1 0 52 103.24993] CT
0.149 GC
/Helvetica 11 F
GS
[1 0 0 1 0 0] CT
-39.5 -3 moveto 
1 -1 scale
(Estimated value) t 
GR
GR
GS
[1 0 0 1 166.50015 30.125] CT
/Helvetica-Bold 11 F
GS
[1 0 0 1 0 0] CT
-43.5 -3 moveto 
1 -1 scale
(Estimation of B0) t 
GR
GR
GS
0 0.447 0.741 RC
1 LJ
1.5 LW
N
74.87 152.518 M
76.74 92.858 L
78.61 92.548 L
80.48 49.341 L
82.35 61.882 L
84.22 65.111 L
86.09 55.34 L
87.96 62.232 L
89.83 53.595 L
91.7 54.124 L
93.57 50.525 L
95.44 45.561 L
97.31 44.142 L
99.18 42.968 L
101.05 42.113 L
102.92 42.222 L
104.79 47.126 L
106.66 48.447 L
108.53 48.729 L
110.4 48.838 L
112.27 46.056 L
114.14 46.839 L
116.01 46.3 L
117.88 46.008 L
119.75 47.33 L
121.62 47.464 L
123.49 48.26 L
125.36 48.61 L
127.23 50.598 L
129.1 48.567 L
130.97 48.984 L
132.84 48.994 L
134.71 48.469 L
136.58 52.221 L
138.45 52.234 L
140.32 51.994 L
142.19 51.632 L
144.06 49.812 L
145.93 49.796 L
147.8 49.022 L
149.67 49.122 L
151.54 49 L
153.41 50.692 L
155.28 50.406 L
157.15 50.541 L
159.02 50.226 L
160.89 48.904 L
162.76 47.562 L
164.63 49.058 L
166.5 48.749 L
168.37 48.831 L
170.24 48.242 L
172.11 47.733 L
173.98 48.846 L
175.85 49.137 L
177.72 48.409 L
179.59 48.377 L
181.46 49.623 L
183.33 49.612 L
185.2 49.145 L
187.07 49.069 L
188.94 48.413 L
190.81 48.122 L
192.68 48.064 L
194.55 48.19 L
196.42 47.802 L
198.29 49.616 L
200.16 49.072 L
202.03 48.259 L
203.9 47.891 L
205.77 47.967 L
207.64 48.561 L
209.51 48.475 L
211.38 48.522 L
213.25 48.547 L
215.12 49.054 L
216.99 49.439 L
218.86 49.619 L
220.73 49.945 L
222.6 51.459 L
224.47 51.835 L
226.34 52.129 L
228.21 51.989 L
230.08 52.004 L
231.95 52.008 L
233.82 52.188 L
235.69 51.54 L
237.56 51.641 L
239.43 50.881 L
241.3 51.255 L
243.17 51.569 L
245.04 51.967 L
246.91 51.726 L
248.78 51.517 L
250.65 51.347 L
252.52 50.877 L
254.39 51.157 L
256.26 51.064 L
258.13 50.841 L
260 50.792 L
S
GR
GS
0.851 0.325 0.098 RC
[10 6] 0 setdash
2 LJ
1.5 LW
N
74.87 55.417 M
76.74 55.417 L
78.61 55.417 L
80.48 55.417 L
82.35 55.417 L
84.22 55.417 L
86.09 55.417 L
87.96 55.417 L
89.83 55.417 L
91.7 55.417 L
93.57 55.417 L
95.44 55.417 L
97.31 55.417 L
99.18 55.417 L
101.05 55.417 L
102.92 55.417 L
104.79 55.417 L
106.66 55.417 L
108.53 55.417 L
110.4 55.417 L
112.27 55.417 L
114.14 55.417 L
116.01 55.417 L
117.88 55.417 L
119.75 55.417 L
121.62 55.417 L
123.49 55.417 L
125.36 55.417 L
127.23 55.417 L
129.1 55.417 L
130.97 55.417 L
132.84 55.417 L
134.71 55.417 L
136.58 55.417 L
138.45 55.417 L
140.32 55.417 L
142.19 55.417 L
144.06 55.417 L
145.93 55.417 L
147.8 55.417 L
149.67 55.417 L
151.54 55.417 L
153.41 55.417 L
155.28 55.417 L
157.15 55.417 L
159.02 55.417 L
160.89 55.417 L
162.76 55.417 L
164.63 55.417 L
166.5 55.417 L
168.37 55.417 L
170.24 55.417 L
172.11 55.417 L
173.98 55.417 L
175.85 55.417 L
177.72 55.417 L
179.59 55.417 L
181.46 55.417 L
183.33 55.417 L
185.2 55.417 L
187.07 55.417 L
188.94 55.417 L
190.81 55.417 L
192.68 55.417 L
194.55 55.417 L
196.42 55.417 L
198.29 55.417 L
200.16 55.417 L
202.03 55.417 L
203.9 55.417 L
205.77 55.417 L
207.64 55.417 L
209.51 55.417 L
211.38 55.417 L
213.25 55.417 L
215.12 55.417 L
216.99 55.417 L
218.86 55.417 L
220.73 55.417 L
222.6 55.417 L
224.47 55.417 L
226.34 55.417 L
228.21 55.417 L
230.08 55.417 L
231.95 55.417 L
233.82 55.417 L
235.69 55.417 L
237.56 55.417 L
239.43 55.417 L
241.3 55.417 L
243.17 55.417 L
245.04 55.417 L
246.91 55.417 L
248.78 55.417 L
250.65 55.417 L
252.52 55.417 L
254.39 55.417 L
256.26 55.417 L
258.13 55.417 L
260 55.417 L
S
GR
GS
1 GC
N
254 98.5 M
254 72 L
172.5 72 L
172.5 98.5 L
cp
f
GR
GS
[1 0 0 1 209.5 79.5] CT
/Helvetica 9 F
GS
[1 0 0 1 0 0] CT
0 3.5 moveto 
1 -1 scale
(Estimated) t 
GR
GR
GS
0 0.447 0.741 RC
1 LJ
1.5 LW
N
176.5 79.5 M
206.5 79.5 L
S
GR
GS
[1 0 0 1 209.5 91] CT
/Helvetica 9 F
GS
[1 0 0 1 0 0] CT
0 3.5 moveto 
1 -1 scale
(Real) t 
GR
GR
GS
0.851 0.325 0.098 RC
[10 6] 0 setdash
2 LJ
1.5 LW
N
176.5 91 M
206.5 91 L
S
GR
GS
0.149 GC
10.0 ML
0.5 LW
N
172.5 98.5 M
172.5 72 L
254 72 L
254 98.5 L
cp
S
GR
GS
1 GC
N
319.5 175 M
507 175 L
507 31.5 L
319.5 31.5 L
cp
f
GR
GS
0.873 GC
1 LJ
0.5 LW
N
319.5 175 M
319.5 31.5 L
S
GR
GS
0.873 GC
1 LJ
0.5 LW
N
357 175 M
357 31.5 L
S
GR
GS
0.873 GC
1 LJ
0.5 LW
N
394.5 175 M
394.5 31.5 L
S
GR
GS
0.873 GC
1 LJ
0.5 LW
N
432 175 M
432 31.5 L
S
GR
GS
0.873 GC
1 LJ
0.5 LW
N
469.5 175 M
469.5 31.5 L
S
GR
GS
0.873 GC
1 LJ
0.5 LW
N
507 175 M
507 31.5 L
S
GR
GS
0.873 GC
1 LJ
0.5 LW
N
507 175 M
319.5 175 L
S
GR
GS
0.873 GC
1 LJ
0.5 LW
N
507 146.3 M
319.5 146.3 L
S
GR
GS
0.873 GC
1 LJ
0.5 LW
N
507 117.6 M
319.5 117.6 L
S
GR
GS
0.873 GC
1 LJ
0.5 LW
N
507 88.9 M
319.5 88.9 L
S
GR
GS
0.873 GC
1 LJ
0.5 LW
N
507 60.2 M
319.5 60.2 L
S
GR
GS
0.873 GC
1 LJ
0.5 LW
N
507 31.5 M
319.5 31.5 L
S
GR
GS
0.149 GC
2 setlinecap
1 LJ
0.5 LW
N
319.5 175 M
507 175 L
S
GR
GS
0.149 GC
2 setlinecap
1 LJ
0.5 LW
N
319.5 175 M
319.5 173.125 L
S
GR
GS
0.149 GC
2 setlinecap
1 LJ
0.5 LW
N
357 175 M
357 173.125 L
S
GR
GS
0.149 GC
2 setlinecap
1 LJ
0.5 LW
N
394.5 175 M
394.5 173.125 L
S
GR
GS
0.149 GC
2 setlinecap
1 LJ
0.5 LW
N
432 175 M
432 173.125 L
S
GR
GS
0.149 GC
2 setlinecap
1 LJ
0.5 LW
N
469.5 175 M
469.5 173.125 L
S
GR
GS
0.149 GC
2 setlinecap
1 LJ
0.5 LW
N
507 175 M
507 173.125 L
S
GR
GS
[1 0 0 1 319.5 179] CT
0.149 GC
/Helvetica 10 F
GS
[1 0 0 1 0 0] CT
-3 10 moveto 
1 -1 scale
(0) t 
GR
GR
GS
[1 0 0 1 357 179] CT
0.149 GC
/Helvetica 10 F
GS
[1 0 0 1 0 0] CT
-6 10 moveto 
1 -1 scale
(20) t 
GR
GR
GS
[1 0 0 1 394.5 179] CT
0.149 GC
/Helvetica 10 F
GS
[1 0 0 1 0 0] CT
-6 10 moveto 
1 -1 scale
(40) t 
GR
GR
GS
[1 0 0 1 432 179] CT
0.149 GC
/Helvetica 10 F
GS
[1 0 0 1 0 0] CT
-6 10 moveto 
1 -1 scale
(60) t 
GR
GR
GS
[1 0 0 1 469.5 179] CT
0.149 GC
/Helvetica 10 F
GS
[1 0 0 1 0 0] CT
-6 10 moveto 
1 -1 scale
(80) t 
GR
GR
GS
[1 0 0 1 507 179] CT
0.149 GC
/Helvetica 10 F
GS
[1 0 0 1 0 0] CT
-8.5 10 moveto 
1 -1 scale
(100) t 
GR
GR
GS
[1 0 0 1 413.25009 192.5] CT
0.149 GC
/Helvetica 11 F
GS
[1 0 0 1 0 0] CT
-30.5 11 moveto 
1 -1 scale
(Number of k) t 
GR
GR
GS
0.149 GC
2 setlinecap
1 LJ
0.5 LW
N
319.5 175 M
319.5 31.5 L
S
GR
GS
0.149 GC
2 setlinecap
1 LJ
0.5 LW
N
319.5 175 M
321.375 175 L
S
GR
GS
0.149 GC
2 setlinecap
1 LJ
0.5 LW
N
319.5 146.3 M
321.375 146.3 L
S
GR
GS
0.149 GC
2 setlinecap
1 LJ
0.5 LW
N
319.5 117.6 M
321.375 117.6 L
S
GR
GS
0.149 GC
2 setlinecap
1 LJ
0.5 LW
N
319.5 88.9 M
321.375 88.9 L
S
GR
GS
0.149 GC
2 setlinecap
1 LJ
0.5 LW
N
319.5 60.2 M
321.375 60.2 L
S
GR
GS
0.149 GC
2 setlinecap
1 LJ
0.5 LW
N
319.5 31.5 M
321.375 31.5 L
S
GR
GS
[1 0 0 1 315.5 175] CT
0.149 GC
/Helvetica 10 F
GS
[1 0 0 1 0 0] CT
-6 3.5 moveto 
1 -1 scale
(0) t 
GR
GR
GS
[1 0 0 1 315.5 146.3] CT
0.149 GC
/Helvetica 10 F
GS
[1 0 0 1 0 0] CT
-6 3.5 moveto 
1 -1 scale
(1) t 
GR
GR
GS
[1 0 0 1 315.5 117.6] CT
0.149 GC
/Helvetica 10 F
GS
[1 0 0 1 0 0] CT
-6 3.5 moveto 
1 -1 scale
(2) t 
GR
GR
GS
[1 0 0 1 315.5 88.9] CT
0.149 GC
/Helvetica 10 F
GS
[1 0 0 1 0 0] CT
-6 3.5 moveto 
1 -1 scale
(3) t 
GR
GR
GS
[1 0 0 1 315.5 60.2] CT
0.149 GC
/Helvetica 10 F
GS
[1 0 0 1 0 0] CT
-6 3.5 moveto 
1 -1 scale
(4) t 
GR
GR
GS
[1 0 0 1 315.5 31.5] CT
0.149 GC
/Helvetica 10 F
GS
[1 0 0 1 0 0] CT
-6 3.5 moveto 
1 -1 scale
(5) t 
GR
GR
GS
[0 -1 1 0 306.5 103.24993] CT
0.149 GC
/Helvetica 11 F
GS
[1 0 0 1 0 0] CT
-39.5 -3 moveto 
1 -1 scale
(Estimated value) t 
GR
GR
GS
[1 0 0 1 413.2504 30.125] CT
/Helvetica-Bold 11 F
GS
[1 0 0 1 0 0] CT
-43.5 -3 moveto 
1 -1 scale
(Estimation of B1) t 
GR
GR
GS
0 0.447 0.741 RC
1 LJ
1.5 LW
N
321.375 162.607 M
323.25 54.05 L
325.125 54.079 L
327 70.425 L
328.875 84.601 L
330.75 84.407 L
332.625 86.605 L
334.5 86.069 L
336.375 88.659 L
338.25 87.805 L
340.125 89.638 L
342 91.514 L
343.875 94.356 L
345.75 95.483 L
347.625 95.659 L
349.5 95.282 L
351.375 95.913 L
353.25 96.631 L
355.125 97.107 L
357 97.092 L
358.875 97.999 L
360.75 95.748 L
362.625 95.548 L
364.5 95.495 L
366.375 94.568 L
368.25 94.659 L
370.125 94.959 L
372 94.956 L
373.875 94.018 L
375.75 95.358 L
377.625 95.667 L
379.5 95.67 L
381.375 95.665 L
383.25 93.441 L
385.125 93.849 L
387 93.886 L
388.875 92.521 L
390.75 93.059 L
392.625 93.486 L
394.5 93.763 L
396.375 93.167 L
398.25 93.241 L
400.125 92.492 L
402 92.007 L
403.875 91.949 L
405.75 92.856 L
407.625 92.449 L
409.5 92.238 L
411.375 90.866 L
413.25 91.302 L
415.125 91.401 L
417 91.671 L
418.875 92.795 L
420.75 91.929 L
422.625 91.989 L
424.5 91.68 L
426.375 91.745 L
428.25 91.551 L
430.125 91.917 L
432 91.843 L
433.875 91.959 L
435.75 91.745 L
437.625 92.092 L
439.5 92.755 L
441.375 92.621 L
443.25 92.656 L
445.125 91.362 L
447 92.051 L
448.875 92.562 L
450.75 92.515 L
452.625 92.418 L
454.5 92.455 L
456.375 93.323 L
458.25 93.335 L
460.125 93.387 L
462 93.374 L
463.875 92.718 L
465.75 92.122 L
467.625 92.038 L
469.5 91.672 L
471.375 92.077 L
473.25 91.937 L
475.125 92.155 L
477 92.091 L
478.875 92.086 L
480.75 92.213 L
482.625 92.292 L
484.5 92.396 L
486.375 92.358 L
488.25 92.48 L
490.125 92.752 L
492 92.503 L
493.875 92.635 L
495.75 92.762 L
497.625 93.052 L
499.5 93.193 L
501.375 92.953 L
503.25 92.492 L
505.125 92.604 L
507 92.545 L
S
GR
GS
0.851 0.325 0.098 RC
[10 6] 0 setdash
2 LJ
1.5 LW
N
321.375 88.9 M
323.25 88.9 L
325.125 88.9 L
327 88.9 L
328.875 88.9 L
330.75 88.9 L
332.625 88.9 L
334.5 88.9 L
336.375 88.9 L
338.25 88.9 L
340.125 88.9 L
342 88.9 L
343.875 88.9 L
345.75 88.9 L
347.625 88.9 L
349.5 88.9 L
351.375 88.9 L
353.25 88.9 L
355.125 88.9 L
357 88.9 L
358.875 88.9 L
360.75 88.9 L
362.625 88.9 L
364.5 88.9 L
366.375 88.9 L
368.25 88.9 L
370.125 88.9 L
372 88.9 L
373.875 88.9 L
375.75 88.9 L
377.625 88.9 L
379.5 88.9 L
381.375 88.9 L
383.25 88.9 L
385.125 88.9 L
387 88.9 L
388.875 88.9 L
390.75 88.9 L
392.625 88.9 L
394.5 88.9 L
396.375 88.9 L
398.25 88.9 L
400.125 88.9 L
402 88.9 L
403.875 88.9 L
405.75 88.9 L
407.625 88.9 L
409.5 88.9 L
411.375 88.9 L
413.25 88.9 L
415.125 88.9 L
417 88.9 L
418.875 88.9 L
420.75 88.9 L
422.625 88.9 L
424.5 88.9 L
426.375 88.9 L
428.25 88.9 L
430.125 88.9 L
432 88.9 L
433.875 88.9 L
435.75 88.9 L
437.625 88.9 L
439.5 88.9 L
441.375 88.9 L
443.25 88.9 L
445.125 88.9 L
447 88.9 L
448.875 88.9 L
450.75 88.9 L
452.625 88.9 L
454.5 88.9 L
456.375 88.9 L
458.25 88.9 L
460.125 88.9 L
462 88.9 L
463.875 88.9 L
465.75 88.9 L
467.625 88.9 L
469.5 88.9 L
471.375 88.9 L
473.25 88.9 L
475.125 88.9 L
477 88.9 L
478.875 88.9 L
480.75 88.9 L
482.625 88.9 L
484.5 88.9 L
486.375 88.9 L
488.25 88.9 L
490.125 88.9 L
492 88.9 L
493.875 88.9 L
495.75 88.9 L
497.625 88.9 L
499.5 88.9 L
501.375 88.9 L
503.25 88.9 L
505.125 88.9 L
507 88.9 L
S
GR
GS
1 GC
N
500.5 62.5 M
500.5 36 L
419 36 L
419 62.5 L
cp
f
GR
GS
[1 0 0 1 456 43.5] CT
/Helvetica 9 F
GS
[1 0 0 1 0 0] CT
0 3.5 moveto 
1 -1 scale
(Estimated) t 
GR
GR
GS
0 0.447 0.741 RC
1 LJ
1.5 LW
N
423 43.5 M
453 43.5 L
S
GR
GS
[1 0 0 1 456 55] CT
/Helvetica 9 F
GS
[1 0 0 1 0 0] CT
0 3.5 moveto 
1 -1 scale
(Real) t 
GR
GR
GS
0.851 0.325 0.098 RC
[10 6] 0 setdash
2 LJ
1.5 LW
N
423 55 M
453 55 L
S
GR
GS
0.149 GC
10.0 ML
0.5 LW
N
419 62.5 M
419 36 L
500.5 36 L
500.5 62.5 L
cp
S
GR
GS
1 GC
N
73 374 M
260 374 L
260 230.5 L
73 230.5 L
cp
f
GR
GS
0.873 GC
1 LJ
0.5 LW
N
73 374 M
73 230.5 L
S
GR
GS
0.873 GC
1 LJ
0.5 LW
N
110.4 374 M
110.4 230.5 L
S
GR
GS
0.873 GC
1 LJ
0.5 LW
N
147.8 374 M
147.8 230.5 L
S
GR
GS
0.873 GC
1 LJ
0.5 LW
N
185.2 374 M
185.2 230.5 L
S
GR
GS
0.873 GC
1 LJ
0.5 LW
N
222.6 374 M
222.6 230.5 L
S
GR
GS
0.873 GC
1 LJ
0.5 LW
N
260 374 M
260 230.5 L
S
GR
GS
0.873 GC
1 LJ
0.5 LW
N
260 374 M
73 374 L
S
GR
GS
0.873 GC
1 LJ
0.5 LW
N
260 329.199 M
73 329.199 L
S
GR
GS
0.873 GC
1 LJ
0.5 LW
N
260 284.398 M
73 284.398 L
S
GR
GS
0.873 GC
1 LJ
0.5 LW
N
260 239.597 M
73 239.597 L
S
GR
GS
0.149 GC
2 setlinecap
1 LJ
0.5 LW
N
73 374 M
260 374 L
S
GR
GS
0.149 GC
2 setlinecap
1 LJ
0.5 LW
N
73 374 M
73 372.13 L
S
GR
GS
0.149 GC
2 setlinecap
1 LJ
0.5 LW
N
110.4 374 M
110.4 372.13 L
S
GR
GS
0.149 GC
2 setlinecap
1 LJ
0.5 LW
N
147.8 374 M
147.8 372.13 L
S
GR
GS
0.149 GC
2 setlinecap
1 LJ
0.5 LW
N
185.2 374 M
185.2 372.13 L
S
GR
GS
0.149 GC
2 setlinecap
1 LJ
0.5 LW
N
222.6 374 M
222.6 372.13 L
S
GR
GS
0.149 GC
2 setlinecap
1 LJ
0.5 LW
N
260 374 M
260 372.13 L
S
GR
GS
[1 0 0 1 73 378] CT
0.149 GC
/Helvetica 10 F
GS
[1 0 0 1 0 0] CT
-3 10 moveto 
1 -1 scale
(0) t 
GR
GR
GS
[1 0 0 1 110.4 378] CT
0.149 GC
/Helvetica 10 F
GS
[1 0 0 1 0 0] CT
-6 10 moveto 
1 -1 scale
(20) t 
GR
GR
GS
[1 0 0 1 147.8 378] CT
0.149 GC
/Helvetica 10 F
GS
[1 0 0 1 0 0] CT
-6 10 moveto 
1 -1 scale
(40) t 
GR
GR
GS
[1 0 0 1 185.2 378] CT
0.149 GC
/Helvetica 10 F
GS
[1 0 0 1 0 0] CT
-6 10 moveto 
1 -1 scale
(60) t 
GR
GR
GS
[1 0 0 1 222.60001 378] CT
0.149 GC
/Helvetica 10 F
GS
[1 0 0 1 0 0] CT
-6 10 moveto 
1 -1 scale
(80) t 
GR
GR
GS
[1 0 0 1 260 378] CT
0.149 GC
/Helvetica 10 F
GS
[1 0 0 1 0 0] CT
-8.5 10 moveto 
1 -1 scale
(100) t 
GR
GR
GS
[1 0 0 1 166.50009 391.5] CT
0.149 GC
/Helvetica 11 F
GS
[1 0 0 1 0 0] CT
-30.5 11 moveto 
1 -1 scale
(Number of k) t 
GR
GR
GS
0.149 GC
2 setlinecap
1 LJ
0.5 LW
N
73 374 M
73 230.5 L
S
GR
GS
0.149 GC
2 setlinecap
1 LJ
0.5 LW
N
73 374 M
74.87 374 L
S
GR
GS
0.149 GC
2 setlinecap
1 LJ
0.5 LW
N
73 329.199 M
74.87 329.199 L
S
GR
GS
0.149 GC
2 setlinecap
1 LJ
0.5 LW
N
73 284.398 M
74.87 284.398 L
S
GR
GS
0.149 GC
2 setlinecap
1 LJ
0.5 LW
N
73 239.597 M
74.87 239.597 L
S
GR
GS
[1 0 0 1 69 374] CT
0.149 GC
/Helvetica 10 F
GS
[1 0 0 1 0 0] CT
-14 3.5 moveto 
1 -1 scale
(0.5) t 
GR
GR
GS
[1 0 0 1 69 329.19904] CT
0.149 GC
/Helvetica 10 F
GS
[1 0 0 1 0 0] CT
-6 3.5 moveto 
1 -1 scale
(1) t 
GR
GR
GS
[1 0 0 1 69 284.39807] CT
0.149 GC
/Helvetica 10 F
GS
[1 0 0 1 0 0] CT
-14 3.5 moveto 
1 -1 scale
(1.5) t 
GR
GR
GS
[1 0 0 1 69 239.59712] CT
0.149 GC
/Helvetica 10 F
GS
[1 0 0 1 0 0] CT
-6 3.5 moveto 
1 -1 scale
(2) t 
GR
GR
GS
[0 -1 1 0 52 302.24994] CT
0.149 GC
/Helvetica 11 F
GS
[1 0 0 1 0 0] CT
-39.5 -3 moveto 
1 -1 scale
(Estimated value) t 
GR
GR
GS
[1 0 0 1 166.50015 229.12502] CT
/Helvetica-Bold 11 F
GS
[1 0 0 1 0 0] CT
-43.5 -3 moveto 
1 -1 scale
(Estimation of B2) t 
GR
GR
GS
0 0.447 0.741 RC
1 LJ
1.5 LW
N
74.87 365.735 M
76.74 331.585 L
78.61 333.148 L
80.48 296.614 L
82.35 255.832 L
84.22 264.666 L
86.09 269.191 L
87.96 265.041 L
89.83 263.27 L
91.7 264.603 L
93.57 254.769 L
95.44 252.983 L
97.31 240.222 L
99.18 235.047 L
101.05 237.119 L
102.92 237.581 L
104.79 230.755 L
106.66 230.5 L
108.53 233.033 L
110.4 233.292 L
112.27 234.86 L
114.14 240.64 L
116.01 242.788 L
117.88 242.739 L
119.75 241.832 L
121.62 241.278 L
123.49 242.919 L
125.36 243.001 L
127.23 242.05 L
129.1 240.161 L
130.97 238.653 L
132.84 238.668 L
134.71 238.752 L
136.58 236.908 L
138.45 235.416 L
140.32 235.788 L
142.19 236.746 L
144.06 232.704 L
145.93 231.592 L
147.8 233.321 L
149.67 234.502 L
151.54 234.321 L
153.41 236.626 L
155.28 238.385 L
157.15 238.104 L
159.02 236.603 L
160.89 240.797 L
162.76 240.599 L
164.63 239.681 L
166.5 238.057 L
168.37 237.351 L
170.24 238.192 L
172.11 236.017 L
173.98 239.252 L
175.85 237.573 L
177.72 237.363 L
179.59 237.521 L
181.46 236.874 L
183.33 236.414 L
185.2 239.463 L
187.07 239.61 L
188.94 240.587 L
190.81 241.181 L
192.68 238.669 L
194.55 239.785 L
196.42 239.72 L
198.29 239.954 L
200.16 237.649 L
202.03 235.408 L
203.9 237.166 L
205.77 237.04 L
207.64 236.455 L
209.51 236.472 L
211.38 236.274 L
213.25 236.33 L
215.12 235.925 L
216.99 235.954 L
218.86 239.371 L
220.73 239.926 L
222.6 240.611 L
224.47 239.52 L
226.34 238.885 L
228.21 238.566 L
230.08 238.82 L
231.95 238.757 L
233.82 238.596 L
235.69 238.994 L
237.56 238.863 L
239.43 237.808 L
241.3 237.516 L
243.17 237.932 L
245.04 236.725 L
246.91 236.311 L
248.78 236.294 L
250.65 234.834 L
252.52 234.696 L
254.39 235.296 L
256.26 237.482 L
258.13 238.219 L
260 238.338 L
S
GR
GS
0.851 0.325 0.098 RC
[10 6] 0 setdash
2 LJ
1.5 LW
N
74.87 239.597 M
76.74 239.597 L
78.61 239.597 L
80.48 239.597 L
82.35 239.597 L
84.22 239.597 L
86.09 239.597 L
87.96 239.597 L
89.83 239.597 L
91.7 239.597 L
93.57 239.597 L
95.44 239.597 L
97.31 239.597 L
99.18 239.597 L
101.05 239.597 L
102.92 239.597 L
104.79 239.597 L
106.66 239.597 L
108.53 239.597 L
110.4 239.597 L
112.27 239.597 L
114.14 239.597 L
116.01 239.597 L
117.88 239.597 L
119.75 239.597 L
121.62 239.597 L
123.49 239.597 L
125.36 239.597 L
127.23 239.597 L
129.1 239.597 L
130.97 239.597 L
132.84 239.597 L
134.71 239.597 L
136.58 239.597 L
138.45 239.597 L
140.32 239.597 L
142.19 239.597 L
144.06 239.597 L
145.93 239.597 L
147.8 239.597 L
149.67 239.597 L
151.54 239.597 L
153.41 239.597 L
155.28 239.597 L
157.15 239.597 L
159.02 239.597 L
160.89 239.597 L
162.76 239.597 L
164.63 239.597 L
166.5 239.597 L
168.37 239.597 L
170.24 239.597 L
172.11 239.597 L
173.98 239.597 L
175.85 239.597 L
177.72 239.597 L
179.59 239.597 L
181.46 239.597 L
183.33 239.597 L
185.2 239.597 L
187.07 239.597 L
188.94 239.597 L
190.81 239.597 L
192.68 239.597 L
194.55 239.597 L
196.42 239.597 L
198.29 239.597 L
200.16 239.597 L
202.03 239.597 L
203.9 239.597 L
205.77 239.597 L
207.64 239.597 L
209.51 239.597 L
211.38 239.597 L
213.25 239.597 L
215.12 239.597 L
216.99 239.597 L
218.86 239.597 L
220.73 239.597 L
222.6 239.597 L
224.47 239.597 L
226.34 239.597 L
228.21 239.597 L
230.08 239.597 L
231.95 239.597 L
233.82 239.597 L
235.69 239.597 L
237.56 239.597 L
239.43 239.597 L
241.3 239.597 L
243.17 239.597 L
245.04 239.597 L
246.91 239.597 L
248.78 239.597 L
250.65 239.597 L
252.52 239.597 L
254.39 239.597 L
256.26 239.597 L
258.13 239.597 L
260 239.597 L
S
GR
GS
1 GC
N
254 297.5 M
254 271 L
172.5 271 L
172.5 297.5 L
cp
f
GR
GS
[1 0 0 1 209.5 278.5] CT
/Helvetica 9 F
GS
[1 0 0 1 0 0] CT
0 3.5 moveto 
1 -1 scale
(Estimated) t 
GR
GR
GS
0 0.447 0.741 RC
1 LJ
1.5 LW
N
176.5 278.5 M
206.5 278.5 L
S
GR
GS
[1 0 0 1 209.5 290] CT
/Helvetica 9 F
GS
[1 0 0 1 0 0] CT
0 3.5 moveto 
1 -1 scale
(Real) t 
GR
GR
GS
0.851 0.325 0.098 RC
[10 6] 0 setdash
2 LJ
1.5 LW
N
176.5 290 M
206.5 290 L
S
GR
GS
0.149 GC
10.0 ML
0.5 LW
N
172.5 297.5 M
172.5 271 L
254 271 L
254 297.5 L
cp
S
GR
GS
1 GC
N
319.5 374 M
507 374 L
507 230.5 L
319.5 230.5 L
cp
f
GR
GS
0.873 GC
1 LJ
0.5 LW
N
319.5 374 M
319.5 230.5 L
S
GR
GS
0.873 GC
1 LJ
0.5 LW
N
357 374 M
357 230.5 L
S
GR
GS
0.873 GC
1 LJ
0.5 LW
N
394.5 374 M
394.5 230.5 L
S
GR
GS
0.873 GC
1 LJ
0.5 LW
N
432 374 M
432 230.5 L
S
GR
GS
0.873 GC
1 LJ
0.5 LW
N
469.5 374 M
469.5 230.5 L
S
GR
GS
0.873 GC
1 LJ
0.5 LW
N
507 374 M
507 230.5 L
S
GR
GS
0.873 GC
1 LJ
0.5 LW
N
507 374 M
319.5 374 L
S
GR
GS
0.873 GC
1 LJ
0.5 LW
N
507 345.3 M
319.5 345.3 L
S
GR
GS
0.873 GC
1 LJ
0.5 LW
N
507 316.6 M
319.5 316.6 L
S
GR
GS
0.873 GC
1 LJ
0.5 LW
N
507 287.9 M
319.5 287.9 L
S
GR
GS
0.873 GC
1 LJ
0.5 LW
N
507 259.2 M
319.5 259.2 L
S
GR
GS
0.873 GC
1 LJ
0.5 LW
N
507 230.5 M
319.5 230.5 L
S
GR
GS
0.149 GC
2 setlinecap
1 LJ
0.5 LW
N
319.5 374 M
507 374 L
S
GR
GS
0.149 GC
2 setlinecap
1 LJ
0.5 LW
N
319.5 374 M
319.5 372.125 L
S
GR
GS
0.149 GC
2 setlinecap
1 LJ
0.5 LW
N
357 374 M
357 372.125 L
S
GR
GS
0.149 GC
2 setlinecap
1 LJ
0.5 LW
N
394.5 374 M
394.5 372.125 L
S
GR
GS
0.149 GC
2 setlinecap
1 LJ
0.5 LW
N
432 374 M
432 372.125 L
S
GR
GS
0.149 GC
2 setlinecap
1 LJ
0.5 LW
N
469.5 374 M
469.5 372.125 L
S
GR
GS
0.149 GC
2 setlinecap
1 LJ
0.5 LW
N
507 374 M
507 372.125 L
S
GR
GS
[1 0 0 1 319.5 378] CT
0.149 GC
/Helvetica 10 F
GS
[1 0 0 1 0 0] CT
-3 10 moveto 
1 -1 scale
(0) t 
GR
GR
GS
[1 0 0 1 357 378] CT
0.149 GC
/Helvetica 10 F
GS
[1 0 0 1 0 0] CT
-6 10 moveto 
1 -1 scale
(20) t 
GR
GR
GS
[1 0 0 1 394.5 378] CT
0.149 GC
/Helvetica 10 F
GS
[1 0 0 1 0 0] CT
-6 10 moveto 
1 -1 scale
(40) t 
GR
GR
GS
[1 0 0 1 432 378] CT
0.149 GC
/Helvetica 10 F
GS
[1 0 0 1 0 0] CT
-6 10 moveto 
1 -1 scale
(60) t 
GR
GR
GS
[1 0 0 1 469.5 378] CT
0.149 GC
/Helvetica 10 F
GS
[1 0 0 1 0 0] CT
-6 10 moveto 
1 -1 scale
(80) t 
GR
GR
GS
[1 0 0 1 507 378] CT
0.149 GC
/Helvetica 10 F
GS
[1 0 0 1 0 0] CT
-8.5 10 moveto 
1 -1 scale
(100) t 
GR
GR
GS
[1 0 0 1 413.25009 391.5] CT
0.149 GC
/Helvetica 11 F
GS
[1 0 0 1 0 0] CT
-30.5 11 moveto 
1 -1 scale
(Number of k) t 
GR
GR
GS
0.149 GC
2 setlinecap
1 LJ
0.5 LW
N
319.5 374 M
319.5 230.5 L
S
GR
GS
0.149 GC
2 setlinecap
1 LJ
0.5 LW
N
319.5 374 M
321.375 374 L
S
GR
GS
0.149 GC
2 setlinecap
1 LJ
0.5 LW
N
319.5 345.3 M
321.375 345.3 L
S
GR
GS
0.149 GC
2 setlinecap
1 LJ
0.5 LW
N
319.5 316.6 M
321.375 316.6 L
S
GR
GS
0.149 GC
2 setlinecap
1 LJ
0.5 LW
N
319.5 287.9 M
321.375 287.9 L
S
GR
GS
0.149 GC
2 setlinecap
1 LJ
0.5 LW
N
319.5 259.2 M
321.375 259.2 L
S
GR
GS
0.149 GC
2 setlinecap
1 LJ
0.5 LW
N
319.5 230.5 M
321.375 230.5 L
S
GR
GS
[1 0 0 1 315.5 374] CT
0.149 GC
/Helvetica 10 F
GS
[1 0 0 1 0 0] CT
-14 3.5 moveto 
1 -1 scale
(0.5) t 
GR
GR
GS
[1 0 0 1 315.5 345.29999] CT
0.149 GC
/Helvetica 10 F
GS
[1 0 0 1 0 0] CT
-6 3.5 moveto 
1 -1 scale
(1) t 
GR
GR
GS
[1 0 0 1 315.5 316.60001] CT
0.149 GC
/Helvetica 10 F
GS
[1 0 0 1 0 0] CT
-14 3.5 moveto 
1 -1 scale
(1.5) t 
GR
GR
GS
[1 0 0 1 315.5 287.89999] CT
0.149 GC
/Helvetica 10 F
GS
[1 0 0 1 0 0] CT
-6 3.5 moveto 
1 -1 scale
(2) t 
GR
GR
GS
[1 0 0 1 315.5 259.20001] CT
0.149 GC
/Helvetica 10 F
GS
[1 0 0 1 0 0] CT
-14 3.5 moveto 
1 -1 scale
(2.5) t 
GR
GR
GS
[1 0 0 1 315.5 230.5] CT
0.149 GC
/Helvetica 10 F
GS
[1 0 0 1 0 0] CT
-6 3.5 moveto 
1 -1 scale
(3) t 
GR
GR
GS
[0 -1 1 0 298.5 302.24994] CT
0.149 GC
/Helvetica 11 F
GS
[1 0 0 1 0 0] CT
-39.5 -3 moveto 
1 -1 scale
(Estimated value) t 
GR
GR
GS
[1 0 0 1 413.2504 229.125] CT
/Helvetica-Bold 11 F
GS
[1 0 0 1 0 0] CT
-43.5 -3 moveto 
1 -1 scale
(Estimation of B3) t 
GR
GR
GS
0 0.447 0.741 RC
1 LJ
1.5 LW
N
321.375 232.071 M
323.25 313.696 L
325.125 313.735 L
327 346.402 L
328.875 341.246 L
330.75 335.542 L
332.625 345.832 L
334.5 336.043 L
336.375 340.098 L
338.25 339.786 L
340.125 344.537 L
342 350.597 L
343.875 351.273 L
345.75 355.933 L
347.625 355.773 L
349.5 356.435 L
351.375 355.416 L
353.25 353.434 L
355.125 352.419 L
357 352.579 L
358.875 354.244 L
360.75 355.633 L
362.625 354.887 L
364.5 355.255 L
366.375 355.141 L
368.25 355.019 L
370.125 351.537 L
372 351.565 L
373.875 350.837 L
375.75 350.903 L
377.625 351.08 L
379.5 351.061 L
381.375 351.12 L
383.25 350.256 L
385.125 350.022 L
387 349.896 L
388.875 351.553 L
390.75 353.669 L
392.625 354.5 L
394.5 354.44 L
396.375 355.596 L
398.25 355.808 L
400.125 354.804 L
402 354.306 L
403.875 354.368 L
405.75 353.153 L
407.625 351.812 L
409.5 353.355 L
411.375 353.497 L
413.25 353.437 L
415.125 353.897 L
417 353.794 L
418.875 352.742 L
420.75 350.344 L
422.625 350.746 L
424.5 352.713 L
426.375 352.369 L
428.25 351.881 L
430.125 351.598 L
432 350.785 L
433.875 350.42 L
435.75 350.647 L
437.625 350.226 L
439.5 349.681 L
441.375 348.579 L
443.25 348.853 L
445.125 348.301 L
447 348.536 L
448.875 350.461 L
450.75 350.068 L
452.625 350.33 L
454.5 350.064 L
456.375 348.923 L
458.25 348.927 L
460.125 348.675 L
462 348.553 L
463.875 348.97 L
465.75 348.619 L
467.625 347.764 L
469.5 346.894 L
471.375 346.841 L
473.25 346.994 L
475.125 346.73 L
477 346.604 L
478.875 346.632 L
480.75 345.909 L
482.625 345.949 L
484.5 345.822 L
486.375 346.738 L
488.25 346.827 L
490.125 346.47 L
492 346.092 L
493.875 345.743 L
495.75 345.974 L
497.625 345.889 L
499.5 346.483 L
501.375 346.455 L
503.25 345.483 L
505.125 345.211 L
507 345.373 L
S
GR
GS
0.851 0.325 0.098 RC
[10 6] 0 setdash
2 LJ
1.5 LW
N
321.375 345.3 M
323.25 345.3 L
325.125 345.3 L
327 345.3 L
328.875 345.3 L
330.75 345.3 L
332.625 345.3 L
334.5 345.3 L
336.375 345.3 L
338.25 345.3 L
340.125 345.3 L
342 345.3 L
343.875 345.3 L
345.75 345.3 L
347.625 345.3 L
349.5 345.3 L
351.375 345.3 L
353.25 345.3 L
355.125 345.3 L
357 345.3 L
358.875 345.3 L
360.75 345.3 L
362.625 345.3 L
364.5 345.3 L
366.375 345.3 L
368.25 345.3 L
370.125 345.3 L
372 345.3 L
373.875 345.3 L
375.75 345.3 L
377.625 345.3 L
379.5 345.3 L
381.375 345.3 L
383.25 345.3 L
385.125 345.3 L
387 345.3 L
388.875 345.3 L
390.75 345.3 L
392.625 345.3 L
394.5 345.3 L
396.375 345.3 L
398.25 345.3 L
400.125 345.3 L
402 345.3 L
403.875 345.3 L
405.75 345.3 L
407.625 345.3 L
409.5 345.3 L
411.375 345.3 L
413.25 345.3 L
415.125 345.3 L
417 345.3 L
418.875 345.3 L
420.75 345.3 L
422.625 345.3 L
424.5 345.3 L
426.375 345.3 L
428.25 345.3 L
430.125 345.3 L
432 345.3 L
433.875 345.3 L
435.75 345.3 L
437.625 345.3 L
439.5 345.3 L
441.375 345.3 L
443.25 345.3 L
445.125 345.3 L
447 345.3 L
448.875 345.3 L
450.75 345.3 L
452.625 345.3 L
454.5 345.3 L
456.375 345.3 L
458.25 345.3 L
460.125 345.3 L
462 345.3 L
463.875 345.3 L
465.75 345.3 L
467.625 345.3 L
469.5 345.3 L
471.375 345.3 L
473.25 345.3 L
475.125 345.3 L
477 345.3 L
478.875 345.3 L
480.75 345.3 L
482.625 345.3 L
484.5 345.3 L
486.375 345.3 L
488.25 345.3 L
490.125 345.3 L
492 345.3 L
493.875 345.3 L
495.75 345.3 L
497.625 345.3 L
499.5 345.3 L
501.375 345.3 L
503.25 345.3 L
505.125 345.3 L
507 345.3 L
S
GR
GS
1 GC
N
500.5 261.5 M
500.5 235 L
419 235 L
419 261.5 L
cp
f
GR
GS
[1 0 0 1 456 242.5] CT
/Helvetica 9 F
GS
[1 0 0 1 0 0] CT
0 3.5 moveto 
1 -1 scale
(Estimated) t 
GR
GR
GS
0 0.447 0.741 RC
1 LJ
1.5 LW
N
423 242.5 M
453 242.5 L
S
GR
GS
[1 0 0 1 456 254] CT
/Helvetica 9 F
GS
[1 0 0 1 0 0] CT
0 3.5 moveto 
1 -1 scale
(Real) t 
GR
GR
GS
0.851 0.325 0.098 RC
[10 6] 0 setdash
2 LJ
1.5 LW
N
423 254 M
453 254 L
S
GR
GS
0.149 GC
10.0 ML
0.5 LW
N
419 261.5 M
419 235 L
500.5 235 L
500.5 261.5 L
cp
S
GR
%%Trailer
%%Pages: 1
%%EOF
