%!PS-Adobe-3.0 EPSF-3.0
%%Creator: (MATLAB, The Mathworks, Inc. Version 23.2.0.2409890 \(R2023b\) Update 3. Operating System: Mac OS X)
%%Title: /Users/jakub/Projects/modeling-and-identification/report-01/images/rejection-method/distribution.eps
%%CreationDate: 2023-11-02T18:28:15
%%Pages: (atend)
%%BoundingBox:     0     0   443   214
%%LanguageLevel: 3
%%EndComments
%%BeginProlog
%%BeginResource: procset (Apache XML Graphics Std ProcSet) 1.2 0
%%Version: 1.2 0
%%Copyright: (Copyright 2001-2003,2010 The Apache Software Foundation. License terms: http://www.apache.org/licenses/LICENSE-2.0)
/bd{bind def}bind def
/ld{load def}bd
/GR/grestore ld
/GS/gsave ld
/RM/rmoveto ld
/C/curveto ld
/t/show ld
/L/lineto ld
/ML/setmiterlimit ld
/CT/concat ld
/f/fill ld
/N/newpath ld
/S/stroke ld
/CC/setcmykcolor ld
/A/ashow ld
/cp/closepath ld
/RC/setrgbcolor ld
/LJ/setlinejoin ld
/GC/setgray ld
/LW/setlinewidth ld
/M/moveto ld
/re {4 2 roll M
1 index 0 rlineto
0 exch rlineto
neg 0 rlineto
cp } bd
/_ctm matrix def
/_tm matrix def
/BT { _ctm currentmatrix pop matrix _tm copy pop 0 0 moveto } bd
/ET { _ctm setmatrix } bd
/iTm { _ctm setmatrix _tm concat } bd
/Tm { _tm astore pop iTm 0 0 moveto } bd
/ux 0.0 def
/uy 0.0 def
/F {
  /Tp exch def
  /Tf exch def
  Tf findfont Tp scalefont setfont
  /cf Tf def  /cs Tp def
} bd
/ULS {currentpoint /uy exch def /ux exch def} bd
/ULE {
  /Tcx currentpoint pop def
  gsave
  newpath
  cf findfont cs scalefont dup
  /FontMatrix get 0 get /Ts exch def /FontInfo get dup
  /UnderlinePosition get Ts mul /To exch def
  /UnderlineThickness get Ts mul /Tt exch def
  ux uy To add moveto  Tcx uy To add lineto
  Tt setlinewidth stroke
  grestore
} bd
/OLE {
  /Tcx currentpoint pop def
  gsave
  newpath
  cf findfont cs scalefont dup
  /FontMatrix get 0 get /Ts exch def /FontInfo get dup
  /UnderlinePosition get Ts mul /To exch def
  /UnderlineThickness get Ts mul /Tt exch def
  ux uy To add cs add moveto Tcx uy To add cs add lineto
  Tt setlinewidth stroke
  grestore
} bd
/SOE {
  /Tcx currentpoint pop def
  gsave
  newpath
  cf findfont cs scalefont dup
  /FontMatrix get 0 get /Ts exch def /FontInfo get dup
  /UnderlinePosition get Ts mul /To exch def
  /UnderlineThickness get Ts mul /Tt exch def
  ux uy To add cs 10 mul 26 idiv add moveto Tcx uy To add cs 10 mul 26 idiv add lineto
  Tt setlinewidth stroke
  grestore
} bd
/QT {
/Y22 exch store
/X22 exch store
/Y21 exch store
/X21 exch store
currentpoint
/Y21 load 2 mul add 3 div exch
/X21 load 2 mul add 3 div exch
/X21 load 2 mul /X22 load add 3 div
/Y21 load 2 mul /Y22 load add 3 div
/X22 load /Y22 load curveto
} bd
/SSPD {
dup length /d exch dict def
{
/v exch def
/k exch def
currentpagedevice k known {
/cpdv currentpagedevice k get def
v cpdv ne {
/upd false def
/nullv v type /nulltype eq def
/nullcpdv cpdv type /nulltype eq def
nullv nullcpdv or
{
/upd true def
} {
/sametype v type cpdv type eq def
sametype {
v type /arraytype eq {
/vlen v length def
/cpdvlen cpdv length def
vlen cpdvlen eq {
0 1 vlen 1 sub {
/i exch def
/obj v i get def
/cpdobj cpdv i get def
obj cpdobj ne {
/upd true def
exit
} if
} for
} {
/upd true def
} ifelse
} {
v type /dicttype eq {
v {
/dv exch def
/dk exch def
/cpddv cpdv dk get def
dv cpddv ne {
/upd true def
exit
} if
} forall
} {
/upd true def
} ifelse
} ifelse
} if
} ifelse
upd true eq {
d k v put
} if
} if
} if
} forall
d length 0 gt {
d setpagedevice
} if
} bd
/RE { % /NewFontName [NewEncodingArray] /FontName RE -
  findfont dup length dict begin
  {
    1 index /FID ne
    {def} {pop pop} ifelse
  } forall
  /Encoding exch def
  /FontName 1 index def
  currentdict definefont pop
  end
} bind def
%%EndResource
%%BeginResource: procset (Apache XML Graphics EPS ProcSet) 1.0 0
%%Version: 1.0 0
%%Copyright: (Copyright 2002-2003 The Apache Software Foundation. License terms: http://www.apache.org/licenses/LICENSE-2.0)
/BeginEPSF { %def
/b4_Inc_state save def         % Save state for cleanup
/dict_count countdictstack def % Count objects on dict stack
/op_count count 1 sub def      % Count objects on operand stack
userdict begin                 % Push userdict on dict stack
/showpage { } def              % Redefine showpage, { } = null proc
0 setgray 0 setlinecap         % Prepare graphics state
1 setlinewidth 0 setlinejoin
10 setmiterlimit [ ] 0 setdash newpath
/languagelevel where           % If level not equal to 1 then
{pop languagelevel             % set strokeadjust and
1 ne                           % overprint to their defaults.
{false setstrokeadjust false setoverprint
} if
} if
} bd
/EndEPSF { %def
count op_count sub {pop} repeat            % Clean up stacks
countdictstack dict_count sub {end} repeat
b4_Inc_state restore
} bd
%%EndResource
%FOPBeginFontDict
%%IncludeResource: font Courier-Oblique
%%IncludeResource: font Courier-BoldOblique
%%IncludeResource: font Courier-Bold
%%IncludeResource: font ZapfDingbats
%%IncludeResource: font Symbol
%%IncludeResource: font Helvetica
%%IncludeResource: font Helvetica-Oblique
%%IncludeResource: font Helvetica-Bold
%%IncludeResource: font Helvetica-BoldOblique
%%IncludeResource: font Times-Roman
%%IncludeResource: font Times-Italic
%%IncludeResource: font Times-Bold
%%IncludeResource: font Times-BoldItalic
%%IncludeResource: font Courier
%FOPEndFontDict
%%BeginResource: encoding WinAnsiEncoding
/WinAnsiEncoding [
/.notdef /.notdef /.notdef /.notdef /.notdef
/.notdef /.notdef /.notdef /.notdef /.notdef
/.notdef /.notdef /.notdef /.notdef /.notdef
/.notdef /.notdef /.notdef /.notdef /.notdef
/.notdef /.notdef /.notdef /.notdef /.notdef
/.notdef /.notdef /.notdef /.notdef /.notdef
/.notdef /.notdef /space /exclam /quotedbl
/numbersign /dollar /percent /ampersand /quotesingle
/parenleft /parenright /asterisk /plus /comma
/hyphen /period /slash /zero /one
/two /three /four /five /six
/seven /eight /nine /colon /semicolon
/less /equal /greater /question /at
/A /B /C /D /E
/F /G /H /I /J
/K /L /M /N /O
/P /Q /R /S /T
/U /V /W /X /Y
/Z /bracketleft /backslash /bracketright /asciicircum
/underscore /quoteleft /a /b /c
/d /e /f /g /h
/i /j /k /l /m
/n /o /p /q /r
/s /t /u /v /w
/x /y /z /braceleft /bar
/braceright /asciitilde /bullet /Euro /bullet
/quotesinglbase /florin /quotedblbase /ellipsis /dagger
/daggerdbl /circumflex /perthousand /Scaron /guilsinglleft
/OE /bullet /Zcaron /bullet /bullet
/quoteleft /quoteright /quotedblleft /quotedblright /bullet
/endash /emdash /asciitilde /trademark /scaron
/guilsinglright /oe /bullet /zcaron /Ydieresis
/space /exclamdown /cent /sterling /currency
/yen /brokenbar /section /dieresis /copyright
/ordfeminine /guillemotleft /logicalnot /sfthyphen /registered
/macron /degree /plusminus /twosuperior /threesuperior
/acute /mu /paragraph /middot /cedilla
/onesuperior /ordmasculine /guillemotright /onequarter /onehalf
/threequarters /questiondown /Agrave /Aacute /Acircumflex
/Atilde /Adieresis /Aring /AE /Ccedilla
/Egrave /Eacute /Ecircumflex /Edieresis /Igrave
/Iacute /Icircumflex /Idieresis /Eth /Ntilde
/Ograve /Oacute /Ocircumflex /Otilde /Odieresis
/multiply /Oslash /Ugrave /Uacute /Ucircumflex
/Udieresis /Yacute /Thorn /germandbls /agrave
/aacute /acircumflex /atilde /adieresis /aring
/ae /ccedilla /egrave /eacute /ecircumflex
/edieresis /igrave /iacute /icircumflex /idieresis
/eth /ntilde /ograve /oacute /ocircumflex
/otilde /odieresis /divide /oslash /ugrave
/uacute /ucircumflex /udieresis /yacute /thorn
/ydieresis
] def
%%EndResource
%FOPBeginFontReencode
/Courier-Oblique findfont
dup length dict begin
  {1 index /FID ne {def} {pop pop} ifelse} forall
  /Encoding WinAnsiEncoding def
  currentdict
end
/Courier-Oblique exch definefont pop
/Courier-BoldOblique findfont
dup length dict begin
  {1 index /FID ne {def} {pop pop} ifelse} forall
  /Encoding WinAnsiEncoding def
  currentdict
end
/Courier-BoldOblique exch definefont pop
/Courier-Bold findfont
dup length dict begin
  {1 index /FID ne {def} {pop pop} ifelse} forall
  /Encoding WinAnsiEncoding def
  currentdict
end
/Courier-Bold exch definefont pop
/Helvetica findfont
dup length dict begin
  {1 index /FID ne {def} {pop pop} ifelse} forall
  /Encoding WinAnsiEncoding def
  currentdict
end
/Helvetica exch definefont pop
/Helvetica-Oblique findfont
dup length dict begin
  {1 index /FID ne {def} {pop pop} ifelse} forall
  /Encoding WinAnsiEncoding def
  currentdict
end
/Helvetica-Oblique exch definefont pop
/Helvetica-Bold findfont
dup length dict begin
  {1 index /FID ne {def} {pop pop} ifelse} forall
  /Encoding WinAnsiEncoding def
  currentdict
end
/Helvetica-Bold exch definefont pop
/Helvetica-BoldOblique findfont
dup length dict begin
  {1 index /FID ne {def} {pop pop} ifelse} forall
  /Encoding WinAnsiEncoding def
  currentdict
end
/Helvetica-BoldOblique exch definefont pop
/Times-Roman findfont
dup length dict begin
  {1 index /FID ne {def} {pop pop} ifelse} forall
  /Encoding WinAnsiEncoding def
  currentdict
end
/Times-Roman exch definefont pop
/Times-Italic findfont
dup length dict begin
  {1 index /FID ne {def} {pop pop} ifelse} forall
  /Encoding WinAnsiEncoding def
  currentdict
end
/Times-Italic exch definefont pop
/Times-Bold findfont
dup length dict begin
  {1 index /FID ne {def} {pop pop} ifelse} forall
  /Encoding WinAnsiEncoding def
  currentdict
end
/Times-Bold exch definefont pop
/Times-BoldItalic findfont
dup length dict begin
  {1 index /FID ne {def} {pop pop} ifelse} forall
  /Encoding WinAnsiEncoding def
  currentdict
end
/Times-BoldItalic exch definefont pop
/Courier findfont
dup length dict begin
  {1 index /FID ne {def} {pop pop} ifelse} forall
  /Encoding WinAnsiEncoding def
  currentdict
end
/Courier exch definefont pop
%FOPEndFontReencode
%%EndProlog
%%Page: 1 1
%%PageBoundingBox: 0 0 443 214
%%BeginPageSetup
[1 0 0 -1 0 214] CT
%%EndPageSetup
GS
1 GC
N
0 0 443 214 re
f
GR
GS
1 GC
N
0 0 443 214 re
f
GR
GS
1 GC
N
57.5 183.5 M
401 183.5 L
401 16.5 L
57.5 16.5 L
cp
f
GR
GS
0.873 GC
1 LJ
0.5 LW
N
57.5 183.5 M
57.5 16.5 L
S
GR
GS
0.873 GC
1 LJ
0.5 LW
N
114.75 183.5 M
114.75 16.5 L
S
GR
GS
0.873 GC
1 LJ
0.5 LW
N
172 183.5 M
172 16.5 L
S
GR
GS
0.873 GC
1 LJ
0.5 LW
N
229.25 183.5 M
229.25 16.5 L
S
GR
GS
0.873 GC
1 LJ
0.5 LW
N
286.5 183.5 M
286.5 16.5 L
S
GR
GS
0.873 GC
1 LJ
0.5 LW
N
343.75 183.5 M
343.75 16.5 L
S
GR
GS
0.873 GC
1 LJ
0.5 LW
N
401 183.5 M
401 16.5 L
S
GR
GS
0.873 GC
1 LJ
0.5 LW
N
401 168.318 M
57.5 168.318 L
S
GR
GS
0.873 GC
1 LJ
0.5 LW
N
401 137.955 M
57.5 137.955 L
S
GR
GS
0.873 GC
1 LJ
0.5 LW
N
401 107.591 M
57.5 107.591 L
S
GR
GS
0.873 GC
1 LJ
0.5 LW
N
401 77.227 M
57.5 77.227 L
S
GR
GS
0.873 GC
1 LJ
0.5 LW
N
401 46.864 M
57.5 46.864 L
S
GR
GS
0.873 GC
1 LJ
0.5 LW
N
401 16.5 M
57.5 16.5 L
S
GR
GS
0.149 GC
2 setlinecap
1 LJ
0.5 LW
N
57.5 183.5 M
401 183.5 L
S
GR
GS
0.149 GC
2 setlinecap
1 LJ
0.5 LW
N
57.5 183.5 M
57.5 180.065 L
S
GR
GS
0.149 GC
2 setlinecap
1 LJ
0.5 LW
N
114.75 183.5 M
114.75 180.065 L
S
GR
GS
0.149 GC
2 setlinecap
1 LJ
0.5 LW
N
172 183.5 M
172 180.065 L
S
GR
GS
0.149 GC
2 setlinecap
1 LJ
0.5 LW
N
229.25 183.5 M
229.25 180.065 L
S
GR
GS
0.149 GC
2 setlinecap
1 LJ
0.5 LW
N
286.5 183.5 M
286.5 180.065 L
S
GR
GS
0.149 GC
2 setlinecap
1 LJ
0.5 LW
N
343.75 183.5 M
343.75 180.065 L
S
GR
GS
0.149 GC
2 setlinecap
1 LJ
0.5 LW
N
401 183.5 M
401 180.065 L
S
GR
GS
[1 0 0 1 57.5 187.5] CT
0.149 GC
/Helvetica 10 F
GS
[1 0 0 1 0 0] CT
-5 10 moveto 
1 -1 scale
(-3) t 
GR
GR
GS
[1 0 0 1 114.75 187.5] CT
0.149 GC
/Helvetica 10 F
GS
[1 0 0 1 0 0] CT
-5 10 moveto 
1 -1 scale
(-2) t 
GR
GR
GS
[1 0 0 1 172 187.5] CT
0.149 GC
/Helvetica 10 F
GS
[1 0 0 1 0 0] CT
-5 10 moveto 
1 -1 scale
(-1) t 
GR
GR
GS
[1 0 0 1 229.25 187.5] CT
0.149 GC
/Helvetica 10 F
GS
[1 0 0 1 0 0] CT
-3 10 moveto 
1 -1 scale
(0) t 
GR
GR
GS
[1 0 0 1 286.5 187.5] CT
0.149 GC
/Helvetica 10 F
GS
[1 0 0 1 0 0] CT
-3 10 moveto 
1 -1 scale
(1) t 
GR
GR
GS
[1 0 0 1 343.75 187.5] CT
0.149 GC
/Helvetica 10 F
GS
[1 0 0 1 0 0] CT
-3 10 moveto 
1 -1 scale
(2) t 
GR
GR
GS
[1 0 0 1 401 187.5] CT
0.149 GC
/Helvetica 10 F
GS
[1 0 0 1 0 0] CT
-3 10 moveto 
1 -1 scale
(3) t 
GR
GR
GS
[1 0 0 1 229.25017 201] CT
0.149 GC
/Helvetica 11 F
GS
[1 0 0 1 0 0] CT
-3 11 moveto 
1 -1 scale
(x) t 
GR
GR
GS
0.149 GC
2 setlinecap
1 LJ
0.5 LW
N
57.5 183.5 M
57.5 16.5 L
S
GR
GS
0.149 GC
2 setlinecap
1 LJ
0.5 LW
N
57.5 168.318 M
60.935 168.318 L
S
GR
GS
0.149 GC
2 setlinecap
1 LJ
0.5 LW
N
57.5 137.955 M
60.935 137.955 L
S
GR
GS
0.149 GC
2 setlinecap
1 LJ
0.5 LW
N
57.5 107.591 M
60.935 107.591 L
S
GR
GS
0.149 GC
2 setlinecap
1 LJ
0.5 LW
N
57.5 77.227 M
60.935 77.227 L
S
GR
GS
0.149 GC
2 setlinecap
1 LJ
0.5 LW
N
57.5 46.864 M
60.935 46.864 L
S
GR
GS
0.149 GC
2 setlinecap
1 LJ
0.5 LW
N
57.5 16.5 M
60.935 16.5 L
S
GR
GS
[1 0 0 1 53.5 168.31818] CT
0.149 GC
/Helvetica 10 F
GS
[1 0 0 1 0 0] CT
-6 3.5 moveto 
1 -1 scale
(0) t 
GR
GR
GS
[1 0 0 1 53.5 137.95454] CT
0.149 GC
/Helvetica 10 F
GS
[1 0 0 1 0 0] CT
-14 3.5 moveto 
1 -1 scale
(0.2) t 
GR
GR
GS
[1 0 0 1 53.5 107.59091] CT
0.149 GC
/Helvetica 10 F
GS
[1 0 0 1 0 0] CT
-14 3.5 moveto 
1 -1 scale
(0.4) t 
GR
GR
GS
[1 0 0 1 53.5 77.22727] CT
0.149 GC
/Helvetica 10 F
GS
[1 0 0 1 0 0] CT
-14 3.5 moveto 
1 -1 scale
(0.6) t 
GR
GR
GS
[1 0 0 1 53.5 46.86364] CT
0.149 GC
/Helvetica 10 F
GS
[1 0 0 1 0 0] CT
-14 3.5 moveto 
1 -1 scale
(0.8) t 
GR
GR
GS
[1 0 0 1 53.5 16.5] CT
0.149 GC
/Helvetica 10 F
GS
[1 0 0 1 0 0] CT
-6 3.5 moveto 
1 -1 scale
(1) t 
GR
GR
GS
[0 -1 1 0 36.5 99.99992] CT
0.149 GC
/Helvetica 11 F
GS
[1 0 0 1 0 0] CT
-29 -3 moveto 
1 -1 scale
(f\(x\) and g\(x\)) t 
GR
GR
GS
[1 0 0 1 229.25021 15.1291] CT
/Helvetica-Bold 11 F
GS
[1 0 0 1 0 0] CT
-127.5 -3 moveto 
1 -1 scale
(Gaussian and Exponential Distribution Functions) t 
GR
GR
GS
0 0 1 RC
1 LJ
2 LW
N
57.5 167.645 M
58.072 167.625 L
58.645 167.604 L
59.217 167.582 L
59.79 167.56 L
60.362 167.537 L
60.935 167.514 L
61.507 167.49 L
62.08 167.466 L
62.652 167.44 L
63.225 167.414 L
63.797 167.388 L
64.37 167.361 L
64.943 167.333 L
65.515 167.304 L
66.088 167.275 L
66.66 167.245 L
67.233 167.214 L
67.805 167.182 L
68.378 167.15 L
68.95 167.116 L
69.522 167.082 L
70.095 167.048 L
70.668 167.012 L
71.24 166.975 L
71.813 166.938 L
72.385 166.899 L
72.957 166.86 L
73.53 166.82 L
74.103 166.778 L
74.675 166.736 L
75.247 166.693 L
75.82 166.649 L
76.392 166.603 L
76.965 166.557 L
77.537 166.51 L
78.11 166.461 L
78.682 166.412 L
79.255 166.361 L
79.828 166.309 L
80.4 166.256 L
80.973 166.202 L
81.545 166.146 L
82.118 166.09 L
82.69 166.032 L
83.263 165.973 L
83.835 165.912 L
84.408 165.85 L
84.98 165.787 L
85.552 165.723 L
86.125 165.657 L
86.698 165.59 L
87.27 165.521 L
87.842 165.451 L
88.415 165.38 L
88.987 165.307 L
89.56 165.232 L
90.132 165.156 L
90.705 165.078 L
91.277 164.999 L
91.85 164.918 L
92.422 164.836 L
92.995 164.752 L
93.568 164.666 L
94.14 164.579 L
94.713 164.49 L
95.285 164.399 L
95.858 164.306 L
96.43 164.212 L
97.003 164.116 L
97.575 164.018 L
98.147 163.918 L
98.72 163.816 L
99.293 163.712 L
99.865 163.607 L
100.438 163.5 L
101.01 163.39 L
101.582 163.279 L
102.155 163.165 L
102.728 163.05 L
103.3 162.932 L
103.872 162.813 L
104.445 162.691 L
105.017 162.568 L
105.59 162.442 L
106.162 162.314 L
106.735 162.184 L
107.307 162.051 L
107.88 161.917 L
108.453 161.78 L
109.025 161.641 L
109.598 161.499 L
110.17 161.356 L
110.743 161.21 L
111.315 161.061 L
111.888 160.911 L
112.46 160.758 L
113.033 160.602 L
113.605 160.444 L
114.177 160.284 L
114.75 160.121 L
115.323 159.956 L
115.895 159.789 L
116.467 159.618 L
117.04 159.446 L
117.612 159.271 L
118.185 159.093 L
118.757 158.913 L
119.33 158.73 L
119.903 158.544 L
120.475 158.357 L
121.048 158.166 L
121.62 157.973 L
122.192 157.777 L
122.765 157.579 L
123.338 157.377 L
123.91 157.174 L
124.482 156.967 L
125.055 156.758 L
125.628 156.547 L
126.2 156.332 L
126.772 156.115 L
127.345 155.895 L
127.918 155.673 L
128.49 155.448 L
129.063 155.22 L
129.635 154.989 L
130.208 154.756 L
130.78 154.52 L
131.352 154.281 L
131.925 154.04 L
132.497 153.796 L
133.07 153.549 L
133.643 153.299 L
134.215 153.047 L
134.788 152.793 L
135.36 152.535 L
135.932 152.275 L
136.505 152.012 L
137.077 151.747 L
137.65 151.478 L
138.223 151.208 L
138.795 150.934 L
139.367 150.658 L
139.94 150.38 L
140.512 150.099 L
141.085 149.815 L
141.658 149.529 L
142.23 149.24 L
142.803 148.949 L
143.375 148.655 L
143.947 148.359 L
144.52 148.06 L
145.092 147.759 L
145.665 147.456 L
146.238 147.15 L
146.81 146.842 L
147.383 146.532 L
147.955 146.219 L
148.527 145.904 L
149.1 145.587 L
149.673 145.268 L
150.245 144.946 L
150.818 144.622 L
151.39 144.297 L
151.962 143.969 L
152.535 143.639 L
153.107 143.308 L
153.68 142.974 L
154.253 142.639 L
154.825 142.301 L
155.398 141.962 L
155.97 141.621 L
156.542 141.279 L
157.115 140.935 L
157.688 140.589 L
158.26 140.241 L
158.833 139.892 L
159.405 139.542 L
159.977 139.19 L
160.55 138.837 L
161.122 138.483 L
161.695 138.127 L
162.268 137.77 L
162.84 137.412 L
163.413 137.053 L
163.985 136.693 L
164.557 136.332 L
165.13 135.97 L
165.702 135.608 L
166.275 135.244 L
166.848 134.88 L
167.42 134.515 L
167.992 134.15 L
168.565 133.784 L
169.137 133.418 L
169.71 133.051 L
170.283 132.684 L
170.855 132.317 L
171.428 131.95 L
172 131.583 L
172.572 131.215 L
173.145 130.848 L
173.717 130.481 L
174.29 130.114 L
174.863 129.747 L
175.435 129.381 L
176.007 129.015 L
176.58 128.65 L
177.152 128.286 L
177.725 127.922 L
178.298 127.558 L
178.87 127.196 L
179.443 126.835 L
180.015 126.474 L
180.587 126.115 L
181.16 125.757 L
181.732 125.4 L
182.305 125.044 L
182.878 124.69 L
183.45 124.338 L
184.022 123.987 L
184.595 123.637 L
185.167 123.29 L
185.74 122.944 L
186.313 122.6 L
186.885 122.258 L
187.458 121.918 L
188.03 121.581 L
188.603 121.245 L
189.175 120.912 L
189.747 120.582 L
190.32 120.254 L
190.893 119.928 L
191.465 119.605 L
192.038 119.285 L
192.61 118.968 L
193.182 118.653 L
193.755 118.342 L
194.327 118.034 L
194.9 117.729 L
195.473 117.427 L
196.045 117.128 L
196.618 116.833 L
197.19 116.541 L
197.762 116.253 L
198.335 115.969 L
198.908 115.688 L
199.48 115.411 L
200.053 115.138 L
200.625 114.868 L
201.197 114.603 L
201.77 114.342 L
202.342 114.085 L
202.915 113.832 L
203.488 113.584 L
204.06 113.34 L
204.632 113.1 L
205.205 112.865 L
205.777 112.634 L
206.35 112.408 L
206.923 112.187 L
207.495 111.97 L
208.068 111.759 L
208.64 111.552 L
209.212 111.35 L
209.785 111.153 L
210.357 110.961 L
210.93 110.774 L
211.503 110.593 L
212.075 110.417 L
212.648 110.246 L
213.22 110.08 L
213.792 109.919 L
214.365 109.764 L
214.938 109.615 L
215.51 109.471 L
216.083 109.332 L
216.655 109.2 L
217.227 109.072 L
217.8 108.951 L
218.372 108.835 L
218.945 108.725 L
219.518 108.62 L
220.09 108.522 L
220.663 108.429 L
221.235 108.342 L
221.807 108.261 L
222.38 108.186 L
222.952 108.117 L
223.525 108.054 L
224.098 107.996 L
224.67 107.945 L
225.242 107.9 L
225.815 107.86 L
226.387 107.827 L
226.96 107.8 L
227.533 107.779 L
228.105 107.764 L
228.678 107.755 L
229.25 107.751 L
229.822 107.755 L
230.395 107.764 L
230.967 107.779 L
231.54 107.8 L
232.113 107.827 L
232.685 107.86 L
233.258 107.9 L
233.83 107.945 L
234.402 107.996 L
234.975 108.054 L
235.548 108.117 L
236.12 108.186 L
236.693 108.261 L
237.265 108.342 L
237.837 108.429 L
238.41 108.522 L
238.982 108.62 L
239.555 108.725 L
240.128 108.835 L
240.7 108.951 L
241.273 109.072 L
241.845 109.2 L
242.417 109.332 L
242.99 109.471 L
243.563 109.615 L
244.135 109.764 L
244.708 109.919 L
245.28 110.08 L
245.852 110.246 L
246.425 110.417 L
246.997 110.593 L
247.57 110.774 L
248.143 110.961 L
248.715 111.153 L
249.288 111.35 L
249.86 111.552 L
250.432 111.759 L
251.005 111.97 L
251.577 112.187 L
252.15 112.408 L
252.723 112.634 L
253.295 112.865 L
253.868 113.1 L
254.44 113.34 L
255.012 113.584 L
255.585 113.832 L
256.158 114.085 L
256.73 114.342 L
257.302 114.603 L
257.875 114.868 L
258.448 115.138 L
259.02 115.411 L
259.592 115.688 L
260.165 115.969 L
260.737 116.253 L
261.31 116.541 L
261.883 116.833 L
262.455 117.128 L
263.027 117.427 L
263.6 117.729 L
264.173 118.034 L
264.745 118.342 L
265.318 118.653 L
265.89 118.968 L
266.462 119.285 L
267.035 119.605 L
267.608 119.928 L
268.18 120.254 L
268.753 120.582 L
269.325 120.912 L
269.897 121.245 L
270.47 121.581 L
271.043 121.918 L
271.615 122.258 L
272.188 122.6 L
272.76 122.944 L
273.332 123.29 L
273.905 123.637 L
274.478 123.987 L
275.05 124.338 L
275.622 124.69 L
276.195 125.044 L
276.767 125.4 L
277.34 125.757 L
277.913 126.115 L
278.485 126.474 L
279.057 126.835 L
279.63 127.196 L
280.202 127.558 L
280.775 127.922 L
281.348 128.286 L
281.92 128.65 L
282.492 129.015 L
283.065 129.381 L
283.638 129.747 L
284.21 130.114 L
284.783 130.481 L
285.355 130.848 L
285.927 131.215 L
286.5 131.583 L
287.073 131.95 L
287.645 132.317 L
288.217 132.684 L
288.79 133.051 L
289.362 133.418 L
289.935 133.784 L
290.508 134.15 L
291.08 134.515 L
291.652 134.88 L
292.225 135.244 L
292.798 135.608 L
293.37 135.97 L
293.943 136.332 L
294.515 136.693 L
295.087 137.053 L
295.66 137.412 L
296.232 137.77 L
296.805 138.127 L
297.378 138.483 L
297.95 138.837 L
298.522 139.19 L
299.095 139.542 L
299.668 139.892 L
300.24 140.241 L
300.813 140.589 L
301.385 140.935 L
301.957 141.279 L
302.53 141.621 L
303.103 141.962 L
303.675 142.301 L
304.247 142.639 L
304.82 142.974 L
305.393 143.308 L
305.965 143.639 L
306.538 143.969 L
307.11 144.297 L
307.682 144.622 L
308.255 144.946 L
308.827 145.268 L
309.4 145.587 L
309.973 145.904 L
310.545 146.219 L
311.117 146.532 L
311.69 146.842 L
312.263 147.15 L
312.835 147.456 L
313.408 147.759 L
313.98 148.06 L
314.552 148.359 L
315.125 148.655 L
315.698 148.949 L
316.27 149.24 L
316.842 149.529 L
317.415 149.815 L
317.987 150.099 L
318.56 150.38 L
319.133 150.658 L
319.705 150.934 L
320.277 151.208 L
320.85 151.478 L
321.423 151.747 L
321.995 152.012 L
322.568 152.275 L
323.14 152.535 L
323.712 152.793 L
324.285 153.047 L
324.857 153.299 L
325.43 153.549 L
326.003 153.796 L
326.575 154.04 L
327.147 154.281 L
327.72 154.52 L
328.293 154.756 L
328.865 154.989 L
329.438 155.22 L
330.01 155.448 L
330.582 155.673 L
331.155 155.895 L
331.728 156.115 L
332.3 156.332 L
332.872 156.547 L
333.445 156.758 L
334.018 156.967 L
334.59 157.174 L
335.163 157.377 L
335.735 157.579 L
336.307 157.777 L
336.88 157.973 L
337.452 158.166 L
338.025 158.357 L
338.598 158.544 L
339.17 158.73 L
339.742 158.913 L
340.315 159.093 L
340.888 159.271 L
341.46 159.446 L
342.033 159.618 L
342.605 159.789 L
343.177 159.956 L
343.75 160.121 L
344.323 160.284 L
344.895 160.444 L
345.467 160.602 L
346.04 160.758 L
346.612 160.911 L
347.185 161.061 L
347.758 161.21 L
348.33 161.356 L
348.902 161.499 L
349.475 161.641 L
350.047 161.78 L
350.62 161.917 L
351.193 162.051 L
351.765 162.184 L
352.337 162.314 L
352.91 162.442 L
353.483 162.568 L
354.055 162.691 L
354.628 162.813 L
355.2 162.932 L
355.772 163.05 L
356.345 163.165 L
356.918 163.279 L
357.49 163.39 L
358.063 163.5 L
358.635 163.607 L
359.207 163.712 L
359.78 163.816 L
360.353 163.918 L
360.925 164.018 L
361.497 164.116 L
362.07 164.212 L
362.642 164.306 L
363.215 164.399 L
363.788 164.49 L
364.36 164.579 L
364.932 164.666 L
365.505 164.752 L
366.078 164.836 L
366.65 164.918 L
367.223 164.999 L
367.795 165.078 L
368.367 165.156 L
368.94 165.232 L
369.513 165.307 L
370.085 165.38 L
370.658 165.451 L
371.23 165.521 L
371.802 165.59 L
372.375 165.657 L
372.948 165.723 L
373.52 165.787 L
374.092 165.85 L
374.665 165.912 L
375.237 165.973 L
375.81 166.032 L
376.383 166.09 L
376.955 166.146 L
377.527 166.202 L
378.1 166.256 L
378.672 166.309 L
379.245 166.361 L
379.818 166.412 L
380.39 166.461 L
380.962 166.51 L
381.535 166.557 L
382.108 166.603 L
382.68 166.649 L
383.253 166.693 L
383.825 166.736 L
384.397 166.778 L
384.97 166.82 L
385.543 166.86 L
386.115 166.899 L
386.688 166.938 L
387.26 166.975 L
387.832 167.012 L
388.405 167.048 L
388.978 167.082 L
389.55 167.116 L
390.122 167.15 L
390.695 167.182 L
391.267 167.214 L
391.84 167.245 L
392.413 167.275 L
392.985 167.304 L
393.557 167.333 L
394.13 167.361 L
394.703 167.388 L
395.275 167.414 L
395.848 167.44 L
396.42 167.466 L
396.992 167.49 L
397.565 167.514 L
398.138 167.537 L
398.71 167.56 L
399.283 167.582 L
399.855 167.604 L
400.427 167.625 L
401 167.645 L
S
GR
GS
1 0 0 RC
1 LJ
2 LW
N
57.5 164.539 M
58.072 164.501 L
58.645 164.463 L
59.217 164.424 L
59.79 164.385 L
60.362 164.345 L
60.935 164.305 L
61.507 164.265 L
62.08 164.224 L
62.652 164.183 L
63.225 164.141 L
63.797 164.099 L
64.37 164.057 L
64.943 164.014 L
65.515 163.971 L
66.088 163.927 L
66.66 163.883 L
67.233 163.839 L
67.805 163.794 L
68.378 163.748 L
68.95 163.702 L
69.522 163.656 L
70.095 163.609 L
70.668 163.562 L
71.24 163.514 L
71.813 163.465 L
72.385 163.417 L
72.957 163.367 L
73.53 163.318 L
74.103 163.267 L
74.675 163.217 L
75.247 163.165 L
75.82 163.114 L
76.392 163.061 L
76.965 163.008 L
77.537 162.955 L
78.11 162.901 L
78.682 162.847 L
79.255 162.792 L
79.828 162.736 L
80.4 162.68 L
80.973 162.623 L
81.545 162.566 L
82.118 162.508 L
82.69 162.45 L
83.263 162.391 L
83.835 162.332 L
84.408 162.271 L
84.98 162.211 L
85.552 162.149 L
86.125 162.087 L
86.698 162.025 L
87.27 161.961 L
87.842 161.897 L
88.415 161.833 L
88.987 161.768 L
89.56 161.702 L
90.132 161.635 L
90.705 161.568 L
91.277 161.5 L
91.85 161.432 L
92.422 161.363 L
92.995 161.293 L
93.568 161.222 L
94.14 161.151 L
94.713 161.079 L
95.285 161.006 L
95.858 160.933 L
96.43 160.858 L
97.003 160.783 L
97.575 160.708 L
98.147 160.631 L
98.72 160.554 L
99.293 160.476 L
99.865 160.397 L
100.438 160.317 L
101.01 160.237 L
101.582 160.156 L
102.155 160.074 L
102.728 159.991 L
103.3 159.907 L
103.872 159.823 L
104.445 159.737 L
105.017 159.651 L
105.59 159.564 L
106.162 159.476 L
106.735 159.387 L
107.307 159.297 L
107.88 159.207 L
108.453 159.115 L
109.025 159.023 L
109.598 158.929 L
110.17 158.835 L
110.743 158.74 L
111.315 158.643 L
111.888 158.546 L
112.46 158.448 L
113.033 158.349 L
113.605 158.248 L
114.177 158.147 L
114.75 158.045 L
115.323 157.942 L
115.895 157.837 L
116.467 157.732 L
117.04 157.626 L
117.612 157.518 L
118.185 157.41 L
118.757 157.3 L
119.33 157.189 L
119.903 157.078 L
120.475 156.965 L
121.048 156.85 L
121.62 156.735 L
122.192 156.619 L
122.765 156.501 L
123.338 156.382 L
123.91 156.262 L
124.482 156.141 L
125.055 156.019 L
125.628 155.895 L
126.2 155.77 L
126.772 155.644 L
127.345 155.517 L
127.918 155.388 L
128.49 155.258 L
129.063 155.127 L
129.635 154.995 L
130.208 154.861 L
130.78 154.725 L
131.352 154.589 L
131.925 154.451 L
132.497 154.311 L
133.07 154.171 L
133.643 154.029 L
134.215 153.885 L
134.788 153.74 L
135.36 153.593 L
135.932 153.445 L
136.505 153.296 L
137.077 153.145 L
137.65 152.992 L
138.223 152.838 L
138.795 152.683 L
139.367 152.526 L
139.94 152.367 L
140.512 152.207 L
141.085 152.045 L
141.658 151.881 L
142.23 151.716 L
142.803 151.549 L
143.375 151.381 L
143.947 151.21 L
144.52 151.038 L
145.092 150.865 L
145.665 150.689 L
146.238 150.512 L
146.81 150.333 L
147.383 150.152 L
147.955 149.97 L
148.527 149.785 L
149.1 149.599 L
149.673 149.411 L
150.245 149.221 L
150.818 149.029 L
151.39 148.835 L
151.962 148.639 L
152.535 148.442 L
153.107 148.242 L
153.68 148.04 L
154.253 147.836 L
154.825 147.631 L
155.398 147.423 L
155.97 147.213 L
156.542 147.001 L
157.115 146.786 L
157.688 146.57 L
158.26 146.351 L
158.833 146.131 L
159.405 145.908 L
159.977 145.682 L
160.55 145.455 L
161.122 145.225 L
161.695 144.993 L
162.268 144.759 L
162.84 144.522 L
163.413 144.283 L
163.985 144.041 L
164.557 143.797 L
165.13 143.551 L
165.702 143.302 L
166.275 143.05 L
166.848 142.796 L
167.42 142.54 L
167.992 142.281 L
168.565 142.019 L
169.137 141.755 L
169.71 141.488 L
170.283 141.218 L
170.855 140.946 L
171.428 140.671 L
172 140.393 L
172.572 140.112 L
173.145 139.829 L
173.717 139.542 L
174.29 139.253 L
174.863 138.961 L
175.435 138.666 L
176.007 138.368 L
176.58 138.067 L
177.152 137.763 L
177.725 137.456 L
178.298 137.146 L
178.87 136.832 L
179.443 136.516 L
180.015 136.196 L
180.587 135.874 L
181.16 135.547 L
181.732 135.218 L
182.305 134.885 L
182.878 134.549 L
183.45 134.21 L
184.022 133.867 L
184.595 133.521 L
185.167 133.171 L
185.74 132.818 L
186.313 132.461 L
186.885 132.101 L
187.458 131.737 L
188.03 131.369 L
188.603 130.998 L
189.175 130.623 L
189.747 130.244 L
190.32 129.861 L
190.893 129.475 L
191.465 129.084 L
192.038 128.69 L
192.61 128.292 L
193.182 127.89 L
193.755 127.483 L
194.327 127.073 L
194.9 126.658 L
195.473 126.24 L
196.045 125.817 L
196.618 125.39 L
197.19 124.958 L
197.762 124.522 L
198.335 124.082 L
198.908 123.638 L
199.48 123.189 L
200.053 122.735 L
200.625 122.277 L
201.197 121.814 L
201.77 121.347 L
202.342 120.875 L
202.915 120.398 L
203.488 119.916 L
204.06 119.43 L
204.632 118.939 L
205.205 118.442 L
205.777 117.941 L
206.35 117.435 L
206.923 116.923 L
207.495 116.407 L
208.068 115.885 L
208.64 115.358 L
209.212 114.826 L
209.785 114.288 L
210.357 113.745 L
210.93 113.197 L
211.503 112.643 L
212.075 112.083 L
212.648 111.518 L
213.22 110.947 L
213.792 110.371 L
214.365 109.788 L
214.938 109.2 L
215.51 108.606 L
216.083 108.006 L
216.655 107.4 L
217.227 106.787 L
217.8 106.169 L
218.372 105.544 L
218.945 104.914 L
219.518 104.276 L
220.09 103.633 L
220.663 102.983 L
221.235 102.326 L
221.807 101.663 L
222.38 100.993 L
222.952 100.316 L
223.525 99.633 L
224.098 98.942 L
224.67 98.245 L
225.242 97.541 L
225.815 96.83 L
226.387 96.111 L
226.96 95.386 L
227.533 94.653 L
228.105 93.912 L
228.678 93.164 L
229.25 92.409 L
229.822 93.164 L
230.395 93.912 L
230.967 94.653 L
231.54 95.386 L
232.113 96.111 L
232.685 96.83 L
233.258 97.541 L
233.83 98.245 L
234.402 98.942 L
234.975 99.633 L
235.548 100.316 L
236.12 100.993 L
236.693 101.663 L
237.265 102.326 L
237.837 102.983 L
238.41 103.633 L
238.982 104.276 L
239.555 104.914 L
240.128 105.544 L
240.7 106.169 L
241.273 106.787 L
241.845 107.4 L
242.417 108.006 L
242.99 108.606 L
243.563 109.2 L
244.135 109.788 L
244.708 110.371 L
245.28 110.947 L
245.852 111.518 L
246.425 112.083 L
246.997 112.643 L
247.57 113.197 L
248.143 113.745 L
248.715 114.288 L
249.288 114.826 L
249.86 115.358 L
250.432 115.885 L
251.005 116.407 L
251.577 116.923 L
252.15 117.435 L
252.723 117.941 L
253.295 118.442 L
253.868 118.939 L
254.44 119.43 L
255.012 119.916 L
255.585 120.398 L
256.158 120.875 L
256.73 121.347 L
257.302 121.814 L
257.875 122.277 L
258.448 122.735 L
259.02 123.189 L
259.592 123.638 L
260.165 124.082 L
260.737 124.522 L
261.31 124.958 L
261.883 125.39 L
262.455 125.817 L
263.027 126.24 L
263.6 126.658 L
264.173 127.073 L
264.745 127.483 L
265.318 127.89 L
265.89 128.292 L
266.462 128.69 L
267.035 129.084 L
267.608 129.475 L
268.18 129.861 L
268.753 130.244 L
269.325 130.623 L
269.897 130.998 L
270.47 131.369 L
271.043 131.737 L
271.615 132.101 L
272.188 132.461 L
272.76 132.818 L
273.332 133.171 L
273.905 133.521 L
274.478 133.867 L
275.05 134.21 L
275.622 134.549 L
276.195 134.885 L
276.767 135.218 L
277.34 135.547 L
277.913 135.874 L
278.485 136.196 L
279.057 136.516 L
279.63 136.832 L
280.202 137.146 L
280.775 137.456 L
281.348 137.763 L
281.92 138.067 L
282.492 138.368 L
283.065 138.666 L
283.638 138.961 L
284.21 139.253 L
284.783 139.542 L
285.355 139.829 L
285.927 140.112 L
286.5 140.393 L
287.073 140.671 L
287.645 140.946 L
288.217 141.218 L
288.79 141.488 L
289.362 141.755 L
289.935 142.019 L
290.508 142.281 L
291.08 142.54 L
291.652 142.796 L
292.225 143.05 L
292.798 143.302 L
293.37 143.551 L
293.943 143.797 L
294.515 144.041 L
295.087 144.283 L
295.66 144.522 L
296.232 144.759 L
296.805 144.993 L
297.378 145.225 L
297.95 145.455 L
298.522 145.682 L
299.095 145.908 L
299.668 146.131 L
300.24 146.351 L
300.813 146.57 L
301.385 146.786 L
301.957 147.001 L
302.53 147.213 L
303.103 147.423 L
303.675 147.631 L
304.247 147.836 L
304.82 148.04 L
305.393 148.242 L
305.965 148.442 L
306.538 148.639 L
307.11 148.835 L
307.682 149.029 L
308.255 149.221 L
308.827 149.411 L
309.4 149.599 L
309.973 149.785 L
310.545 149.97 L
311.117 150.152 L
311.69 150.333 L
312.263 150.512 L
312.835 150.689 L
313.408 150.865 L
313.98 151.038 L
314.552 151.21 L
315.125 151.381 L
315.698 151.549 L
316.27 151.716 L
316.842 151.881 L
317.415 152.045 L
317.987 152.207 L
318.56 152.367 L
319.133 152.526 L
319.705 152.683 L
320.277 152.838 L
320.85 152.992 L
321.423 153.145 L
321.995 153.296 L
322.568 153.445 L
323.14 153.593 L
323.712 153.74 L
324.285 153.885 L
324.857 154.029 L
325.43 154.171 L
326.003 154.311 L
326.575 154.451 L
327.147 154.589 L
327.72 154.725 L
328.293 154.861 L
328.865 154.995 L
329.438 155.127 L
330.01 155.258 L
330.582 155.388 L
331.155 155.517 L
331.728 155.644 L
332.3 155.77 L
332.872 155.895 L
333.445 156.019 L
334.018 156.141 L
334.59 156.262 L
335.163 156.382 L
335.735 156.501 L
336.307 156.619 L
336.88 156.735 L
337.452 156.85 L
338.025 156.965 L
338.598 157.078 L
339.17 157.189 L
339.742 157.3 L
340.315 157.41 L
340.888 157.518 L
341.46 157.626 L
342.033 157.732 L
342.605 157.837 L
343.177 157.942 L
343.75 158.045 L
344.323 158.147 L
344.895 158.248 L
345.467 158.349 L
346.04 158.448 L
346.612 158.546 L
347.185 158.643 L
347.758 158.74 L
348.33 158.835 L
348.902 158.929 L
349.475 159.023 L
350.047 159.115 L
350.62 159.207 L
351.193 159.297 L
351.765 159.387 L
352.337 159.476 L
352.91 159.564 L
353.483 159.651 L
354.055 159.737 L
354.628 159.823 L
355.2 159.907 L
355.772 159.991 L
356.345 160.074 L
356.918 160.156 L
357.49 160.237 L
358.063 160.317 L
358.635 160.397 L
359.207 160.476 L
359.78 160.554 L
360.353 160.631 L
360.925 160.708 L
361.497 160.783 L
362.07 160.858 L
362.642 160.933 L
363.215 161.006 L
363.788 161.079 L
364.36 161.151 L
364.932 161.222 L
365.505 161.293 L
366.078 161.363 L
366.65 161.432 L
367.223 161.5 L
367.795 161.568 L
368.367 161.635 L
368.94 161.702 L
369.513 161.768 L
370.085 161.833 L
370.658 161.897 L
371.23 161.961 L
371.802 162.025 L
372.375 162.087 L
372.948 162.149 L
373.52 162.211 L
374.092 162.271 L
374.665 162.332 L
375.237 162.391 L
375.81 162.45 L
376.383 162.508 L
376.955 162.566 L
377.527 162.623 L
378.1 162.68 L
378.672 162.736 L
379.245 162.792 L
379.818 162.847 L
380.39 162.901 L
380.962 162.955 L
381.535 163.008 L
382.108 163.061 L
382.68 163.114 L
383.253 163.165 L
383.825 163.217 L
384.397 163.267 L
384.97 163.318 L
385.543 163.367 L
386.115 163.417 L
386.688 163.465 L
387.26 163.514 L
387.832 163.562 L
388.405 163.609 L
388.978 163.656 L
389.55 163.702 L
390.122 163.748 L
390.695 163.794 L
391.267 163.839 L
391.84 163.883 L
392.413 163.927 L
392.985 163.971 L
393.557 164.014 L
394.13 164.057 L
394.703 164.099 L
395.275 164.141 L
395.848 164.183 L
396.42 164.224 L
396.992 164.265 L
397.565 164.305 L
398.138 164.345 L
398.71 164.385 L
399.283 164.424 L
399.855 164.463 L
400.427 164.501 L
401 164.539 L
S
GR
GS
0 1 0 RC
1 LJ
2 LW
N
57.5 163.347 M
58.072 163.297 L
58.645 163.246 L
59.217 163.195 L
59.79 163.144 L
60.362 163.092 L
60.935 163.039 L
61.507 162.986 L
62.08 162.932 L
62.652 162.878 L
63.225 162.824 L
63.797 162.768 L
64.37 162.713 L
64.943 162.656 L
65.515 162.599 L
66.088 162.542 L
66.66 162.484 L
67.233 162.425 L
67.805 162.366 L
68.378 162.306 L
68.95 162.246 L
69.522 162.185 L
70.095 162.123 L
70.668 162.061 L
71.24 161.998 L
71.813 161.934 L
72.385 161.87 L
72.957 161.806 L
73.53 161.74 L
74.103 161.674 L
74.675 161.607 L
75.247 161.54 L
75.82 161.472 L
76.392 161.403 L
76.965 161.333 L
77.537 161.263 L
78.11 161.192 L
78.682 161.121 L
79.255 161.048 L
79.828 160.975 L
80.4 160.901 L
80.973 160.827 L
81.545 160.752 L
82.118 160.676 L
82.69 160.599 L
83.263 160.521 L
83.835 160.443 L
84.408 160.364 L
84.98 160.284 L
85.552 160.203 L
86.125 160.121 L
86.698 160.039 L
87.27 159.956 L
87.842 159.872 L
88.415 159.787 L
88.987 159.701 L
89.56 159.615 L
90.132 159.527 L
90.705 159.439 L
91.277 159.349 L
91.85 159.259 L
92.422 159.168 L
92.995 159.076 L
93.568 158.983 L
94.14 158.89 L
94.713 158.795 L
95.285 158.699 L
95.858 158.602 L
96.43 158.505 L
97.003 158.406 L
97.575 158.307 L
98.147 158.206 L
98.72 158.104 L
99.293 158.002 L
99.865 157.898 L
100.438 157.793 L
101.01 157.687 L
101.582 157.581 L
102.155 157.473 L
102.728 157.364 L
103.3 157.254 L
103.872 157.142 L
104.445 157.03 L
105.017 156.917 L
105.59 156.802 L
106.162 156.686 L
106.735 156.569 L
107.307 156.451 L
107.88 156.332 L
108.453 156.212 L
109.025 156.09 L
109.598 155.967 L
110.17 155.843 L
110.743 155.718 L
111.315 155.591 L
111.888 155.463 L
112.46 155.334 L
113.033 155.203 L
113.605 155.072 L
114.177 154.938 L
114.75 154.804 L
115.323 154.668 L
115.895 154.531 L
116.467 154.392 L
117.04 154.252 L
117.612 154.111 L
118.185 153.968 L
118.757 153.824 L
119.33 153.678 L
119.903 153.531 L
120.475 153.383 L
121.048 153.233 L
121.62 153.081 L
122.192 152.928 L
122.765 152.773 L
123.338 152.617 L
123.91 152.459 L
124.482 152.3 L
125.055 152.139 L
125.628 151.976 L
126.2 151.812 L
126.772 151.646 L
127.345 151.478 L
127.918 151.309 L
128.49 151.138 L
129.063 150.966 L
129.635 150.791 L
130.208 150.615 L
130.78 150.437 L
131.352 150.257 L
131.925 150.076 L
132.497 149.893 L
133.07 149.707 L
133.643 149.52 L
134.215 149.331 L
134.788 149.141 L
135.36 148.948 L
135.932 148.753 L
136.505 148.556 L
137.077 148.358 L
137.65 148.157 L
138.223 147.955 L
138.795 147.75 L
139.367 147.543 L
139.94 147.335 L
140.512 147.124 L
141.085 146.911 L
141.658 146.695 L
142.23 146.478 L
142.803 146.259 L
143.375 146.037 L
143.947 145.813 L
144.52 145.587 L
145.092 145.358 L
145.665 145.128 L
146.238 144.895 L
146.81 144.659 L
147.383 144.421 L
147.955 144.181 L
148.527 143.939 L
149.1 143.694 L
149.673 143.446 L
150.245 143.196 L
150.818 142.944 L
151.39 142.689 L
151.962 142.431 L
152.535 142.171 L
153.107 141.908 L
153.68 141.643 L
154.253 141.375 L
154.825 141.104 L
155.398 140.83 L
155.97 140.554 L
156.542 140.275 L
157.115 139.993 L
157.688 139.708 L
158.26 139.421 L
158.833 139.131 L
159.405 138.837 L
159.977 138.541 L
160.55 138.242 L
161.122 137.939 L
161.695 137.634 L
162.268 137.326 L
162.84 137.014 L
163.413 136.7 L
163.985 136.382 L
164.557 136.061 L
165.13 135.737 L
165.702 135.409 L
166.275 135.078 L
166.848 134.744 L
167.42 134.407 L
167.992 134.066 L
168.565 133.722 L
169.137 133.374 L
169.71 133.023 L
170.283 132.668 L
170.855 132.31 L
171.428 131.948 L
172 131.583 L
172.572 131.213 L
173.145 130.841 L
173.717 130.464 L
174.29 130.083 L
174.863 129.699 L
175.435 129.311 L
176.007 128.919 L
176.58 128.523 L
177.152 128.123 L
177.725 127.719 L
178.298 127.311 L
178.87 126.899 L
179.443 126.483 L
180.015 126.062 L
180.587 125.638 L
181.16 125.209 L
181.732 124.775 L
182.305 124.338 L
182.878 123.896 L
183.45 123.449 L
184.022 122.998 L
184.595 122.543 L
185.167 122.083 L
185.74 121.618 L
186.313 121.149 L
186.885 120.675 L
187.458 120.196 L
188.03 119.712 L
188.603 119.224 L
189.175 118.73 L
189.747 118.232 L
190.32 117.729 L
190.893 117.22 L
191.465 116.707 L
192.038 116.188 L
192.61 115.664 L
193.182 115.135 L
193.755 114.6 L
194.327 114.06 L
194.9 113.515 L
195.473 112.964 L
196.045 112.408 L
196.618 111.846 L
197.19 111.279 L
197.762 110.705 L
198.335 110.126 L
198.908 109.542 L
199.48 108.951 L
200.053 108.354 L
200.625 107.751 L
201.197 107.143 L
201.77 106.528 L
202.342 105.907 L
202.915 105.28 L
203.488 104.646 L
204.06 104.006 L
204.632 103.36 L
205.205 102.707 L
205.777 102.048 L
206.35 101.382 L
206.923 100.709 L
207.495 100.029 L
208.068 99.343 L
208.64 98.65 L
209.212 97.95 L
209.785 97.243 L
210.357 96.528 L
210.93 95.807 L
211.503 95.078 L
212.075 94.342 L
212.648 93.598 L
213.22 92.847 L
213.792 92.089 L
214.365 91.323 L
214.938 90.549 L
215.51 89.767 L
216.083 88.978 L
216.655 88.181 L
217.227 87.375 L
217.8 86.562 L
218.372 85.74 L
218.945 84.91 L
219.518 84.072 L
220.09 83.225 L
220.663 82.37 L
221.235 81.506 L
221.807 80.634 L
222.38 79.752 L
222.952 78.862 L
223.525 77.963 L
224.098 77.055 L
224.67 76.138 L
225.242 75.212 L
225.815 74.276 L
226.387 73.331 L
226.96 72.376 L
227.533 71.412 L
228.105 70.438 L
228.678 69.454 L
229.25 68.461 L
229.822 69.454 L
230.395 70.438 L
230.967 71.412 L
231.54 72.376 L
232.113 73.331 L
232.685 74.276 L
233.258 75.212 L
233.83 76.138 L
234.402 77.055 L
234.975 77.963 L
235.548 78.862 L
236.12 79.752 L
236.693 80.634 L
237.265 81.506 L
237.837 82.37 L
238.41 83.225 L
238.982 84.072 L
239.555 84.91 L
240.128 85.74 L
240.7 86.562 L
241.273 87.375 L
241.845 88.181 L
242.417 88.978 L
242.99 89.767 L
243.563 90.549 L
244.135 91.323 L
244.708 92.089 L
245.28 92.847 L
245.852 93.598 L
246.425 94.342 L
246.997 95.078 L
247.57 95.807 L
248.143 96.528 L
248.715 97.243 L
249.288 97.95 L
249.86 98.65 L
250.432 99.343 L
251.005 100.029 L
251.577 100.709 L
252.15 101.382 L
252.723 102.048 L
253.295 102.707 L
253.868 103.36 L
254.44 104.006 L
255.012 104.646 L
255.585 105.28 L
256.158 105.907 L
256.73 106.528 L
257.302 107.143 L
257.875 107.751 L
258.448 108.354 L
259.02 108.951 L
259.592 109.542 L
260.165 110.126 L
260.737 110.705 L
261.31 111.279 L
261.883 111.846 L
262.455 112.408 L
263.027 112.964 L
263.6 113.515 L
264.173 114.06 L
264.745 114.6 L
265.318 115.135 L
265.89 115.664 L
266.462 116.188 L
267.035 116.707 L
267.608 117.22 L
268.18 117.729 L
268.753 118.232 L
269.325 118.73 L
269.897 119.224 L
270.47 119.712 L
271.043 120.196 L
271.615 120.675 L
272.188 121.149 L
272.76 121.618 L
273.332 122.083 L
273.905 122.543 L
274.478 122.998 L
275.05 123.449 L
275.622 123.896 L
276.195 124.338 L
276.767 124.775 L
277.34 125.209 L
277.913 125.638 L
278.485 126.062 L
279.057 126.483 L
279.63 126.899 L
280.202 127.311 L
280.775 127.719 L
281.348 128.123 L
281.92 128.523 L
282.492 128.919 L
283.065 129.311 L
283.638 129.699 L
284.21 130.083 L
284.783 130.464 L
285.355 130.841 L
285.927 131.213 L
286.5 131.583 L
287.073 131.948 L
287.645 132.31 L
288.217 132.668 L
288.79 133.023 L
289.362 133.374 L
289.935 133.722 L
290.508 134.066 L
291.08 134.407 L
291.652 134.744 L
292.225 135.078 L
292.798 135.409 L
293.37 135.737 L
293.943 136.061 L
294.515 136.382 L
295.087 136.7 L
295.66 137.014 L
296.232 137.326 L
296.805 137.634 L
297.378 137.939 L
297.95 138.242 L
298.522 138.541 L
299.095 138.837 L
299.668 139.131 L
300.24 139.421 L
300.813 139.708 L
301.385 139.993 L
301.957 140.275 L
302.53 140.554 L
303.103 140.83 L
303.675 141.104 L
304.247 141.375 L
304.82 141.643 L
305.393 141.908 L
305.965 142.171 L
306.538 142.431 L
307.11 142.689 L
307.682 142.944 L
308.255 143.196 L
308.827 143.446 L
309.4 143.694 L
309.973 143.939 L
310.545 144.181 L
311.117 144.421 L
311.69 144.659 L
312.263 144.895 L
312.835 145.128 L
313.408 145.358 L
313.98 145.587 L
314.552 145.813 L
315.125 146.037 L
315.698 146.259 L
316.27 146.478 L
316.842 146.695 L
317.415 146.911 L
317.987 147.124 L
318.56 147.335 L
319.133 147.543 L
319.705 147.75 L
320.277 147.955 L
320.85 148.157 L
321.423 148.358 L
321.995 148.556 L
322.568 148.753 L
323.14 148.948 L
323.712 149.141 L
324.285 149.331 L
324.857 149.52 L
325.43 149.707 L
326.003 149.893 L
326.575 150.076 L
327.147 150.257 L
327.72 150.437 L
328.293 150.615 L
328.865 150.791 L
329.438 150.966 L
330.01 151.138 L
330.582 151.309 L
331.155 151.478 L
331.728 151.646 L
332.3 151.812 L
332.872 151.976 L
333.445 152.139 L
334.018 152.3 L
334.59 152.459 L
335.163 152.617 L
335.735 152.773 L
336.307 152.928 L
336.88 153.081 L
337.452 153.233 L
338.025 153.383 L
338.598 153.531 L
339.17 153.678 L
339.742 153.824 L
340.315 153.968 L
340.888 154.111 L
341.46 154.252 L
342.033 154.392 L
342.605 154.531 L
343.177 154.668 L
343.75 154.804 L
344.323 154.938 L
344.895 155.072 L
345.467 155.203 L
346.04 155.334 L
346.612 155.463 L
347.185 155.591 L
347.758 155.718 L
348.33 155.843 L
348.902 155.967 L
349.475 156.09 L
350.047 156.212 L
350.62 156.332 L
351.193 156.451 L
351.765 156.569 L
352.337 156.686 L
352.91 156.802 L
353.483 156.917 L
354.055 157.03 L
354.628 157.142 L
355.2 157.254 L
355.772 157.364 L
356.345 157.473 L
356.918 157.581 L
357.49 157.687 L
358.063 157.793 L
358.635 157.898 L
359.207 158.002 L
359.78 158.104 L
360.353 158.206 L
360.925 158.307 L
361.497 158.406 L
362.07 158.505 L
362.642 158.602 L
363.215 158.699 L
363.788 158.795 L
364.36 158.89 L
364.932 158.983 L
365.505 159.076 L
366.078 159.168 L
366.65 159.259 L
367.223 159.349 L
367.795 159.439 L
368.367 159.527 L
368.94 159.615 L
369.513 159.701 L
370.085 159.787 L
370.658 159.872 L
371.23 159.956 L
371.802 160.039 L
372.375 160.121 L
372.948 160.203 L
373.52 160.284 L
374.092 160.364 L
374.665 160.443 L
375.237 160.521 L
375.81 160.599 L
376.383 160.676 L
376.955 160.752 L
377.527 160.827 L
378.1 160.901 L
378.672 160.975 L
379.245 161.048 L
379.818 161.121 L
380.39 161.192 L
380.962 161.263 L
381.535 161.333 L
382.108 161.403 L
382.68 161.472 L
383.253 161.54 L
383.825 161.607 L
384.397 161.674 L
384.97 161.74 L
385.543 161.806 L
386.115 161.87 L
386.688 161.934 L
387.26 161.998 L
387.832 162.061 L
388.405 162.123 L
388.978 162.185 L
389.55 162.246 L
390.122 162.306 L
390.695 162.366 L
391.267 162.425 L
391.84 162.484 L
392.413 162.542 L
392.985 162.599 L
393.557 162.656 L
394.13 162.713 L
394.703 162.768 L
395.275 162.824 L
395.848 162.878 L
396.42 162.932 L
396.992 162.986 L
397.565 163.039 L
398.138 163.092 L
398.71 163.144 L
399.283 163.195 L
399.855 163.246 L
400.427 163.297 L
401 163.347 L
S
GR
GS
1 GC
N
393 60.5 M
393 22.5 L
332.5 22.5 L
332.5 60.5 L
cp
f
GR
GS
[1 0 0 1 369.5 30] CT
/Helvetica 9 F
GS
[1 0 0 1 0 0] CT
0 3.5 moveto 
1 -1 scale
(f\(x\)) t 
GR
GR
GS
0 0 1 RC
1 LJ
2 LW
N
336.5 30 M
366.5 30 L
S
GR
GS
[1 0 0 1 369.5 41.5] CT
/Helvetica 9 F
GS
[1 0 0 1 0 0] CT
0 3.5 moveto 
1 -1 scale
(g\(x\)) t 
GR
GR
GS
1 0 0 RC
1 LJ
2 LW
N
336.5 41.5 M
366.5 41.5 L
S
GR
GS
[1 0 0 1 369.5 53] CT
/Helvetica 9 F
GS
[1 0 0 1 0 0] CT
0 3.5 moveto 
1 -1 scale
(cg\(x\)) t 
GR
GR
GS
0 1 0 RC
1 LJ
2 LW
N
336.5 53 M
366.5 53 L
S
GR
GS
0.149 GC
10.0 ML
0.5 LW
N
332.5 60.5 M
332.5 22.5 L
393 22.5 L
393 60.5 L
cp
S
GR
%%Trailer
%%Pages: 1
%%EOF
