%!PS-Adobe-3.0 EPSF-3.0
%%Creator: (MATLAB, The Mathworks, Inc. Version 23.2.0.2409890 \(R2023b\) Update 3. Operating System: Mac OS X)
%%Title: /Users/jakub/Projects/modeling-and-identification/report-01/images/inverse-method/distribution.eps
%%CreationDate: 2023-11-02T17:32:53
%%Pages: (atend)
%%BoundingBox:     0     0   462   260
%%LanguageLevel: 3
%%EndComments
%%BeginProlog
%%BeginResource: procset (Apache XML Graphics Std ProcSet) 1.2 0
%%Version: 1.2 0
%%Copyright: (Copyright 2001-2003,2010 The Apache Software Foundation. License terms: http://www.apache.org/licenses/LICENSE-2.0)
/bd{bind def}bind def
/ld{load def}bd
/GR/grestore ld
/GS/gsave ld
/RM/rmoveto ld
/C/curveto ld
/t/show ld
/L/lineto ld
/ML/setmiterlimit ld
/CT/concat ld
/f/fill ld
/N/newpath ld
/S/stroke ld
/CC/setcmykcolor ld
/A/ashow ld
/cp/closepath ld
/RC/setrgbcolor ld
/LJ/setlinejoin ld
/GC/setgray ld
/LW/setlinewidth ld
/M/moveto ld
/re {4 2 roll M
1 index 0 rlineto
0 exch rlineto
neg 0 rlineto
cp } bd
/_ctm matrix def
/_tm matrix def
/BT { _ctm currentmatrix pop matrix _tm copy pop 0 0 moveto } bd
/ET { _ctm setmatrix } bd
/iTm { _ctm setmatrix _tm concat } bd
/Tm { _tm astore pop iTm 0 0 moveto } bd
/ux 0.0 def
/uy 0.0 def
/F {
  /Tp exch def
  /Tf exch def
  Tf findfont Tp scalefont setfont
  /cf Tf def  /cs Tp def
} bd
/ULS {currentpoint /uy exch def /ux exch def} bd
/ULE {
  /Tcx currentpoint pop def
  gsave
  newpath
  cf findfont cs scalefont dup
  /FontMatrix get 0 get /Ts exch def /FontInfo get dup
  /UnderlinePosition get Ts mul /To exch def
  /UnderlineThickness get Ts mul /Tt exch def
  ux uy To add moveto  Tcx uy To add lineto
  Tt setlinewidth stroke
  grestore
} bd
/OLE {
  /Tcx currentpoint pop def
  gsave
  newpath
  cf findfont cs scalefont dup
  /FontMatrix get 0 get /Ts exch def /FontInfo get dup
  /UnderlinePosition get Ts mul /To exch def
  /UnderlineThickness get Ts mul /Tt exch def
  ux uy To add cs add moveto Tcx uy To add cs add lineto
  Tt setlinewidth stroke
  grestore
} bd
/SOE {
  /Tcx currentpoint pop def
  gsave
  newpath
  cf findfont cs scalefont dup
  /FontMatrix get 0 get /Ts exch def /FontInfo get dup
  /UnderlinePosition get Ts mul /To exch def
  /UnderlineThickness get Ts mul /Tt exch def
  ux uy To add cs 10 mul 26 idiv add moveto Tcx uy To add cs 10 mul 26 idiv add lineto
  Tt setlinewidth stroke
  grestore
} bd
/QT {
/Y22 exch store
/X22 exch store
/Y21 exch store
/X21 exch store
currentpoint
/Y21 load 2 mul add 3 div exch
/X21 load 2 mul add 3 div exch
/X21 load 2 mul /X22 load add 3 div
/Y21 load 2 mul /Y22 load add 3 div
/X22 load /Y22 load curveto
} bd
/SSPD {
dup length /d exch dict def
{
/v exch def
/k exch def
currentpagedevice k known {
/cpdv currentpagedevice k get def
v cpdv ne {
/upd false def
/nullv v type /nulltype eq def
/nullcpdv cpdv type /nulltype eq def
nullv nullcpdv or
{
/upd true def
} {
/sametype v type cpdv type eq def
sametype {
v type /arraytype eq {
/vlen v length def
/cpdvlen cpdv length def
vlen cpdvlen eq {
0 1 vlen 1 sub {
/i exch def
/obj v i get def
/cpdobj cpdv i get def
obj cpdobj ne {
/upd true def
exit
} if
} for
} {
/upd true def
} ifelse
} {
v type /dicttype eq {
v {
/dv exch def
/dk exch def
/cpddv cpdv dk get def
dv cpddv ne {
/upd true def
exit
} if
} forall
} {
/upd true def
} ifelse
} ifelse
} if
} ifelse
upd true eq {
d k v put
} if
} if
} if
} forall
d length 0 gt {
d setpagedevice
} if
} bd
/RE { % /NewFontName [NewEncodingArray] /FontName RE -
  findfont dup length dict begin
  {
    1 index /FID ne
    {def} {pop pop} ifelse
  } forall
  /Encoding exch def
  /FontName 1 index def
  currentdict definefont pop
  end
} bind def
%%EndResource
%%BeginResource: procset (Apache XML Graphics EPS ProcSet) 1.0 0
%%Version: 1.0 0
%%Copyright: (Copyright 2002-2003 The Apache Software Foundation. License terms: http://www.apache.org/licenses/LICENSE-2.0)
/BeginEPSF { %def
/b4_Inc_state save def         % Save state for cleanup
/dict_count countdictstack def % Count objects on dict stack
/op_count count 1 sub def      % Count objects on operand stack
userdict begin                 % Push userdict on dict stack
/showpage { } def              % Redefine showpage, { } = null proc
0 setgray 0 setlinecap         % Prepare graphics state
1 setlinewidth 0 setlinejoin
10 setmiterlimit [ ] 0 setdash newpath
/languagelevel where           % If level not equal to 1 then
{pop languagelevel             % set strokeadjust and
1 ne                           % overprint to their defaults.
{false setstrokeadjust false setoverprint
} if
} if
} bd
/EndEPSF { %def
count op_count sub {pop} repeat            % Clean up stacks
countdictstack dict_count sub {end} repeat
b4_Inc_state restore
} bd
%%EndResource
%FOPBeginFontDict
%%IncludeResource: font Courier-Oblique
%%IncludeResource: font Courier-BoldOblique
%%IncludeResource: font Courier-Bold
%%IncludeResource: font ZapfDingbats
%%IncludeResource: font Symbol
%%IncludeResource: font Helvetica
%%IncludeResource: font Helvetica-Oblique
%%IncludeResource: font Helvetica-Bold
%%IncludeResource: font Helvetica-BoldOblique
%%IncludeResource: font Times-Roman
%%IncludeResource: font Times-Italic
%%IncludeResource: font Times-Bold
%%IncludeResource: font Times-BoldItalic
%%IncludeResource: font Courier
%FOPEndFontDict
%%BeginResource: encoding WinAnsiEncoding
/WinAnsiEncoding [
/.notdef /.notdef /.notdef /.notdef /.notdef
/.notdef /.notdef /.notdef /.notdef /.notdef
/.notdef /.notdef /.notdef /.notdef /.notdef
/.notdef /.notdef /.notdef /.notdef /.notdef
/.notdef /.notdef /.notdef /.notdef /.notdef
/.notdef /.notdef /.notdef /.notdef /.notdef
/.notdef /.notdef /space /exclam /quotedbl
/numbersign /dollar /percent /ampersand /quotesingle
/parenleft /parenright /asterisk /plus /comma
/hyphen /period /slash /zero /one
/two /three /four /five /six
/seven /eight /nine /colon /semicolon
/less /equal /greater /question /at
/A /B /C /D /E
/F /G /H /I /J
/K /L /M /N /O
/P /Q /R /S /T
/U /V /W /X /Y
/Z /bracketleft /backslash /bracketright /asciicircum
/underscore /quoteleft /a /b /c
/d /e /f /g /h
/i /j /k /l /m
/n /o /p /q /r
/s /t /u /v /w
/x /y /z /braceleft /bar
/braceright /asciitilde /bullet /Euro /bullet
/quotesinglbase /florin /quotedblbase /ellipsis /dagger
/daggerdbl /circumflex /perthousand /Scaron /guilsinglleft
/OE /bullet /Zcaron /bullet /bullet
/quoteleft /quoteright /quotedblleft /quotedblright /bullet
/endash /emdash /asciitilde /trademark /scaron
/guilsinglright /oe /bullet /zcaron /Ydieresis
/space /exclamdown /cent /sterling /currency
/yen /brokenbar /section /dieresis /copyright
/ordfeminine /guillemotleft /logicalnot /sfthyphen /registered
/macron /degree /plusminus /twosuperior /threesuperior
/acute /mu /paragraph /middot /cedilla
/onesuperior /ordmasculine /guillemotright /onequarter /onehalf
/threequarters /questiondown /Agrave /Aacute /Acircumflex
/Atilde /Adieresis /Aring /AE /Ccedilla
/Egrave /Eacute /Ecircumflex /Edieresis /Igrave
/Iacute /Icircumflex /Idieresis /Eth /Ntilde
/Ograve /Oacute /Ocircumflex /Otilde /Odieresis
/multiply /Oslash /Ugrave /Uacute /Ucircumflex
/Udieresis /Yacute /Thorn /germandbls /agrave
/aacute /acircumflex /atilde /adieresis /aring
/ae /ccedilla /egrave /eacute /ecircumflex
/edieresis /igrave /iacute /icircumflex /idieresis
/eth /ntilde /ograve /oacute /ocircumflex
/otilde /odieresis /divide /oslash /ugrave
/uacute /ucircumflex /udieresis /yacute /thorn
/ydieresis
] def
%%EndResource
%FOPBeginFontReencode
/Courier-Oblique findfont
dup length dict begin
  {1 index /FID ne {def} {pop pop} ifelse} forall
  /Encoding WinAnsiEncoding def
  currentdict
end
/Courier-Oblique exch definefont pop
/Courier-BoldOblique findfont
dup length dict begin
  {1 index /FID ne {def} {pop pop} ifelse} forall
  /Encoding WinAnsiEncoding def
  currentdict
end
/Courier-BoldOblique exch definefont pop
/Courier-Bold findfont
dup length dict begin
  {1 index /FID ne {def} {pop pop} ifelse} forall
  /Encoding WinAnsiEncoding def
  currentdict
end
/Courier-Bold exch definefont pop
/Helvetica findfont
dup length dict begin
  {1 index /FID ne {def} {pop pop} ifelse} forall
  /Encoding WinAnsiEncoding def
  currentdict
end
/Helvetica exch definefont pop
/Helvetica-Oblique findfont
dup length dict begin
  {1 index /FID ne {def} {pop pop} ifelse} forall
  /Encoding WinAnsiEncoding def
  currentdict
end
/Helvetica-Oblique exch definefont pop
/Helvetica-Bold findfont
dup length dict begin
  {1 index /FID ne {def} {pop pop} ifelse} forall
  /Encoding WinAnsiEncoding def
  currentdict
end
/Helvetica-Bold exch definefont pop
/Helvetica-BoldOblique findfont
dup length dict begin
  {1 index /FID ne {def} {pop pop} ifelse} forall
  /Encoding WinAnsiEncoding def
  currentdict
end
/Helvetica-BoldOblique exch definefont pop
/Times-Roman findfont
dup length dict begin
  {1 index /FID ne {def} {pop pop} ifelse} forall
  /Encoding WinAnsiEncoding def
  currentdict
end
/Times-Roman exch definefont pop
/Times-Italic findfont
dup length dict begin
  {1 index /FID ne {def} {pop pop} ifelse} forall
  /Encoding WinAnsiEncoding def
  currentdict
end
/Times-Italic exch definefont pop
/Times-Bold findfont
dup length dict begin
  {1 index /FID ne {def} {pop pop} ifelse} forall
  /Encoding WinAnsiEncoding def
  currentdict
end
/Times-Bold exch definefont pop
/Times-BoldItalic findfont
dup length dict begin
  {1 index /FID ne {def} {pop pop} ifelse} forall
  /Encoding WinAnsiEncoding def
  currentdict
end
/Times-BoldItalic exch definefont pop
/Courier findfont
dup length dict begin
  {1 index /FID ne {def} {pop pop} ifelse} forall
  /Encoding WinAnsiEncoding def
  currentdict
end
/Courier exch definefont pop
%FOPEndFontReencode
%%EndProlog
%%Page: 1 1
%%PageBoundingBox: 0 0 462 260
%%BeginPageSetup
[1 0 0 -1 0 260] CT
%%EndPageSetup
GS
1 GC
N
0 0 462 260 re
f
GR
GS
1 GC
N
0 0 462 260 re
f
GR
GS
1 GC
N
60 229.5 M
418 229.5 L
418 19.5 L
60 19.5 L
cp
f
GR
GS
0.873 GC
1 LJ
0.5 LW
N
60 229.5 M
60 19.5 L
S
GR
GS
0.873 GC
1 LJ
0.5 LW
N
104.75 229.5 M
104.75 19.5 L
S
GR
GS
0.873 GC
1 LJ
0.5 LW
N
149.5 229.5 M
149.5 19.5 L
S
GR
GS
0.873 GC
1 LJ
0.5 LW
N
194.25 229.5 M
194.25 19.5 L
S
GR
GS
0.873 GC
1 LJ
0.5 LW
N
239 229.5 M
239 19.5 L
S
GR
GS
0.873 GC
1 LJ
0.5 LW
N
283.75 229.5 M
283.75 19.5 L
S
GR
GS
0.873 GC
1 LJ
0.5 LW
N
328.5 229.5 M
328.5 19.5 L
S
GR
GS
0.873 GC
1 LJ
0.5 LW
N
373.25 229.5 M
373.25 19.5 L
S
GR
GS
0.873 GC
1 LJ
0.5 LW
N
418 229.5 M
418 19.5 L
S
GR
GS
0.873 GC
1 LJ
0.5 LW
N
418 229.5 M
60 229.5 L
S
GR
GS
0.873 GC
1 LJ
0.5 LW
N
418 177 M
60 177 L
S
GR
GS
0.873 GC
1 LJ
0.5 LW
N
418 124.5 M
60 124.5 L
S
GR
GS
0.873 GC
1 LJ
0.5 LW
N
418 72 M
60 72 L
S
GR
GS
0.873 GC
1 LJ
0.5 LW
N
418 19.5 M
60 19.5 L
S
GR
GS
0.149 GC
2 setlinecap
1 LJ
0.5 LW
N
60 229.5 M
418 229.5 L
S
GR
GS
0.149 GC
2 setlinecap
1 LJ
0.5 LW
N
60 19.5 M
418 19.5 L
S
GR
GS
0.149 GC
2 setlinecap
1 LJ
0.5 LW
N
60 229.5 M
60 225.92 L
S
GR
GS
0.149 GC
2 setlinecap
1 LJ
0.5 LW
N
104.75 229.5 M
104.75 225.92 L
S
GR
GS
0.149 GC
2 setlinecap
1 LJ
0.5 LW
N
149.5 229.5 M
149.5 225.92 L
S
GR
GS
0.149 GC
2 setlinecap
1 LJ
0.5 LW
N
194.25 229.5 M
194.25 225.92 L
S
GR
GS
0.149 GC
2 setlinecap
1 LJ
0.5 LW
N
239 229.5 M
239 225.92 L
S
GR
GS
0.149 GC
2 setlinecap
1 LJ
0.5 LW
N
283.75 229.5 M
283.75 225.92 L
S
GR
GS
0.149 GC
2 setlinecap
1 LJ
0.5 LW
N
328.5 229.5 M
328.5 225.92 L
S
GR
GS
0.149 GC
2 setlinecap
1 LJ
0.5 LW
N
373.25 229.5 M
373.25 225.92 L
S
GR
GS
0.149 GC
2 setlinecap
1 LJ
0.5 LW
N
418 229.5 M
418 225.92 L
S
GR
GS
0.149 GC
2 setlinecap
1 LJ
0.5 LW
N
60 19.5 M
60 23.08 L
S
GR
GS
0.149 GC
2 setlinecap
1 LJ
0.5 LW
N
104.75 19.5 M
104.75 23.08 L
S
GR
GS
0.149 GC
2 setlinecap
1 LJ
0.5 LW
N
149.5 19.5 M
149.5 23.08 L
S
GR
GS
0.149 GC
2 setlinecap
1 LJ
0.5 LW
N
194.25 19.5 M
194.25 23.08 L
S
GR
GS
0.149 GC
2 setlinecap
1 LJ
0.5 LW
N
239 19.5 M
239 23.08 L
S
GR
GS
0.149 GC
2 setlinecap
1 LJ
0.5 LW
N
283.75 19.5 M
283.75 23.08 L
S
GR
GS
0.149 GC
2 setlinecap
1 LJ
0.5 LW
N
328.5 19.5 M
328.5 23.08 L
S
GR
GS
0.149 GC
2 setlinecap
1 LJ
0.5 LW
N
373.25 19.5 M
373.25 23.08 L
S
GR
GS
0.149 GC
2 setlinecap
1 LJ
0.5 LW
N
418 19.5 M
418 23.08 L
S
GR
GS
[1 0 0 1 60 233.5] CT
0.149 GC
/Helvetica 10 F
GS
[1 0 0 1 0 0] CT
-5 10 moveto 
1 -1 scale
(-2) t 
GR
GR
GS
[1 0 0 1 104.75 233.5] CT
0.149 GC
/Helvetica 10 F
GS
[1 0 0 1 0 0] CT
-9 10 moveto 
1 -1 scale
(-1.5) t 
GR
GR
GS
[1 0 0 1 149.5 233.5] CT
0.149 GC
/Helvetica 10 F
GS
[1 0 0 1 0 0] CT
-5 10 moveto 
1 -1 scale
(-1) t 
GR
GR
GS
[1 0 0 1 194.25 233.5] CT
0.149 GC
/Helvetica 10 F
GS
[1 0 0 1 0 0] CT
-9 10 moveto 
1 -1 scale
(-0.5) t 
GR
GR
GS
[1 0 0 1 239 233.5] CT
0.149 GC
/Helvetica 10 F
GS
[1 0 0 1 0 0] CT
-3 10 moveto 
1 -1 scale
(0) t 
GR
GR
GS
[1 0 0 1 283.75 233.5] CT
0.149 GC
/Helvetica 10 F
GS
[1 0 0 1 0 0] CT
-7 10 moveto 
1 -1 scale
(0.5) t 
GR
GR
GS
[1 0 0 1 328.5 233.5] CT
0.149 GC
/Helvetica 10 F
GS
[1 0 0 1 0 0] CT
-3 10 moveto 
1 -1 scale
(1) t 
GR
GR
GS
[1 0 0 1 373.25 233.5] CT
0.149 GC
/Helvetica 10 F
GS
[1 0 0 1 0 0] CT
-7 10 moveto 
1 -1 scale
(1.5) t 
GR
GR
GS
[1 0 0 1 418 233.5] CT
0.149 GC
/Helvetica 10 F
GS
[1 0 0 1 0 0] CT
-3 10 moveto 
1 -1 scale
(2) t 
GR
GR
GS
[1 0 0 1 239.00017 247] CT
0.149 GC
/Helvetica 11 F
GS
[1 0 0 1 0 0] CT
-3 11 moveto 
1 -1 scale
(x) t 
GR
GR
GS
0.149 GC
2 setlinecap
1 LJ
0.5 LW
N
60 229.5 M
60 19.5 L
S
GR
GS
0.149 GC
2 setlinecap
1 LJ
0.5 LW
N
418 229.5 M
418 19.5 L
S
GR
GS
0.149 GC
2 setlinecap
1 LJ
0.5 LW
N
60 229.5 M
63.58 229.5 L
S
GR
GS
0.149 GC
2 setlinecap
1 LJ
0.5 LW
N
60 177 M
63.58 177 L
S
GR
GS
0.149 GC
2 setlinecap
1 LJ
0.5 LW
N
60 124.5 M
63.58 124.5 L
S
GR
GS
0.149 GC
2 setlinecap
1 LJ
0.5 LW
N
60 72 M
63.58 72 L
S
GR
GS
0.149 GC
2 setlinecap
1 LJ
0.5 LW
N
60 19.5 M
63.58 19.5 L
S
GR
GS
0.149 GC
2 setlinecap
1 LJ
0.5 LW
N
418 229.5 M
414.42 229.5 L
S
GR
GS
0.149 GC
2 setlinecap
1 LJ
0.5 LW
N
418 177 M
414.42 177 L
S
GR
GS
0.149 GC
2 setlinecap
1 LJ
0.5 LW
N
418 124.5 M
414.42 124.5 L
S
GR
GS
0.149 GC
2 setlinecap
1 LJ
0.5 LW
N
418 72 M
414.42 72 L
S
GR
GS
0.149 GC
2 setlinecap
1 LJ
0.5 LW
N
418 19.5 M
414.42 19.5 L
S
GR
GS
[1 0 0 1 56 229.5] CT
0.149 GC
/Helvetica 10 F
GS
[1 0 0 1 0 0] CT
-18 3.5 moveto 
1 -1 scale
(-0.5) t 
GR
GR
GS
[1 0 0 1 56 177] CT
0.149 GC
/Helvetica 10 F
GS
[1 0 0 1 0 0] CT
-6 3.5 moveto 
1 -1 scale
(0) t 
GR
GR
GS
[1 0 0 1 56 124.5] CT
0.149 GC
/Helvetica 10 F
GS
[1 0 0 1 0 0] CT
-14 3.5 moveto 
1 -1 scale
(0.5) t 
GR
GR
GS
[1 0 0 1 56 72] CT
0.149 GC
/Helvetica 10 F
GS
[1 0 0 1 0 0] CT
-6 3.5 moveto 
1 -1 scale
(1) t 
GR
GR
GS
[1 0 0 1 56 19.5] CT
0.149 GC
/Helvetica 10 F
GS
[1 0 0 1 0 0] CT
-14 3.5 moveto 
1 -1 scale
(1.5) t 
GR
GR
GS
[0 -1 1 0 35.00001 124.4999] CT
0.149 GC
/Helvetica 11 F
GS
[1 0 0 1 0 0] CT
-7.5 -3 moveto 
1 -1 scale
(f\(x\)) t 
GR
GR
GS
[1 0 0 1 239.00023 18.125] CT
/Helvetica-Bold 11 F
GS
[1 0 0 1 0 0] CT
-67 -3 moveto 
1 -1 scale
(Distribution function - f\(x\)) t 
GR
GR
GS
0 0.447 0.741 RC
1 LJ
2 LW
N
60 177 M
60.895 177 L
61.79 177 L
62.685 177 L
63.58 177 L
64.475 177 L
65.37 177 L
66.265 177 L
67.16 177 L
68.055 177 L
68.95 177 L
69.845 177 L
70.74 177 L
71.635 177 L
72.53 177 L
73.425 177 L
74.32 177 L
75.215 177 L
76.11 177 L
77.005 177 L
77.9 177 L
78.795 177 L
79.69 177 L
80.585 177 L
81.48 177 L
82.375 177 L
83.27 177 L
84.165 177 L
85.06 177 L
85.955 177 L
86.85 177 L
87.745 177 L
88.64 177 L
89.535 177 L
90.43 177 L
91.325 177 L
92.22 177 L
93.115 177 L
94.01 177 L
94.905 177 L
95.8 177 L
96.695 177 L
97.59 177 L
98.485 177 L
99.38 177 L
100.275 177 L
101.17 177 L
102.065 177 L
102.96 177 L
103.855 177 L
104.75 177 L
105.645 177 L
106.54 177 L
107.435 177 L
108.33 177 L
109.225 177 L
110.12 177 L
111.015 177 L
111.91 177 L
112.805 177 L
113.7 177 L
114.595 177 L
115.49 177 L
116.385 177 L
117.28 177 L
118.175 177 L
119.07 177 L
119.965 177 L
120.86 177 L
121.755 177 L
122.65 177 L
123.545 177 L
124.44 177 L
125.335 177 L
126.23 177 L
127.125 177 L
128.02 177 L
128.915 177 L
129.81 177 L
130.705 177 L
131.6 177 L
132.495 177 L
133.39 177 L
134.285 177 L
135.18 177 L
136.075 177 L
136.97 177 L
137.865 177 L
138.76 177 L
139.655 177 L
140.55 177 L
141.445 177 L
142.34 177 L
143.235 177 L
144.13 177 L
145.025 177 L
145.92 177 L
146.815 177 L
147.71 177 L
148.605 177 L
149.5 72 L
150.395 73.05 L
151.29 74.1 L
152.185 75.15 L
153.08 76.2 L
153.975 77.25 L
154.87 78.3 L
155.765 79.35 L
156.66 80.4 L
157.555 81.45 L
158.45 82.5 L
159.345 83.55 L
160.24 84.6 L
161.135 85.65 L
162.03 86.7 L
162.925 87.75 L
163.82 88.8 L
164.715 89.85 L
165.61 90.9 L
166.505 91.95 L
167.4 93 L
168.295 94.05 L
169.19 95.1 L
170.085 96.15 L
170.98 97.2 L
171.875 98.25 L
172.77 99.3 L
173.665 100.35 L
174.56 101.4 L
175.455 102.45 L
176.35 103.5 L
177.245 104.55 L
178.14 105.6 L
179.035 106.65 L
179.93 107.7 L
180.825 108.75 L
181.72 109.8 L
182.615 110.85 L
183.51 111.9 L
184.405 112.95 L
185.3 114 L
186.195 115.05 L
187.09 116.1 L
187.985 117.15 L
188.88 118.2 L
189.775 119.25 L
190.67 120.3 L
191.565 121.35 L
192.46 122.4 L
193.355 123.45 L
194.25 124.5 L
195.145 125.55 L
196.04 126.6 L
196.935 127.65 L
197.83 128.7 L
198.725 129.75 L
199.62 130.8 L
200.515 131.85 L
201.41 132.9 L
202.305 133.95 L
203.2 135 L
204.095 136.05 L
204.99 137.1 L
205.885 138.15 L
206.78 139.2 L
207.675 140.25 L
208.57 141.3 L
209.465 142.35 L
210.36 143.4 L
211.255 144.45 L
212.15 145.5 L
213.045 146.55 L
213.94 147.6 L
214.835 148.65 L
215.73 149.7 L
216.625 150.75 L
217.52 151.8 L
218.415 152.85 L
219.31 153.9 L
220.205 154.95 L
221.1 156 L
221.995 157.05 L
222.89 158.1 L
223.785 159.15 L
224.68 160.2 L
225.575 161.25 L
226.47 162.3 L
227.365 163.35 L
228.26 164.4 L
229.155 165.45 L
230.05 166.5 L
230.945 167.55 L
231.84 168.6 L
232.735 169.65 L
233.63 170.7 L
234.525 171.75 L
235.42 172.8 L
236.315 173.85 L
237.21 174.9 L
238.105 175.95 L
239 177 L
239.895 175.95 L
240.79 174.9 L
241.685 173.85 L
242.58 172.8 L
243.475 171.75 L
244.37 170.7 L
245.265 169.65 L
246.16 168.6 L
247.055 167.55 L
247.95 166.5 L
248.845 165.45 L
249.74 164.4 L
250.635 163.35 L
251.53 162.3 L
252.425 161.25 L
253.32 160.2 L
254.215 159.15 L
255.11 158.1 L
256.005 157.05 L
256.9 156 L
257.795 154.95 L
258.69 153.9 L
259.585 152.85 L
260.48 151.8 L
261.375 150.75 L
262.27 149.7 L
263.165 148.65 L
264.06 147.6 L
264.955 146.55 L
265.85 145.5 L
266.745 144.45 L
267.64 143.4 L
268.535 142.35 L
269.43 141.3 L
270.325 140.25 L
271.22 139.2 L
272.115 138.15 L
273.01 137.1 L
273.905 136.05 L
274.8 135 L
275.695 133.95 L
276.59 132.9 L
277.485 131.85 L
278.38 130.8 L
279.275 129.75 L
280.17 128.7 L
281.065 127.65 L
281.96 126.6 L
282.855 125.55 L
283.75 124.5 L
284.645 123.45 L
285.54 122.4 L
286.435 121.35 L
287.33 120.3 L
288.225 119.25 L
289.12 118.2 L
290.015 117.15 L
290.91 116.1 L
291.805 115.05 L
292.7 114 L
293.595 112.95 L
294.49 111.9 L
295.385 110.85 L
296.28 109.8 L
297.175 108.75 L
298.07 107.7 L
298.965 106.65 L
299.86 105.6 L
300.755 104.55 L
301.65 103.5 L
302.545 102.45 L
303.44 101.4 L
304.335 100.35 L
305.23 99.3 L
306.125 98.25 L
307.02 97.2 L
307.915 96.15 L
308.81 95.1 L
309.705 94.05 L
310.6 93 L
311.495 91.95 L
312.39 90.9 L
313.285 89.85 L
314.18 88.8 L
315.075 87.75 L
315.97 86.7 L
316.865 85.65 L
317.76 84.6 L
318.655 83.55 L
319.55 82.5 L
320.445 81.45 L
321.34 80.4 L
322.235 79.35 L
323.13 78.3 L
324.025 77.25 L
324.92 76.2 L
325.815 75.15 L
326.71 74.1 L
327.605 73.05 L
328.5 72 L
329.395 177 L
330.29 177 L
331.185 177 L
332.08 177 L
332.975 177 L
333.87 177 L
334.765 177 L
335.66 177 L
336.555 177 L
337.45 177 L
338.345 177 L
339.24 177 L
340.135 177 L
341.03 177 L
341.925 177 L
342.82 177 L
343.715 177 L
344.61 177 L
345.505 177 L
346.4 177 L
347.295 177 L
348.19 177 L
349.085 177 L
349.98 177 L
350.875 177 L
351.77 177 L
352.665 177 L
353.56 177 L
354.455 177 L
355.35 177 L
356.245 177 L
357.14 177 L
358.035 177 L
358.93 177 L
359.825 177 L
360.72 177 L
361.615 177 L
362.51 177 L
363.405 177 L
364.3 177 L
365.195 177 L
366.09 177 L
366.985 177 L
367.88 177 L
368.775 177 L
369.67 177 L
370.565 177 L
371.46 177 L
372.355 177 L
373.25 177 L
374.145 177 L
375.04 177 L
375.935 177 L
376.83 177 L
377.725 177 L
378.62 177 L
379.515 177 L
380.41 177 L
381.305 177 L
382.2 177 L
383.095 177 L
383.99 177 L
384.885 177 L
385.78 177 L
386.675 177 L
387.57 177 L
388.465 177 L
389.36 177 L
390.255 177 L
391.15 177 L
392.045 177 L
392.94 177 L
393.835 177 L
394.73 177 L
395.625 177 L
396.52 177 L
397.415 177 L
398.31 177 L
399.205 177 L
400.1 177 L
400.995 177 L
401.89 177 L
402.785 177 L
403.68 177 L
404.575 177 L
405.47 177 L
406.365 177 L
407.26 177 L
408.155 177 L
409.05 177 L
409.945 177 L
410.84 177 L
411.735 177 L
412.63 177 L
413.525 177 L
414.42 177 L
415.315 177 L
416.21 177 L
417.105 177 L
418 177 L
S
GR
%%Trailer
%%Pages: 1
%%EOF
