%!PS-Adobe-3.0 EPSF-3.0
%%Creator: (MATLAB, The Mathworks, Inc. Version 23.2.0.2485118 \(R2023b\) Update 6. Operating System: Mac OS X)
%%Title: /Users/jakub/Projects/modeling-and-identification/report-04/images/bootstrap.eps
%%CreationDate: 2024-01-21T15:25:49
%%Pages: (atend)
%%BoundingBox:     0     0   418   175
%%LanguageLevel: 3
%%EndComments
%%BeginProlog
%%BeginResource: procset (Apache XML Graphics Std ProcSet) 1.2 0
%%Version: 1.2 0
%%Copyright: (Copyright 2001-2003,2010 The Apache Software Foundation. License terms: http://www.apache.org/licenses/LICENSE-2.0)
/bd{bind def}bind def
/ld{load def}bd
/GR/grestore ld
/GS/gsave ld
/RM/rmoveto ld
/C/curveto ld
/t/show ld
/L/lineto ld
/ML/setmiterlimit ld
/CT/concat ld
/f/fill ld
/N/newpath ld
/S/stroke ld
/CC/setcmykcolor ld
/A/ashow ld
/cp/closepath ld
/RC/setrgbcolor ld
/LJ/setlinejoin ld
/GC/setgray ld
/LW/setlinewidth ld
/M/moveto ld
/re {4 2 roll M
1 index 0 rlineto
0 exch rlineto
neg 0 rlineto
cp } bd
/_ctm matrix def
/_tm matrix def
/BT { _ctm currentmatrix pop matrix _tm copy pop 0 0 moveto } bd
/ET { _ctm setmatrix } bd
/iTm { _ctm setmatrix _tm concat } bd
/Tm { _tm astore pop iTm 0 0 moveto } bd
/ux 0.0 def
/uy 0.0 def
/F {
  /Tp exch def
  /Tf exch def
  Tf findfont Tp scalefont setfont
  /cf Tf def  /cs Tp def
} bd
/ULS {currentpoint /uy exch def /ux exch def} bd
/ULE {
  /Tcx currentpoint pop def
  gsave
  newpath
  cf findfont cs scalefont dup
  /FontMatrix get 0 get /Ts exch def /FontInfo get dup
  /UnderlinePosition get Ts mul /To exch def
  /UnderlineThickness get Ts mul /Tt exch def
  ux uy To add moveto  Tcx uy To add lineto
  Tt setlinewidth stroke
  grestore
} bd
/OLE {
  /Tcx currentpoint pop def
  gsave
  newpath
  cf findfont cs scalefont dup
  /FontMatrix get 0 get /Ts exch def /FontInfo get dup
  /UnderlinePosition get Ts mul /To exch def
  /UnderlineThickness get Ts mul /Tt exch def
  ux uy To add cs add moveto Tcx uy To add cs add lineto
  Tt setlinewidth stroke
  grestore
} bd
/SOE {
  /Tcx currentpoint pop def
  gsave
  newpath
  cf findfont cs scalefont dup
  /FontMatrix get 0 get /Ts exch def /FontInfo get dup
  /UnderlinePosition get Ts mul /To exch def
  /UnderlineThickness get Ts mul /Tt exch def
  ux uy To add cs 10 mul 26 idiv add moveto Tcx uy To add cs 10 mul 26 idiv add lineto
  Tt setlinewidth stroke
  grestore
} bd
/QT {
/Y22 exch store
/X22 exch store
/Y21 exch store
/X21 exch store
currentpoint
/Y21 load 2 mul add 3 div exch
/X21 load 2 mul add 3 div exch
/X21 load 2 mul /X22 load add 3 div
/Y21 load 2 mul /Y22 load add 3 div
/X22 load /Y22 load curveto
} bd
/SSPD {
dup length /d exch dict def
{
/v exch def
/k exch def
currentpagedevice k known {
/cpdv currentpagedevice k get def
v cpdv ne {
/upd false def
/nullv v type /nulltype eq def
/nullcpdv cpdv type /nulltype eq def
nullv nullcpdv or
{
/upd true def
} {
/sametype v type cpdv type eq def
sametype {
v type /arraytype eq {
/vlen v length def
/cpdvlen cpdv length def
vlen cpdvlen eq {
0 1 vlen 1 sub {
/i exch def
/obj v i get def
/cpdobj cpdv i get def
obj cpdobj ne {
/upd true def
exit
} if
} for
} {
/upd true def
} ifelse
} {
v type /dicttype eq {
v {
/dv exch def
/dk exch def
/cpddv cpdv dk get def
dv cpddv ne {
/upd true def
exit
} if
} forall
} {
/upd true def
} ifelse
} ifelse
} if
} ifelse
upd true eq {
d k v put
} if
} if
} if
} forall
d length 0 gt {
d setpagedevice
} if
} bd
/RE { % /NewFontName [NewEncodingArray] /FontName RE -
  findfont dup length dict begin
  {
    1 index /FID ne
    {def} {pop pop} ifelse
  } forall
  /Encoding exch def
  /FontName 1 index def
  currentdict definefont pop
  end
} bind def
%%EndResource
%%BeginResource: procset (Apache XML Graphics EPS ProcSet) 1.0 0
%%Version: 1.0 0
%%Copyright: (Copyright 2002-2003 The Apache Software Foundation. License terms: http://www.apache.org/licenses/LICENSE-2.0)
/BeginEPSF { %def
/b4_Inc_state save def         % Save state for cleanup
/dict_count countdictstack def % Count objects on dict stack
/op_count count 1 sub def      % Count objects on operand stack
userdict begin                 % Push userdict on dict stack
/showpage { } def              % Redefine showpage, { } = null proc
0 setgray 0 setlinecap         % Prepare graphics state
1 setlinewidth 0 setlinejoin
10 setmiterlimit [ ] 0 setdash newpath
/languagelevel where           % If level not equal to 1 then
{pop languagelevel             % set strokeadjust and
1 ne                           % overprint to their defaults.
{false setstrokeadjust false setoverprint
} if
} if
} bd
/EndEPSF { %def
count op_count sub {pop} repeat            % Clean up stacks
countdictstack dict_count sub {end} repeat
b4_Inc_state restore
} bd
%%EndResource
%FOPBeginFontDict
%%IncludeResource: font Courier-Oblique
%%IncludeResource: font Courier-BoldOblique
%%IncludeResource: font Courier-Bold
%%IncludeResource: font ZapfDingbats
%%IncludeResource: font Symbol
%%IncludeResource: font Helvetica
%%IncludeResource: font Helvetica-Oblique
%%IncludeResource: font Helvetica-Bold
%%IncludeResource: font Helvetica-BoldOblique
%%IncludeResource: font Times-Roman
%%IncludeResource: font Times-Italic
%%IncludeResource: font Times-Bold
%%IncludeResource: font Times-BoldItalic
%%IncludeResource: font Courier
%FOPEndFontDict
%%BeginResource: encoding WinAnsiEncoding
/WinAnsiEncoding [
/.notdef /.notdef /.notdef /.notdef /.notdef
/.notdef /.notdef /.notdef /.notdef /.notdef
/.notdef /.notdef /.notdef /.notdef /.notdef
/.notdef /.notdef /.notdef /.notdef /.notdef
/.notdef /.notdef /.notdef /.notdef /.notdef
/.notdef /.notdef /.notdef /.notdef /.notdef
/.notdef /.notdef /space /exclam /quotedbl
/numbersign /dollar /percent /ampersand /quotesingle
/parenleft /parenright /asterisk /plus /comma
/hyphen /period /slash /zero /one
/two /three /four /five /six
/seven /eight /nine /colon /semicolon
/less /equal /greater /question /at
/A /B /C /D /E
/F /G /H /I /J
/K /L /M /N /O
/P /Q /R /S /T
/U /V /W /X /Y
/Z /bracketleft /backslash /bracketright /asciicircum
/underscore /quoteleft /a /b /c
/d /e /f /g /h
/i /j /k /l /m
/n /o /p /q /r
/s /t /u /v /w
/x /y /z /braceleft /bar
/braceright /asciitilde /bullet /Euro /bullet
/quotesinglbase /florin /quotedblbase /ellipsis /dagger
/daggerdbl /circumflex /perthousand /Scaron /guilsinglleft
/OE /bullet /Zcaron /bullet /bullet
/quoteleft /quoteright /quotedblleft /quotedblright /bullet
/endash /emdash /asciitilde /trademark /scaron
/guilsinglright /oe /bullet /zcaron /Ydieresis
/space /exclamdown /cent /sterling /currency
/yen /brokenbar /section /dieresis /copyright
/ordfeminine /guillemotleft /logicalnot /sfthyphen /registered
/macron /degree /plusminus /twosuperior /threesuperior
/acute /mu /paragraph /middot /cedilla
/onesuperior /ordmasculine /guillemotright /onequarter /onehalf
/threequarters /questiondown /Agrave /Aacute /Acircumflex
/Atilde /Adieresis /Aring /AE /Ccedilla
/Egrave /Eacute /Ecircumflex /Edieresis /Igrave
/Iacute /Icircumflex /Idieresis /Eth /Ntilde
/Ograve /Oacute /Ocircumflex /Otilde /Odieresis
/multiply /Oslash /Ugrave /Uacute /Ucircumflex
/Udieresis /Yacute /Thorn /germandbls /agrave
/aacute /acircumflex /atilde /adieresis /aring
/ae /ccedilla /egrave /eacute /ecircumflex
/edieresis /igrave /iacute /icircumflex /idieresis
/eth /ntilde /ograve /oacute /ocircumflex
/otilde /odieresis /divide /oslash /ugrave
/uacute /ucircumflex /udieresis /yacute /thorn
/ydieresis
] def
%%EndResource
%FOPBeginFontReencode
/Courier-Oblique findfont
dup length dict begin
  {1 index /FID ne {def} {pop pop} ifelse} forall
  /Encoding WinAnsiEncoding def
  currentdict
end
/Courier-Oblique exch definefont pop
/Courier-BoldOblique findfont
dup length dict begin
  {1 index /FID ne {def} {pop pop} ifelse} forall
  /Encoding WinAnsiEncoding def
  currentdict
end
/Courier-BoldOblique exch definefont pop
/Courier-Bold findfont
dup length dict begin
  {1 index /FID ne {def} {pop pop} ifelse} forall
  /Encoding WinAnsiEncoding def
  currentdict
end
/Courier-Bold exch definefont pop
/Helvetica findfont
dup length dict begin
  {1 index /FID ne {def} {pop pop} ifelse} forall
  /Encoding WinAnsiEncoding def
  currentdict
end
/Helvetica exch definefont pop
/Helvetica-Oblique findfont
dup length dict begin
  {1 index /FID ne {def} {pop pop} ifelse} forall
  /Encoding WinAnsiEncoding def
  currentdict
end
/Helvetica-Oblique exch definefont pop
/Helvetica-Bold findfont
dup length dict begin
  {1 index /FID ne {def} {pop pop} ifelse} forall
  /Encoding WinAnsiEncoding def
  currentdict
end
/Helvetica-Bold exch definefont pop
/Helvetica-BoldOblique findfont
dup length dict begin
  {1 index /FID ne {def} {pop pop} ifelse} forall
  /Encoding WinAnsiEncoding def
  currentdict
end
/Helvetica-BoldOblique exch definefont pop
/Times-Roman findfont
dup length dict begin
  {1 index /FID ne {def} {pop pop} ifelse} forall
  /Encoding WinAnsiEncoding def
  currentdict
end
/Times-Roman exch definefont pop
/Times-Italic findfont
dup length dict begin
  {1 index /FID ne {def} {pop pop} ifelse} forall
  /Encoding WinAnsiEncoding def
  currentdict
end
/Times-Italic exch definefont pop
/Times-Bold findfont
dup length dict begin
  {1 index /FID ne {def} {pop pop} ifelse} forall
  /Encoding WinAnsiEncoding def
  currentdict
end
/Times-Bold exch definefont pop
/Times-BoldItalic findfont
dup length dict begin
  {1 index /FID ne {def} {pop pop} ifelse} forall
  /Encoding WinAnsiEncoding def
  currentdict
end
/Times-BoldItalic exch definefont pop
/Courier findfont
dup length dict begin
  {1 index /FID ne {def} {pop pop} ifelse} forall
  /Encoding WinAnsiEncoding def
  currentdict
end
/Courier exch definefont pop
%FOPEndFontReencode
%%EndProlog
%%Page: 1 1
%%PageBoundingBox: 0 0 418 175
%%BeginPageSetup
[1 0 0 -1 0 175] CT
%%EndPageSetup
GS
1 GC
N
0 0 418 175 re
f
GR
GS
1 GC
N
0 0 418 175 re
f
GR
GS
1 GC
N
54.5 144.5 M
378.5 144.5 L
378.5 13 L
54.5 13 L
cp
f
GR
GS
0.873 GC
1 LJ
0.5 LW
N
54.5 144.5 M
54.5 13 L
S
GR
GS
0.873 GC
1 LJ
0.5 LW
N
108.5 144.5 M
108.5 13 L
S
GR
GS
0.873 GC
1 LJ
0.5 LW
N
162.5 144.5 M
162.5 13 L
S
GR
GS
0.873 GC
1 LJ
0.5 LW
N
216.5 144.5 M
216.5 13 L
S
GR
GS
0.873 GC
1 LJ
0.5 LW
N
270.5 144.5 M
270.5 13 L
S
GR
GS
0.873 GC
1 LJ
0.5 LW
N
324.5 144.5 M
324.5 13 L
S
GR
GS
0.873 GC
1 LJ
0.5 LW
N
378.5 144.5 M
378.5 13 L
S
GR
GS
0.873 GC
1 LJ
0.5 LW
N
378.5 144.5 M
54.5 144.5 L
S
GR
GS
0.873 GC
1 LJ
0.5 LW
N
378.5 118.2 M
54.5 118.2 L
S
GR
GS
0.873 GC
1 LJ
0.5 LW
N
378.5 91.9 M
54.5 91.9 L
S
GR
GS
0.873 GC
1 LJ
0.5 LW
N
378.5 65.6 M
54.5 65.6 L
S
GR
GS
0.873 GC
1 LJ
0.5 LW
N
378.5 39.3 M
54.5 39.3 L
S
GR
GS
0.873 GC
1 LJ
0.5 LW
N
378.5 13 M
54.5 13 L
S
GR
GS
0.149 GC
2 setlinecap
1 LJ
0.5 LW
N
54.5 144.5 M
378.5 144.5 L
S
GR
GS
0.149 GC
2 setlinecap
1 LJ
0.5 LW
N
54.5 144.5 M
54.5 141.26 L
S
GR
GS
0.149 GC
2 setlinecap
1 LJ
0.5 LW
N
108.5 144.5 M
108.5 141.26 L
S
GR
GS
0.149 GC
2 setlinecap
1 LJ
0.5 LW
N
162.5 144.5 M
162.5 141.26 L
S
GR
GS
0.149 GC
2 setlinecap
1 LJ
0.5 LW
N
216.5 144.5 M
216.5 141.26 L
S
GR
GS
0.149 GC
2 setlinecap
1 LJ
0.5 LW
N
270.5 144.5 M
270.5 141.26 L
S
GR
GS
0.149 GC
2 setlinecap
1 LJ
0.5 LW
N
324.5 144.5 M
324.5 141.26 L
S
GR
GS
0.149 GC
2 setlinecap
1 LJ
0.5 LW
N
378.5 144.5 M
378.5 141.26 L
S
GR
GS
[1 0 0 1 54.5 148.5] CT
0.149 GC
/Helvetica 10 F
GS
[1 0 0 1 0 0] CT
-3 10 moveto 
1 -1 scale
(0) t 
GR
GR
GS
[1 0 0 1 108.5 148.5] CT
0.149 GC
/Helvetica 10 F
GS
[1 0 0 1 0 0] CT
-7 10 moveto 
1 -1 scale
(0.5) t 
GR
GR
GS
[1 0 0 1 162.5 148.5] CT
0.149 GC
/Helvetica 10 F
GS
[1 0 0 1 0 0] CT
-3 10 moveto 
1 -1 scale
(1) t 
GR
GR
GS
[1 0 0 1 216.5 148.5] CT
0.149 GC
/Helvetica 10 F
GS
[1 0 0 1 0 0] CT
-7 10 moveto 
1 -1 scale
(1.5) t 
GR
GR
GS
[1 0 0 1 270.5 148.5] CT
0.149 GC
/Helvetica 10 F
GS
[1 0 0 1 0 0] CT
-3 10 moveto 
1 -1 scale
(2) t 
GR
GR
GS
[1 0 0 1 324.5 148.5] CT
0.149 GC
/Helvetica 10 F
GS
[1 0 0 1 0 0] CT
-7 10 moveto 
1 -1 scale
(2.5) t 
GR
GR
GS
[1 0 0 1 378.5 148.5] CT
0.149 GC
/Helvetica 10 F
GS
[1 0 0 1 0 0] CT
-3 10 moveto 
1 -1 scale
(3) t 
GR
GR
GS
[1 0 0 1 216.50015 162] CT
0.149 GC
/Helvetica 11 F
GS
[1 0 0 1 0 0] CT
-25 11 moveto 
1 -1 scale
(Value of T) t 
GR
GR
GS
0.149 GC
2 setlinecap
1 LJ
0.5 LW
N
54.5 144.5 M
54.5 13 L
S
GR
GS
0.149 GC
2 setlinecap
1 LJ
0.5 LW
N
54.5 144.5 M
57.74 144.5 L
S
GR
GS
0.149 GC
2 setlinecap
1 LJ
0.5 LW
N
54.5 118.2 M
57.74 118.2 L
S
GR
GS
0.149 GC
2 setlinecap
1 LJ
0.5 LW
N
54.5 91.9 M
57.74 91.9 L
S
GR
GS
0.149 GC
2 setlinecap
1 LJ
0.5 LW
N
54.5 65.6 M
57.74 65.6 L
S
GR
GS
0.149 GC
2 setlinecap
1 LJ
0.5 LW
N
54.5 39.3 M
57.74 39.3 L
S
GR
GS
0.149 GC
2 setlinecap
1 LJ
0.5 LW
N
54.5 13 M
57.74 13 L
S
GR
GS
[1 0 0 1 50.5 144.5] CT
0.149 GC
/Helvetica 10 F
GS
[1 0 0 1 0 0] CT
-6 3.5 moveto 
1 -1 scale
(0) t 
GR
GR
GS
[1 0 0 1 50.5 118.2] CT
0.149 GC
/Helvetica 10 F
GS
[1 0 0 1 0 0] CT
-14 3.5 moveto 
1 -1 scale
(0.2) t 
GR
GR
GS
[1 0 0 1 50.5 91.9] CT
0.149 GC
/Helvetica 10 F
GS
[1 0 0 1 0 0] CT
-14 3.5 moveto 
1 -1 scale
(0.4) t 
GR
GR
GS
[1 0 0 1 50.5 65.6] CT
0.149 GC
/Helvetica 10 F
GS
[1 0 0 1 0 0] CT
-14 3.5 moveto 
1 -1 scale
(0.6) t 
GR
GR
GS
[1 0 0 1 50.5 39.3] CT
0.149 GC
/Helvetica 10 F
GS
[1 0 0 1 0 0] CT
-14 3.5 moveto 
1 -1 scale
(0.8) t 
GR
GR
GS
[1 0 0 1 50.5 13] CT
0.149 GC
/Helvetica 10 F
GS
[1 0 0 1 0 0] CT
-6 3.5 moveto 
1 -1 scale
(1) t 
GR
GR
GS
[0 -1 1 0 33.5 78.74994] CT
0.149 GC
/Helvetica 11 F
GS
[1 0 0 1 0 0] CT
-48 -3 moveto 
1 -1 scale
(Value of Probability) t 
GR
GR
GS
0 0.447 0.741 RC
1 LJ
1.5 LW
N
54.5 144.5 M
57.773 144.131 L
61.045 143.458 L
64.318 142.61 L
67.591 141.601 L
70.864 140.466 L
74.136 139.178 L
77.409 137.799 L
80.682 136.329 L
83.955 134.747 L
87.227 133.066 L
90.5 131.319 L
93.773 129.485 L
97.045 127.582 L
100.318 125.608 L
103.591 123.554 L
106.864 121.37 L
110.136 119.152 L
113.409 116.899 L
116.682 114.538 L
119.955 112.143 L
123.227 109.651 L
126.5 107.148 L
129.773 104.54 L
133.045 101.9 L
136.318 99.207 L
139.591 96.46 L
142.864 93.666 L
146.136 90.806 L
149.409 87.881 L
152.682 84.933 L
155.955 81.897 L
159.227 78.836 L
162.5 75.756 L
165.773 72.665 L
169.045 69.686 L
172.318 66.769 L
175.591 63.95 L
178.864 61.233 L
182.136 58.619 L
185.409 56.111 L
188.682 53.649 L
191.955 51.275 L
195.227 49 L
198.5 46.817 L
201.773 44.694 L
205.045 42.647 L
208.318 40.665 L
211.591 38.771 L
214.864 36.99 L
218.136 35.234 L
221.409 33.583 L
224.682 32.025 L
227.955 30.525 L
231.227 29.054 L
234.5 27.706 L
237.773 26.436 L
241.045 25.227 L
244.318 24.077 L
247.591 23.024 L
250.864 22.015 L
254.136 21.095 L
257.409 20.248 L
260.682 19.466 L
263.955 18.761 L
267.227 18.117 L
270.5 17.566 L
273.773 17.067 L
277.045 16.609 L
280.318 16.193 L
283.591 15.809 L
286.864 15.48 L
290.136 15.17 L
293.409 14.893 L
296.682 14.651 L
299.955 14.443 L
303.227 14.247 L
306.5 14.072 L
309.773 13.917 L
313.045 13.775 L
316.318 13.651 L
319.591 13.55 L
322.864 13.461 L
326.136 13.379 L
329.409 13.305 L
332.682 13.239 L
335.955 13.187 L
339.227 13.144 L
342.5 13.109 L
345.773 13.08 L
349.045 13.058 L
352.318 13.044 L
355.591 13.029 L
358.864 13.018 L
362.136 13.01 L
365.409 13.006 L
368.682 13.002 L
371.955 13.001 L
375.227 13 L
378.5 13 L
S
GR
GS
1 GC
N
370.5 33.5 M
370.5 18.5 L
287 18.5 L
287 33.5 L
cp
f
GR
GS
[1 0 0 1 324 26] CT
/Helvetica 9 F
GS
[1 0 0 1 0 0] CT
0 3.5 moveto 
1 -1 scale
(probability) t 
GR
GR
GS
0 0.447 0.741 RC
1 LJ
1.5 LW
N
291 26 M
321 26 L
S
GR
GS
0.149 GC
10.0 ML
0.5 LW
N
287 33.5 M
287 18.5 L
370.5 18.5 L
370.5 33.5 L
cp
S
GR
%%Trailer
%%Pages: 1
%%EOF
