%!PS-Adobe-3.0 EPSF-3.0
%%Creator: (MATLAB, The Mathworks, Inc. Version 23.2.0.2409890 \(R2023b\) Update 3. Operating System: Mac OS X)
%%Title: /Users/jakub/Projects/modeling-and-identification/report-01/images/inverse-method/cumulative-distribution.eps
%%CreationDate: 2023-11-02T17:32:38
%%Pages: (atend)
%%BoundingBox:     0     0   462   259
%%LanguageLevel: 3
%%EndComments
%%BeginProlog
%%BeginResource: procset (Apache XML Graphics Std ProcSet) 1.2 0
%%Version: 1.2 0
%%Copyright: (Copyright 2001-2003,2010 The Apache Software Foundation. License terms: http://www.apache.org/licenses/LICENSE-2.0)
/bd{bind def}bind def
/ld{load def}bd
/GR/grestore ld
/GS/gsave ld
/RM/rmoveto ld
/C/curveto ld
/t/show ld
/L/lineto ld
/ML/setmiterlimit ld
/CT/concat ld
/f/fill ld
/N/newpath ld
/S/stroke ld
/CC/setcmykcolor ld
/A/ashow ld
/cp/closepath ld
/RC/setrgbcolor ld
/LJ/setlinejoin ld
/GC/setgray ld
/LW/setlinewidth ld
/M/moveto ld
/re {4 2 roll M
1 index 0 rlineto
0 exch rlineto
neg 0 rlineto
cp } bd
/_ctm matrix def
/_tm matrix def
/BT { _ctm currentmatrix pop matrix _tm copy pop 0 0 moveto } bd
/ET { _ctm setmatrix } bd
/iTm { _ctm setmatrix _tm concat } bd
/Tm { _tm astore pop iTm 0 0 moveto } bd
/ux 0.0 def
/uy 0.0 def
/F {
  /Tp exch def
  /Tf exch def
  Tf findfont Tp scalefont setfont
  /cf Tf def  /cs Tp def
} bd
/ULS {currentpoint /uy exch def /ux exch def} bd
/ULE {
  /Tcx currentpoint pop def
  gsave
  newpath
  cf findfont cs scalefont dup
  /FontMatrix get 0 get /Ts exch def /FontInfo get dup
  /UnderlinePosition get Ts mul /To exch def
  /UnderlineThickness get Ts mul /Tt exch def
  ux uy To add moveto  Tcx uy To add lineto
  Tt setlinewidth stroke
  grestore
} bd
/OLE {
  /Tcx currentpoint pop def
  gsave
  newpath
  cf findfont cs scalefont dup
  /FontMatrix get 0 get /Ts exch def /FontInfo get dup
  /UnderlinePosition get Ts mul /To exch def
  /UnderlineThickness get Ts mul /Tt exch def
  ux uy To add cs add moveto Tcx uy To add cs add lineto
  Tt setlinewidth stroke
  grestore
} bd
/SOE {
  /Tcx currentpoint pop def
  gsave
  newpath
  cf findfont cs scalefont dup
  /FontMatrix get 0 get /Ts exch def /FontInfo get dup
  /UnderlinePosition get Ts mul /To exch def
  /UnderlineThickness get Ts mul /Tt exch def
  ux uy To add cs 10 mul 26 idiv add moveto Tcx uy To add cs 10 mul 26 idiv add lineto
  Tt setlinewidth stroke
  grestore
} bd
/QT {
/Y22 exch store
/X22 exch store
/Y21 exch store
/X21 exch store
currentpoint
/Y21 load 2 mul add 3 div exch
/X21 load 2 mul add 3 div exch
/X21 load 2 mul /X22 load add 3 div
/Y21 load 2 mul /Y22 load add 3 div
/X22 load /Y22 load curveto
} bd
/SSPD {
dup length /d exch dict def
{
/v exch def
/k exch def
currentpagedevice k known {
/cpdv currentpagedevice k get def
v cpdv ne {
/upd false def
/nullv v type /nulltype eq def
/nullcpdv cpdv type /nulltype eq def
nullv nullcpdv or
{
/upd true def
} {
/sametype v type cpdv type eq def
sametype {
v type /arraytype eq {
/vlen v length def
/cpdvlen cpdv length def
vlen cpdvlen eq {
0 1 vlen 1 sub {
/i exch def
/obj v i get def
/cpdobj cpdv i get def
obj cpdobj ne {
/upd true def
exit
} if
} for
} {
/upd true def
} ifelse
} {
v type /dicttype eq {
v {
/dv exch def
/dk exch def
/cpddv cpdv dk get def
dv cpddv ne {
/upd true def
exit
} if
} forall
} {
/upd true def
} ifelse
} ifelse
} if
} ifelse
upd true eq {
d k v put
} if
} if
} if
} forall
d length 0 gt {
d setpagedevice
} if
} bd
/RE { % /NewFontName [NewEncodingArray] /FontName RE -
  findfont dup length dict begin
  {
    1 index /FID ne
    {def} {pop pop} ifelse
  } forall
  /Encoding exch def
  /FontName 1 index def
  currentdict definefont pop
  end
} bind def
%%EndResource
%%BeginResource: procset (Apache XML Graphics EPS ProcSet) 1.0 0
%%Version: 1.0 0
%%Copyright: (Copyright 2002-2003 The Apache Software Foundation. License terms: http://www.apache.org/licenses/LICENSE-2.0)
/BeginEPSF { %def
/b4_Inc_state save def         % Save state for cleanup
/dict_count countdictstack def % Count objects on dict stack
/op_count count 1 sub def      % Count objects on operand stack
userdict begin                 % Push userdict on dict stack
/showpage { } def              % Redefine showpage, { } = null proc
0 setgray 0 setlinecap         % Prepare graphics state
1 setlinewidth 0 setlinejoin
10 setmiterlimit [ ] 0 setdash newpath
/languagelevel where           % If level not equal to 1 then
{pop languagelevel             % set strokeadjust and
1 ne                           % overprint to their defaults.
{false setstrokeadjust false setoverprint
} if
} if
} bd
/EndEPSF { %def
count op_count sub {pop} repeat            % Clean up stacks
countdictstack dict_count sub {end} repeat
b4_Inc_state restore
} bd
%%EndResource
%FOPBeginFontDict
%%IncludeResource: font Courier-Oblique
%%IncludeResource: font Courier-BoldOblique
%%IncludeResource: font Courier-Bold
%%IncludeResource: font ZapfDingbats
%%IncludeResource: font Symbol
%%IncludeResource: font Helvetica
%%IncludeResource: font Helvetica-Oblique
%%IncludeResource: font Helvetica-Bold
%%IncludeResource: font Helvetica-BoldOblique
%%IncludeResource: font Times-Roman
%%IncludeResource: font Times-Italic
%%IncludeResource: font Times-Bold
%%IncludeResource: font Times-BoldItalic
%%IncludeResource: font Courier
%FOPEndFontDict
%%BeginResource: encoding WinAnsiEncoding
/WinAnsiEncoding [
/.notdef /.notdef /.notdef /.notdef /.notdef
/.notdef /.notdef /.notdef /.notdef /.notdef
/.notdef /.notdef /.notdef /.notdef /.notdef
/.notdef /.notdef /.notdef /.notdef /.notdef
/.notdef /.notdef /.notdef /.notdef /.notdef
/.notdef /.notdef /.notdef /.notdef /.notdef
/.notdef /.notdef /space /exclam /quotedbl
/numbersign /dollar /percent /ampersand /quotesingle
/parenleft /parenright /asterisk /plus /comma
/hyphen /period /slash /zero /one
/two /three /four /five /six
/seven /eight /nine /colon /semicolon
/less /equal /greater /question /at
/A /B /C /D /E
/F /G /H /I /J
/K /L /M /N /O
/P /Q /R /S /T
/U /V /W /X /Y
/Z /bracketleft /backslash /bracketright /asciicircum
/underscore /quoteleft /a /b /c
/d /e /f /g /h
/i /j /k /l /m
/n /o /p /q /r
/s /t /u /v /w
/x /y /z /braceleft /bar
/braceright /asciitilde /bullet /Euro /bullet
/quotesinglbase /florin /quotedblbase /ellipsis /dagger
/daggerdbl /circumflex /perthousand /Scaron /guilsinglleft
/OE /bullet /Zcaron /bullet /bullet
/quoteleft /quoteright /quotedblleft /quotedblright /bullet
/endash /emdash /asciitilde /trademark /scaron
/guilsinglright /oe /bullet /zcaron /Ydieresis
/space /exclamdown /cent /sterling /currency
/yen /brokenbar /section /dieresis /copyright
/ordfeminine /guillemotleft /logicalnot /sfthyphen /registered
/macron /degree /plusminus /twosuperior /threesuperior
/acute /mu /paragraph /middot /cedilla
/onesuperior /ordmasculine /guillemotright /onequarter /onehalf
/threequarters /questiondown /Agrave /Aacute /Acircumflex
/Atilde /Adieresis /Aring /AE /Ccedilla
/Egrave /Eacute /Ecircumflex /Edieresis /Igrave
/Iacute /Icircumflex /Idieresis /Eth /Ntilde
/Ograve /Oacute /Ocircumflex /Otilde /Odieresis
/multiply /Oslash /Ugrave /Uacute /Ucircumflex
/Udieresis /Yacute /Thorn /germandbls /agrave
/aacute /acircumflex /atilde /adieresis /aring
/ae /ccedilla /egrave /eacute /ecircumflex
/edieresis /igrave /iacute /icircumflex /idieresis
/eth /ntilde /ograve /oacute /ocircumflex
/otilde /odieresis /divide /oslash /ugrave
/uacute /ucircumflex /udieresis /yacute /thorn
/ydieresis
] def
%%EndResource
%FOPBeginFontReencode
/Courier-Oblique findfont
dup length dict begin
  {1 index /FID ne {def} {pop pop} ifelse} forall
  /Encoding WinAnsiEncoding def
  currentdict
end
/Courier-Oblique exch definefont pop
/Courier-BoldOblique findfont
dup length dict begin
  {1 index /FID ne {def} {pop pop} ifelse} forall
  /Encoding WinAnsiEncoding def
  currentdict
end
/Courier-BoldOblique exch definefont pop
/Courier-Bold findfont
dup length dict begin
  {1 index /FID ne {def} {pop pop} ifelse} forall
  /Encoding WinAnsiEncoding def
  currentdict
end
/Courier-Bold exch definefont pop
/Helvetica findfont
dup length dict begin
  {1 index /FID ne {def} {pop pop} ifelse} forall
  /Encoding WinAnsiEncoding def
  currentdict
end
/Helvetica exch definefont pop
/Helvetica-Oblique findfont
dup length dict begin
  {1 index /FID ne {def} {pop pop} ifelse} forall
  /Encoding WinAnsiEncoding def
  currentdict
end
/Helvetica-Oblique exch definefont pop
/Helvetica-Bold findfont
dup length dict begin
  {1 index /FID ne {def} {pop pop} ifelse} forall
  /Encoding WinAnsiEncoding def
  currentdict
end
/Helvetica-Bold exch definefont pop
/Helvetica-BoldOblique findfont
dup length dict begin
  {1 index /FID ne {def} {pop pop} ifelse} forall
  /Encoding WinAnsiEncoding def
  currentdict
end
/Helvetica-BoldOblique exch definefont pop
/Times-Roman findfont
dup length dict begin
  {1 index /FID ne {def} {pop pop} ifelse} forall
  /Encoding WinAnsiEncoding def
  currentdict
end
/Times-Roman exch definefont pop
/Times-Italic findfont
dup length dict begin
  {1 index /FID ne {def} {pop pop} ifelse} forall
  /Encoding WinAnsiEncoding def
  currentdict
end
/Times-Italic exch definefont pop
/Times-Bold findfont
dup length dict begin
  {1 index /FID ne {def} {pop pop} ifelse} forall
  /Encoding WinAnsiEncoding def
  currentdict
end
/Times-Bold exch definefont pop
/Times-BoldItalic findfont
dup length dict begin
  {1 index /FID ne {def} {pop pop} ifelse} forall
  /Encoding WinAnsiEncoding def
  currentdict
end
/Times-BoldItalic exch definefont pop
/Courier findfont
dup length dict begin
  {1 index /FID ne {def} {pop pop} ifelse} forall
  /Encoding WinAnsiEncoding def
  currentdict
end
/Courier exch definefont pop
%FOPEndFontReencode
%%EndProlog
%%Page: 1 1
%%PageBoundingBox: 0 0 462 259
%%BeginPageSetup
[1 0 0 -1 0 259] CT
%%EndPageSetup
GS
1 GC
N
0 0 462 259 re
f
GR
GS
1 GC
N
0 0 462 259 re
f
GR
GS
1 GC
N
60 228.5 M
418 228.5 L
418 19.5 L
60 19.5 L
cp
f
GR
GS
0.873 GC
1 LJ
0.5 LW
N
60 228.5 M
60 19.5 L
S
GR
GS
0.873 GC
1 LJ
0.5 LW
N
104.75 228.5 M
104.75 19.5 L
S
GR
GS
0.873 GC
1 LJ
0.5 LW
N
149.5 228.5 M
149.5 19.5 L
S
GR
GS
0.873 GC
1 LJ
0.5 LW
N
194.25 228.5 M
194.25 19.5 L
S
GR
GS
0.873 GC
1 LJ
0.5 LW
N
239 228.5 M
239 19.5 L
S
GR
GS
0.873 GC
1 LJ
0.5 LW
N
283.75 228.5 M
283.75 19.5 L
S
GR
GS
0.873 GC
1 LJ
0.5 LW
N
328.5 228.5 M
328.5 19.5 L
S
GR
GS
0.873 GC
1 LJ
0.5 LW
N
373.25 228.5 M
373.25 19.5 L
S
GR
GS
0.873 GC
1 LJ
0.5 LW
N
418 228.5 M
418 19.5 L
S
GR
GS
0.873 GC
1 LJ
0.5 LW
N
418 228.5 M
60 228.5 L
S
GR
GS
0.873 GC
1 LJ
0.5 LW
N
418 176.25 M
60 176.25 L
S
GR
GS
0.873 GC
1 LJ
0.5 LW
N
418 124 M
60 124 L
S
GR
GS
0.873 GC
1 LJ
0.5 LW
N
418 71.75 M
60 71.75 L
S
GR
GS
0.873 GC
1 LJ
0.5 LW
N
418 19.5 M
60 19.5 L
S
GR
GS
0.149 GC
2 setlinecap
1 LJ
0.5 LW
N
60 228.5 M
418 228.5 L
S
GR
GS
0.149 GC
2 setlinecap
1 LJ
0.5 LW
N
60 19.5 M
418 19.5 L
S
GR
GS
0.149 GC
2 setlinecap
1 LJ
0.5 LW
N
60 228.5 M
60 224.92 L
S
GR
GS
0.149 GC
2 setlinecap
1 LJ
0.5 LW
N
104.75 228.5 M
104.75 224.92 L
S
GR
GS
0.149 GC
2 setlinecap
1 LJ
0.5 LW
N
149.5 228.5 M
149.5 224.92 L
S
GR
GS
0.149 GC
2 setlinecap
1 LJ
0.5 LW
N
194.25 228.5 M
194.25 224.92 L
S
GR
GS
0.149 GC
2 setlinecap
1 LJ
0.5 LW
N
239 228.5 M
239 224.92 L
S
GR
GS
0.149 GC
2 setlinecap
1 LJ
0.5 LW
N
283.75 228.5 M
283.75 224.92 L
S
GR
GS
0.149 GC
2 setlinecap
1 LJ
0.5 LW
N
328.5 228.5 M
328.5 224.92 L
S
GR
GS
0.149 GC
2 setlinecap
1 LJ
0.5 LW
N
373.25 228.5 M
373.25 224.92 L
S
GR
GS
0.149 GC
2 setlinecap
1 LJ
0.5 LW
N
418 228.5 M
418 224.92 L
S
GR
GS
0.149 GC
2 setlinecap
1 LJ
0.5 LW
N
60 19.5 M
60 23.08 L
S
GR
GS
0.149 GC
2 setlinecap
1 LJ
0.5 LW
N
104.75 19.5 M
104.75 23.08 L
S
GR
GS
0.149 GC
2 setlinecap
1 LJ
0.5 LW
N
149.5 19.5 M
149.5 23.08 L
S
GR
GS
0.149 GC
2 setlinecap
1 LJ
0.5 LW
N
194.25 19.5 M
194.25 23.08 L
S
GR
GS
0.149 GC
2 setlinecap
1 LJ
0.5 LW
N
239 19.5 M
239 23.08 L
S
GR
GS
0.149 GC
2 setlinecap
1 LJ
0.5 LW
N
283.75 19.5 M
283.75 23.08 L
S
GR
GS
0.149 GC
2 setlinecap
1 LJ
0.5 LW
N
328.5 19.5 M
328.5 23.08 L
S
GR
GS
0.149 GC
2 setlinecap
1 LJ
0.5 LW
N
373.25 19.5 M
373.25 23.08 L
S
GR
GS
0.149 GC
2 setlinecap
1 LJ
0.5 LW
N
418 19.5 M
418 23.08 L
S
GR
GS
[1 0 0 1 60 232.5] CT
0.149 GC
/Helvetica 10 F
GS
[1 0 0 1 0 0] CT
-5 10 moveto 
1 -1 scale
(-2) t 
GR
GR
GS
[1 0 0 1 104.75 232.5] CT
0.149 GC
/Helvetica 10 F
GS
[1 0 0 1 0 0] CT
-9 10 moveto 
1 -1 scale
(-1.5) t 
GR
GR
GS
[1 0 0 1 149.5 232.5] CT
0.149 GC
/Helvetica 10 F
GS
[1 0 0 1 0 0] CT
-5 10 moveto 
1 -1 scale
(-1) t 
GR
GR
GS
[1 0 0 1 194.25 232.5] CT
0.149 GC
/Helvetica 10 F
GS
[1 0 0 1 0 0] CT
-9 10 moveto 
1 -1 scale
(-0.5) t 
GR
GR
GS
[1 0 0 1 239 232.5] CT
0.149 GC
/Helvetica 10 F
GS
[1 0 0 1 0 0] CT
-3 10 moveto 
1 -1 scale
(0) t 
GR
GR
GS
[1 0 0 1 283.75 232.5] CT
0.149 GC
/Helvetica 10 F
GS
[1 0 0 1 0 0] CT
-7 10 moveto 
1 -1 scale
(0.5) t 
GR
GR
GS
[1 0 0 1 328.5 232.5] CT
0.149 GC
/Helvetica 10 F
GS
[1 0 0 1 0 0] CT
-3 10 moveto 
1 -1 scale
(1) t 
GR
GR
GS
[1 0 0 1 373.25 232.5] CT
0.149 GC
/Helvetica 10 F
GS
[1 0 0 1 0 0] CT
-7 10 moveto 
1 -1 scale
(1.5) t 
GR
GR
GS
[1 0 0 1 418 232.5] CT
0.149 GC
/Helvetica 10 F
GS
[1 0 0 1 0 0] CT
-3 10 moveto 
1 -1 scale
(2) t 
GR
GR
GS
[1 0 0 1 239.00017 246] CT
0.149 GC
/Helvetica 11 F
GS
[1 0 0 1 0 0] CT
-3 11 moveto 
1 -1 scale
(x) t 
GR
GR
GS
0.149 GC
2 setlinecap
1 LJ
0.5 LW
N
60 228.5 M
60 19.5 L
S
GR
GS
0.149 GC
2 setlinecap
1 LJ
0.5 LW
N
418 228.5 M
418 19.5 L
S
GR
GS
0.149 GC
2 setlinecap
1 LJ
0.5 LW
N
60 228.5 M
63.58 228.5 L
S
GR
GS
0.149 GC
2 setlinecap
1 LJ
0.5 LW
N
60 176.25 M
63.58 176.25 L
S
GR
GS
0.149 GC
2 setlinecap
1 LJ
0.5 LW
N
60 124 M
63.58 124 L
S
GR
GS
0.149 GC
2 setlinecap
1 LJ
0.5 LW
N
60 71.75 M
63.58 71.75 L
S
GR
GS
0.149 GC
2 setlinecap
1 LJ
0.5 LW
N
60 19.5 M
63.58 19.5 L
S
GR
GS
0.149 GC
2 setlinecap
1 LJ
0.5 LW
N
418 228.5 M
414.42 228.5 L
S
GR
GS
0.149 GC
2 setlinecap
1 LJ
0.5 LW
N
418 176.25 M
414.42 176.25 L
S
GR
GS
0.149 GC
2 setlinecap
1 LJ
0.5 LW
N
418 124 M
414.42 124 L
S
GR
GS
0.149 GC
2 setlinecap
1 LJ
0.5 LW
N
418 71.75 M
414.42 71.75 L
S
GR
GS
0.149 GC
2 setlinecap
1 LJ
0.5 LW
N
418 19.5 M
414.42 19.5 L
S
GR
GS
[1 0 0 1 56 228.5] CT
0.149 GC
/Helvetica 10 F
GS
[1 0 0 1 0 0] CT
-18 3.5 moveto 
1 -1 scale
(-0.5) t 
GR
GR
GS
[1 0 0 1 56 176.25] CT
0.149 GC
/Helvetica 10 F
GS
[1 0 0 1 0 0] CT
-6 3.5 moveto 
1 -1 scale
(0) t 
GR
GR
GS
[1 0 0 1 56 124] CT
0.149 GC
/Helvetica 10 F
GS
[1 0 0 1 0 0] CT
-14 3.5 moveto 
1 -1 scale
(0.5) t 
GR
GR
GS
[1 0 0 1 56 71.75] CT
0.149 GC
/Helvetica 10 F
GS
[1 0 0 1 0 0] CT
-6 3.5 moveto 
1 -1 scale
(1) t 
GR
GR
GS
[1 0 0 1 56 19.5] CT
0.149 GC
/Helvetica 10 F
GS
[1 0 0 1 0 0] CT
-14 3.5 moveto 
1 -1 scale
(1.5) t 
GR
GR
GS
[0 -1 1 0 35.00001 123.9999] CT
0.149 GC
/Helvetica 11 F
GS
[1 0 0 1 0 0] CT
-9 -3 moveto 
1 -1 scale
(F\(x\)) t 
GR
GR
GS
[1 0 0 1 239.00023 18.12501] CT
/Helvetica-Bold 11 F
GS
[1 0 0 1 0 0] CT
-101 -3 moveto 
1 -1 scale
(Cumulative Distribution Function - F\(x\)) t 
GR
GR
GS
0 0.447 0.741 RC
1 LJ
2 LW
N
60 176.25 M
60.895 176.25 L
61.79 176.25 L
62.685 176.25 L
63.58 176.25 L
64.475 176.25 L
65.37 176.25 L
66.265 176.25 L
67.16 176.25 L
68.055 176.25 L
68.95 176.25 L
69.845 176.25 L
70.74 176.25 L
71.635 176.25 L
72.53 176.25 L
73.425 176.25 L
74.32 176.25 L
75.215 176.25 L
76.11 176.25 L
77.005 176.25 L
77.9 176.25 L
78.795 176.25 L
79.69 176.25 L
80.585 176.25 L
81.48 176.25 L
82.375 176.25 L
83.27 176.25 L
84.165 176.25 L
85.06 176.25 L
85.955 176.25 L
86.85 176.25 L
87.745 176.25 L
88.64 176.25 L
89.535 176.25 L
90.43 176.25 L
91.325 176.25 L
92.22 176.25 L
93.115 176.25 L
94.01 176.25 L
94.905 176.25 L
95.8 176.25 L
96.695 176.25 L
97.59 176.25 L
98.485 176.25 L
99.38 176.25 L
100.275 176.25 L
101.17 176.25 L
102.065 176.25 L
102.96 176.25 L
103.855 176.25 L
104.75 176.25 L
105.645 176.25 L
106.54 176.25 L
107.435 176.25 L
108.33 176.25 L
109.225 176.25 L
110.12 176.25 L
111.015 176.25 L
111.91 176.25 L
112.805 176.25 L
113.7 176.25 L
114.595 176.25 L
115.49 176.25 L
116.385 176.25 L
117.28 176.25 L
118.175 176.25 L
119.07 176.25 L
119.965 176.25 L
120.86 176.25 L
121.755 176.25 L
122.65 176.25 L
123.545 176.25 L
124.44 176.25 L
125.335 176.25 L
126.23 176.25 L
127.125 176.25 L
128.02 176.25 L
128.915 176.25 L
129.81 176.25 L
130.705 176.25 L
131.6 176.25 L
132.495 176.25 L
133.39 176.25 L
134.285 176.25 L
135.18 176.25 L
136.075 176.25 L
136.97 176.25 L
137.865 176.25 L
138.76 176.25 L
139.655 176.25 L
140.55 176.25 L
141.445 176.25 L
142.34 176.25 L
143.235 176.25 L
144.13 176.25 L
145.025 176.25 L
145.92 176.25 L
146.815 176.25 L
147.71 176.25 L
148.605 176.25 L
149.5 176.25 L
150.395 175.21 L
151.29 174.181 L
152.185 173.162 L
153.08 172.154 L
153.975 171.156 L
154.87 170.168 L
155.765 169.191 L
156.66 168.224 L
157.555 167.268 L
158.45 166.322 L
159.345 165.387 L
160.24 164.462 L
161.135 163.548 L
162.03 162.644 L
162.925 161.751 L
163.82 160.868 L
164.715 159.995 L
165.61 159.133 L
166.505 158.281 L
167.4 157.44 L
168.295 156.609 L
169.19 155.789 L
170.085 154.979 L
170.98 154.18 L
171.875 153.391 L
172.77 152.612 L
173.665 151.844 L
174.56 151.086 L
175.455 150.339 L
176.35 149.602 L
177.245 148.876 L
178.14 148.16 L
179.035 147.455 L
179.93 146.76 L
180.825 146.076 L
181.72 145.402 L
182.615 144.738 L
183.51 144.085 L
184.405 143.442 L
185.3 142.81 L
186.195 142.188 L
187.09 141.577 L
187.985 140.976 L
188.88 140.386 L
189.775 139.806 L
190.67 139.236 L
191.565 138.677 L
192.46 138.128 L
193.355 137.59 L
194.25 137.063 L
195.145 136.545 L
196.04 136.038 L
196.935 135.542 L
197.83 135.056 L
198.725 134.581 L
199.62 134.116 L
200.515 133.661 L
201.41 133.217 L
202.305 132.783 L
203.2 132.36 L
204.095 131.947 L
204.99 131.545 L
205.885 131.153 L
206.78 130.772 L
207.675 130.401 L
208.57 130.04 L
209.465 129.69 L
210.36 129.35 L
211.255 129.021 L
212.15 128.702 L
213.045 128.394 L
213.94 128.096 L
214.835 127.809 L
215.73 127.532 L
216.625 127.266 L
217.52 127.01 L
218.415 126.764 L
219.31 126.529 L
220.205 126.304 L
221.1 126.09 L
221.995 125.886 L
222.89 125.693 L
223.785 125.51 L
224.68 125.338 L
225.575 125.176 L
226.47 125.024 L
227.365 124.883 L
228.26 124.752 L
229.155 124.632 L
230.05 124.522 L
230.945 124.423 L
231.84 124.334 L
232.735 124.256 L
233.63 124.188 L
234.525 124.131 L
235.42 124.084 L
236.315 124.047 L
237.21 124.021 L
238.105 124.005 L
239 124 L
239.895 123.995 L
240.79 123.979 L
241.685 123.953 L
242.58 123.916 L
243.475 123.869 L
244.37 123.812 L
245.265 123.744 L
246.16 123.666 L
247.055 123.577 L
247.95 123.478 L
248.845 123.368 L
249.74 123.248 L
250.635 123.117 L
251.53 122.976 L
252.425 122.824 L
253.32 122.662 L
254.215 122.49 L
255.11 122.307 L
256.005 122.114 L
256.9 121.91 L
257.795 121.696 L
258.69 121.471 L
259.585 121.236 L
260.48 120.99 L
261.375 120.734 L
262.27 120.468 L
263.165 120.191 L
264.06 119.904 L
264.955 119.606 L
265.85 119.298 L
266.745 118.979 L
267.64 118.65 L
268.535 118.31 L
269.43 117.96 L
270.325 117.599 L
271.22 117.228 L
272.115 116.847 L
273.01 116.455 L
273.905 116.053 L
274.8 115.64 L
275.695 115.217 L
276.59 114.783 L
277.485 114.339 L
278.38 113.884 L
279.275 113.419 L
280.17 112.944 L
281.065 112.458 L
281.96 111.962 L
282.855 111.455 L
283.75 110.938 L
284.645 110.41 L
285.54 109.872 L
286.435 109.323 L
287.33 108.764 L
288.225 108.194 L
289.12 107.614 L
290.015 107.024 L
290.91 106.423 L
291.805 105.812 L
292.7 105.19 L
293.595 104.558 L
294.49 103.915 L
295.385 103.262 L
296.28 102.598 L
297.175 101.924 L
298.07 101.24 L
298.965 100.545 L
299.86 99.84 L
300.755 99.124 L
301.65 98.397 L
302.545 97.661 L
303.44 96.914 L
304.335 96.156 L
305.23 95.388 L
306.125 94.609 L
307.02 93.82 L
307.915 93.021 L
308.81 92.211 L
309.705 91.391 L
310.6 90.56 L
311.495 89.719 L
312.39 88.867 L
313.285 88.005 L
314.18 87.132 L
315.075 86.249 L
315.97 85.356 L
316.865 84.452 L
317.76 83.538 L
318.655 82.613 L
319.55 81.678 L
320.445 80.732 L
321.34 79.776 L
322.235 78.809 L
323.13 77.832 L
324.025 76.844 L
324.92 75.846 L
325.815 74.838 L
326.71 73.819 L
327.605 72.79 L
328.5 71.75 L
329.395 71.75 L
330.29 71.75 L
331.185 71.75 L
332.08 71.75 L
332.975 71.75 L
333.87 71.75 L
334.765 71.75 L
335.66 71.75 L
336.555 71.75 L
337.45 71.75 L
338.345 71.75 L
339.24 71.75 L
340.135 71.75 L
341.03 71.75 L
341.925 71.75 L
342.82 71.75 L
343.715 71.75 L
344.61 71.75 L
345.505 71.75 L
346.4 71.75 L
347.295 71.75 L
348.19 71.75 L
349.085 71.75 L
349.98 71.75 L
350.875 71.75 L
351.77 71.75 L
352.665 71.75 L
353.56 71.75 L
354.455 71.75 L
355.35 71.75 L
356.245 71.75 L
357.14 71.75 L
358.035 71.75 L
358.93 71.75 L
359.825 71.75 L
360.72 71.75 L
361.615 71.75 L
362.51 71.75 L
363.405 71.75 L
364.3 71.75 L
365.195 71.75 L
366.09 71.75 L
366.985 71.75 L
367.88 71.75 L
368.775 71.75 L
369.67 71.75 L
370.565 71.75 L
371.46 71.75 L
372.355 71.75 L
373.25 71.75 L
374.145 71.75 L
375.04 71.75 L
375.935 71.75 L
376.83 71.75 L
377.725 71.75 L
378.62 71.75 L
379.515 71.75 L
380.41 71.75 L
381.305 71.75 L
382.2 71.75 L
383.095 71.75 L
383.99 71.75 L
384.885 71.75 L
385.78 71.75 L
386.675 71.75 L
387.57 71.75 L
388.465 71.75 L
389.36 71.75 L
390.255 71.75 L
391.15 71.75 L
392.045 71.75 L
392.94 71.75 L
393.835 71.75 L
394.73 71.75 L
395.625 71.75 L
396.52 71.75 L
397.415 71.75 L
398.31 71.75 L
399.205 71.75 L
400.1 71.75 L
400.995 71.75 L
401.89 71.75 L
402.785 71.75 L
403.68 71.75 L
404.575 71.75 L
405.47 71.75 L
406.365 71.75 L
407.26 71.75 L
408.155 71.75 L
409.05 71.75 L
409.945 71.75 L
410.84 71.75 L
411.735 71.75 L
412.63 71.75 L
413.525 71.75 L
414.42 71.75 L
415.315 71.75 L
416.21 71.75 L
417.105 71.75 L
418 71.75 L
S
GR
%%Trailer
%%Pages: 1
%%EOF
