%!PS-Adobe-3.0 EPSF-3.0
%%Creator: (MATLAB, The Mathworks, Inc. Version 23.2.0.2409890 \(R2023b\) Update 3. Operating System: Mac OS X)
%%Title: /Users/jakub/Projects/modeling-and-identification/report-01/images/estimation/estimation_r_200.eps
%%CreationDate: 2023-11-05T17:16:42
%%Pages: (atend)
%%BoundingBox:     0     0   337   219
%%LanguageLevel: 3
%%EndComments
%%BeginProlog
%%BeginResource: procset (Apache XML Graphics Std ProcSet) 1.2 0
%%Version: 1.2 0
%%Copyright: (Copyright 2001-2003,2010 The Apache Software Foundation. License terms: http://www.apache.org/licenses/LICENSE-2.0)
/bd{bind def}bind def
/ld{load def}bd
/GR/grestore ld
/GS/gsave ld
/RM/rmoveto ld
/C/curveto ld
/t/show ld
/L/lineto ld
/ML/setmiterlimit ld
/CT/concat ld
/f/fill ld
/N/newpath ld
/S/stroke ld
/CC/setcmykcolor ld
/A/ashow ld
/cp/closepath ld
/RC/setrgbcolor ld
/LJ/setlinejoin ld
/GC/setgray ld
/LW/setlinewidth ld
/M/moveto ld
/re {4 2 roll M
1 index 0 rlineto
0 exch rlineto
neg 0 rlineto
cp } bd
/_ctm matrix def
/_tm matrix def
/BT { _ctm currentmatrix pop matrix _tm copy pop 0 0 moveto } bd
/ET { _ctm setmatrix } bd
/iTm { _ctm setmatrix _tm concat } bd
/Tm { _tm astore pop iTm 0 0 moveto } bd
/ux 0.0 def
/uy 0.0 def
/F {
  /Tp exch def
  /Tf exch def
  Tf findfont Tp scalefont setfont
  /cf Tf def  /cs Tp def
} bd
/ULS {currentpoint /uy exch def /ux exch def} bd
/ULE {
  /Tcx currentpoint pop def
  gsave
  newpath
  cf findfont cs scalefont dup
  /FontMatrix get 0 get /Ts exch def /FontInfo get dup
  /UnderlinePosition get Ts mul /To exch def
  /UnderlineThickness get Ts mul /Tt exch def
  ux uy To add moveto  Tcx uy To add lineto
  Tt setlinewidth stroke
  grestore
} bd
/OLE {
  /Tcx currentpoint pop def
  gsave
  newpath
  cf findfont cs scalefont dup
  /FontMatrix get 0 get /Ts exch def /FontInfo get dup
  /UnderlinePosition get Ts mul /To exch def
  /UnderlineThickness get Ts mul /Tt exch def
  ux uy To add cs add moveto Tcx uy To add cs add lineto
  Tt setlinewidth stroke
  grestore
} bd
/SOE {
  /Tcx currentpoint pop def
  gsave
  newpath
  cf findfont cs scalefont dup
  /FontMatrix get 0 get /Ts exch def /FontInfo get dup
  /UnderlinePosition get Ts mul /To exch def
  /UnderlineThickness get Ts mul /Tt exch def
  ux uy To add cs 10 mul 26 idiv add moveto Tcx uy To add cs 10 mul 26 idiv add lineto
  Tt setlinewidth stroke
  grestore
} bd
/QT {
/Y22 exch store
/X22 exch store
/Y21 exch store
/X21 exch store
currentpoint
/Y21 load 2 mul add 3 div exch
/X21 load 2 mul add 3 div exch
/X21 load 2 mul /X22 load add 3 div
/Y21 load 2 mul /Y22 load add 3 div
/X22 load /Y22 load curveto
} bd
/SSPD {
dup length /d exch dict def
{
/v exch def
/k exch def
currentpagedevice k known {
/cpdv currentpagedevice k get def
v cpdv ne {
/upd false def
/nullv v type /nulltype eq def
/nullcpdv cpdv type /nulltype eq def
nullv nullcpdv or
{
/upd true def
} {
/sametype v type cpdv type eq def
sametype {
v type /arraytype eq {
/vlen v length def
/cpdvlen cpdv length def
vlen cpdvlen eq {
0 1 vlen 1 sub {
/i exch def
/obj v i get def
/cpdobj cpdv i get def
obj cpdobj ne {
/upd true def
exit
} if
} for
} {
/upd true def
} ifelse
} {
v type /dicttype eq {
v {
/dv exch def
/dk exch def
/cpddv cpdv dk get def
dv cpddv ne {
/upd true def
exit
} if
} forall
} {
/upd true def
} ifelse
} ifelse
} if
} ifelse
upd true eq {
d k v put
} if
} if
} if
} forall
d length 0 gt {
d setpagedevice
} if
} bd
/RE { % /NewFontName [NewEncodingArray] /FontName RE -
  findfont dup length dict begin
  {
    1 index /FID ne
    {def} {pop pop} ifelse
  } forall
  /Encoding exch def
  /FontName 1 index def
  currentdict definefont pop
  end
} bind def
%%EndResource
%%BeginResource: procset (Apache XML Graphics EPS ProcSet) 1.0 0
%%Version: 1.0 0
%%Copyright: (Copyright 2002-2003 The Apache Software Foundation. License terms: http://www.apache.org/licenses/LICENSE-2.0)
/BeginEPSF { %def
/b4_Inc_state save def         % Save state for cleanup
/dict_count countdictstack def % Count objects on dict stack
/op_count count 1 sub def      % Count objects on operand stack
userdict begin                 % Push userdict on dict stack
/showpage { } def              % Redefine showpage, { } = null proc
0 setgray 0 setlinecap         % Prepare graphics state
1 setlinewidth 0 setlinejoin
10 setmiterlimit [ ] 0 setdash newpath
/languagelevel where           % If level not equal to 1 then
{pop languagelevel             % set strokeadjust and
1 ne                           % overprint to their defaults.
{false setstrokeadjust false setoverprint
} if
} if
} bd
/EndEPSF { %def
count op_count sub {pop} repeat            % Clean up stacks
countdictstack dict_count sub {end} repeat
b4_Inc_state restore
} bd
%%EndResource
%FOPBeginFontDict
%%IncludeResource: font Courier-Oblique
%%IncludeResource: font Courier-BoldOblique
%%IncludeResource: font Courier-Bold
%%IncludeResource: font ZapfDingbats
%%IncludeResource: font Symbol
%%IncludeResource: font Helvetica
%%IncludeResource: font Helvetica-Oblique
%%IncludeResource: font Helvetica-Bold
%%IncludeResource: font Helvetica-BoldOblique
%%IncludeResource: font Times-Roman
%%IncludeResource: font Times-Italic
%%IncludeResource: font Times-Bold
%%IncludeResource: font Times-BoldItalic
%%IncludeResource: font Courier
%FOPEndFontDict
%%BeginResource: encoding WinAnsiEncoding
/WinAnsiEncoding [
/.notdef /.notdef /.notdef /.notdef /.notdef
/.notdef /.notdef /.notdef /.notdef /.notdef
/.notdef /.notdef /.notdef /.notdef /.notdef
/.notdef /.notdef /.notdef /.notdef /.notdef
/.notdef /.notdef /.notdef /.notdef /.notdef
/.notdef /.notdef /.notdef /.notdef /.notdef
/.notdef /.notdef /space /exclam /quotedbl
/numbersign /dollar /percent /ampersand /quotesingle
/parenleft /parenright /asterisk /plus /comma
/hyphen /period /slash /zero /one
/two /three /four /five /six
/seven /eight /nine /colon /semicolon
/less /equal /greater /question /at
/A /B /C /D /E
/F /G /H /I /J
/K /L /M /N /O
/P /Q /R /S /T
/U /V /W /X /Y
/Z /bracketleft /backslash /bracketright /asciicircum
/underscore /quoteleft /a /b /c
/d /e /f /g /h
/i /j /k /l /m
/n /o /p /q /r
/s /t /u /v /w
/x /y /z /braceleft /bar
/braceright /asciitilde /bullet /Euro /bullet
/quotesinglbase /florin /quotedblbase /ellipsis /dagger
/daggerdbl /circumflex /perthousand /Scaron /guilsinglleft
/OE /bullet /Zcaron /bullet /bullet
/quoteleft /quoteright /quotedblleft /quotedblright /bullet
/endash /emdash /asciitilde /trademark /scaron
/guilsinglright /oe /bullet /zcaron /Ydieresis
/space /exclamdown /cent /sterling /currency
/yen /brokenbar /section /dieresis /copyright
/ordfeminine /guillemotleft /logicalnot /sfthyphen /registered
/macron /degree /plusminus /twosuperior /threesuperior
/acute /mu /paragraph /middot /cedilla
/onesuperior /ordmasculine /guillemotright /onequarter /onehalf
/threequarters /questiondown /Agrave /Aacute /Acircumflex
/Atilde /Adieresis /Aring /AE /Ccedilla
/Egrave /Eacute /Ecircumflex /Edieresis /Igrave
/Iacute /Icircumflex /Idieresis /Eth /Ntilde
/Ograve /Oacute /Ocircumflex /Otilde /Odieresis
/multiply /Oslash /Ugrave /Uacute /Ucircumflex
/Udieresis /Yacute /Thorn /germandbls /agrave
/aacute /acircumflex /atilde /adieresis /aring
/ae /ccedilla /egrave /eacute /ecircumflex
/edieresis /igrave /iacute /icircumflex /idieresis
/eth /ntilde /ograve /oacute /ocircumflex
/otilde /odieresis /divide /oslash /ugrave
/uacute /ucircumflex /udieresis /yacute /thorn
/ydieresis
] def
%%EndResource
%FOPBeginFontReencode
/Courier-Oblique findfont
dup length dict begin
  {1 index /FID ne {def} {pop pop} ifelse} forall
  /Encoding WinAnsiEncoding def
  currentdict
end
/Courier-Oblique exch definefont pop
/Courier-BoldOblique findfont
dup length dict begin
  {1 index /FID ne {def} {pop pop} ifelse} forall
  /Encoding WinAnsiEncoding def
  currentdict
end
/Courier-BoldOblique exch definefont pop
/Courier-Bold findfont
dup length dict begin
  {1 index /FID ne {def} {pop pop} ifelse} forall
  /Encoding WinAnsiEncoding def
  currentdict
end
/Courier-Bold exch definefont pop
/Helvetica findfont
dup length dict begin
  {1 index /FID ne {def} {pop pop} ifelse} forall
  /Encoding WinAnsiEncoding def
  currentdict
end
/Helvetica exch definefont pop
/Helvetica-Oblique findfont
dup length dict begin
  {1 index /FID ne {def} {pop pop} ifelse} forall
  /Encoding WinAnsiEncoding def
  currentdict
end
/Helvetica-Oblique exch definefont pop
/Helvetica-Bold findfont
dup length dict begin
  {1 index /FID ne {def} {pop pop} ifelse} forall
  /Encoding WinAnsiEncoding def
  currentdict
end
/Helvetica-Bold exch definefont pop
/Helvetica-BoldOblique findfont
dup length dict begin
  {1 index /FID ne {def} {pop pop} ifelse} forall
  /Encoding WinAnsiEncoding def
  currentdict
end
/Helvetica-BoldOblique exch definefont pop
/Times-Roman findfont
dup length dict begin
  {1 index /FID ne {def} {pop pop} ifelse} forall
  /Encoding WinAnsiEncoding def
  currentdict
end
/Times-Roman exch definefont pop
/Times-Italic findfont
dup length dict begin
  {1 index /FID ne {def} {pop pop} ifelse} forall
  /Encoding WinAnsiEncoding def
  currentdict
end
/Times-Italic exch definefont pop
/Times-Bold findfont
dup length dict begin
  {1 index /FID ne {def} {pop pop} ifelse} forall
  /Encoding WinAnsiEncoding def
  currentdict
end
/Times-Bold exch definefont pop
/Times-BoldItalic findfont
dup length dict begin
  {1 index /FID ne {def} {pop pop} ifelse} forall
  /Encoding WinAnsiEncoding def
  currentdict
end
/Times-BoldItalic exch definefont pop
/Courier findfont
dup length dict begin
  {1 index /FID ne {def} {pop pop} ifelse} forall
  /Encoding WinAnsiEncoding def
  currentdict
end
/Courier exch definefont pop
%FOPEndFontReencode
%%EndProlog
%%Page: 1 1
%%PageBoundingBox: 0 0 337 219
%%BeginPageSetup
[1 0 0 -1 0 219] CT
%%EndPageSetup
GS
1 GC
N
0 0 337 219 re
f
GR
GS
1 GC
N
0 0 337 219 re
f
GR
GS
1 GC
N
44 188.5 M
305 188.5 L
305 16.5 L
44 16.5 L
cp
f
GR
GS
0.873 GC
1 LJ
0.5 LW
N
44 188.5 M
44 16.5 L
S
GR
GS
0.873 GC
1 LJ
0.5 LW
N
96.2 188.5 M
96.2 16.5 L
S
GR
GS
0.873 GC
1 LJ
0.5 LW
N
148.4 188.5 M
148.4 16.5 L
S
GR
GS
0.873 GC
1 LJ
0.5 LW
N
200.6 188.5 M
200.6 16.5 L
S
GR
GS
0.873 GC
1 LJ
0.5 LW
N
252.8 188.5 M
252.8 16.5 L
S
GR
GS
0.873 GC
1 LJ
0.5 LW
N
305 188.5 M
305 16.5 L
S
GR
GS
0.873 GC
1 LJ
0.5 LW
N
305 188.5 M
44 188.5 L
S
GR
GS
0.873 GC
1 LJ
0.5 LW
N
305 154.1 M
44 154.1 L
S
GR
GS
0.873 GC
1 LJ
0.5 LW
N
305 119.7 M
44 119.7 L
S
GR
GS
0.873 GC
1 LJ
0.5 LW
N
305 85.3 M
44 85.3 L
S
GR
GS
0.873 GC
1 LJ
0.5 LW
N
305 50.9 M
44 50.9 L
S
GR
GS
0.873 GC
1 LJ
0.5 LW
N
305 16.5 M
44 16.5 L
S
GR
GS
0.149 GC
2 setlinecap
1 LJ
0.5 LW
N
44 188.5 M
305 188.5 L
S
GR
GS
0.149 GC
2 setlinecap
1 LJ
0.5 LW
N
44 188.5 M
44 185.89 L
S
GR
GS
0.149 GC
2 setlinecap
1 LJ
0.5 LW
N
96.2 188.5 M
96.2 185.89 L
S
GR
GS
0.149 GC
2 setlinecap
1 LJ
0.5 LW
N
148.4 188.5 M
148.4 185.89 L
S
GR
GS
0.149 GC
2 setlinecap
1 LJ
0.5 LW
N
200.6 188.5 M
200.6 185.89 L
S
GR
GS
0.149 GC
2 setlinecap
1 LJ
0.5 LW
N
252.8 188.5 M
252.8 185.89 L
S
GR
GS
0.149 GC
2 setlinecap
1 LJ
0.5 LW
N
305 188.5 M
305 185.89 L
S
GR
GS
[1 0 0 1 44 192.5] CT
0.149 GC
/Helvetica 10 F
GS
[1 0 0 1 0 0] CT
-3 10 moveto 
1 -1 scale
(0) t 
GR
GR
GS
[1 0 0 1 96.2 192.5] CT
0.149 GC
/Helvetica 10 F
GS
[1 0 0 1 0 0] CT
-8.5 10 moveto 
1 -1 scale
(200) t 
GR
GR
GS
[1 0 0 1 148.39999 192.5] CT
0.149 GC
/Helvetica 10 F
GS
[1 0 0 1 0 0] CT
-8.5 10 moveto 
1 -1 scale
(400) t 
GR
GR
GS
[1 0 0 1 200.60001 192.5] CT
0.149 GC
/Helvetica 10 F
GS
[1 0 0 1 0 0] CT
-8.5 10 moveto 
1 -1 scale
(600) t 
GR
GR
GS
[1 0 0 1 252.8 192.5] CT
0.149 GC
/Helvetica 10 F
GS
[1 0 0 1 0 0] CT
-8.5 10 moveto 
1 -1 scale
(800) t 
GR
GR
GS
[1 0 0 1 305 192.5] CT
0.149 GC
/Helvetica 10 F
GS
[1 0 0 1 0 0] CT
-11.5 10 moveto 
1 -1 scale
(1000) t 
GR
GR
GS
[1 0 0 1 174.50012 206] CT
0.149 GC
/Helvetica 11 F
GS
[1 0 0 1 0 0] CT
-32 11 moveto 
1 -1 scale
(Number of N) t 
GR
GR
GS
0.149 GC
2 setlinecap
1 LJ
0.5 LW
N
44 188.5 M
44 16.5 L
S
GR
GS
0.149 GC
2 setlinecap
1 LJ
0.5 LW
N
44 188.5 M
46.61 188.5 L
S
GR
GS
0.149 GC
2 setlinecap
1 LJ
0.5 LW
N
44 154.1 M
46.61 154.1 L
S
GR
GS
0.149 GC
2 setlinecap
1 LJ
0.5 LW
N
44 119.7 M
46.61 119.7 L
S
GR
GS
0.149 GC
2 setlinecap
1 LJ
0.5 LW
N
44 85.3 M
46.61 85.3 L
S
GR
GS
0.149 GC
2 setlinecap
1 LJ
0.5 LW
N
44 50.9 M
46.61 50.9 L
S
GR
GS
0.149 GC
2 setlinecap
1 LJ
0.5 LW
N
44 16.5 M
46.61 16.5 L
S
GR
GS
[1 0 0 1 40 188.5] CT
0.149 GC
/Helvetica 10 F
GS
[1 0 0 1 0 0] CT
-6 3.5 moveto 
1 -1 scale
(0) t 
GR
GR
GS
[1 0 0 1 40 154.10001] CT
0.149 GC
/Helvetica 10 F
GS
[1 0 0 1 0 0] CT
-14 3.5 moveto 
1 -1 scale
(0.2) t 
GR
GR
GS
[1 0 0 1 40 119.7] CT
0.149 GC
/Helvetica 10 F
GS
[1 0 0 1 0 0] CT
-14 3.5 moveto 
1 -1 scale
(0.4) t 
GR
GR
GS
[1 0 0 1 40 85.3] CT
0.149 GC
/Helvetica 10 F
GS
[1 0 0 1 0 0] CT
-14 3.5 moveto 
1 -1 scale
(0.6) t 
GR
GR
GS
[1 0 0 1 40 50.90001] CT
0.149 GC
/Helvetica 10 F
GS
[1 0 0 1 0 0] CT
-14 3.5 moveto 
1 -1 scale
(0.8) t 
GR
GR
GS
[1 0 0 1 40 16.49999] CT
0.149 GC
/Helvetica 10 F
GS
[1 0 0 1 0 0] CT
-6 3.5 moveto 
1 -1 scale
(1) t 
GR
GR
GS
[0 -1 1 0 23 102.49992] CT
0.149 GC
/Helvetica 11 F
GS
[1 0 0 1 0 0] CT
-33.5 -3 moveto 
1 -1 scale
(Value of MSE) t 
GR
GR
GS
[1 0 0 1 44 13] CT
0.149 GC
N
1.469 -0.281 M
1.469 -0.359 1.516 -0.438 QT
3.594 -2.5 L
1.516 -4.578 L
1.469 -4.625 1.469 -4.719 QT
1.469 -4.781 1.531 -4.844 QT
1.594 -4.906 1.672 -4.906 QT
1.734 -4.906 1.828 -4.844 QT
3.891 -2.781 L
5.953 -4.844 L
6.031 -4.906 6.094 -4.906 QT
6.188 -4.906 6.234 -4.844 QT
6.297 -4.797 6.297 -4.719 QT
6.297 -4.625 6.25 -4.578 QT
4.172 -2.5 L
6.25 -0.438 L
6.297 -0.359 6.297 -0.281 QT
6.297 -0.203 6.234 -0.141 QT
6.188 -0.094 6.094 -0.094 QT
6.031 -0.094 5.953 -0.156 QT
3.891 -2.219 L
1.828 -0.156 L
1.75 -0.094 1.672 -0.094 QT
1.594 -0.094 1.531 -0.156 QT
1.469 -0.219 1.469 -0.281 QT
cp
f
GR
GS
[1 0 0 1 52 13] CT
0.149 GC
/Helvetica 10 F
GS
[1 0 0 1 0 0] CT
0 0 moveto 
1 -1 scale
(10) t 
GR
GR
GS
[1 0 0 1 64 8] CT
0.149 GC
/Helvetica 8 F
GS
[1 0 0 1 0 0] CT
0 0 moveto 
1 -1 scale
(-3) t 
GR
GR
GS
[1 0 0 1 174.50017 15.12498] CT
/Helvetica-Bold 11 F
GS
[1 0 0 1 0 0] CT
-80.5 -3 moveto 
1 -1 scale
(Number of realizations R = 200) t 
GR
GR
GS
[1 0 0 1 70.1 47.41785] CT
1 0 0 RC
10.0 ML
2 LW
N
-2.121 -2.121 M
2.121 2.121 L
-2.121 2.121 M
2.121 -2.121 L
S
GR
GS
[1 0 0 1 96.2 120.94014] CT
1 0 0 RC
10.0 ML
2 LW
N
-2.121 -2.121 M
2.121 2.121 L
-2.121 2.121 M
2.121 -2.121 L
S
GR
GS
[1 0 0 1 122.3 142.28152] CT
1 0 0 RC
10.0 ML
2 LW
N
-2.121 -2.121 M
2.121 2.121 L
-2.121 2.121 M
2.121 -2.121 L
S
GR
GS
[1 0 0 1 148.39999 145.46228] CT
1 0 0 RC
10.0 ML
2 LW
N
-2.121 -2.121 M
2.121 2.121 L
-2.121 2.121 M
2.121 -2.121 L
S
GR
GS
[1 0 0 1 174.5 161.45372] CT
1 0 0 RC
10.0 ML
2 LW
N
-2.121 -2.121 M
2.121 2.121 L
-2.121 2.121 M
2.121 -2.121 L
S
GR
GS
[1 0 0 1 200.60001 163.96878] CT
1 0 0 RC
10.0 ML
2 LW
N
-2.121 -2.121 M
2.121 2.121 L
-2.121 2.121 M
2.121 -2.121 L
S
GR
GS
[1 0 0 1 226.7 166.81024] CT
1 0 0 RC
10.0 ML
2 LW
N
-2.121 -2.121 M
2.121 2.121 L
-2.121 2.121 M
2.121 -2.121 L
S
GR
GS
[1 0 0 1 252.8 168.78403] CT
1 0 0 RC
10.0 ML
2 LW
N
-2.121 -2.121 M
2.121 2.121 L
-2.121 2.121 M
2.121 -2.121 L
S
GR
GS
[1 0 0 1 278.89999 172.87045] CT
1 0 0 RC
10.0 ML
2 LW
N
-2.121 -2.121 M
2.121 2.121 L
-2.121 2.121 M
2.121 -2.121 L
S
GR
GS
[1 0 0 1 305 175.42598] CT
1 0 0 RC
10.0 ML
2 LW
N
-2.121 -2.121 M
2.121 2.121 L
-2.121 2.121 M
2.121 -2.121 L
S
GR
GS
[1 0 0 1 70.1 45.16666] CT
0 0 1 RC
N
0 -2 M
1.105 -2 2 -1.105 2 0 C
2 0 L
2 1.105 1.105 2 0 2 C
-1.105 2 -2 1.105 -2 0 C
-2 -1.105 -1.105 -2 0 -2 C
cp
0 -4 M
-2.209 -4 -4 -2.209 -4 0 C
-4 2.209 -2.209 4 0 4 C
2.209 4 4 2.209 4 0 C
4 0 L
4 -2.209 2.209 -4 0 -4 C
cp
f
GR
GS
[1 0 0 1 96.2 116.83333] CT
0 0 1 RC
N
/f-421279856{0 -2 M
1.105 -2 2 -1.105 2 0 C
2 0 L
2 1.105 1.105 2 0 2 C
-1.105 2 -2 1.105 -2 0 C
-2 -1.105 -1.105 -2 0 -2 C
cp
0 -4 M
-2.209 -4 -4 -2.209 -4 0 C
-4 2.209 -2.209 4 0 4 C
2.209 4 4 2.209 4 0 C
4 0 L
4 -2.209 2.209 -4 0 -4 C
cp}def
f-421279856
f
GR
GS
[1 0 0 1 122.3 140.72221] CT
0 0 1 RC
N
f-421279856
f
GR
GS
[1 0 0 1 148.39999 152.66667] CT
0 0 1 RC
N
f-421279856
f
GR
GS
[1 0 0 1 174.5 159.83333] CT
0 0 1 RC
N
f-421279856
f
GR
GS
[1 0 0 1 200.60001 164.61111] CT
0 0 1 RC
N
f-421279856
f
GR
GS
[1 0 0 1 226.7 168.0238] CT
0 0 1 RC
N
f-421279856
f
GR
GS
[1 0 0 1 252.8 170.58333] CT
0 0 1 RC
N
f-421279856
f
GR
GS
[1 0 0 1 278.89999 172.57408] CT
0 0 1 RC
N
f-421279856
f
GR
GS
[1 0 0 1 305 174.16667] CT
0 0 1 RC
N
f-421279856
f
GR
GS
1 GC
N
298 49.5 M
298 23 L
212.5 23 L
212.5 49.5 L
cp
f
GR
GS
[1 0 0 1 249.5 30.5] CT
/Helvetica 9 F
GS
[1 0 0 1 0 0] CT
0 3.5 moveto 
1 -1 scale
(Computed) t 
GR
GR
GS
[1 0 0 1 231.5 30.5] CT
1 0 0 RC
10.0 ML
2 LW
N
-2.121 -2.121 M
2.121 2.121 L
-2.121 2.121 M
2.121 -2.121 L
S
GR
GS
[1 0 0 1 249.5 42] CT
/Helvetica 9 F
GS
[1 0 0 1 0 0] CT
0 3.5 moveto 
1 -1 scale
(Theoretical) t 
GR
GR
GS
[1 0 0 1 231.5 42] CT
0 0 1 RC
N
f-421279856
f
GR
GS
0.149 GC
10.0 ML
0.5 LW
N
212.5 49.5 M
212.5 23 L
298 23 L
298 49.5 L
cp
S
GR
%%Trailer
%%Pages: 1
%%EOF
