%!PS-Adobe-3.0 EPSF-3.0
%%Creator: (MATLAB, The Mathworks, Inc. Version 23.2.0.2409890 \(R2023b\) Update 3. Operating System: Mac OS X)
%%Title: /Users/jakub/Projects/modeling-and-identification/report-03/images/lab8/10_000.eps
%%CreationDate: 2024-01-04T18:11:57
%%Pages: (atend)
%%BoundingBox:     0     0   306   216
%%LanguageLevel: 3
%%EndComments
%%BeginProlog
%%BeginResource: procset (Apache XML Graphics Std ProcSet) 1.2 0
%%Version: 1.2 0
%%Copyright: (Copyright 2001-2003,2010 The Apache Software Foundation. License terms: http://www.apache.org/licenses/LICENSE-2.0)
/bd{bind def}bind def
/ld{load def}bd
/GR/grestore ld
/GS/gsave ld
/RM/rmoveto ld
/C/curveto ld
/t/show ld
/L/lineto ld
/ML/setmiterlimit ld
/CT/concat ld
/f/fill ld
/N/newpath ld
/S/stroke ld
/CC/setcmykcolor ld
/A/ashow ld
/cp/closepath ld
/RC/setrgbcolor ld
/LJ/setlinejoin ld
/GC/setgray ld
/LW/setlinewidth ld
/M/moveto ld
/re {4 2 roll M
1 index 0 rlineto
0 exch rlineto
neg 0 rlineto
cp } bd
/_ctm matrix def
/_tm matrix def
/BT { _ctm currentmatrix pop matrix _tm copy pop 0 0 moveto } bd
/ET { _ctm setmatrix } bd
/iTm { _ctm setmatrix _tm concat } bd
/Tm { _tm astore pop iTm 0 0 moveto } bd
/ux 0.0 def
/uy 0.0 def
/F {
  /Tp exch def
  /Tf exch def
  Tf findfont Tp scalefont setfont
  /cf Tf def  /cs Tp def
} bd
/ULS {currentpoint /uy exch def /ux exch def} bd
/ULE {
  /Tcx currentpoint pop def
  gsave
  newpath
  cf findfont cs scalefont dup
  /FontMatrix get 0 get /Ts exch def /FontInfo get dup
  /UnderlinePosition get Ts mul /To exch def
  /UnderlineThickness get Ts mul /Tt exch def
  ux uy To add moveto  Tcx uy To add lineto
  Tt setlinewidth stroke
  grestore
} bd
/OLE {
  /Tcx currentpoint pop def
  gsave
  newpath
  cf findfont cs scalefont dup
  /FontMatrix get 0 get /Ts exch def /FontInfo get dup
  /UnderlinePosition get Ts mul /To exch def
  /UnderlineThickness get Ts mul /Tt exch def
  ux uy To add cs add moveto Tcx uy To add cs add lineto
  Tt setlinewidth stroke
  grestore
} bd
/SOE {
  /Tcx currentpoint pop def
  gsave
  newpath
  cf findfont cs scalefont dup
  /FontMatrix get 0 get /Ts exch def /FontInfo get dup
  /UnderlinePosition get Ts mul /To exch def
  /UnderlineThickness get Ts mul /Tt exch def
  ux uy To add cs 10 mul 26 idiv add moveto Tcx uy To add cs 10 mul 26 idiv add lineto
  Tt setlinewidth stroke
  grestore
} bd
/QT {
/Y22 exch store
/X22 exch store
/Y21 exch store
/X21 exch store
currentpoint
/Y21 load 2 mul add 3 div exch
/X21 load 2 mul add 3 div exch
/X21 load 2 mul /X22 load add 3 div
/Y21 load 2 mul /Y22 load add 3 div
/X22 load /Y22 load curveto
} bd
/SSPD {
dup length /d exch dict def
{
/v exch def
/k exch def
currentpagedevice k known {
/cpdv currentpagedevice k get def
v cpdv ne {
/upd false def
/nullv v type /nulltype eq def
/nullcpdv cpdv type /nulltype eq def
nullv nullcpdv or
{
/upd true def
} {
/sametype v type cpdv type eq def
sametype {
v type /arraytype eq {
/vlen v length def
/cpdvlen cpdv length def
vlen cpdvlen eq {
0 1 vlen 1 sub {
/i exch def
/obj v i get def
/cpdobj cpdv i get def
obj cpdobj ne {
/upd true def
exit
} if
} for
} {
/upd true def
} ifelse
} {
v type /dicttype eq {
v {
/dv exch def
/dk exch def
/cpddv cpdv dk get def
dv cpddv ne {
/upd true def
exit
} if
} forall
} {
/upd true def
} ifelse
} ifelse
} if
} ifelse
upd true eq {
d k v put
} if
} if
} if
} forall
d length 0 gt {
d setpagedevice
} if
} bd
/RE { % /NewFontName [NewEncodingArray] /FontName RE -
  findfont dup length dict begin
  {
    1 index /FID ne
    {def} {pop pop} ifelse
  } forall
  /Encoding exch def
  /FontName 1 index def
  currentdict definefont pop
  end
} bind def
%%EndResource
%%BeginResource: procset (Apache XML Graphics EPS ProcSet) 1.0 0
%%Version: 1.0 0
%%Copyright: (Copyright 2002-2003 The Apache Software Foundation. License terms: http://www.apache.org/licenses/LICENSE-2.0)
/BeginEPSF { %def
/b4_Inc_state save def         % Save state for cleanup
/dict_count countdictstack def % Count objects on dict stack
/op_count count 1 sub def      % Count objects on operand stack
userdict begin                 % Push userdict on dict stack
/showpage { } def              % Redefine showpage, { } = null proc
0 setgray 0 setlinecap         % Prepare graphics state
1 setlinewidth 0 setlinejoin
10 setmiterlimit [ ] 0 setdash newpath
/languagelevel where           % If level not equal to 1 then
{pop languagelevel             % set strokeadjust and
1 ne                           % overprint to their defaults.
{false setstrokeadjust false setoverprint
} if
} if
} bd
/EndEPSF { %def
count op_count sub {pop} repeat            % Clean up stacks
countdictstack dict_count sub {end} repeat
b4_Inc_state restore
} bd
%%EndResource
%FOPBeginFontDict
%%IncludeResource: font Courier-Oblique
%%IncludeResource: font Courier-BoldOblique
%%IncludeResource: font Courier-Bold
%%IncludeResource: font ZapfDingbats
%%IncludeResource: font Symbol
%%IncludeResource: font Helvetica
%%IncludeResource: font Helvetica-Oblique
%%IncludeResource: font Helvetica-Bold
%%IncludeResource: font Helvetica-BoldOblique
%%IncludeResource: font Times-Roman
%%IncludeResource: font Times-Italic
%%IncludeResource: font Times-Bold
%%IncludeResource: font Times-BoldItalic
%%IncludeResource: font Courier
%FOPEndFontDict
%%BeginResource: encoding WinAnsiEncoding
/WinAnsiEncoding [
/.notdef /.notdef /.notdef /.notdef /.notdef
/.notdef /.notdef /.notdef /.notdef /.notdef
/.notdef /.notdef /.notdef /.notdef /.notdef
/.notdef /.notdef /.notdef /.notdef /.notdef
/.notdef /.notdef /.notdef /.notdef /.notdef
/.notdef /.notdef /.notdef /.notdef /.notdef
/.notdef /.notdef /space /exclam /quotedbl
/numbersign /dollar /percent /ampersand /quotesingle
/parenleft /parenright /asterisk /plus /comma
/hyphen /period /slash /zero /one
/two /three /four /five /six
/seven /eight /nine /colon /semicolon
/less /equal /greater /question /at
/A /B /C /D /E
/F /G /H /I /J
/K /L /M /N /O
/P /Q /R /S /T
/U /V /W /X /Y
/Z /bracketleft /backslash /bracketright /asciicircum
/underscore /quoteleft /a /b /c
/d /e /f /g /h
/i /j /k /l /m
/n /o /p /q /r
/s /t /u /v /w
/x /y /z /braceleft /bar
/braceright /asciitilde /bullet /Euro /bullet
/quotesinglbase /florin /quotedblbase /ellipsis /dagger
/daggerdbl /circumflex /perthousand /Scaron /guilsinglleft
/OE /bullet /Zcaron /bullet /bullet
/quoteleft /quoteright /quotedblleft /quotedblright /bullet
/endash /emdash /asciitilde /trademark /scaron
/guilsinglright /oe /bullet /zcaron /Ydieresis
/space /exclamdown /cent /sterling /currency
/yen /brokenbar /section /dieresis /copyright
/ordfeminine /guillemotleft /logicalnot /sfthyphen /registered
/macron /degree /plusminus /twosuperior /threesuperior
/acute /mu /paragraph /middot /cedilla
/onesuperior /ordmasculine /guillemotright /onequarter /onehalf
/threequarters /questiondown /Agrave /Aacute /Acircumflex
/Atilde /Adieresis /Aring /AE /Ccedilla
/Egrave /Eacute /Ecircumflex /Edieresis /Igrave
/Iacute /Icircumflex /Idieresis /Eth /Ntilde
/Ograve /Oacute /Ocircumflex /Otilde /Odieresis
/multiply /Oslash /Ugrave /Uacute /Ucircumflex
/Udieresis /Yacute /Thorn /germandbls /agrave
/aacute /acircumflex /atilde /adieresis /aring
/ae /ccedilla /egrave /eacute /ecircumflex
/edieresis /igrave /iacute /icircumflex /idieresis
/eth /ntilde /ograve /oacute /ocircumflex
/otilde /odieresis /divide /oslash /ugrave
/uacute /ucircumflex /udieresis /yacute /thorn
/ydieresis
] def
%%EndResource
%FOPBeginFontReencode
/Courier-Oblique findfont
dup length dict begin
  {1 index /FID ne {def} {pop pop} ifelse} forall
  /Encoding WinAnsiEncoding def
  currentdict
end
/Courier-Oblique exch definefont pop
/Courier-BoldOblique findfont
dup length dict begin
  {1 index /FID ne {def} {pop pop} ifelse} forall
  /Encoding WinAnsiEncoding def
  currentdict
end
/Courier-BoldOblique exch definefont pop
/Courier-Bold findfont
dup length dict begin
  {1 index /FID ne {def} {pop pop} ifelse} forall
  /Encoding WinAnsiEncoding def
  currentdict
end
/Courier-Bold exch definefont pop
/Helvetica findfont
dup length dict begin
  {1 index /FID ne {def} {pop pop} ifelse} forall
  /Encoding WinAnsiEncoding def
  currentdict
end
/Helvetica exch definefont pop
/Helvetica-Oblique findfont
dup length dict begin
  {1 index /FID ne {def} {pop pop} ifelse} forall
  /Encoding WinAnsiEncoding def
  currentdict
end
/Helvetica-Oblique exch definefont pop
/Helvetica-Bold findfont
dup length dict begin
  {1 index /FID ne {def} {pop pop} ifelse} forall
  /Encoding WinAnsiEncoding def
  currentdict
end
/Helvetica-Bold exch definefont pop
/Helvetica-BoldOblique findfont
dup length dict begin
  {1 index /FID ne {def} {pop pop} ifelse} forall
  /Encoding WinAnsiEncoding def
  currentdict
end
/Helvetica-BoldOblique exch definefont pop
/Times-Roman findfont
dup length dict begin
  {1 index /FID ne {def} {pop pop} ifelse} forall
  /Encoding WinAnsiEncoding def
  currentdict
end
/Times-Roman exch definefont pop
/Times-Italic findfont
dup length dict begin
  {1 index /FID ne {def} {pop pop} ifelse} forall
  /Encoding WinAnsiEncoding def
  currentdict
end
/Times-Italic exch definefont pop
/Times-Bold findfont
dup length dict begin
  {1 index /FID ne {def} {pop pop} ifelse} forall
  /Encoding WinAnsiEncoding def
  currentdict
end
/Times-Bold exch definefont pop
/Times-BoldItalic findfont
dup length dict begin
  {1 index /FID ne {def} {pop pop} ifelse} forall
  /Encoding WinAnsiEncoding def
  currentdict
end
/Times-BoldItalic exch definefont pop
/Courier findfont
dup length dict begin
  {1 index /FID ne {def} {pop pop} ifelse} forall
  /Encoding WinAnsiEncoding def
  currentdict
end
/Courier exch definefont pop
%FOPEndFontReencode
%%EndProlog
%%Page: 1 1
%%PageBoundingBox: 0 0 306 216
%%BeginPageSetup
[1 0 0 -1 0 216] CT
%%EndPageSetup
GS
1 GC
N
0 0 306 216 re
f
GR
GS
1 GC
N
0 0 306 216 re
f
GR
GS
1 GC
N
40 192 M
277 192 L
277 16.5 L
40 16.5 L
cp
f
GR
GS
0.873 GC
1 LJ
0.5 LW
N
40 192 M
40 16.5 L
S
GR
GS
0.873 GC
1 LJ
0.5 LW
N
79.5 192 M
79.5 16.5 L
S
GR
GS
0.873 GC
1 LJ
0.5 LW
N
119 192 M
119 16.5 L
S
GR
GS
0.873 GC
1 LJ
0.5 LW
N
158.5 192 M
158.5 16.5 L
S
GR
GS
0.873 GC
1 LJ
0.5 LW
N
198 192 M
198 16.5 L
S
GR
GS
0.873 GC
1 LJ
0.5 LW
N
237.5 192 M
237.5 16.5 L
S
GR
GS
0.873 GC
1 LJ
0.5 LW
N
277 192 M
277 16.5 L
S
GR
GS
0.873 GC
1 LJ
0.5 LW
N
277 192 M
40 192 L
S
GR
GS
0.873 GC
1 LJ
0.5 LW
N
277 162.75 M
40 162.75 L
S
GR
GS
0.873 GC
1 LJ
0.5 LW
N
277 133.5 M
40 133.5 L
S
GR
GS
0.873 GC
1 LJ
0.5 LW
N
277 104.25 M
40 104.25 L
S
GR
GS
0.873 GC
1 LJ
0.5 LW
N
277 75 M
40 75 L
S
GR
GS
0.873 GC
1 LJ
0.5 LW
N
277 45.75 M
40 45.75 L
S
GR
GS
0.873 GC
1 LJ
0.5 LW
N
277 16.5 M
40 16.5 L
S
GR
GS
0.149 GC
2 setlinecap
1 LJ
0.5 LW
N
40 192 M
277 192 L
S
GR
GS
0.149 GC
2 setlinecap
1 LJ
0.5 LW
N
40 192 M
40 189.63 L
S
GR
GS
0.149 GC
2 setlinecap
1 LJ
0.5 LW
N
79.5 192 M
79.5 189.63 L
S
GR
GS
0.149 GC
2 setlinecap
1 LJ
0.5 LW
N
119 192 M
119 189.63 L
S
GR
GS
0.149 GC
2 setlinecap
1 LJ
0.5 LW
N
158.5 192 M
158.5 189.63 L
S
GR
GS
0.149 GC
2 setlinecap
1 LJ
0.5 LW
N
198 192 M
198 189.63 L
S
GR
GS
0.149 GC
2 setlinecap
1 LJ
0.5 LW
N
237.5 192 M
237.5 189.63 L
S
GR
GS
0.149 GC
2 setlinecap
1 LJ
0.5 LW
N
277 192 M
277 189.63 L
S
GR
GS
[1 0 0 1 40 196] CT
0.149 GC
/Helvetica 10 F
GS
[1 0 0 1 0 0] CT
-5 10 moveto 
1 -1 scale
(-6) t 
GR
GR
GS
[1 0 0 1 79.5 196] CT
0.149 GC
/Helvetica 10 F
GS
[1 0 0 1 0 0] CT
-5 10 moveto 
1 -1 scale
(-4) t 
GR
GR
GS
[1 0 0 1 119 196] CT
0.149 GC
/Helvetica 10 F
GS
[1 0 0 1 0 0] CT
-5 10 moveto 
1 -1 scale
(-2) t 
GR
GR
GS
[1 0 0 1 158.5 196] CT
0.149 GC
/Helvetica 10 F
GS
[1 0 0 1 0 0] CT
-3 10 moveto 
1 -1 scale
(0) t 
GR
GR
GS
[1 0 0 1 198 196] CT
0.149 GC
/Helvetica 10 F
GS
[1 0 0 1 0 0] CT
-3 10 moveto 
1 -1 scale
(2) t 
GR
GR
GS
[1 0 0 1 237.5 196] CT
0.149 GC
/Helvetica 10 F
GS
[1 0 0 1 0 0] CT
-3 10 moveto 
1 -1 scale
(4) t 
GR
GR
GS
[1 0 0 1 277 196] CT
0.149 GC
/Helvetica 10 F
GS
[1 0 0 1 0 0] CT
-3 10 moveto 
1 -1 scale
(6) t 
GR
GR
GS
0.149 GC
2 setlinecap
1 LJ
0.5 LW
N
40 192 M
40 16.5 L
S
GR
GS
0.149 GC
2 setlinecap
1 LJ
0.5 LW
N
40 192 M
42.37 192 L
S
GR
GS
0.149 GC
2 setlinecap
1 LJ
0.5 LW
N
40 162.75 M
42.37 162.75 L
S
GR
GS
0.149 GC
2 setlinecap
1 LJ
0.5 LW
N
40 133.5 M
42.37 133.5 L
S
GR
GS
0.149 GC
2 setlinecap
1 LJ
0.5 LW
N
40 104.25 M
42.37 104.25 L
S
GR
GS
0.149 GC
2 setlinecap
1 LJ
0.5 LW
N
40 75 M
42.37 75 L
S
GR
GS
0.149 GC
2 setlinecap
1 LJ
0.5 LW
N
40 45.75 M
42.37 45.75 L
S
GR
GS
0.149 GC
2 setlinecap
1 LJ
0.5 LW
N
40 16.5 M
42.37 16.5 L
S
GR
GS
[1 0 0 1 36 192] CT
0.149 GC
/Helvetica 10 F
GS
[1 0 0 1 0 0] CT
-16 3.5 moveto 
1 -1 scale
(-10) t 
GR
GR
GS
[1 0 0 1 36 162.75] CT
0.149 GC
/Helvetica 10 F
GS
[1 0 0 1 0 0] CT
-6 3.5 moveto 
1 -1 scale
(0) t 
GR
GR
GS
[1 0 0 1 36 133.5] CT
0.149 GC
/Helvetica 10 F
GS
[1 0 0 1 0 0] CT
-12 3.5 moveto 
1 -1 scale
(10) t 
GR
GR
GS
[1 0 0 1 36 104.25] CT
0.149 GC
/Helvetica 10 F
GS
[1 0 0 1 0 0] CT
-12 3.5 moveto 
1 -1 scale
(20) t 
GR
GR
GS
[1 0 0 1 36 75] CT
0.149 GC
/Helvetica 10 F
GS
[1 0 0 1 0 0] CT
-12 3.5 moveto 
1 -1 scale
(30) t 
GR
GR
GS
[1 0 0 1 36 45.75] CT
0.149 GC
/Helvetica 10 F
GS
[1 0 0 1 0 0] CT
-12 3.5 moveto 
1 -1 scale
(40) t 
GR
GR
GS
[1 0 0 1 36 16.5] CT
0.149 GC
/Helvetica 10 F
GS
[1 0 0 1 0 0] CT
-12 3.5 moveto 
1 -1 scale
(50) t 
GR
GR
GS
[1 0 0 1 158.50015 15.12891] CT
/Helvetica-Bold 11 F
GS
[1 0 0 1 0 0] CT
-84 -3 moveto 
1 -1 scale
(Estimation for N = 10000 H = 0.7) t 
GR
GR
GS
0 0.447 0.741 RC
1 LJ
1.5 LW
N
40 75 M
42.394 78.857 L
44.788 82.628 L
47.182 86.313 L
49.576 89.912 L
51.97 93.426 L
54.364 96.853 L
56.758 100.194 L
59.152 103.45 L
61.545 106.619 L
63.939 109.702 L
66.333 112.7 L
68.727 115.612 L
71.121 118.437 L
73.515 121.177 L
75.909 123.831 L
78.303 126.398 L
80.697 128.88 L
83.091 131.276 L
85.485 133.586 L
87.879 135.81 L
90.273 137.948 L
92.667 140 L
95.061 141.966 L
97.455 143.846 L
99.848 145.641 L
102.242 147.349 L
104.636 148.971 L
107.03 150.507 L
109.424 151.958 L
111.818 153.322 L
114.212 154.601 L
116.606 155.793 L
119 156.9 L
121.394 157.921 L
123.788 158.855 L
126.182 159.704 L
128.576 160.467 L
130.97 161.144 L
133.364 161.735 L
135.758 162.24 L
138.152 162.659 L
140.545 162.992 L
142.939 163.239 L
145.333 163.4 L
147.727 163.475 L
150.121 163.464 L
152.515 163.368 L
154.909 163.185 L
157.303 162.917 L
159.697 162.562 L
162.091 162.121 L
164.485 161.595 L
166.879 160.983 L
169.273 160.284 L
171.667 159.5 L
174.061 158.63 L
176.455 157.674 L
178.848 156.631 L
181.242 155.503 L
183.636 154.289 L
186.03 152.989 L
188.424 151.603 L
190.818 150.131 L
193.212 148.574 L
195.606 146.93 L
198 145.2 L
200.394 143.384 L
202.788 141.483 L
205.182 139.495 L
207.576 137.421 L
209.97 135.262 L
212.364 133.017 L
214.758 130.685 L
217.152 128.268 L
219.545 125.764 L
221.939 123.175 L
224.333 120.5 L
226.727 117.739 L
229.121 114.892 L
231.515 111.959 L
233.909 108.94 L
236.303 105.835 L
238.697 102.644 L
241.091 99.367 L
243.485 96.004 L
245.879 92.555 L
248.273 89.021 L
250.667 85.4 L
253.061 81.693 L
255.455 77.901 L
257.848 74.022 L
260.242 70.058 L
262.636 66.007 L
265.03 61.871 L
267.424 57.649 L
269.818 53.34 L
272.212 48.946 L
274.606 44.466 L
277 39.9 L
S
GR
GS
0.851 0.325 0.098 RC
1 LJ
N
40 91.396 M
42.394 93.431 L
44.788 96.234 L
47.182 98.175 L
49.576 101.367 L
51.97 104.703 L
54.364 107.93 L
56.758 110.32 L
59.152 112.841 L
61.545 115.525 L
63.939 117.72 L
66.333 120.052 L
68.727 122.379 L
71.121 125.06 L
73.515 127.528 L
75.909 129.999 L
78.303 132.017 L
80.697 133.962 L
83.091 135.783 L
85.485 137.618 L
87.879 139.629 L
90.273 141.569 L
92.667 143.328 L
95.061 144.911 L
97.455 146.45 L
99.848 147.952 L
102.242 149.491 L
104.636 150.977 L
107.03 152.122 L
109.424 153.316 L
111.818 154.472 L
114.212 155.643 L
116.606 156.758 L
119 157.779 L
121.394 158.582 L
123.788 159.449 L
126.182 160.121 L
128.576 160.816 L
130.97 161.44 L
133.364 161.956 L
135.758 162.362 L
138.152 162.711 L
140.545 162.938 L
142.939 163.124 L
145.333 163.234 L
147.727 163.296 L
150.121 163.284 L
152.515 163.163 L
154.909 162.985 L
157.303 162.761 L
159.697 162.456 L
162.091 162.048 L
164.485 161.599 L
166.879 160.997 L
169.273 160.253 L
171.667 159.561 L
174.061 158.68 L
176.455 157.841 L
178.848 156.932 L
181.242 155.987 L
183.636 154.94 L
186.03 153.685 L
188.424 152.303 L
190.818 151.003 L
193.212 149.576 L
195.606 148.088 L
198 146.742 L
200.394 145.116 L
202.788 143.487 L
205.182 141.604 L
207.576 139.947 L
209.97 137.774 L
212.364 135.758 L
214.758 133.746 L
217.152 131.774 L
219.545 129.479 L
221.939 127.377 L
224.333 124.827 L
226.727 122.281 L
229.121 119.909 L
231.515 117.555 L
233.909 115.005 L
236.303 112.706 L
238.697 109.783 L
241.091 106.577 L
243.485 103.957 L
245.879 101.435 L
248.273 98.456 L
250.667 95.555 L
253.061 92.314 L
255.455 88.074 L
257.848 85.074 L
260.242 82.504 L
262.636 79.016 L
265.03 76.034 L
267.424 72.801 L
269.818 68.852 L
272.212 66.238 L
274.606 62.971 L
277 60.624 L
S
GR
GS
[1 0 0 1 40 91.39648] CT
0.851 0.325 0.098 RC
N
1 0 M
1 0.552 0.552 1 0 1 C
-0.552 1 -1 0.552 -1 0 C
-1 -0.552 -0.552 -1 0 -1 C
0.552 -1 1 -0.552 1 0 C
cp
f
GR
GS
[1 0 0 1 42.39394 93.43144] CT
0.851 0.325 0.098 RC
N
/f-891180347{1 0 M
1 0.552 0.552 1 0 1 C
-0.552 1 -1 0.552 -1 0 C
-1 -0.552 -0.552 -1 0 -1 C
0.552 -1 1 -0.552 1 0 C
cp}def
f-891180347
f
GR
GS
[1 0 0 1 44.78788 96.2344] CT
0.851 0.325 0.098 RC
N
f-891180347
f
GR
GS
[1 0 0 1 47.18182 98.17508] CT
0.851 0.325 0.098 RC
N
f-891180347
f
GR
GS
[1 0 0 1 49.57576 101.36733] CT
0.851 0.325 0.098 RC
N
f-891180347
f
GR
GS
[1 0 0 1 51.9697 104.70324] CT
0.851 0.325 0.098 RC
N
f-891180347
f
GR
GS
[1 0 0 1 54.36363 107.92969] CT
0.851 0.325 0.098 RC
N
f-891180347
f
GR
GS
[1 0 0 1 56.75758 110.32005] CT
0.851 0.325 0.098 RC
N
f-891180347
f
GR
GS
[1 0 0 1 59.15152 112.84148] CT
0.851 0.325 0.098 RC
N
f-891180347
f
GR
GS
[1 0 0 1 61.54545 115.52469] CT
0.851 0.325 0.098 RC
N
f-891180347
f
GR
GS
[1 0 0 1 63.93939 117.7197] CT
0.851 0.325 0.098 RC
N
f-891180347
f
GR
GS
[1 0 0 1 66.33334 120.05248] CT
0.851 0.325 0.098 RC
N
f-891180347
f
GR
GS
[1 0 0 1 68.72727 122.37913] CT
0.851 0.325 0.098 RC
N
f-891180347
f
GR
GS
[1 0 0 1 71.12121 125.05978] CT
0.851 0.325 0.098 RC
N
f-891180347
f
GR
GS
[1 0 0 1 73.51514 127.5276] CT
0.851 0.325 0.098 RC
N
f-891180347
f
GR
GS
[1 0 0 1 75.9091 129.99898] CT
0.851 0.325 0.098 RC
N
f-891180347
f
GR
GS
[1 0 0 1 78.30303 132.01717] CT
0.851 0.325 0.098 RC
N
f-891180347
f
GR
GS
[1 0 0 1 80.69697 133.96153] CT
0.851 0.325 0.098 RC
N
f-891180347
f
GR
GS
[1 0 0 1 83.09091 135.78253] CT
0.851 0.325 0.098 RC
N
f-891180347
f
GR
GS
[1 0 0 1 85.48485 137.61765] CT
0.851 0.325 0.098 RC
N
f-891180347
f
GR
GS
[1 0 0 1 87.87879 139.62856] CT
0.851 0.325 0.098 RC
N
f-891180347
f
GR
GS
[1 0 0 1 90.27273 141.569] CT
0.851 0.325 0.098 RC
N
f-891180347
f
GR
GS
[1 0 0 1 92.66667 143.32841] CT
0.851 0.325 0.098 RC
N
f-891180347
f
GR
GS
[1 0 0 1 95.06061 144.91063] CT
0.851 0.325 0.098 RC
N
f-891180347
f
GR
GS
[1 0 0 1 97.45454 146.44966] CT
0.851 0.325 0.098 RC
N
f-891180347
f
GR
GS
[1 0 0 1 99.84849 147.95224] CT
0.851 0.325 0.098 RC
N
f-891180347
f
GR
GS
[1 0 0 1 102.24242 149.49095] CT
0.851 0.325 0.098 RC
N
f-891180347
f
GR
GS
[1 0 0 1 104.63636 150.97675] CT
0.851 0.325 0.098 RC
N
f-891180347
f
GR
GS
[1 0 0 1 107.0303 152.12224] CT
0.851 0.325 0.098 RC
N
f-891180347
f
GR
GS
[1 0 0 1 109.42424 153.31554] CT
0.851 0.325 0.098 RC
N
f-891180347
f
GR
GS
[1 0 0 1 111.81818 154.47214] CT
0.851 0.325 0.098 RC
N
f-891180347
f
GR
GS
[1 0 0 1 114.21212 155.64339] CT
0.851 0.325 0.098 RC
N
f-891180347
f
GR
GS
[1 0 0 1 116.60606 156.75829] CT
0.851 0.325 0.098 RC
N
f-891180347
f
GR
GS
[1 0 0 1 119 157.77922] CT
0.851 0.325 0.098 RC
N
f-891180347
f
GR
GS
[1 0 0 1 121.39394 158.58203] CT
0.851 0.325 0.098 RC
N
f-891180347
f
GR
GS
[1 0 0 1 123.78788 159.44908] CT
0.851 0.325 0.098 RC
N
f-891180347
f
GR
GS
[1 0 0 1 126.18182 160.12085] CT
0.851 0.325 0.098 RC
N
f-891180347
f
GR
GS
[1 0 0 1 128.57576 160.81583] CT
0.851 0.325 0.098 RC
N
f-891180347
f
GR
GS
[1 0 0 1 130.9697 161.43954] CT
0.851 0.325 0.098 RC
N
f-891180347
f
GR
GS
[1 0 0 1 133.36363 161.9559] CT
0.851 0.325 0.098 RC
N
f-891180347
f
GR
GS
[1 0 0 1 135.75758 162.36169] CT
0.851 0.325 0.098 RC
N
f-891180347
f
GR
GS
[1 0 0 1 138.15152 162.71127] CT
0.851 0.325 0.098 RC
N
f-891180347
f
GR
GS
[1 0 0 1 140.54546 162.93782] CT
0.851 0.325 0.098 RC
N
f-891180347
f
GR
GS
[1 0 0 1 142.93939 163.12433] CT
0.851 0.325 0.098 RC
N
f-891180347
f
GR
GS
[1 0 0 1 145.33333 163.23383] CT
0.851 0.325 0.098 RC
N
f-891180347
f
GR
GS
[1 0 0 1 147.72728 163.29555] CT
0.851 0.325 0.098 RC
N
f-891180347
f
GR
GS
[1 0 0 1 150.12122 163.28395] CT
0.851 0.325 0.098 RC
N
f-891180347
f
GR
GS
[1 0 0 1 152.51515 163.1629] CT
0.851 0.325 0.098 RC
N
f-891180347
f
GR
GS
[1 0 0 1 154.90909 162.98451] CT
0.851 0.325 0.098 RC
N
f-891180347
f
GR
GS
[1 0 0 1 157.30302 162.76108] CT
0.851 0.325 0.098 RC
N
f-891180347
f
GR
GS
[1 0 0 1 159.69698 162.45567] CT
0.851 0.325 0.098 RC
N
f-891180347
f
GR
GS
[1 0 0 1 162.09091 162.04816] CT
0.851 0.325 0.098 RC
N
f-891180347
f
GR
GS
[1 0 0 1 164.48485 161.59866] CT
0.851 0.325 0.098 RC
N
f-891180347
f
GR
GS
[1 0 0 1 166.87878 160.99675] CT
0.851 0.325 0.098 RC
N
f-891180347
f
GR
GS
[1 0 0 1 169.27272 160.25288] CT
0.851 0.325 0.098 RC
N
f-891180347
f
GR
GS
[1 0 0 1 171.66667 159.56097] CT
0.851 0.325 0.098 RC
N
f-891180347
f
GR
GS
[1 0 0 1 174.06061 158.67952] CT
0.851 0.325 0.098 RC
N
f-891180347
f
GR
GS
[1 0 0 1 176.45454 157.84116] CT
0.851 0.325 0.098 RC
N
f-891180347
f
GR
GS
[1 0 0 1 178.84848 156.93214] CT
0.851 0.325 0.098 RC
N
f-891180347
f
GR
GS
[1 0 0 1 181.24242 155.98654] CT
0.851 0.325 0.098 RC
N
f-891180347
f
GR
GS
[1 0 0 1 183.63637 154.93953] CT
0.851 0.325 0.098 RC
N
f-891180347
f
GR
GS
[1 0 0 1 186.0303 153.68503] CT
0.851 0.325 0.098 RC
N
f-891180347
f
GR
GS
[1 0 0 1 188.42424 152.30273] CT
0.851 0.325 0.098 RC
N
f-891180347
f
GR
GS
[1 0 0 1 190.81818 151.00308] CT
0.851 0.325 0.098 RC
N
f-891180347
f
GR
GS
[1 0 0 1 193.21213 149.57645] CT
0.851 0.325 0.098 RC
N
f-891180347
f
GR
GS
[1 0 0 1 195.60606 148.08774] CT
0.851 0.325 0.098 RC
N
f-891180347
f
GR
GS
[1 0 0 1 198 146.7415] CT
0.851 0.325 0.098 RC
N
f-891180347
f
GR
GS
[1 0 0 1 200.39394 145.11617] CT
0.851 0.325 0.098 RC
N
f-891180347
f
GR
GS
[1 0 0 1 202.78787 143.48705] CT
0.851 0.325 0.098 RC
N
f-891180347
f
GR
GS
[1 0 0 1 205.18181 141.60422] CT
0.851 0.325 0.098 RC
N
f-891180347
f
GR
GS
[1 0 0 1 207.57576 139.94695] CT
0.851 0.325 0.098 RC
N
f-891180347
f
GR
GS
[1 0 0 1 209.9697 137.77446] CT
0.851 0.325 0.098 RC
N
f-891180347
f
GR
GS
[1 0 0 1 212.36363 135.75806] CT
0.851 0.325 0.098 RC
N
f-891180347
f
GR
GS
[1 0 0 1 214.75757 133.74586] CT
0.851 0.325 0.098 RC
N
f-891180347
f
GR
GS
[1 0 0 1 217.15152 131.77393] CT
0.851 0.325 0.098 RC
N
f-891180347
f
GR
GS
[1 0 0 1 219.54546 129.47865] CT
0.851 0.325 0.098 RC
N
f-891180347
f
GR
GS
[1 0 0 1 221.93939 127.37708] CT
0.851 0.325 0.098 RC
N
f-891180347
f
GR
GS
[1 0 0 1 224.33333 124.8267] CT
0.851 0.325 0.098 RC
N
f-891180347
f
GR
GS
[1 0 0 1 226.72728 122.2806] CT
0.851 0.325 0.098 RC
N
f-891180347
f
GR
GS
[1 0 0 1 229.12122 119.90943] CT
0.851 0.325 0.098 RC
N
f-891180347
f
GR
GS
[1 0 0 1 231.51515 117.55538] CT
0.851 0.325 0.098 RC
N
f-891180347
f
GR
GS
[1 0 0 1 233.90909 115.00528] CT
0.851 0.325 0.098 RC
N
f-891180347
f
GR
GS
[1 0 0 1 236.30302 112.70595] CT
0.851 0.325 0.098 RC
N
f-891180347
f
GR
GS
[1 0 0 1 238.69698 109.78324] CT
0.851 0.325 0.098 RC
N
f-891180347
f
GR
GS
[1 0 0 1 241.09091 106.57659] CT
0.851 0.325 0.098 RC
N
f-891180347
f
GR
GS
[1 0 0 1 243.48485 103.95747] CT
0.851 0.325 0.098 RC
N
f-891180347
f
GR
GS
[1 0 0 1 245.87878 101.43549] CT
0.851 0.325 0.098 RC
N
f-891180347
f
GR
GS
[1 0 0 1 248.27272 98.45612] CT
0.851 0.325 0.098 RC
N
f-891180347
f
GR
GS
[1 0 0 1 250.66666 95.55509] CT
0.851 0.325 0.098 RC
N
f-891180347
f
GR
GS
[1 0 0 1 253.06061 92.31445] CT
0.851 0.325 0.098 RC
N
f-891180347
f
GR
GS
[1 0 0 1 255.45454 88.07388] CT
0.851 0.325 0.098 RC
N
f-891180347
f
GR
GS
[1 0 0 1 257.84848 85.07404] CT
0.851 0.325 0.098 RC
N
f-891180347
f
GR
GS
[1 0 0 1 260.24243 82.50375] CT
0.851 0.325 0.098 RC
N
f-891180347
f
GR
GS
[1 0 0 1 262.63638 79.01554] CT
0.851 0.325 0.098 RC
N
f-891180347
f
GR
GS
[1 0 0 1 265.0303 76.03365] CT
0.851 0.325 0.098 RC
N
f-891180347
f
GR
GS
[1 0 0 1 267.42426 72.80052] CT
0.851 0.325 0.098 RC
N
f-891180347
f
GR
GS
[1 0 0 1 269.81818 68.85201] CT
0.851 0.325 0.098 RC
N
f-891180347
f
GR
GS
[1 0 0 1 272.21213 66.23833] CT
0.851 0.325 0.098 RC
N
f-891180347
f
GR
GS
[1 0 0 1 274.60605 62.97059] CT
0.851 0.325 0.098 RC
N
f-891180347
f
GR
GS
[1 0 0 1 277 60.6244] CT
0.851 0.325 0.098 RC
N
f-891180347
f
GR
GS
1 GC
N
140 51.5 M
140 25 L
58.5 25 L
58.5 51.5 L
cp
f
GR
GS
[1 0 0 1 95.5 32.5] CT
/Helvetica 9 F
GS
[1 0 0 1 0 0] CT
0 3.5 moveto 
1 -1 scale
(Real) t 
GR
GR
GS
0 0.447 0.741 RC
1 LJ
1.5 LW
N
62.5 32.5 M
92.5 32.5 L
S
GR
GS
[1 0 0 1 95.5 44] CT
/Helvetica 9 F
GS
[1 0 0 1 0 0] CT
0 3.5 moveto 
1 -1 scale
(Estimated) t 
GR
GR
GS
0.851 0.325 0.098 RC
1 LJ
N
62.5 44 M
92.5 44 L
S
GR
GS
[1 0 0 1 77.5 44] CT
0.851 0.325 0.098 RC
N
f-891180347
f
GR
GS
0.149 GC
10.0 ML
0.5 LW
N
58.5 51.5 M
58.5 25 L
140 25 L
140 51.5 L
cp
S
GR
%%Trailer
%%Pages: 1
%%EOF
