%!PS-Adobe-3.0 EPSF-3.0
%%Creator: (MATLAB, The Mathworks, Inc. Version 23.2.0.2409890 \(R2023b\) Update 3. Operating System: Mac OS X)
%%Title: /Users/jakub/Projects/modeling-and-identification/report-02/images/lab6/1.eps
%%CreationDate: 2023-11-30T18:40:15
%%Pages: (atend)
%%BoundingBox:     0     0   560   420
%%LanguageLevel: 3
%%EndComments
%%BeginProlog
%%BeginResource: procset (Apache XML Graphics Std ProcSet) 1.2 0
%%Version: 1.2 0
%%Copyright: (Copyright 2001-2003,2010 The Apache Software Foundation. License terms: http://www.apache.org/licenses/LICENSE-2.0)
/bd{bind def}bind def
/ld{load def}bd
/GR/grestore ld
/GS/gsave ld
/RM/rmoveto ld
/C/curveto ld
/t/show ld
/L/lineto ld
/ML/setmiterlimit ld
/CT/concat ld
/f/fill ld
/N/newpath ld
/S/stroke ld
/CC/setcmykcolor ld
/A/ashow ld
/cp/closepath ld
/RC/setrgbcolor ld
/LJ/setlinejoin ld
/GC/setgray ld
/LW/setlinewidth ld
/M/moveto ld
/re {4 2 roll M
1 index 0 rlineto
0 exch rlineto
neg 0 rlineto
cp } bd
/_ctm matrix def
/_tm matrix def
/BT { _ctm currentmatrix pop matrix _tm copy pop 0 0 moveto } bd
/ET { _ctm setmatrix } bd
/iTm { _ctm setmatrix _tm concat } bd
/Tm { _tm astore pop iTm 0 0 moveto } bd
/ux 0.0 def
/uy 0.0 def
/F {
  /Tp exch def
  /Tf exch def
  Tf findfont Tp scalefont setfont
  /cf Tf def  /cs Tp def
} bd
/ULS {currentpoint /uy exch def /ux exch def} bd
/ULE {
  /Tcx currentpoint pop def
  gsave
  newpath
  cf findfont cs scalefont dup
  /FontMatrix get 0 get /Ts exch def /FontInfo get dup
  /UnderlinePosition get Ts mul /To exch def
  /UnderlineThickness get Ts mul /Tt exch def
  ux uy To add moveto  Tcx uy To add lineto
  Tt setlinewidth stroke
  grestore
} bd
/OLE {
  /Tcx currentpoint pop def
  gsave
  newpath
  cf findfont cs scalefont dup
  /FontMatrix get 0 get /Ts exch def /FontInfo get dup
  /UnderlinePosition get Ts mul /To exch def
  /UnderlineThickness get Ts mul /Tt exch def
  ux uy To add cs add moveto Tcx uy To add cs add lineto
  Tt setlinewidth stroke
  grestore
} bd
/SOE {
  /Tcx currentpoint pop def
  gsave
  newpath
  cf findfont cs scalefont dup
  /FontMatrix get 0 get /Ts exch def /FontInfo get dup
  /UnderlinePosition get Ts mul /To exch def
  /UnderlineThickness get Ts mul /Tt exch def
  ux uy To add cs 10 mul 26 idiv add moveto Tcx uy To add cs 10 mul 26 idiv add lineto
  Tt setlinewidth stroke
  grestore
} bd
/QT {
/Y22 exch store
/X22 exch store
/Y21 exch store
/X21 exch store
currentpoint
/Y21 load 2 mul add 3 div exch
/X21 load 2 mul add 3 div exch
/X21 load 2 mul /X22 load add 3 div
/Y21 load 2 mul /Y22 load add 3 div
/X22 load /Y22 load curveto
} bd
/SSPD {
dup length /d exch dict def
{
/v exch def
/k exch def
currentpagedevice k known {
/cpdv currentpagedevice k get def
v cpdv ne {
/upd false def
/nullv v type /nulltype eq def
/nullcpdv cpdv type /nulltype eq def
nullv nullcpdv or
{
/upd true def
} {
/sametype v type cpdv type eq def
sametype {
v type /arraytype eq {
/vlen v length def
/cpdvlen cpdv length def
vlen cpdvlen eq {
0 1 vlen 1 sub {
/i exch def
/obj v i get def
/cpdobj cpdv i get def
obj cpdobj ne {
/upd true def
exit
} if
} for
} {
/upd true def
} ifelse
} {
v type /dicttype eq {
v {
/dv exch def
/dk exch def
/cpddv cpdv dk get def
dv cpddv ne {
/upd true def
exit
} if
} forall
} {
/upd true def
} ifelse
} ifelse
} if
} ifelse
upd true eq {
d k v put
} if
} if
} if
} forall
d length 0 gt {
d setpagedevice
} if
} bd
/RE { % /NewFontName [NewEncodingArray] /FontName RE -
  findfont dup length dict begin
  {
    1 index /FID ne
    {def} {pop pop} ifelse
  } forall
  /Encoding exch def
  /FontName 1 index def
  currentdict definefont pop
  end
} bind def
%%EndResource
%%BeginResource: procset (Apache XML Graphics EPS ProcSet) 1.0 0
%%Version: 1.0 0
%%Copyright: (Copyright 2002-2003 The Apache Software Foundation. License terms: http://www.apache.org/licenses/LICENSE-2.0)
/BeginEPSF { %def
/b4_Inc_state save def         % Save state for cleanup
/dict_count countdictstack def % Count objects on dict stack
/op_count count 1 sub def      % Count objects on operand stack
userdict begin                 % Push userdict on dict stack
/showpage { } def              % Redefine showpage, { } = null proc
0 setgray 0 setlinecap         % Prepare graphics state
1 setlinewidth 0 setlinejoin
10 setmiterlimit [ ] 0 setdash newpath
/languagelevel where           % If level not equal to 1 then
{pop languagelevel             % set strokeadjust and
1 ne                           % overprint to their defaults.
{false setstrokeadjust false setoverprint
} if
} if
} bd
/EndEPSF { %def
count op_count sub {pop} repeat            % Clean up stacks
countdictstack dict_count sub {end} repeat
b4_Inc_state restore
} bd
%%EndResource
%FOPBeginFontDict
%%IncludeResource: font Courier-Oblique
%%IncludeResource: font Courier-BoldOblique
%%IncludeResource: font Courier-Bold
%%IncludeResource: font ZapfDingbats
%%IncludeResource: font Symbol
%%IncludeResource: font Helvetica
%%IncludeResource: font Helvetica-Oblique
%%IncludeResource: font Helvetica-Bold
%%IncludeResource: font Helvetica-BoldOblique
%%IncludeResource: font Times-Roman
%%IncludeResource: font Times-Italic
%%IncludeResource: font Times-Bold
%%IncludeResource: font Times-BoldItalic
%%IncludeResource: font Courier
%FOPEndFontDict
%%BeginResource: encoding WinAnsiEncoding
/WinAnsiEncoding [
/.notdef /.notdef /.notdef /.notdef /.notdef
/.notdef /.notdef /.notdef /.notdef /.notdef
/.notdef /.notdef /.notdef /.notdef /.notdef
/.notdef /.notdef /.notdef /.notdef /.notdef
/.notdef /.notdef /.notdef /.notdef /.notdef
/.notdef /.notdef /.notdef /.notdef /.notdef
/.notdef /.notdef /space /exclam /quotedbl
/numbersign /dollar /percent /ampersand /quotesingle
/parenleft /parenright /asterisk /plus /comma
/hyphen /period /slash /zero /one
/two /three /four /five /six
/seven /eight /nine /colon /semicolon
/less /equal /greater /question /at
/A /B /C /D /E
/F /G /H /I /J
/K /L /M /N /O
/P /Q /R /S /T
/U /V /W /X /Y
/Z /bracketleft /backslash /bracketright /asciicircum
/underscore /quoteleft /a /b /c
/d /e /f /g /h
/i /j /k /l /m
/n /o /p /q /r
/s /t /u /v /w
/x /y /z /braceleft /bar
/braceright /asciitilde /bullet /Euro /bullet
/quotesinglbase /florin /quotedblbase /ellipsis /dagger
/daggerdbl /circumflex /perthousand /Scaron /guilsinglleft
/OE /bullet /Zcaron /bullet /bullet
/quoteleft /quoteright /quotedblleft /quotedblright /bullet
/endash /emdash /asciitilde /trademark /scaron
/guilsinglright /oe /bullet /zcaron /Ydieresis
/space /exclamdown /cent /sterling /currency
/yen /brokenbar /section /dieresis /copyright
/ordfeminine /guillemotleft /logicalnot /sfthyphen /registered
/macron /degree /plusminus /twosuperior /threesuperior
/acute /mu /paragraph /middot /cedilla
/onesuperior /ordmasculine /guillemotright /onequarter /onehalf
/threequarters /questiondown /Agrave /Aacute /Acircumflex
/Atilde /Adieresis /Aring /AE /Ccedilla
/Egrave /Eacute /Ecircumflex /Edieresis /Igrave
/Iacute /Icircumflex /Idieresis /Eth /Ntilde
/Ograve /Oacute /Ocircumflex /Otilde /Odieresis
/multiply /Oslash /Ugrave /Uacute /Ucircumflex
/Udieresis /Yacute /Thorn /germandbls /agrave
/aacute /acircumflex /atilde /adieresis /aring
/ae /ccedilla /egrave /eacute /ecircumflex
/edieresis /igrave /iacute /icircumflex /idieresis
/eth /ntilde /ograve /oacute /ocircumflex
/otilde /odieresis /divide /oslash /ugrave
/uacute /ucircumflex /udieresis /yacute /thorn
/ydieresis
] def
%%EndResource
%FOPBeginFontReencode
/Courier-Oblique findfont
dup length dict begin
  {1 index /FID ne {def} {pop pop} ifelse} forall
  /Encoding WinAnsiEncoding def
  currentdict
end
/Courier-Oblique exch definefont pop
/Courier-BoldOblique findfont
dup length dict begin
  {1 index /FID ne {def} {pop pop} ifelse} forall
  /Encoding WinAnsiEncoding def
  currentdict
end
/Courier-BoldOblique exch definefont pop
/Courier-Bold findfont
dup length dict begin
  {1 index /FID ne {def} {pop pop} ifelse} forall
  /Encoding WinAnsiEncoding def
  currentdict
end
/Courier-Bold exch definefont pop
/Helvetica findfont
dup length dict begin
  {1 index /FID ne {def} {pop pop} ifelse} forall
  /Encoding WinAnsiEncoding def
  currentdict
end
/Helvetica exch definefont pop
/Helvetica-Oblique findfont
dup length dict begin
  {1 index /FID ne {def} {pop pop} ifelse} forall
  /Encoding WinAnsiEncoding def
  currentdict
end
/Helvetica-Oblique exch definefont pop
/Helvetica-Bold findfont
dup length dict begin
  {1 index /FID ne {def} {pop pop} ifelse} forall
  /Encoding WinAnsiEncoding def
  currentdict
end
/Helvetica-Bold exch definefont pop
/Helvetica-BoldOblique findfont
dup length dict begin
  {1 index /FID ne {def} {pop pop} ifelse} forall
  /Encoding WinAnsiEncoding def
  currentdict
end
/Helvetica-BoldOblique exch definefont pop
/Times-Roman findfont
dup length dict begin
  {1 index /FID ne {def} {pop pop} ifelse} forall
  /Encoding WinAnsiEncoding def
  currentdict
end
/Times-Roman exch definefont pop
/Times-Italic findfont
dup length dict begin
  {1 index /FID ne {def} {pop pop} ifelse} forall
  /Encoding WinAnsiEncoding def
  currentdict
end
/Times-Italic exch definefont pop
/Times-Bold findfont
dup length dict begin
  {1 index /FID ne {def} {pop pop} ifelse} forall
  /Encoding WinAnsiEncoding def
  currentdict
end
/Times-Bold exch definefont pop
/Times-BoldItalic findfont
dup length dict begin
  {1 index /FID ne {def} {pop pop} ifelse} forall
  /Encoding WinAnsiEncoding def
  currentdict
end
/Times-BoldItalic exch definefont pop
/Courier findfont
dup length dict begin
  {1 index /FID ne {def} {pop pop} ifelse} forall
  /Encoding WinAnsiEncoding def
  currentdict
end
/Courier exch definefont pop
%FOPEndFontReencode
%%EndProlog
%%Page: 1 1
%%PageBoundingBox: 0 0 560 420
%%BeginPageSetup
[1 0 0 -1 0 420] CT
%%EndPageSetup
GS
1 GC
N
0 0 560 420 re
f
GR
GS
1 GC
N
0 0 560 420 re
f
GR
GS
1 GC
N
73 374 M
507 374 L
507 31.5 L
73 31.5 L
cp
f
GR
GS
0.775 GC
[1 3] 0 setdash
2 LJ
0.5 LW
N
83.85 374 M
83.85 31.5 L
S
GR
GS
0.775 GC
[1 3] 0 setdash
2 LJ
0.5 LW
N
94.7 374 M
94.7 31.5 L
S
GR
GS
0.775 GC
[1 3] 0 setdash
2 LJ
0.5 LW
N
105.55 374 M
105.55 31.5 L
S
GR
GS
0.775 GC
[1 3] 0 setdash
2 LJ
0.5 LW
N
127.25 374 M
127.25 31.5 L
S
GR
GS
0.775 GC
[1 3] 0 setdash
2 LJ
0.5 LW
N
138.1 374 M
138.1 31.5 L
S
GR
GS
0.775 GC
[1 3] 0 setdash
2 LJ
0.5 LW
N
148.95 374 M
148.95 31.5 L
S
GR
GS
0.775 GC
[1 3] 0 setdash
2 LJ
0.5 LW
N
170.65 374 M
170.65 31.5 L
S
GR
GS
0.775 GC
[1 3] 0 setdash
2 LJ
0.5 LW
N
181.5 374 M
181.5 31.5 L
S
GR
GS
0.775 GC
[1 3] 0 setdash
2 LJ
0.5 LW
N
192.35 374 M
192.35 31.5 L
S
GR
GS
0.775 GC
[1 3] 0 setdash
2 LJ
0.5 LW
N
214.05 374 M
214.05 31.5 L
S
GR
GS
0.775 GC
[1 3] 0 setdash
2 LJ
0.5 LW
N
224.9 374 M
224.9 31.5 L
S
GR
GS
0.775 GC
[1 3] 0 setdash
2 LJ
0.5 LW
N
235.75 374 M
235.75 31.5 L
S
GR
GS
0.775 GC
[1 3] 0 setdash
2 LJ
0.5 LW
N
257.45 374 M
257.45 31.5 L
S
GR
GS
0.775 GC
[1 3] 0 setdash
2 LJ
0.5 LW
N
268.3 374 M
268.3 31.5 L
S
GR
GS
0.775 GC
[1 3] 0 setdash
2 LJ
0.5 LW
N
279.15 374 M
279.15 31.5 L
S
GR
GS
0.775 GC
[1 3] 0 setdash
2 LJ
0.5 LW
N
300.85 374 M
300.85 31.5 L
S
GR
GS
0.775 GC
[1 3] 0 setdash
2 LJ
0.5 LW
N
311.7 374 M
311.7 31.5 L
S
GR
GS
0.775 GC
[1 3] 0 setdash
2 LJ
0.5 LW
N
322.55 374 M
322.55 31.5 L
S
GR
GS
0.775 GC
[1 3] 0 setdash
2 LJ
0.5 LW
N
344.25 374 M
344.25 31.5 L
S
GR
GS
0.775 GC
[1 3] 0 setdash
2 LJ
0.5 LW
N
355.1 374 M
355.1 31.5 L
S
GR
GS
0.775 GC
[1 3] 0 setdash
2 LJ
0.5 LW
N
365.95 374 M
365.95 31.5 L
S
GR
GS
0.775 GC
[1 3] 0 setdash
2 LJ
0.5 LW
N
387.65 374 M
387.65 31.5 L
S
GR
GS
0.775 GC
[1 3] 0 setdash
2 LJ
0.5 LW
N
398.5 374 M
398.5 31.5 L
S
GR
GS
0.775 GC
[1 3] 0 setdash
2 LJ
0.5 LW
N
409.35 374 M
409.35 31.5 L
S
GR
GS
0.775 GC
[1 3] 0 setdash
2 LJ
0.5 LW
N
431.05 374 M
431.05 31.5 L
S
GR
GS
0.775 GC
[1 3] 0 setdash
2 LJ
0.5 LW
N
441.9 374 M
441.9 31.5 L
S
GR
GS
0.775 GC
[1 3] 0 setdash
2 LJ
0.5 LW
N
452.75 374 M
452.75 31.5 L
S
GR
GS
0.775 GC
[1 3] 0 setdash
2 LJ
0.5 LW
N
474.45 374 M
474.45 31.5 L
S
GR
GS
0.775 GC
[1 3] 0 setdash
2 LJ
0.5 LW
N
485.3 374 M
485.3 31.5 L
S
GR
GS
0.775 GC
[1 3] 0 setdash
2 LJ
0.5 LW
N
496.15 374 M
496.15 31.5 L
S
GR
GS
0.873 GC
1 LJ
0.5 LW
N
73 374 M
73 31.5 L
S
GR
GS
0.873 GC
1 LJ
0.5 LW
N
116.4 374 M
116.4 31.5 L
S
GR
GS
0.873 GC
1 LJ
0.5 LW
N
159.8 374 M
159.8 31.5 L
S
GR
GS
0.873 GC
1 LJ
0.5 LW
N
203.2 374 M
203.2 31.5 L
S
GR
GS
0.873 GC
1 LJ
0.5 LW
N
246.6 374 M
246.6 31.5 L
S
GR
GS
0.873 GC
1 LJ
0.5 LW
N
290 374 M
290 31.5 L
S
GR
GS
0.873 GC
1 LJ
0.5 LW
N
333.4 374 M
333.4 31.5 L
S
GR
GS
0.873 GC
1 LJ
0.5 LW
N
376.8 374 M
376.8 31.5 L
S
GR
GS
0.873 GC
1 LJ
0.5 LW
N
420.2 374 M
420.2 31.5 L
S
GR
GS
0.873 GC
1 LJ
0.5 LW
N
463.6 374 M
463.6 31.5 L
S
GR
GS
0.873 GC
1 LJ
0.5 LW
N
507 374 M
507 31.5 L
S
GR
GS
0.775 GC
[1 3] 0 setdash
2 LJ
0.5 LW
N
507 363.297 M
73 363.297 L
S
GR
GS
0.775 GC
[1 3] 0 setdash
2 LJ
0.5 LW
N
507 352.594 M
73 352.594 L
S
GR
GS
0.775 GC
[1 3] 0 setdash
2 LJ
0.5 LW
N
507 341.891 M
73 341.891 L
S
GR
GS
0.775 GC
[1 3] 0 setdash
2 LJ
0.5 LW
N
507 320.484 M
73 320.484 L
S
GR
GS
0.775 GC
[1 3] 0 setdash
2 LJ
0.5 LW
N
507 309.781 M
73 309.781 L
S
GR
GS
0.775 GC
[1 3] 0 setdash
2 LJ
0.5 LW
N
507 299.078 M
73 299.078 L
S
GR
GS
0.775 GC
[1 3] 0 setdash
2 LJ
0.5 LW
N
507 277.672 M
73 277.672 L
S
GR
GS
0.775 GC
[1 3] 0 setdash
2 LJ
0.5 LW
N
507 266.969 M
73 266.969 L
S
GR
GS
0.775 GC
[1 3] 0 setdash
2 LJ
0.5 LW
N
507 256.266 M
73 256.266 L
S
GR
GS
0.775 GC
[1 3] 0 setdash
2 LJ
0.5 LW
N
507 234.859 M
73 234.859 L
S
GR
GS
0.775 GC
[1 3] 0 setdash
2 LJ
0.5 LW
N
507 224.156 M
73 224.156 L
S
GR
GS
0.775 GC
[1 3] 0 setdash
2 LJ
0.5 LW
N
507 213.453 M
73 213.453 L
S
GR
GS
0.775 GC
[1 3] 0 setdash
2 LJ
0.5 LW
N
507 192.047 M
73 192.047 L
S
GR
GS
0.775 GC
[1 3] 0 setdash
2 LJ
0.5 LW
N
507 181.344 M
73 181.344 L
S
GR
GS
0.775 GC
[1 3] 0 setdash
2 LJ
0.5 LW
N
507 170.641 M
73 170.641 L
S
GR
GS
0.775 GC
[1 3] 0 setdash
2 LJ
0.5 LW
N
507 149.234 M
73 149.234 L
S
GR
GS
0.775 GC
[1 3] 0 setdash
2 LJ
0.5 LW
N
507 138.531 M
73 138.531 L
S
GR
GS
0.775 GC
[1 3] 0 setdash
2 LJ
0.5 LW
N
507 127.828 M
73 127.828 L
S
GR
GS
0.775 GC
[1 3] 0 setdash
2 LJ
0.5 LW
N
507 106.422 M
73 106.422 L
S
GR
GS
0.775 GC
[1 3] 0 setdash
2 LJ
0.5 LW
N
507 95.719 M
73 95.719 L
S
GR
GS
0.775 GC
[1 3] 0 setdash
2 LJ
0.5 LW
N
507 85.016 M
73 85.016 L
S
GR
GS
0.775 GC
[1 3] 0 setdash
2 LJ
0.5 LW
N
507 63.609 M
73 63.609 L
S
GR
GS
0.775 GC
[1 3] 0 setdash
2 LJ
0.5 LW
N
507 52.906 M
73 52.906 L
S
GR
GS
0.775 GC
[1 3] 0 setdash
2 LJ
0.5 LW
N
507 42.203 M
73 42.203 L
S
GR
GS
0.873 GC
1 LJ
0.5 LW
N
507 374 M
73 374 L
S
GR
GS
0.873 GC
1 LJ
0.5 LW
N
507 331.188 M
73 331.188 L
S
GR
GS
0.873 GC
1 LJ
0.5 LW
N
507 288.375 M
73 288.375 L
S
GR
GS
0.873 GC
1 LJ
0.5 LW
N
507 245.563 M
73 245.563 L
S
GR
GS
0.873 GC
1 LJ
0.5 LW
N
507 202.75 M
73 202.75 L
S
GR
GS
0.873 GC
1 LJ
0.5 LW
N
507 159.938 M
73 159.938 L
S
GR
GS
0.873 GC
1 LJ
0.5 LW
N
507 117.125 M
73 117.125 L
S
GR
GS
0.873 GC
1 LJ
0.5 LW
N
507 74.313 M
73 74.313 L
S
GR
GS
0.873 GC
1 LJ
0.5 LW
N
507 31.5 M
73 31.5 L
S
GR
GS
0.149 GC
2 setlinecap
1 LJ
0.5 LW
N
73 374 M
507 374 L
S
GR
GS
0.149 GC
2 setlinecap
1 LJ
0.5 LW
N
73 374 M
73 369.66 L
S
GR
GS
0.149 GC
2 setlinecap
1 LJ
0.5 LW
N
116.4 374 M
116.4 369.66 L
S
GR
GS
0.149 GC
2 setlinecap
1 LJ
0.5 LW
N
159.8 374 M
159.8 369.66 L
S
GR
GS
0.149 GC
2 setlinecap
1 LJ
0.5 LW
N
203.2 374 M
203.2 369.66 L
S
GR
GS
0.149 GC
2 setlinecap
1 LJ
0.5 LW
N
246.6 374 M
246.6 369.66 L
S
GR
GS
0.149 GC
2 setlinecap
1 LJ
0.5 LW
N
290 374 M
290 369.66 L
S
GR
GS
0.149 GC
2 setlinecap
1 LJ
0.5 LW
N
333.4 374 M
333.4 369.66 L
S
GR
GS
0.149 GC
2 setlinecap
1 LJ
0.5 LW
N
376.8 374 M
376.8 369.66 L
S
GR
GS
0.149 GC
2 setlinecap
1 LJ
0.5 LW
N
420.2 374 M
420.2 369.66 L
S
GR
GS
0.149 GC
2 setlinecap
1 LJ
0.5 LW
N
463.6 374 M
463.6 369.66 L
S
GR
GS
0.149 GC
2 setlinecap
1 LJ
0.5 LW
N
507 374 M
507 369.66 L
S
GR
GS
[1 0 0 1 73 378] CT
0.149 GC
/Helvetica 10 F
GS
[1 0 0 1 0 0] CT
-5 10 moveto 
1 -1 scale
(-1) t 
GR
GR
GS
[1 0 0 1 116.39999 378] CT
0.149 GC
/Helvetica 10 F
GS
[1 0 0 1 0 0] CT
-9 10 moveto 
1 -1 scale
(-0.8) t 
GR
GR
GS
[1 0 0 1 159.79999 378] CT
0.149 GC
/Helvetica 10 F
GS
[1 0 0 1 0 0] CT
-9 10 moveto 
1 -1 scale
(-0.6) t 
GR
GR
GS
[1 0 0 1 203.2 378] CT
0.149 GC
/Helvetica 10 F
GS
[1 0 0 1 0 0] CT
-9 10 moveto 
1 -1 scale
(-0.4) t 
GR
GR
GS
[1 0 0 1 246.60001 378] CT
0.149 GC
/Helvetica 10 F
GS
[1 0 0 1 0 0] CT
-9 10 moveto 
1 -1 scale
(-0.2) t 
GR
GR
GS
[1 0 0 1 290 378] CT
0.149 GC
/Helvetica 10 F
GS
[1 0 0 1 0 0] CT
-3 10 moveto 
1 -1 scale
(0) t 
GR
GR
GS
[1 0 0 1 333.39999 378] CT
0.149 GC
/Helvetica 10 F
GS
[1 0 0 1 0 0] CT
-7 10 moveto 
1 -1 scale
(0.2) t 
GR
GR
GS
[1 0 0 1 376.79999 378] CT
0.149 GC
/Helvetica 10 F
GS
[1 0 0 1 0 0] CT
-7 10 moveto 
1 -1 scale
(0.4) t 
GR
GR
GS
[1 0 0 1 420.20001 378] CT
0.149 GC
/Helvetica 10 F
GS
[1 0 0 1 0 0] CT
-7 10 moveto 
1 -1 scale
(0.6) t 
GR
GR
GS
[1 0 0 1 463.60001 378] CT
0.149 GC
/Helvetica 10 F
GS
[1 0 0 1 0 0] CT
-7 10 moveto 
1 -1 scale
(0.8) t 
GR
GR
GS
[1 0 0 1 507 378] CT
0.149 GC
/Helvetica 10 F
GS
[1 0 0 1 0 0] CT
-3 10 moveto 
1 -1 scale
(1) t 
GR
GR
GS
0.149 GC
2 setlinecap
1 LJ
0.5 LW
N
73 374 M
73 31.5 L
S
GR
GS
0.149 GC
2 setlinecap
1 LJ
0.5 LW
N
73 374 M
77.34 374 L
S
GR
GS
0.149 GC
2 setlinecap
1 LJ
0.5 LW
N
73 331.188 M
77.34 331.188 L
S
GR
GS
0.149 GC
2 setlinecap
1 LJ
0.5 LW
N
73 288.375 M
77.34 288.375 L
S
GR
GS
0.149 GC
2 setlinecap
1 LJ
0.5 LW
N
73 245.563 M
77.34 245.563 L
S
GR
GS
0.149 GC
2 setlinecap
1 LJ
0.5 LW
N
73 202.75 M
77.34 202.75 L
S
GR
GS
0.149 GC
2 setlinecap
1 LJ
0.5 LW
N
73 159.938 M
77.34 159.938 L
S
GR
GS
0.149 GC
2 setlinecap
1 LJ
0.5 LW
N
73 117.125 M
77.34 117.125 L
S
GR
GS
0.149 GC
2 setlinecap
1 LJ
0.5 LW
N
73 74.313 M
77.34 74.313 L
S
GR
GS
0.149 GC
2 setlinecap
1 LJ
0.5 LW
N
73 31.5 M
77.34 31.5 L
S
GR
GS
[1 0 0 1 68.99999 374] CT
0.149 GC
/Helvetica 10 F
GS
[1 0 0 1 0 0] CT
-6 3.5 moveto 
1 -1 scale
(0) t 
GR
GR
GS
[1 0 0 1 68.99999 331.1875] CT
0.149 GC
/Helvetica 10 F
GS
[1 0 0 1 0 0] CT
-14 3.5 moveto 
1 -1 scale
(0.2) t 
GR
GR
GS
[1 0 0 1 68.99999 288.375] CT
0.149 GC
/Helvetica 10 F
GS
[1 0 0 1 0 0] CT
-14 3.5 moveto 
1 -1 scale
(0.4) t 
GR
GR
GS
[1 0 0 1 68.99999 245.5625] CT
0.149 GC
/Helvetica 10 F
GS
[1 0 0 1 0 0] CT
-14 3.5 moveto 
1 -1 scale
(0.6) t 
GR
GR
GS
[1 0 0 1 68.99999 202.75] CT
0.149 GC
/Helvetica 10 F
GS
[1 0 0 1 0 0] CT
-14 3.5 moveto 
1 -1 scale
(0.8) t 
GR
GR
GS
[1 0 0 1 68.99999 159.9375] CT
0.149 GC
/Helvetica 10 F
GS
[1 0 0 1 0 0] CT
-6 3.5 moveto 
1 -1 scale
(1) t 
GR
GR
GS
[1 0 0 1 68.99999 117.12499] CT
0.149 GC
/Helvetica 10 F
GS
[1 0 0 1 0 0] CT
-14 3.5 moveto 
1 -1 scale
(1.2) t 
GR
GR
GS
[1 0 0 1 68.99999 74.31251] CT
0.149 GC
/Helvetica 10 F
GS
[1 0 0 1 0 0] CT
-14 3.5 moveto 
1 -1 scale
(1.4) t 
GR
GR
GS
[1 0 0 1 68.99999 31.49999] CT
0.149 GC
/Helvetica 10 F
GS
[1 0 0 1 0 0] CT
-14 3.5 moveto 
1 -1 scale
(1.6) t 
GR
GR
GS
0 0.447 0.741 RC
1 LJ
1.5 LW
N
73 374 M
77.384 365.438 L
81.768 357.051 L
86.152 348.839 L
90.535 340.802 L
94.919 332.939 L
99.303 325.251 L
103.687 317.738 L
108.071 310.399 L
112.455 303.236 L
116.838 296.246 L
121.222 289.432 L
125.606 282.792 L
129.99 276.328 L
134.374 270.037 L
138.758 263.922 L
143.141 257.981 L
147.525 252.215 L
151.909 246.624 L
156.293 241.207 L
160.677 235.966 L
165.061 230.899 L
169.444 226.006 L
173.828 221.289 L
178.212 216.746 L
182.596 212.377 L
186.98 208.184 L
191.364 204.165 L
195.747 200.321 L
200.131 196.652 L
204.515 193.157 L
208.899 189.838 L
213.283 186.693 L
217.667 183.722 L
222.051 180.927 L
226.434 178.306 L
230.818 175.859 L
235.202 173.588 L
239.586 171.491 L
243.97 169.569 L
248.354 167.822 L
252.737 166.25 L
257.121 164.852 L
261.505 163.629 L
265.889 162.58 L
270.273 161.707 L
274.657 161.008 L
279.04 160.484 L
283.424 160.134 L
287.808 159.959 L
292.192 159.959 L
296.576 160.134 L
300.96 160.484 L
305.343 161.008 L
309.727 161.707 L
314.111 162.58 L
318.495 163.629 L
322.879 164.852 L
327.263 166.25 L
331.646 167.822 L
336.03 169.569 L
340.414 171.491 L
344.798 173.588 L
349.182 175.859 L
353.566 178.306 L
357.949 180.927 L
362.333 183.722 L
366.717 186.693 L
371.101 189.838 L
375.485 193.157 L
379.869 196.652 L
384.253 200.321 L
388.636 204.165 L
393.02 208.184 L
397.404 212.377 L
401.788 216.746 L
406.172 221.289 L
410.556 226.006 L
414.939 230.899 L
419.323 235.966 L
423.707 241.207 L
428.091 246.624 L
432.475 252.215 L
436.859 257.981 L
441.242 263.922 L
445.626 270.037 L
450.01 276.328 L
454.394 282.792 L
458.778 289.432 L
463.162 296.246 L
467.545 303.236 L
471.929 310.399 L
476.313 317.738 L
480.697 325.251 L
485.081 332.939 L
489.465 340.802 L
493.848 348.839 L
498.232 357.051 L
502.616 365.438 L
507 374 L
S
GR
GS
0.851 0.325 0.098 RC
1 LJ
N
73 142.051 M
77.384 139.177 L
81.768 136.388 L
86.152 133.69 L
90.535 131.014 L
94.919 128.372 L
99.303 125.782 L
103.687 123.254 L
108.071 120.835 L
112.455 118.416 L
116.838 116.048 L
121.222 113.715 L
125.606 111.532 L
129.99 109.393 L
134.374 107.282 L
138.758 105.23 L
143.141 103.214 L
147.525 101.288 L
151.909 99.437 L
156.293 97.656 L
160.677 95.931 L
165.061 94.262 L
169.444 92.683 L
173.828 91.121 L
178.212 89.603 L
182.596 87.45 L
186.98 83.294 L
191.364 79.283 L
195.747 75.506 L
200.131 71.85 L
204.515 68.335 L
208.899 64.994 L
213.283 61.899 L
217.667 58.938 L
222.051 56.119 L
226.434 53.492 L
230.818 51.031 L
235.202 48.69 L
239.586 46.608 L
243.97 44.675 L
248.354 42.884 L
252.737 41.296 L
257.121 39.895 L
261.505 38.686 L
265.889 37.642 L
270.273 36.753 L
274.657 36.106 L
279.04 35.574 L
283.424 35.24 L
287.808 35.031 L
292.192 35.044 L
296.576 35.187 L
300.96 35.527 L
305.343 36.044 L
309.727 36.724 L
314.111 37.593 L
318.495 38.645 L
322.879 39.863 L
327.263 41.294 L
331.646 42.857 L
336.03 44.669 L
340.414 46.579 L
344.798 48.689 L
349.182 50.924 L
353.566 53.371 L
357.949 56 L
362.333 58.798 L
366.717 61.828 L
371.101 64.968 L
375.485 68.26 L
379.869 71.786 L
384.253 75.539 L
388.636 79.355 L
393.02 83.41 L
397.404 87.636 L
401.788 89.834 L
406.172 91.357 L
410.556 92.929 L
414.939 94.549 L
419.323 96.221 L
423.707 97.943 L
428.091 99.74 L
432.475 101.597 L
436.859 103.546 L
441.242 105.571 L
445.626 107.592 L
450.01 109.724 L
454.394 111.873 L
458.778 114.151 L
463.162 116.468 L
467.545 118.856 L
471.929 121.258 L
476.313 123.723 L
480.697 126.257 L
485.081 128.814 L
489.465 131.467 L
493.848 134.195 L
498.232 136.87 L
502.616 139.601 L
507 142.488 L
S
GR
GS
[1 0 0 1 73 142.05052] CT
0.851 0.325 0.098 RC
N
1 0 M
1 0.552 0.552 1 0 1 C
-0.552 1 -1 0.552 -1 0 C
-1 -0.552 -0.552 -1 0 -1 C
0.552 -1 1 -0.552 1 0 C
cp
f
GR
GS
[1 0 0 1 77.38384 139.1767] CT
0.851 0.325 0.098 RC
N
/f-891180347{1 0 M
1 0.552 0.552 1 0 1 C
-0.552 1 -1 0.552 -1 0 C
-1 -0.552 -0.552 -1 0 -1 C
0.552 -1 1 -0.552 1 0 C
cp}def
f-891180347
f
GR
GS
[1 0 0 1 81.76767 136.38823] CT
0.851 0.325 0.098 RC
N
f-891180347
f
GR
GS
[1 0 0 1 86.15151 133.69016] CT
0.851 0.325 0.098 RC
N
f-891180347
f
GR
GS
[1 0 0 1 90.53535 131.01408] CT
0.851 0.325 0.098 RC
N
f-891180347
f
GR
GS
[1 0 0 1 94.91919 128.37161] CT
0.851 0.325 0.098 RC
N
f-891180347
f
GR
GS
[1 0 0 1 99.30303 125.78249] CT
0.851 0.325 0.098 RC
N
f-891180347
f
GR
GS
[1 0 0 1 103.68687 123.25406] CT
0.851 0.325 0.098 RC
N
f-891180347
f
GR
GS
[1 0 0 1 108.0707 120.83478] CT
0.851 0.325 0.098 RC
N
f-891180347
f
GR
GS
[1 0 0 1 112.45454 118.41576] CT
0.851 0.325 0.098 RC
N
f-891180347
f
GR
GS
[1 0 0 1 116.83839 116.0484] CT
0.851 0.325 0.098 RC
N
f-891180347
f
GR
GS
[1 0 0 1 121.22222 113.71458] CT
0.851 0.325 0.098 RC
N
f-891180347
f
GR
GS
[1 0 0 1 125.60606 111.53165] CT
0.851 0.325 0.098 RC
N
f-891180347
f
GR
GS
[1 0 0 1 129.9899 109.39347] CT
0.851 0.325 0.098 RC
N
f-891180347
f
GR
GS
[1 0 0 1 134.37373 107.28199] CT
0.851 0.325 0.098 RC
N
f-891180347
f
GR
GS
[1 0 0 1 138.75758 105.22966] CT
0.851 0.325 0.098 RC
N
f-891180347
f
GR
GS
[1 0 0 1 143.14142 103.21441] CT
0.851 0.325 0.098 RC
N
f-891180347
f
GR
GS
[1 0 0 1 147.52525 101.2884] CT
0.851 0.325 0.098 RC
N
f-891180347
f
GR
GS
[1 0 0 1 151.90909 99.43702] CT
0.851 0.325 0.098 RC
N
f-891180347
f
GR
GS
[1 0 0 1 156.29292 97.65552] CT
0.851 0.325 0.098 RC
N
f-891180347
f
GR
GS
[1 0 0 1 160.67677 95.93053] CT
0.851 0.325 0.098 RC
N
f-891180347
f
GR
GS
[1 0 0 1 165.06061 94.26205] CT
0.851 0.325 0.098 RC
N
f-891180347
f
GR
GS
[1 0 0 1 169.44444 92.68296] CT
0.851 0.325 0.098 RC
N
f-891180347
f
GR
GS
[1 0 0 1 173.82828 91.12144] CT
0.851 0.325 0.098 RC
N
f-891180347
f
GR
GS
[1 0 0 1 178.21213 89.60336] CT
0.851 0.325 0.098 RC
N
f-891180347
f
GR
GS
[1 0 0 1 182.59596 87.45013] CT
0.851 0.325 0.098 RC
N
f-891180347
f
GR
GS
[1 0 0 1 186.9798 83.29393] CT
0.851 0.325 0.098 RC
N
f-891180347
f
GR
GS
[1 0 0 1 191.36363 79.28267] CT
0.851 0.325 0.098 RC
N
f-891180347
f
GR
GS
[1 0 0 1 195.74748 75.50623] CT
0.851 0.325 0.098 RC
N
f-891180347
f
GR
GS
[1 0 0 1 200.13132 71.84951] CT
0.851 0.325 0.098 RC
N
f-891180347
f
GR
GS
[1 0 0 1 204.51515 68.33478] CT
0.851 0.325 0.098 RC
N
f-891180347
f
GR
GS
[1 0 0 1 208.89899 64.99416] CT
0.851 0.325 0.098 RC
N
f-891180347
f
GR
GS
[1 0 0 1 213.28282 61.89921] CT
0.851 0.325 0.098 RC
N
f-891180347
f
GR
GS
[1 0 0 1 217.66667 58.93756] CT
0.851 0.325 0.098 RC
N
f-891180347
f
GR
GS
[1 0 0 1 222.05051 56.11856] CT
0.851 0.325 0.098 RC
N
f-891180347
f
GR
GS
[1 0 0 1 226.43434 53.49166] CT
0.851 0.325 0.098 RC
N
f-891180347
f
GR
GS
[1 0 0 1 230.81818 51.03143] CT
0.851 0.325 0.098 RC
N
f-891180347
f
GR
GS
[1 0 0 1 235.20203 48.69046] CT
0.851 0.325 0.098 RC
N
f-891180347
f
GR
GS
[1 0 0 1 239.58586 46.60825] CT
0.851 0.325 0.098 RC
N
f-891180347
f
GR
GS
[1 0 0 1 243.9697 44.67534] CT
0.851 0.325 0.098 RC
N
f-891180347
f
GR
GS
[1 0 0 1 248.35353 42.88447] CT
0.851 0.325 0.098 RC
N
f-891180347
f
GR
GS
[1 0 0 1 252.73738 41.2963] CT
0.851 0.325 0.098 RC
N
f-891180347
f
GR
GS
[1 0 0 1 257.12122 39.89463] CT
0.851 0.325 0.098 RC
N
f-891180347
f
GR
GS
[1 0 0 1 261.50507 38.6858] CT
0.851 0.325 0.098 RC
N
f-891180347
f
GR
GS
[1 0 0 1 265.88889 37.64219] CT
0.851 0.325 0.098 RC
N
f-891180347
f
GR
GS
[1 0 0 1 270.27274 36.75295] CT
0.851 0.325 0.098 RC
N
f-891180347
f
GR
GS
[1 0 0 1 274.65656 36.10632] CT
0.851 0.325 0.098 RC
N
f-891180347
f
GR
GS
[1 0 0 1 279.04041 35.57373] CT
0.851 0.325 0.098 RC
N
f-891180347
f
GR
GS
[1 0 0 1 283.42426 35.24023] CT
0.851 0.325 0.098 RC
N
f-891180347
f
GR
GS
[1 0 0 1 287.80807 35.03134] CT
0.851 0.325 0.098 RC
N
f-891180347
f
GR
GS
[1 0 0 1 292.19193 35.04448] CT
0.851 0.325 0.098 RC
N
f-891180347
f
GR
GS
[1 0 0 1 296.57574 35.18728] CT
0.851 0.325 0.098 RC
N
f-891180347
f
GR
GS
[1 0 0 1 300.95959 35.52677] CT
0.851 0.325 0.098 RC
N
f-891180347
f
GR
GS
[1 0 0 1 305.34344 36.04398] CT
0.851 0.325 0.098 RC
N
f-891180347
f
GR
GS
[1 0 0 1 309.72726 36.72393] CT
0.851 0.325 0.098 RC
N
f-891180347
f
GR
GS
[1 0 0 1 314.11111 37.59263] CT
0.851 0.325 0.098 RC
N
f-891180347
f
GR
GS
[1 0 0 1 318.49493 38.64543] CT
0.851 0.325 0.098 RC
N
f-891180347
f
GR
GS
[1 0 0 1 322.87878 39.86263] CT
0.851 0.325 0.098 RC
N
f-891180347
f
GR
GS
[1 0 0 1 327.26263 41.29361] CT
0.851 0.325 0.098 RC
N
f-891180347
f
GR
GS
[1 0 0 1 331.64645 42.85666] CT
0.851 0.325 0.098 RC
N
f-891180347
f
GR
GS
[1 0 0 1 336.0303 44.66873] CT
0.851 0.325 0.098 RC
N
f-891180347
f
GR
GS
[1 0 0 1 340.41415 46.57852] CT
0.851 0.325 0.098 RC
N
f-891180347
f
GR
GS
[1 0 0 1 344.79797 48.68906] CT
0.851 0.325 0.098 RC
N
f-891180347
f
GR
GS
[1 0 0 1 349.18182 50.92379] CT
0.851 0.325 0.098 RC
N
f-891180347
f
GR
GS
[1 0 0 1 353.56564 53.37094] CT
0.851 0.325 0.098 RC
N
f-891180347
f
GR
GS
[1 0 0 1 357.94949 55.9998] CT
0.851 0.325 0.098 RC
N
f-891180347
f
GR
GS
[1 0 0 1 362.33334 58.79826] CT
0.851 0.325 0.098 RC
N
f-891180347
f
GR
GS
[1 0 0 1 366.71716 61.82796] CT
0.851 0.325 0.098 RC
N
f-891180347
f
GR
GS
[1 0 0 1 371.10101 64.96847] CT
0.851 0.325 0.098 RC
N
f-891180347
f
GR
GS
[1 0 0 1 375.48486 68.25986] CT
0.851 0.325 0.098 RC
N
f-891180347
f
GR
GS
[1 0 0 1 379.86868 71.78556] CT
0.851 0.325 0.098 RC
N
f-891180347
f
GR
GS
[1 0 0 1 384.25253 75.53925] CT
0.851 0.325 0.098 RC
N
f-891180347
f
GR
GS
[1 0 0 1 388.63635 79.35473] CT
0.851 0.325 0.098 RC
N
f-891180347
f
GR
GS
[1 0 0 1 393.0202 83.41027] CT
0.851 0.325 0.098 RC
N
f-891180347
f
GR
GS
[1 0 0 1 397.40405 87.63631] CT
0.851 0.325 0.098 RC
N
f-891180347
f
GR
GS
[1 0 0 1 401.78787 89.83398] CT
0.851 0.325 0.098 RC
N
f-891180347
f
GR
GS
[1 0 0 1 406.17172 91.35738] CT
0.851 0.325 0.098 RC
N
f-891180347
f
GR
GS
[1 0 0 1 410.55557 92.92908] CT
0.851 0.325 0.098 RC
N
f-891180347
f
GR
GS
[1 0 0 1 414.93939 94.54949] CT
0.851 0.325 0.098 RC
N
f-891180347
f
GR
GS
[1 0 0 1 419.32324 96.22099] CT
0.851 0.325 0.098 RC
N
f-891180347
f
GR
GS
[1 0 0 1 423.70706 97.94316] CT
0.851 0.325 0.098 RC
N
f-891180347
f
GR
GS
[1 0 0 1 428.09091 99.7401] CT
0.851 0.325 0.098 RC
N
f-891180347
f
GR
GS
[1 0 0 1 432.47476 101.59689] CT
0.851 0.325 0.098 RC
N
f-891180347
f
GR
GS
[1 0 0 1 436.85858 103.54623] CT
0.851 0.325 0.098 RC
N
f-891180347
f
GR
GS
[1 0 0 1 441.24243 105.5712] CT
0.851 0.325 0.098 RC
N
f-891180347
f
GR
GS
[1 0 0 1 445.62625 107.59155] CT
0.851 0.325 0.098 RC
N
f-891180347
f
GR
GS
[1 0 0 1 450.0101 109.72427] CT
0.851 0.325 0.098 RC
N
f-891180347
f
GR
GS
[1 0 0 1 454.39395 111.8726] CT
0.851 0.325 0.098 RC
N
f-891180347
f
GR
GS
[1 0 0 1 458.77777 114.15097] CT
0.851 0.325 0.098 RC
N
f-891180347
f
GR
GS
[1 0 0 1 463.16162 116.46764] CT
0.851 0.325 0.098 RC
N
f-891180347
f
GR
GS
[1 0 0 1 467.54544 118.85579] CT
0.851 0.325 0.098 RC
N
f-891180347
f
GR
GS
[1 0 0 1 471.92929 121.25808] CT
0.851 0.325 0.098 RC
N
f-891180347
f
GR
GS
[1 0 0 1 476.31314 123.72317] CT
0.851 0.325 0.098 RC
N
f-891180347
f
GR
GS
[1 0 0 1 480.69696 126.25677] CT
0.851 0.325 0.098 RC
N
f-891180347
f
GR
GS
[1 0 0 1 485.08081 128.81436] CT
0.851 0.325 0.098 RC
N
f-891180347
f
GR
GS
[1 0 0 1 489.46463 131.46664] CT
0.851 0.325 0.098 RC
N
f-891180347
f
GR
GS
[1 0 0 1 493.84848 134.19489] CT
0.851 0.325 0.098 RC
N
f-891180347
f
GR
GS
[1 0 0 1 498.23233 136.86972] CT
0.851 0.325 0.098 RC
N
f-891180347
f
GR
GS
[1 0 0 1 502.61615 139.60109] CT
0.851 0.325 0.098 RC
N
f-891180347
f
GR
GS
[1 0 0 1 507 142.48767] CT
0.851 0.325 0.098 RC
N
f-891180347
f
GR
GS
1 GC
N
499 66 M
499 39.5 L
417.5 39.5 L
417.5 66 L
cp
f
GR
GS
[1 0 0 1 454.5 47] CT
/Helvetica 9 F
GS
[1 0 0 1 0 0] CT
0 3.5 moveto 
1 -1 scale
(Real) t 
GR
GR
GS
0 0.447 0.741 RC
1 LJ
1.5 LW
N
421.5 47 M
451.5 47 L
S
GR
GS
[1 0 0 1 454.5 58.5] CT
/Helvetica 9 F
GS
[1 0 0 1 0 0] CT
0 3.5 moveto 
1 -1 scale
(Estimated) t 
GR
GR
GS
0.851 0.325 0.098 RC
1 LJ
N
421.5 58.5 M
451.5 58.5 L
S
GR
GS
[1 0 0 1 436.5 58.5] CT
0.851 0.325 0.098 RC
N
f-891180347
f
GR
GS
0.149 GC
10.0 ML
0.5 LW
N
417.5 66 M
417.5 39.5 L
499 39.5 L
499 66 L
cp
S
GR
%%Trailer
%%Pages: 1
%%EOF
