%!PS-Adobe-3.0 EPSF-3.0
%%Creator: (MATLAB, The Mathworks, Inc. Version 23.2.0.2409890 \(R2023b\) Update 3. Operating System: Mac OS X)
%%Title: /Users/jakub/Projects/modeling-and-identification/report-03/images/lab8/100.eps
%%CreationDate: 2024-01-04T18:12:27
%%Pages: (atend)
%%BoundingBox:     0     0   306   217
%%LanguageLevel: 3
%%EndComments
%%BeginProlog
%%BeginResource: procset (Apache XML Graphics Std ProcSet) 1.2 0
%%Version: 1.2 0
%%Copyright: (Copyright 2001-2003,2010 The Apache Software Foundation. License terms: http://www.apache.org/licenses/LICENSE-2.0)
/bd{bind def}bind def
/ld{load def}bd
/GR/grestore ld
/GS/gsave ld
/RM/rmoveto ld
/C/curveto ld
/t/show ld
/L/lineto ld
/ML/setmiterlimit ld
/CT/concat ld
/f/fill ld
/N/newpath ld
/S/stroke ld
/CC/setcmykcolor ld
/A/ashow ld
/cp/closepath ld
/RC/setrgbcolor ld
/LJ/setlinejoin ld
/GC/setgray ld
/LW/setlinewidth ld
/M/moveto ld
/re {4 2 roll M
1 index 0 rlineto
0 exch rlineto
neg 0 rlineto
cp } bd
/_ctm matrix def
/_tm matrix def
/BT { _ctm currentmatrix pop matrix _tm copy pop 0 0 moveto } bd
/ET { _ctm setmatrix } bd
/iTm { _ctm setmatrix _tm concat } bd
/Tm { _tm astore pop iTm 0 0 moveto } bd
/ux 0.0 def
/uy 0.0 def
/F {
  /Tp exch def
  /Tf exch def
  Tf findfont Tp scalefont setfont
  /cf Tf def  /cs Tp def
} bd
/ULS {currentpoint /uy exch def /ux exch def} bd
/ULE {
  /Tcx currentpoint pop def
  gsave
  newpath
  cf findfont cs scalefont dup
  /FontMatrix get 0 get /Ts exch def /FontInfo get dup
  /UnderlinePosition get Ts mul /To exch def
  /UnderlineThickness get Ts mul /Tt exch def
  ux uy To add moveto  Tcx uy To add lineto
  Tt setlinewidth stroke
  grestore
} bd
/OLE {
  /Tcx currentpoint pop def
  gsave
  newpath
  cf findfont cs scalefont dup
  /FontMatrix get 0 get /Ts exch def /FontInfo get dup
  /UnderlinePosition get Ts mul /To exch def
  /UnderlineThickness get Ts mul /Tt exch def
  ux uy To add cs add moveto Tcx uy To add cs add lineto
  Tt setlinewidth stroke
  grestore
} bd
/SOE {
  /Tcx currentpoint pop def
  gsave
  newpath
  cf findfont cs scalefont dup
  /FontMatrix get 0 get /Ts exch def /FontInfo get dup
  /UnderlinePosition get Ts mul /To exch def
  /UnderlineThickness get Ts mul /Tt exch def
  ux uy To add cs 10 mul 26 idiv add moveto Tcx uy To add cs 10 mul 26 idiv add lineto
  Tt setlinewidth stroke
  grestore
} bd
/QT {
/Y22 exch store
/X22 exch store
/Y21 exch store
/X21 exch store
currentpoint
/Y21 load 2 mul add 3 div exch
/X21 load 2 mul add 3 div exch
/X21 load 2 mul /X22 load add 3 div
/Y21 load 2 mul /Y22 load add 3 div
/X22 load /Y22 load curveto
} bd
/SSPD {
dup length /d exch dict def
{
/v exch def
/k exch def
currentpagedevice k known {
/cpdv currentpagedevice k get def
v cpdv ne {
/upd false def
/nullv v type /nulltype eq def
/nullcpdv cpdv type /nulltype eq def
nullv nullcpdv or
{
/upd true def
} {
/sametype v type cpdv type eq def
sametype {
v type /arraytype eq {
/vlen v length def
/cpdvlen cpdv length def
vlen cpdvlen eq {
0 1 vlen 1 sub {
/i exch def
/obj v i get def
/cpdobj cpdv i get def
obj cpdobj ne {
/upd true def
exit
} if
} for
} {
/upd true def
} ifelse
} {
v type /dicttype eq {
v {
/dv exch def
/dk exch def
/cpddv cpdv dk get def
dv cpddv ne {
/upd true def
exit
} if
} forall
} {
/upd true def
} ifelse
} ifelse
} if
} ifelse
upd true eq {
d k v put
} if
} if
} if
} forall
d length 0 gt {
d setpagedevice
} if
} bd
/RE { % /NewFontName [NewEncodingArray] /FontName RE -
  findfont dup length dict begin
  {
    1 index /FID ne
    {def} {pop pop} ifelse
  } forall
  /Encoding exch def
  /FontName 1 index def
  currentdict definefont pop
  end
} bind def
%%EndResource
%%BeginResource: procset (Apache XML Graphics EPS ProcSet) 1.0 0
%%Version: 1.0 0
%%Copyright: (Copyright 2002-2003 The Apache Software Foundation. License terms: http://www.apache.org/licenses/LICENSE-2.0)
/BeginEPSF { %def
/b4_Inc_state save def         % Save state for cleanup
/dict_count countdictstack def % Count objects on dict stack
/op_count count 1 sub def      % Count objects on operand stack
userdict begin                 % Push userdict on dict stack
/showpage { } def              % Redefine showpage, { } = null proc
0 setgray 0 setlinecap         % Prepare graphics state
1 setlinewidth 0 setlinejoin
10 setmiterlimit [ ] 0 setdash newpath
/languagelevel where           % If level not equal to 1 then
{pop languagelevel             % set strokeadjust and
1 ne                           % overprint to their defaults.
{false setstrokeadjust false setoverprint
} if
} if
} bd
/EndEPSF { %def
count op_count sub {pop} repeat            % Clean up stacks
countdictstack dict_count sub {end} repeat
b4_Inc_state restore
} bd
%%EndResource
%FOPBeginFontDict
%%IncludeResource: font Courier-Oblique
%%IncludeResource: font Courier-BoldOblique
%%IncludeResource: font Courier-Bold
%%IncludeResource: font ZapfDingbats
%%IncludeResource: font Symbol
%%IncludeResource: font Helvetica
%%IncludeResource: font Helvetica-Oblique
%%IncludeResource: font Helvetica-Bold
%%IncludeResource: font Helvetica-BoldOblique
%%IncludeResource: font Times-Roman
%%IncludeResource: font Times-Italic
%%IncludeResource: font Times-Bold
%%IncludeResource: font Times-BoldItalic
%%IncludeResource: font Courier
%FOPEndFontDict
%%BeginResource: encoding WinAnsiEncoding
/WinAnsiEncoding [
/.notdef /.notdef /.notdef /.notdef /.notdef
/.notdef /.notdef /.notdef /.notdef /.notdef
/.notdef /.notdef /.notdef /.notdef /.notdef
/.notdef /.notdef /.notdef /.notdef /.notdef
/.notdef /.notdef /.notdef /.notdef /.notdef
/.notdef /.notdef /.notdef /.notdef /.notdef
/.notdef /.notdef /space /exclam /quotedbl
/numbersign /dollar /percent /ampersand /quotesingle
/parenleft /parenright /asterisk /plus /comma
/hyphen /period /slash /zero /one
/two /three /four /five /six
/seven /eight /nine /colon /semicolon
/less /equal /greater /question /at
/A /B /C /D /E
/F /G /H /I /J
/K /L /M /N /O
/P /Q /R /S /T
/U /V /W /X /Y
/Z /bracketleft /backslash /bracketright /asciicircum
/underscore /quoteleft /a /b /c
/d /e /f /g /h
/i /j /k /l /m
/n /o /p /q /r
/s /t /u /v /w
/x /y /z /braceleft /bar
/braceright /asciitilde /bullet /Euro /bullet
/quotesinglbase /florin /quotedblbase /ellipsis /dagger
/daggerdbl /circumflex /perthousand /Scaron /guilsinglleft
/OE /bullet /Zcaron /bullet /bullet
/quoteleft /quoteright /quotedblleft /quotedblright /bullet
/endash /emdash /asciitilde /trademark /scaron
/guilsinglright /oe /bullet /zcaron /Ydieresis
/space /exclamdown /cent /sterling /currency
/yen /brokenbar /section /dieresis /copyright
/ordfeminine /guillemotleft /logicalnot /sfthyphen /registered
/macron /degree /plusminus /twosuperior /threesuperior
/acute /mu /paragraph /middot /cedilla
/onesuperior /ordmasculine /guillemotright /onequarter /onehalf
/threequarters /questiondown /Agrave /Aacute /Acircumflex
/Atilde /Adieresis /Aring /AE /Ccedilla
/Egrave /Eacute /Ecircumflex /Edieresis /Igrave
/Iacute /Icircumflex /Idieresis /Eth /Ntilde
/Ograve /Oacute /Ocircumflex /Otilde /Odieresis
/multiply /Oslash /Ugrave /Uacute /Ucircumflex
/Udieresis /Yacute /Thorn /germandbls /agrave
/aacute /acircumflex /atilde /adieresis /aring
/ae /ccedilla /egrave /eacute /ecircumflex
/edieresis /igrave /iacute /icircumflex /idieresis
/eth /ntilde /ograve /oacute /ocircumflex
/otilde /odieresis /divide /oslash /ugrave
/uacute /ucircumflex /udieresis /yacute /thorn
/ydieresis
] def
%%EndResource
%FOPBeginFontReencode
/Courier-Oblique findfont
dup length dict begin
  {1 index /FID ne {def} {pop pop} ifelse} forall
  /Encoding WinAnsiEncoding def
  currentdict
end
/Courier-Oblique exch definefont pop
/Courier-BoldOblique findfont
dup length dict begin
  {1 index /FID ne {def} {pop pop} ifelse} forall
  /Encoding WinAnsiEncoding def
  currentdict
end
/Courier-BoldOblique exch definefont pop
/Courier-Bold findfont
dup length dict begin
  {1 index /FID ne {def} {pop pop} ifelse} forall
  /Encoding WinAnsiEncoding def
  currentdict
end
/Courier-Bold exch definefont pop
/Helvetica findfont
dup length dict begin
  {1 index /FID ne {def} {pop pop} ifelse} forall
  /Encoding WinAnsiEncoding def
  currentdict
end
/Helvetica exch definefont pop
/Helvetica-Oblique findfont
dup length dict begin
  {1 index /FID ne {def} {pop pop} ifelse} forall
  /Encoding WinAnsiEncoding def
  currentdict
end
/Helvetica-Oblique exch definefont pop
/Helvetica-Bold findfont
dup length dict begin
  {1 index /FID ne {def} {pop pop} ifelse} forall
  /Encoding WinAnsiEncoding def
  currentdict
end
/Helvetica-Bold exch definefont pop
/Helvetica-BoldOblique findfont
dup length dict begin
  {1 index /FID ne {def} {pop pop} ifelse} forall
  /Encoding WinAnsiEncoding def
  currentdict
end
/Helvetica-BoldOblique exch definefont pop
/Times-Roman findfont
dup length dict begin
  {1 index /FID ne {def} {pop pop} ifelse} forall
  /Encoding WinAnsiEncoding def
  currentdict
end
/Times-Roman exch definefont pop
/Times-Italic findfont
dup length dict begin
  {1 index /FID ne {def} {pop pop} ifelse} forall
  /Encoding WinAnsiEncoding def
  currentdict
end
/Times-Italic exch definefont pop
/Times-Bold findfont
dup length dict begin
  {1 index /FID ne {def} {pop pop} ifelse} forall
  /Encoding WinAnsiEncoding def
  currentdict
end
/Times-Bold exch definefont pop
/Times-BoldItalic findfont
dup length dict begin
  {1 index /FID ne {def} {pop pop} ifelse} forall
  /Encoding WinAnsiEncoding def
  currentdict
end
/Times-BoldItalic exch definefont pop
/Courier findfont
dup length dict begin
  {1 index /FID ne {def} {pop pop} ifelse} forall
  /Encoding WinAnsiEncoding def
  currentdict
end
/Courier exch definefont pop
%FOPEndFontReencode
%%EndProlog
%%Page: 1 1
%%PageBoundingBox: 0 0 306 217
%%BeginPageSetup
[1 0 0 -1 0 217] CT
%%EndPageSetup
GS
1 GC
N
0 0 306 217 re
f
GR
GS
1 GC
N
0 0 306 217 re
f
GR
GS
1 GC
N
40 193 M
277 193 L
277 16.5 L
40 16.5 L
cp
f
GR
GS
0.873 GC
1 LJ
0.5 LW
N
40 193 M
40 16.5 L
S
GR
GS
0.873 GC
1 LJ
0.5 LW
N
79.5 193 M
79.5 16.5 L
S
GR
GS
0.873 GC
1 LJ
0.5 LW
N
119 193 M
119 16.5 L
S
GR
GS
0.873 GC
1 LJ
0.5 LW
N
158.5 193 M
158.5 16.5 L
S
GR
GS
0.873 GC
1 LJ
0.5 LW
N
198 193 M
198 16.5 L
S
GR
GS
0.873 GC
1 LJ
0.5 LW
N
237.5 193 M
237.5 16.5 L
S
GR
GS
0.873 GC
1 LJ
0.5 LW
N
277 193 M
277 16.5 L
S
GR
GS
0.873 GC
1 LJ
0.5 LW
N
277 193 M
40 193 L
S
GR
GS
0.873 GC
1 LJ
0.5 LW
N
277 163.583 M
40 163.583 L
S
GR
GS
0.873 GC
1 LJ
0.5 LW
N
277 134.167 M
40 134.167 L
S
GR
GS
0.873 GC
1 LJ
0.5 LW
N
277 104.75 M
40 104.75 L
S
GR
GS
0.873 GC
1 LJ
0.5 LW
N
277 75.333 M
40 75.333 L
S
GR
GS
0.873 GC
1 LJ
0.5 LW
N
277 45.917 M
40 45.917 L
S
GR
GS
0.873 GC
1 LJ
0.5 LW
N
277 16.5 M
40 16.5 L
S
GR
GS
0.149 GC
2 setlinecap
1 LJ
0.5 LW
N
40 193 M
277 193 L
S
GR
GS
0.149 GC
2 setlinecap
1 LJ
0.5 LW
N
40 193 M
40 190.63 L
S
GR
GS
0.149 GC
2 setlinecap
1 LJ
0.5 LW
N
79.5 193 M
79.5 190.63 L
S
GR
GS
0.149 GC
2 setlinecap
1 LJ
0.5 LW
N
119 193 M
119 190.63 L
S
GR
GS
0.149 GC
2 setlinecap
1 LJ
0.5 LW
N
158.5 193 M
158.5 190.63 L
S
GR
GS
0.149 GC
2 setlinecap
1 LJ
0.5 LW
N
198 193 M
198 190.63 L
S
GR
GS
0.149 GC
2 setlinecap
1 LJ
0.5 LW
N
237.5 193 M
237.5 190.63 L
S
GR
GS
0.149 GC
2 setlinecap
1 LJ
0.5 LW
N
277 193 M
277 190.63 L
S
GR
GS
[1 0 0 1 40 197] CT
0.149 GC
/Helvetica 10 F
GS
[1 0 0 1 0 0] CT
-5 10 moveto 
1 -1 scale
(-6) t 
GR
GR
GS
[1 0 0 1 79.5 197] CT
0.149 GC
/Helvetica 10 F
GS
[1 0 0 1 0 0] CT
-5 10 moveto 
1 -1 scale
(-4) t 
GR
GR
GS
[1 0 0 1 119 197] CT
0.149 GC
/Helvetica 10 F
GS
[1 0 0 1 0 0] CT
-5 10 moveto 
1 -1 scale
(-2) t 
GR
GR
GS
[1 0 0 1 158.5 197] CT
0.149 GC
/Helvetica 10 F
GS
[1 0 0 1 0 0] CT
-3 10 moveto 
1 -1 scale
(0) t 
GR
GR
GS
[1 0 0 1 198 197] CT
0.149 GC
/Helvetica 10 F
GS
[1 0 0 1 0 0] CT
-3 10 moveto 
1 -1 scale
(2) t 
GR
GR
GS
[1 0 0 1 237.5 197] CT
0.149 GC
/Helvetica 10 F
GS
[1 0 0 1 0 0] CT
-3 10 moveto 
1 -1 scale
(4) t 
GR
GR
GS
[1 0 0 1 277 197] CT
0.149 GC
/Helvetica 10 F
GS
[1 0 0 1 0 0] CT
-3 10 moveto 
1 -1 scale
(6) t 
GR
GR
GS
0.149 GC
2 setlinecap
1 LJ
0.5 LW
N
40 193 M
40 16.5 L
S
GR
GS
0.149 GC
2 setlinecap
1 LJ
0.5 LW
N
40 193 M
42.37 193 L
S
GR
GS
0.149 GC
2 setlinecap
1 LJ
0.5 LW
N
40 163.583 M
42.37 163.583 L
S
GR
GS
0.149 GC
2 setlinecap
1 LJ
0.5 LW
N
40 134.167 M
42.37 134.167 L
S
GR
GS
0.149 GC
2 setlinecap
1 LJ
0.5 LW
N
40 104.75 M
42.37 104.75 L
S
GR
GS
0.149 GC
2 setlinecap
1 LJ
0.5 LW
N
40 75.333 M
42.37 75.333 L
S
GR
GS
0.149 GC
2 setlinecap
1 LJ
0.5 LW
N
40 45.917 M
42.37 45.917 L
S
GR
GS
0.149 GC
2 setlinecap
1 LJ
0.5 LW
N
40 16.5 M
42.37 16.5 L
S
GR
GS
[1 0 0 1 36 193] CT
0.149 GC
/Helvetica 10 F
GS
[1 0 0 1 0 0] CT
-16 3.5 moveto 
1 -1 scale
(-10) t 
GR
GR
GS
[1 0 0 1 36 163.58333] CT
0.149 GC
/Helvetica 10 F
GS
[1 0 0 1 0 0] CT
-6 3.5 moveto 
1 -1 scale
(0) t 
GR
GR
GS
[1 0 0 1 36 134.16667] CT
0.149 GC
/Helvetica 10 F
GS
[1 0 0 1 0 0] CT
-12 3.5 moveto 
1 -1 scale
(10) t 
GR
GR
GS
[1 0 0 1 36 104.75] CT
0.149 GC
/Helvetica 10 F
GS
[1 0 0 1 0 0] CT
-12 3.5 moveto 
1 -1 scale
(20) t 
GR
GR
GS
[1 0 0 1 36 75.33334] CT
0.149 GC
/Helvetica 10 F
GS
[1 0 0 1 0 0] CT
-12 3.5 moveto 
1 -1 scale
(30) t 
GR
GR
GS
[1 0 0 1 36 45.91667] CT
0.149 GC
/Helvetica 10 F
GS
[1 0 0 1 0 0] CT
-12 3.5 moveto 
1 -1 scale
(40) t 
GR
GR
GS
[1 0 0 1 36 16.5] CT
0.149 GC
/Helvetica 10 F
GS
[1 0 0 1 0 0] CT
-12 3.5 moveto 
1 -1 scale
(50) t 
GR
GR
GS
[1 0 0 1 158.50015 15.125] CT
/Helvetica-Bold 11 F
GS
[1 0 0 1 0 0] CT
-78 -3 moveto 
1 -1 scale
(Estimation for N = 100 H = 0.7) t 
GR
GR
GS
0 0.447 0.741 RC
1 LJ
1.5 LW
N
40 75.333 M
42.394 79.212 L
44.788 83.005 L
47.182 86.711 L
49.576 90.331 L
51.97 93.864 L
54.364 97.311 L
56.758 100.671 L
59.152 103.945 L
61.545 107.133 L
63.939 110.234 L
66.333 113.248 L
68.727 116.176 L
71.121 119.018 L
73.515 121.773 L
75.909 124.442 L
78.303 127.025 L
80.697 129.521 L
83.091 131.93 L
85.485 134.253 L
87.879 136.49 L
90.273 138.64 L
92.667 140.704 L
95.061 142.681 L
97.455 144.572 L
99.848 146.376 L
102.242 148.094 L
104.636 149.726 L
107.03 151.271 L
109.424 152.73 L
111.818 154.102 L
114.212 155.388 L
116.606 156.587 L
119 157.7 L
121.394 158.726 L
123.788 159.667 L
126.182 160.52 L
128.576 161.287 L
130.97 161.968 L
133.364 162.562 L
135.758 163.07 L
138.152 163.491 L
140.545 163.826 L
142.939 164.075 L
145.333 164.237 L
147.727 164.313 L
150.121 164.302 L
152.515 164.205 L
154.909 164.021 L
157.303 163.751 L
159.697 163.394 L
162.091 162.951 L
164.485 162.422 L
166.879 161.806 L
169.273 161.104 L
171.667 160.315 L
174.061 159.44 L
176.455 158.478 L
178.848 157.43 L
181.242 156.295 L
183.636 155.074 L
186.03 153.767 L
188.424 152.373 L
190.818 150.893 L
193.212 149.326 L
195.606 147.673 L
198 145.933 L
200.394 144.107 L
202.788 142.195 L
205.182 140.196 L
207.576 138.111 L
209.97 135.939 L
212.364 133.68 L
214.758 131.336 L
217.152 128.905 L
219.545 126.387 L
221.939 123.783 L
224.333 121.093 L
226.727 118.316 L
229.121 115.452 L
231.515 112.503 L
233.909 109.466 L
236.303 106.344 L
238.697 103.135 L
241.091 99.839 L
243.485 96.457 L
245.879 92.989 L
248.273 89.434 L
250.667 85.793 L
253.061 82.065 L
255.455 78.251 L
257.848 74.35 L
260.242 70.363 L
262.636 66.29 L
265.03 62.13 L
267.424 57.883 L
269.818 53.55 L
272.212 49.131 L
274.606 44.625 L
277 40.033 L
S
GR
GS
0.851 0.325 0.098 RC
1 LJ
N
40 146.178 M
42.394 144.861 L
44.788 144.861 L
47.182 144.861 L
49.576 147.663 L
51.97 150.216 L
54.364 149.589 L
56.758 154.665 L
59.152 154.665 L
61.545 153.954 L
63.939 149.014 L
66.333 148.982 L
68.727 148.982 L
71.121 148.982 L
73.515 154.634 L
75.909 154.634 L
78.303 161.451 L
80.697 158.905 L
83.091 158.905 L
85.485 159.311 L
87.879 159.964 L
90.273 160.756 L
92.667 160.225 L
95.061 161.589 L
97.455 160.868 L
99.848 160.52 L
102.242 159.456 L
104.636 159.253 L
107.03 159.423 L
109.424 158.575 L
111.818 158.765 L
114.212 158.352 L
116.606 157.918 L
119 157.918 L
121.394 158.317 L
123.788 160.662 L
126.182 163.038 L
128.576 162.444 L
130.97 163.28 L
133.364 163.07 L
135.758 162.815 L
138.152 162.815 L
140.545 162.067 L
142.939 161.611 L
145.333 160.891 L
147.727 160.564 L
150.121 161.032 L
152.515 161.803 L
154.909 162.76 L
157.303 163.124 L
159.697 163.124 L
162.091 164.26 L
164.485 162.817 L
166.879 162.262 L
169.273 159.729 L
171.667 159.729 L
174.061 158.715 L
176.455 155.927 L
178.848 155.287 L
181.242 156.144 L
183.636 156.587 L
186.03 156.841 L
188.424 157.112 L
190.818 157.834 L
193.212 157.29 L
195.606 154.175 L
198 153.792 L
200.394 153.65 L
202.788 153.169 L
205.182 152.892 L
207.576 153.1 L
209.97 151.469 L
212.364 151.814 L
214.758 151.298 L
217.152 151.96 L
219.545 151.96 L
221.939 148.162 L
224.333 148.947 L
226.727 145.599 L
229.121 145.154 L
231.515 142.532 L
233.909 143.127 L
236.303 142.532 L
238.697 142.532 L
241.091 144.577 L
243.485 142.906 L
245.879 142.948 L
248.273 142.948 L
250.667 143.847 L
253.061 140.816 L
255.455 139.601 L
257.848 138.934 L
260.242 136.049 L
262.636 135.086 L
265.03 135.086 L
267.424 132.86 L
269.818 127.561 L
272.212 125.978 L
274.606 117.689 L
277 107.032 L
S
GR
GS
[1 0 0 1 40 146.17841] CT
0.851 0.325 0.098 RC
N
1 0 M
1 0.552 0.552 1 0 1 C
-0.552 1 -1 0.552 -1 0 C
-1 -0.552 -0.552 -1 0 -1 C
0.552 -1 1 -0.552 1 0 C
cp
f
GR
GS
[1 0 0 1 42.39394 144.86119] CT
0.851 0.325 0.098 RC
N
/f-891180347{1 0 M
1 0.552 0.552 1 0 1 C
-0.552 1 -1 0.552 -1 0 C
-1 -0.552 -0.552 -1 0 -1 C
0.552 -1 1 -0.552 1 0 C
cp}def
f-891180347
f
GR
GS
[1 0 0 1 44.78788 144.86119] CT
0.851 0.325 0.098 RC
N
f-891180347
f
GR
GS
[1 0 0 1 47.18182 144.86119] CT
0.851 0.325 0.098 RC
N
f-891180347
f
GR
GS
[1 0 0 1 49.57576 147.6629] CT
0.851 0.325 0.098 RC
N
f-891180347
f
GR
GS
[1 0 0 1 51.9697 150.21634] CT
0.851 0.325 0.098 RC
N
f-891180347
f
GR
GS
[1 0 0 1 54.36363 149.58949] CT
0.851 0.325 0.098 RC
N
f-891180347
f
GR
GS
[1 0 0 1 56.75758 154.66458] CT
0.851 0.325 0.098 RC
N
f-891180347
f
GR
GS
[1 0 0 1 59.15152 154.66458] CT
0.851 0.325 0.098 RC
N
f-891180347
f
GR
GS
[1 0 0 1 61.54545 153.95367] CT
0.851 0.325 0.098 RC
N
f-891180347
f
GR
GS
[1 0 0 1 63.93939 149.01357] CT
0.851 0.325 0.098 RC
N
f-891180347
f
GR
GS
[1 0 0 1 66.33334 148.9818] CT
0.851 0.325 0.098 RC
N
f-891180347
f
GR
GS
[1 0 0 1 68.72727 148.9818] CT
0.851 0.325 0.098 RC
N
f-891180347
f
GR
GS
[1 0 0 1 71.12121 148.9818] CT
0.851 0.325 0.098 RC
N
f-891180347
f
GR
GS
[1 0 0 1 73.51514 154.63449] CT
0.851 0.325 0.098 RC
N
f-891180347
f
GR
GS
[1 0 0 1 75.9091 154.63449] CT
0.851 0.325 0.098 RC
N
f-891180347
f
GR
GS
[1 0 0 1 78.30303 161.45149] CT
0.851 0.325 0.098 RC
N
f-891180347
f
GR
GS
[1 0 0 1 80.69697 158.9053] CT
0.851 0.325 0.098 RC
N
f-891180347
f
GR
GS
[1 0 0 1 83.09091 158.9053] CT
0.851 0.325 0.098 RC
N
f-891180347
f
GR
GS
[1 0 0 1 85.48485 159.3105] CT
0.851 0.325 0.098 RC
N
f-891180347
f
GR
GS
[1 0 0 1 87.87879 159.96413] CT
0.851 0.325 0.098 RC
N
f-891180347
f
GR
GS
[1 0 0 1 90.27273 160.75578] CT
0.851 0.325 0.098 RC
N
f-891180347
f
GR
GS
[1 0 0 1 92.66667 160.22528] CT
0.851 0.325 0.098 RC
N
f-891180347
f
GR
GS
[1 0 0 1 95.06061 161.58907] CT
0.851 0.325 0.098 RC
N
f-891180347
f
GR
GS
[1 0 0 1 97.45454 160.86803] CT
0.851 0.325 0.098 RC
N
f-891180347
f
GR
GS
[1 0 0 1 99.84849 160.52042] CT
0.851 0.325 0.098 RC
N
f-891180347
f
GR
GS
[1 0 0 1 102.24242 159.45648] CT
0.851 0.325 0.098 RC
N
f-891180347
f
GR
GS
[1 0 0 1 104.63636 159.25273] CT
0.851 0.325 0.098 RC
N
f-891180347
f
GR
GS
[1 0 0 1 107.0303 159.42252] CT
0.851 0.325 0.098 RC
N
f-891180347
f
GR
GS
[1 0 0 1 109.42424 158.57462] CT
0.851 0.325 0.098 RC
N
f-891180347
f
GR
GS
[1 0 0 1 111.81818 158.76517] CT
0.851 0.325 0.098 RC
N
f-891180347
f
GR
GS
[1 0 0 1 114.21212 158.35223] CT
0.851 0.325 0.098 RC
N
f-891180347
f
GR
GS
[1 0 0 1 116.60606 157.91754] CT
0.851 0.325 0.098 RC
N
f-891180347
f
GR
GS
[1 0 0 1 119 157.91754] CT
0.851 0.325 0.098 RC
N
f-891180347
f
GR
GS
[1 0 0 1 121.39394 158.317] CT
0.851 0.325 0.098 RC
N
f-891180347
f
GR
GS
[1 0 0 1 123.78788 160.66209] CT
0.851 0.325 0.098 RC
N
f-891180347
f
GR
GS
[1 0 0 1 126.18182 163.03828] CT
0.851 0.325 0.098 RC
N
f-891180347
f
GR
GS
[1 0 0 1 128.57576 162.44405] CT
0.851 0.325 0.098 RC
N
f-891180347
f
GR
GS
[1 0 0 1 130.9697 163.28043] CT
0.851 0.325 0.098 RC
N
f-891180347
f
GR
GS
[1 0 0 1 133.36363 163.07024] CT
0.851 0.325 0.098 RC
N
f-891180347
f
GR
GS
[1 0 0 1 135.75758 162.81502] CT
0.851 0.325 0.098 RC
N
f-891180347
f
GR
GS
[1 0 0 1 138.15152 162.81502] CT
0.851 0.325 0.098 RC
N
f-891180347
f
GR
GS
[1 0 0 1 140.54546 162.06723] CT
0.851 0.325 0.098 RC
N
f-891180347
f
GR
GS
[1 0 0 1 142.93939 161.61148] CT
0.851 0.325 0.098 RC
N
f-891180347
f
GR
GS
[1 0 0 1 145.33333 160.89136] CT
0.851 0.325 0.098 RC
N
f-891180347
f
GR
GS
[1 0 0 1 147.72728 160.56351] CT
0.851 0.325 0.098 RC
N
f-891180347
f
GR
GS
[1 0 0 1 150.12122 161.0321] CT
0.851 0.325 0.098 RC
N
f-891180347
f
GR
GS
[1 0 0 1 152.51515 161.80283] CT
0.851 0.325 0.098 RC
N
f-891180347
f
GR
GS
[1 0 0 1 154.90909 162.76033] CT
0.851 0.325 0.098 RC
N
f-891180347
f
GR
GS
[1 0 0 1 157.30302 163.12447] CT
0.851 0.325 0.098 RC
N
f-891180347
f
GR
GS
[1 0 0 1 159.69698 163.12447] CT
0.851 0.325 0.098 RC
N
f-891180347
f
GR
GS
[1 0 0 1 162.09091 164.25999] CT
0.851 0.325 0.098 RC
N
f-891180347
f
GR
GS
[1 0 0 1 164.48485 162.81686] CT
0.851 0.325 0.098 RC
N
f-891180347
f
GR
GS
[1 0 0 1 166.87878 162.26184] CT
0.851 0.325 0.098 RC
N
f-891180347
f
GR
GS
[1 0 0 1 169.27272 159.72945] CT
0.851 0.325 0.098 RC
N
f-891180347
f
GR
GS
[1 0 0 1 171.66667 159.72945] CT
0.851 0.325 0.098 RC
N
f-891180347
f
GR
GS
[1 0 0 1 174.06061 158.71541] CT
0.851 0.325 0.098 RC
N
f-891180347
f
GR
GS
[1 0 0 1 176.45454 155.92673] CT
0.851 0.325 0.098 RC
N
f-891180347
f
GR
GS
[1 0 0 1 178.84848 155.28654] CT
0.851 0.325 0.098 RC
N
f-891180347
f
GR
GS
[1 0 0 1 181.24242 156.14427] CT
0.851 0.325 0.098 RC
N
f-891180347
f
GR
GS
[1 0 0 1 183.63637 156.58678] CT
0.851 0.325 0.098 RC
N
f-891180347
f
GR
GS
[1 0 0 1 186.0303 156.84142] CT
0.851 0.325 0.098 RC
N
f-891180347
f
GR
GS
[1 0 0 1 188.42424 157.11166] CT
0.851 0.325 0.098 RC
N
f-891180347
f
GR
GS
[1 0 0 1 190.81818 157.83391] CT
0.851 0.325 0.098 RC
N
f-891180347
f
GR
GS
[1 0 0 1 193.21213 157.28986] CT
0.851 0.325 0.098 RC
N
f-891180347
f
GR
GS
[1 0 0 1 195.60606 154.17477] CT
0.851 0.325 0.098 RC
N
f-891180347
f
GR
GS
[1 0 0 1 198 153.79175] CT
0.851 0.325 0.098 RC
N
f-891180347
f
GR
GS
[1 0 0 1 200.39394 153.65013] CT
0.851 0.325 0.098 RC
N
f-891180347
f
GR
GS
[1 0 0 1 202.78787 153.16942] CT
0.851 0.325 0.098 RC
N
f-891180347
f
GR
GS
[1 0 0 1 205.18181 152.89244] CT
0.851 0.325 0.098 RC
N
f-891180347
f
GR
GS
[1 0 0 1 207.57576 153.09982] CT
0.851 0.325 0.098 RC
N
f-891180347
f
GR
GS
[1 0 0 1 209.9697 151.46939] CT
0.851 0.325 0.098 RC
N
f-891180347
f
GR
GS
[1 0 0 1 212.36363 151.81442] CT
0.851 0.325 0.098 RC
N
f-891180347
f
GR
GS
[1 0 0 1 214.75757 151.2981] CT
0.851 0.325 0.098 RC
N
f-891180347
f
GR
GS
[1 0 0 1 217.15152 151.96022] CT
0.851 0.325 0.098 RC
N
f-891180347
f
GR
GS
[1 0 0 1 219.54546 151.96022] CT
0.851 0.325 0.098 RC
N
f-891180347
f
GR
GS
[1 0 0 1 221.93939 148.16171] CT
0.851 0.325 0.098 RC
N
f-891180347
f
GR
GS
[1 0 0 1 224.33333 148.94662] CT
0.851 0.325 0.098 RC
N
f-891180347
f
GR
GS
[1 0 0 1 226.72728 145.59877] CT
0.851 0.325 0.098 RC
N
f-891180347
f
GR
GS
[1 0 0 1 229.12122 145.15361] CT
0.851 0.325 0.098 RC
N
f-891180347
f
GR
GS
[1 0 0 1 231.51515 142.53209] CT
0.851 0.325 0.098 RC
N
f-891180347
f
GR
GS
[1 0 0 1 233.90909 143.12657] CT
0.851 0.325 0.098 RC
N
f-891180347
f
GR
GS
[1 0 0 1 236.30302 142.53162] CT
0.851 0.325 0.098 RC
N
f-891180347
f
GR
GS
[1 0 0 1 238.69698 142.53162] CT
0.851 0.325 0.098 RC
N
f-891180347
f
GR
GS
[1 0 0 1 241.09091 144.57664] CT
0.851 0.325 0.098 RC
N
f-891180347
f
GR
GS
[1 0 0 1 243.48485 142.90645] CT
0.851 0.325 0.098 RC
N
f-891180347
f
GR
GS
[1 0 0 1 245.87878 142.94771] CT
0.851 0.325 0.098 RC
N
f-891180347
f
GR
GS
[1 0 0 1 248.27272 142.94771] CT
0.851 0.325 0.098 RC
N
f-891180347
f
GR
GS
[1 0 0 1 250.66666 143.84671] CT
0.851 0.325 0.098 RC
N
f-891180347
f
GR
GS
[1 0 0 1 253.06061 140.81604] CT
0.851 0.325 0.098 RC
N
f-891180347
f
GR
GS
[1 0 0 1 255.45454 139.60132] CT
0.851 0.325 0.098 RC
N
f-891180347
f
GR
GS
[1 0 0 1 257.84848 138.93445] CT
0.851 0.325 0.098 RC
N
f-891180347
f
GR
GS
[1 0 0 1 260.24243 136.04893] CT
0.851 0.325 0.098 RC
N
f-891180347
f
GR
GS
[1 0 0 1 262.63638 135.08615] CT
0.851 0.325 0.098 RC
N
f-891180347
f
GR
GS
[1 0 0 1 265.0303 135.08615] CT
0.851 0.325 0.098 RC
N
f-891180347
f
GR
GS
[1 0 0 1 267.42426 132.86049] CT
0.851 0.325 0.098 RC
N
f-891180347
f
GR
GS
[1 0 0 1 269.81818 127.56135] CT
0.851 0.325 0.098 RC
N
f-891180347
f
GR
GS
[1 0 0 1 272.21213 125.97802] CT
0.851 0.325 0.098 RC
N
f-891180347
f
GR
GS
[1 0 0 1 274.60605 117.68935] CT
0.851 0.325 0.098 RC
N
f-891180347
f
GR
GS
[1 0 0 1 277 107.03206] CT
0.851 0.325 0.098 RC
N
f-891180347
f
GR
GS
1 GC
N
140 47 M
140 20.5 L
58.5 20.5 L
58.5 47 L
cp
f
GR
GS
[1 0 0 1 95.5 28] CT
/Helvetica 9 F
GS
[1 0 0 1 0 0] CT
0 3.5 moveto 
1 -1 scale
(Real) t 
GR
GR
GS
0 0.447 0.741 RC
1 LJ
1.5 LW
N
62.5 28 M
92.5 28 L
S
GR
GS
[1 0 0 1 95.5 39.5] CT
/Helvetica 9 F
GS
[1 0 0 1 0 0] CT
0 3.5 moveto 
1 -1 scale
(Estimated) t 
GR
GR
GS
0.851 0.325 0.098 RC
1 LJ
N
62.5 39.5 M
92.5 39.5 L
S
GR
GS
[1 0 0 1 77.5 39.5] CT
0.851 0.325 0.098 RC
N
f-891180347
f
GR
GS
0.149 GC
10.0 ML
0.5 LW
N
58.5 47 M
58.5 20.5 L
140 20.5 L
140 47 L
cp
S
GR
%%Trailer
%%Pages: 1
%%EOF
