%!PS-Adobe-3.0 EPSF-3.0
%%Creator: (MATLAB, The Mathworks, Inc. Version 23.2.0.2409890 \(R2023b\) Update 3. Operating System: Mac OS X)
%%Title: /Users/jakub/Projects/modeling-and-identification/report-02/images/lab4/50.eps
%%CreationDate: 2023-11-30T16:51:43
%%Pages: (atend)
%%BoundingBox:     0     0   560   420
%%LanguageLevel: 3
%%EndComments
%%BeginProlog
%%BeginResource: procset (Apache XML Graphics Std ProcSet) 1.2 0
%%Version: 1.2 0
%%Copyright: (Copyright 2001-2003,2010 The Apache Software Foundation. License terms: http://www.apache.org/licenses/LICENSE-2.0)
/bd{bind def}bind def
/ld{load def}bd
/GR/grestore ld
/GS/gsave ld
/RM/rmoveto ld
/C/curveto ld
/t/show ld
/L/lineto ld
/ML/setmiterlimit ld
/CT/concat ld
/f/fill ld
/N/newpath ld
/S/stroke ld
/CC/setcmykcolor ld
/A/ashow ld
/cp/closepath ld
/RC/setrgbcolor ld
/LJ/setlinejoin ld
/GC/setgray ld
/LW/setlinewidth ld
/M/moveto ld
/re {4 2 roll M
1 index 0 rlineto
0 exch rlineto
neg 0 rlineto
cp } bd
/_ctm matrix def
/_tm matrix def
/BT { _ctm currentmatrix pop matrix _tm copy pop 0 0 moveto } bd
/ET { _ctm setmatrix } bd
/iTm { _ctm setmatrix _tm concat } bd
/Tm { _tm astore pop iTm 0 0 moveto } bd
/ux 0.0 def
/uy 0.0 def
/F {
  /Tp exch def
  /Tf exch def
  Tf findfont Tp scalefont setfont
  /cf Tf def  /cs Tp def
} bd
/ULS {currentpoint /uy exch def /ux exch def} bd
/ULE {
  /Tcx currentpoint pop def
  gsave
  newpath
  cf findfont cs scalefont dup
  /FontMatrix get 0 get /Ts exch def /FontInfo get dup
  /UnderlinePosition get Ts mul /To exch def
  /UnderlineThickness get Ts mul /Tt exch def
  ux uy To add moveto  Tcx uy To add lineto
  Tt setlinewidth stroke
  grestore
} bd
/OLE {
  /Tcx currentpoint pop def
  gsave
  newpath
  cf findfont cs scalefont dup
  /FontMatrix get 0 get /Ts exch def /FontInfo get dup
  /UnderlinePosition get Ts mul /To exch def
  /UnderlineThickness get Ts mul /Tt exch def
  ux uy To add cs add moveto Tcx uy To add cs add lineto
  Tt setlinewidth stroke
  grestore
} bd
/SOE {
  /Tcx currentpoint pop def
  gsave
  newpath
  cf findfont cs scalefont dup
  /FontMatrix get 0 get /Ts exch def /FontInfo get dup
  /UnderlinePosition get Ts mul /To exch def
  /UnderlineThickness get Ts mul /Tt exch def
  ux uy To add cs 10 mul 26 idiv add moveto Tcx uy To add cs 10 mul 26 idiv add lineto
  Tt setlinewidth stroke
  grestore
} bd
/QT {
/Y22 exch store
/X22 exch store
/Y21 exch store
/X21 exch store
currentpoint
/Y21 load 2 mul add 3 div exch
/X21 load 2 mul add 3 div exch
/X21 load 2 mul /X22 load add 3 div
/Y21 load 2 mul /Y22 load add 3 div
/X22 load /Y22 load curveto
} bd
/SSPD {
dup length /d exch dict def
{
/v exch def
/k exch def
currentpagedevice k known {
/cpdv currentpagedevice k get def
v cpdv ne {
/upd false def
/nullv v type /nulltype eq def
/nullcpdv cpdv type /nulltype eq def
nullv nullcpdv or
{
/upd true def
} {
/sametype v type cpdv type eq def
sametype {
v type /arraytype eq {
/vlen v length def
/cpdvlen cpdv length def
vlen cpdvlen eq {
0 1 vlen 1 sub {
/i exch def
/obj v i get def
/cpdobj cpdv i get def
obj cpdobj ne {
/upd true def
exit
} if
} for
} {
/upd true def
} ifelse
} {
v type /dicttype eq {
v {
/dv exch def
/dk exch def
/cpddv cpdv dk get def
dv cpddv ne {
/upd true def
exit
} if
} forall
} {
/upd true def
} ifelse
} ifelse
} if
} ifelse
upd true eq {
d k v put
} if
} if
} if
} forall
d length 0 gt {
d setpagedevice
} if
} bd
/RE { % /NewFontName [NewEncodingArray] /FontName RE -
  findfont dup length dict begin
  {
    1 index /FID ne
    {def} {pop pop} ifelse
  } forall
  /Encoding exch def
  /FontName 1 index def
  currentdict definefont pop
  end
} bind def
%%EndResource
%%BeginResource: procset (Apache XML Graphics EPS ProcSet) 1.0 0
%%Version: 1.0 0
%%Copyright: (Copyright 2002-2003 The Apache Software Foundation. License terms: http://www.apache.org/licenses/LICENSE-2.0)
/BeginEPSF { %def
/b4_Inc_state save def         % Save state for cleanup
/dict_count countdictstack def % Count objects on dict stack
/op_count count 1 sub def      % Count objects on operand stack
userdict begin                 % Push userdict on dict stack
/showpage { } def              % Redefine showpage, { } = null proc
0 setgray 0 setlinecap         % Prepare graphics state
1 setlinewidth 0 setlinejoin
10 setmiterlimit [ ] 0 setdash newpath
/languagelevel where           % If level not equal to 1 then
{pop languagelevel             % set strokeadjust and
1 ne                           % overprint to their defaults.
{false setstrokeadjust false setoverprint
} if
} if
} bd
/EndEPSF { %def
count op_count sub {pop} repeat            % Clean up stacks
countdictstack dict_count sub {end} repeat
b4_Inc_state restore
} bd
%%EndResource
%FOPBeginFontDict
%%IncludeResource: font Courier-Oblique
%%IncludeResource: font Courier-BoldOblique
%%IncludeResource: font Courier-Bold
%%IncludeResource: font ZapfDingbats
%%IncludeResource: font Symbol
%%IncludeResource: font Helvetica
%%IncludeResource: font Helvetica-Oblique
%%IncludeResource: font Helvetica-Bold
%%IncludeResource: font Helvetica-BoldOblique
%%IncludeResource: font Times-Roman
%%IncludeResource: font Times-Italic
%%IncludeResource: font Times-Bold
%%IncludeResource: font Times-BoldItalic
%%IncludeResource: font Courier
%FOPEndFontDict
%%BeginResource: encoding WinAnsiEncoding
/WinAnsiEncoding [
/.notdef /.notdef /.notdef /.notdef /.notdef
/.notdef /.notdef /.notdef /.notdef /.notdef
/.notdef /.notdef /.notdef /.notdef /.notdef
/.notdef /.notdef /.notdef /.notdef /.notdef
/.notdef /.notdef /.notdef /.notdef /.notdef
/.notdef /.notdef /.notdef /.notdef /.notdef
/.notdef /.notdef /space /exclam /quotedbl
/numbersign /dollar /percent /ampersand /quotesingle
/parenleft /parenright /asterisk /plus /comma
/hyphen /period /slash /zero /one
/two /three /four /five /six
/seven /eight /nine /colon /semicolon
/less /equal /greater /question /at
/A /B /C /D /E
/F /G /H /I /J
/K /L /M /N /O
/P /Q /R /S /T
/U /V /W /X /Y
/Z /bracketleft /backslash /bracketright /asciicircum
/underscore /quoteleft /a /b /c
/d /e /f /g /h
/i /j /k /l /m
/n /o /p /q /r
/s /t /u /v /w
/x /y /z /braceleft /bar
/braceright /asciitilde /bullet /Euro /bullet
/quotesinglbase /florin /quotedblbase /ellipsis /dagger
/daggerdbl /circumflex /perthousand /Scaron /guilsinglleft
/OE /bullet /Zcaron /bullet /bullet
/quoteleft /quoteright /quotedblleft /quotedblright /bullet
/endash /emdash /asciitilde /trademark /scaron
/guilsinglright /oe /bullet /zcaron /Ydieresis
/space /exclamdown /cent /sterling /currency
/yen /brokenbar /section /dieresis /copyright
/ordfeminine /guillemotleft /logicalnot /sfthyphen /registered
/macron /degree /plusminus /twosuperior /threesuperior
/acute /mu /paragraph /middot /cedilla
/onesuperior /ordmasculine /guillemotright /onequarter /onehalf
/threequarters /questiondown /Agrave /Aacute /Acircumflex
/Atilde /Adieresis /Aring /AE /Ccedilla
/Egrave /Eacute /Ecircumflex /Edieresis /Igrave
/Iacute /Icircumflex /Idieresis /Eth /Ntilde
/Ograve /Oacute /Ocircumflex /Otilde /Odieresis
/multiply /Oslash /Ugrave /Uacute /Ucircumflex
/Udieresis /Yacute /Thorn /germandbls /agrave
/aacute /acircumflex /atilde /adieresis /aring
/ae /ccedilla /egrave /eacute /ecircumflex
/edieresis /igrave /iacute /icircumflex /idieresis
/eth /ntilde /ograve /oacute /ocircumflex
/otilde /odieresis /divide /oslash /ugrave
/uacute /ucircumflex /udieresis /yacute /thorn
/ydieresis
] def
%%EndResource
%FOPBeginFontReencode
/Courier-Oblique findfont
dup length dict begin
  {1 index /FID ne {def} {pop pop} ifelse} forall
  /Encoding WinAnsiEncoding def
  currentdict
end
/Courier-Oblique exch definefont pop
/Courier-BoldOblique findfont
dup length dict begin
  {1 index /FID ne {def} {pop pop} ifelse} forall
  /Encoding WinAnsiEncoding def
  currentdict
end
/Courier-BoldOblique exch definefont pop
/Courier-Bold findfont
dup length dict begin
  {1 index /FID ne {def} {pop pop} ifelse} forall
  /Encoding WinAnsiEncoding def
  currentdict
end
/Courier-Bold exch definefont pop
/Helvetica findfont
dup length dict begin
  {1 index /FID ne {def} {pop pop} ifelse} forall
  /Encoding WinAnsiEncoding def
  currentdict
end
/Helvetica exch definefont pop
/Helvetica-Oblique findfont
dup length dict begin
  {1 index /FID ne {def} {pop pop} ifelse} forall
  /Encoding WinAnsiEncoding def
  currentdict
end
/Helvetica-Oblique exch definefont pop
/Helvetica-Bold findfont
dup length dict begin
  {1 index /FID ne {def} {pop pop} ifelse} forall
  /Encoding WinAnsiEncoding def
  currentdict
end
/Helvetica-Bold exch definefont pop
/Helvetica-BoldOblique findfont
dup length dict begin
  {1 index /FID ne {def} {pop pop} ifelse} forall
  /Encoding WinAnsiEncoding def
  currentdict
end
/Helvetica-BoldOblique exch definefont pop
/Times-Roman findfont
dup length dict begin
  {1 index /FID ne {def} {pop pop} ifelse} forall
  /Encoding WinAnsiEncoding def
  currentdict
end
/Times-Roman exch definefont pop
/Times-Italic findfont
dup length dict begin
  {1 index /FID ne {def} {pop pop} ifelse} forall
  /Encoding WinAnsiEncoding def
  currentdict
end
/Times-Italic exch definefont pop
/Times-Bold findfont
dup length dict begin
  {1 index /FID ne {def} {pop pop} ifelse} forall
  /Encoding WinAnsiEncoding def
  currentdict
end
/Times-Bold exch definefont pop
/Times-BoldItalic findfont
dup length dict begin
  {1 index /FID ne {def} {pop pop} ifelse} forall
  /Encoding WinAnsiEncoding def
  currentdict
end
/Times-BoldItalic exch definefont pop
/Courier findfont
dup length dict begin
  {1 index /FID ne {def} {pop pop} ifelse} forall
  /Encoding WinAnsiEncoding def
  currentdict
end
/Courier exch definefont pop
%FOPEndFontReencode
%%EndProlog
%%Page: 1 1
%%PageBoundingBox: 0 0 560 420
%%BeginPageSetup
[1 0 0 -1 0 420] CT
%%EndPageSetup
GS
1 GC
N
0 0 560 420 re
f
GR
GS
1 GC
N
0 0 560 420 re
f
GR
GS
1 GC
N
73 374 M
507 374 L
507 31.5 L
73 31.5 L
cp
f
GR
GS
0.775 GC
[1 3] 0 setdash
2 LJ
0.5 LW
N
83.85 374 M
83.85 31.5 L
S
GR
GS
0.775 GC
[1 3] 0 setdash
2 LJ
0.5 LW
N
94.7 374 M
94.7 31.5 L
S
GR
GS
0.775 GC
[1 3] 0 setdash
2 LJ
0.5 LW
N
105.55 374 M
105.55 31.5 L
S
GR
GS
0.775 GC
[1 3] 0 setdash
2 LJ
0.5 LW
N
127.25 374 M
127.25 31.5 L
S
GR
GS
0.775 GC
[1 3] 0 setdash
2 LJ
0.5 LW
N
138.1 374 M
138.1 31.5 L
S
GR
GS
0.775 GC
[1 3] 0 setdash
2 LJ
0.5 LW
N
148.95 374 M
148.95 31.5 L
S
GR
GS
0.775 GC
[1 3] 0 setdash
2 LJ
0.5 LW
N
170.65 374 M
170.65 31.5 L
S
GR
GS
0.775 GC
[1 3] 0 setdash
2 LJ
0.5 LW
N
181.5 374 M
181.5 31.5 L
S
GR
GS
0.775 GC
[1 3] 0 setdash
2 LJ
0.5 LW
N
192.35 374 M
192.35 31.5 L
S
GR
GS
0.775 GC
[1 3] 0 setdash
2 LJ
0.5 LW
N
214.05 374 M
214.05 31.5 L
S
GR
GS
0.775 GC
[1 3] 0 setdash
2 LJ
0.5 LW
N
224.9 374 M
224.9 31.5 L
S
GR
GS
0.775 GC
[1 3] 0 setdash
2 LJ
0.5 LW
N
235.75 374 M
235.75 31.5 L
S
GR
GS
0.775 GC
[1 3] 0 setdash
2 LJ
0.5 LW
N
257.45 374 M
257.45 31.5 L
S
GR
GS
0.775 GC
[1 3] 0 setdash
2 LJ
0.5 LW
N
268.3 374 M
268.3 31.5 L
S
GR
GS
0.775 GC
[1 3] 0 setdash
2 LJ
0.5 LW
N
279.15 374 M
279.15 31.5 L
S
GR
GS
0.775 GC
[1 3] 0 setdash
2 LJ
0.5 LW
N
300.85 374 M
300.85 31.5 L
S
GR
GS
0.775 GC
[1 3] 0 setdash
2 LJ
0.5 LW
N
311.7 374 M
311.7 31.5 L
S
GR
GS
0.775 GC
[1 3] 0 setdash
2 LJ
0.5 LW
N
322.55 374 M
322.55 31.5 L
S
GR
GS
0.775 GC
[1 3] 0 setdash
2 LJ
0.5 LW
N
344.25 374 M
344.25 31.5 L
S
GR
GS
0.775 GC
[1 3] 0 setdash
2 LJ
0.5 LW
N
355.1 374 M
355.1 31.5 L
S
GR
GS
0.775 GC
[1 3] 0 setdash
2 LJ
0.5 LW
N
365.95 374 M
365.95 31.5 L
S
GR
GS
0.775 GC
[1 3] 0 setdash
2 LJ
0.5 LW
N
387.65 374 M
387.65 31.5 L
S
GR
GS
0.775 GC
[1 3] 0 setdash
2 LJ
0.5 LW
N
398.5 374 M
398.5 31.5 L
S
GR
GS
0.775 GC
[1 3] 0 setdash
2 LJ
0.5 LW
N
409.35 374 M
409.35 31.5 L
S
GR
GS
0.775 GC
[1 3] 0 setdash
2 LJ
0.5 LW
N
431.05 374 M
431.05 31.5 L
S
GR
GS
0.775 GC
[1 3] 0 setdash
2 LJ
0.5 LW
N
441.9 374 M
441.9 31.5 L
S
GR
GS
0.775 GC
[1 3] 0 setdash
2 LJ
0.5 LW
N
452.75 374 M
452.75 31.5 L
S
GR
GS
0.775 GC
[1 3] 0 setdash
2 LJ
0.5 LW
N
474.45 374 M
474.45 31.5 L
S
GR
GS
0.775 GC
[1 3] 0 setdash
2 LJ
0.5 LW
N
485.3 374 M
485.3 31.5 L
S
GR
GS
0.775 GC
[1 3] 0 setdash
2 LJ
0.5 LW
N
496.15 374 M
496.15 31.5 L
S
GR
GS
0.873 GC
1 LJ
0.5 LW
N
73 374 M
73 31.5 L
S
GR
GS
0.873 GC
1 LJ
0.5 LW
N
116.4 374 M
116.4 31.5 L
S
GR
GS
0.873 GC
1 LJ
0.5 LW
N
159.8 374 M
159.8 31.5 L
S
GR
GS
0.873 GC
1 LJ
0.5 LW
N
203.2 374 M
203.2 31.5 L
S
GR
GS
0.873 GC
1 LJ
0.5 LW
N
246.6 374 M
246.6 31.5 L
S
GR
GS
0.873 GC
1 LJ
0.5 LW
N
290 374 M
290 31.5 L
S
GR
GS
0.873 GC
1 LJ
0.5 LW
N
333.4 374 M
333.4 31.5 L
S
GR
GS
0.873 GC
1 LJ
0.5 LW
N
376.8 374 M
376.8 31.5 L
S
GR
GS
0.873 GC
1 LJ
0.5 LW
N
420.2 374 M
420.2 31.5 L
S
GR
GS
0.873 GC
1 LJ
0.5 LW
N
463.6 374 M
463.6 31.5 L
S
GR
GS
0.873 GC
1 LJ
0.5 LW
N
507 374 M
507 31.5 L
S
GR
GS
0.775 GC
[1 3] 0 setdash
2 LJ
0.5 LW
N
507 367.15 M
73 367.15 L
S
GR
GS
0.775 GC
[1 3] 0 setdash
2 LJ
0.5 LW
N
507 360.3 M
73 360.3 L
S
GR
GS
0.775 GC
[1 3] 0 setdash
2 LJ
0.5 LW
N
507 353.45 M
73 353.45 L
S
GR
GS
0.775 GC
[1 3] 0 setdash
2 LJ
0.5 LW
N
507 346.6 M
73 346.6 L
S
GR
GS
0.775 GC
[1 3] 0 setdash
2 LJ
0.5 LW
N
507 332.9 M
73 332.9 L
S
GR
GS
0.775 GC
[1 3] 0 setdash
2 LJ
0.5 LW
N
507 326.05 M
73 326.05 L
S
GR
GS
0.775 GC
[1 3] 0 setdash
2 LJ
0.5 LW
N
507 319.2 M
73 319.2 L
S
GR
GS
0.775 GC
[1 3] 0 setdash
2 LJ
0.5 LW
N
507 312.35 M
73 312.35 L
S
GR
GS
0.775 GC
[1 3] 0 setdash
2 LJ
0.5 LW
N
507 298.65 M
73 298.65 L
S
GR
GS
0.775 GC
[1 3] 0 setdash
2 LJ
0.5 LW
N
507 291.8 M
73 291.8 L
S
GR
GS
0.775 GC
[1 3] 0 setdash
2 LJ
0.5 LW
N
507 284.95 M
73 284.95 L
S
GR
GS
0.775 GC
[1 3] 0 setdash
2 LJ
0.5 LW
N
507 278.1 M
73 278.1 L
S
GR
GS
0.775 GC
[1 3] 0 setdash
2 LJ
0.5 LW
N
507 264.4 M
73 264.4 L
S
GR
GS
0.775 GC
[1 3] 0 setdash
2 LJ
0.5 LW
N
507 257.55 M
73 257.55 L
S
GR
GS
0.775 GC
[1 3] 0 setdash
2 LJ
0.5 LW
N
507 250.7 M
73 250.7 L
S
GR
GS
0.775 GC
[1 3] 0 setdash
2 LJ
0.5 LW
N
507 243.85 M
73 243.85 L
S
GR
GS
0.775 GC
[1 3] 0 setdash
2 LJ
0.5 LW
N
507 230.15 M
73 230.15 L
S
GR
GS
0.775 GC
[1 3] 0 setdash
2 LJ
0.5 LW
N
507 223.3 M
73 223.3 L
S
GR
GS
0.775 GC
[1 3] 0 setdash
2 LJ
0.5 LW
N
507 216.45 M
73 216.45 L
S
GR
GS
0.775 GC
[1 3] 0 setdash
2 LJ
0.5 LW
N
507 209.6 M
73 209.6 L
S
GR
GS
0.775 GC
[1 3] 0 setdash
2 LJ
0.5 LW
N
507 195.9 M
73 195.9 L
S
GR
GS
0.775 GC
[1 3] 0 setdash
2 LJ
0.5 LW
N
507 189.05 M
73 189.05 L
S
GR
GS
0.775 GC
[1 3] 0 setdash
2 LJ
0.5 LW
N
507 182.2 M
73 182.2 L
S
GR
GS
0.775 GC
[1 3] 0 setdash
2 LJ
0.5 LW
N
507 175.35 M
73 175.35 L
S
GR
GS
0.775 GC
[1 3] 0 setdash
2 LJ
0.5 LW
N
507 161.65 M
73 161.65 L
S
GR
GS
0.775 GC
[1 3] 0 setdash
2 LJ
0.5 LW
N
507 154.8 M
73 154.8 L
S
GR
GS
0.775 GC
[1 3] 0 setdash
2 LJ
0.5 LW
N
507 147.95 M
73 147.95 L
S
GR
GS
0.775 GC
[1 3] 0 setdash
2 LJ
0.5 LW
N
507 141.1 M
73 141.1 L
S
GR
GS
0.775 GC
[1 3] 0 setdash
2 LJ
0.5 LW
N
507 127.4 M
73 127.4 L
S
GR
GS
0.775 GC
[1 3] 0 setdash
2 LJ
0.5 LW
N
507 120.55 M
73 120.55 L
S
GR
GS
0.775 GC
[1 3] 0 setdash
2 LJ
0.5 LW
N
507 113.7 M
73 113.7 L
S
GR
GS
0.775 GC
[1 3] 0 setdash
2 LJ
0.5 LW
N
507 106.85 M
73 106.85 L
S
GR
GS
0.775 GC
[1 3] 0 setdash
2 LJ
0.5 LW
N
507 93.15 M
73 93.15 L
S
GR
GS
0.775 GC
[1 3] 0 setdash
2 LJ
0.5 LW
N
507 86.3 M
73 86.3 L
S
GR
GS
0.775 GC
[1 3] 0 setdash
2 LJ
0.5 LW
N
507 79.45 M
73 79.45 L
S
GR
GS
0.775 GC
[1 3] 0 setdash
2 LJ
0.5 LW
N
507 72.6 M
73 72.6 L
S
GR
GS
0.775 GC
[1 3] 0 setdash
2 LJ
0.5 LW
N
507 58.9 M
73 58.9 L
S
GR
GS
0.775 GC
[1 3] 0 setdash
2 LJ
0.5 LW
N
507 52.05 M
73 52.05 L
S
GR
GS
0.775 GC
[1 3] 0 setdash
2 LJ
0.5 LW
N
507 45.2 M
73 45.2 L
S
GR
GS
0.775 GC
[1 3] 0 setdash
2 LJ
0.5 LW
N
507 38.35 M
73 38.35 L
S
GR
GS
0.873 GC
1 LJ
0.5 LW
N
507 374 M
73 374 L
S
GR
GS
0.873 GC
1 LJ
0.5 LW
N
507 339.75 M
73 339.75 L
S
GR
GS
0.873 GC
1 LJ
0.5 LW
N
507 305.5 M
73 305.5 L
S
GR
GS
0.873 GC
1 LJ
0.5 LW
N
507 271.25 M
73 271.25 L
S
GR
GS
0.873 GC
1 LJ
0.5 LW
N
507 237 M
73 237 L
S
GR
GS
0.873 GC
1 LJ
0.5 LW
N
507 202.75 M
73 202.75 L
S
GR
GS
0.873 GC
1 LJ
0.5 LW
N
507 168.5 M
73 168.5 L
S
GR
GS
0.873 GC
1 LJ
0.5 LW
N
507 134.25 M
73 134.25 L
S
GR
GS
0.873 GC
1 LJ
0.5 LW
N
507 100 M
73 100 L
S
GR
GS
0.873 GC
1 LJ
0.5 LW
N
507 65.75 M
73 65.75 L
S
GR
GS
0.873 GC
1 LJ
0.5 LW
N
507 31.5 M
73 31.5 L
S
GR
GS
0.149 GC
2 setlinecap
1 LJ
0.5 LW
N
73 374 M
507 374 L
S
GR
GS
0.149 GC
2 setlinecap
1 LJ
0.5 LW
N
73 374 M
73 369.66 L
S
GR
GS
0.149 GC
2 setlinecap
1 LJ
0.5 LW
N
116.4 374 M
116.4 369.66 L
S
GR
GS
0.149 GC
2 setlinecap
1 LJ
0.5 LW
N
159.8 374 M
159.8 369.66 L
S
GR
GS
0.149 GC
2 setlinecap
1 LJ
0.5 LW
N
203.2 374 M
203.2 369.66 L
S
GR
GS
0.149 GC
2 setlinecap
1 LJ
0.5 LW
N
246.6 374 M
246.6 369.66 L
S
GR
GS
0.149 GC
2 setlinecap
1 LJ
0.5 LW
N
290 374 M
290 369.66 L
S
GR
GS
0.149 GC
2 setlinecap
1 LJ
0.5 LW
N
333.4 374 M
333.4 369.66 L
S
GR
GS
0.149 GC
2 setlinecap
1 LJ
0.5 LW
N
376.8 374 M
376.8 369.66 L
S
GR
GS
0.149 GC
2 setlinecap
1 LJ
0.5 LW
N
420.2 374 M
420.2 369.66 L
S
GR
GS
0.149 GC
2 setlinecap
1 LJ
0.5 LW
N
463.6 374 M
463.6 369.66 L
S
GR
GS
0.149 GC
2 setlinecap
1 LJ
0.5 LW
N
507 374 M
507 369.66 L
S
GR
GS
[1 0 0 1 73 378] CT
0.149 GC
/Helvetica 10 F
GS
[1 0 0 1 0 0] CT
-5 10 moveto 
1 -1 scale
(-1) t 
GR
GR
GS
[1 0 0 1 116.39999 378] CT
0.149 GC
/Helvetica 10 F
GS
[1 0 0 1 0 0] CT
-9 10 moveto 
1 -1 scale
(-0.8) t 
GR
GR
GS
[1 0 0 1 159.79999 378] CT
0.149 GC
/Helvetica 10 F
GS
[1 0 0 1 0 0] CT
-9 10 moveto 
1 -1 scale
(-0.6) t 
GR
GR
GS
[1 0 0 1 203.2 378] CT
0.149 GC
/Helvetica 10 F
GS
[1 0 0 1 0 0] CT
-9 10 moveto 
1 -1 scale
(-0.4) t 
GR
GR
GS
[1 0 0 1 246.60001 378] CT
0.149 GC
/Helvetica 10 F
GS
[1 0 0 1 0 0] CT
-9 10 moveto 
1 -1 scale
(-0.2) t 
GR
GR
GS
[1 0 0 1 290 378] CT
0.149 GC
/Helvetica 10 F
GS
[1 0 0 1 0 0] CT
-3 10 moveto 
1 -1 scale
(0) t 
GR
GR
GS
[1 0 0 1 333.39999 378] CT
0.149 GC
/Helvetica 10 F
GS
[1 0 0 1 0 0] CT
-7 10 moveto 
1 -1 scale
(0.2) t 
GR
GR
GS
[1 0 0 1 376.79999 378] CT
0.149 GC
/Helvetica 10 F
GS
[1 0 0 1 0 0] CT
-7 10 moveto 
1 -1 scale
(0.4) t 
GR
GR
GS
[1 0 0 1 420.20001 378] CT
0.149 GC
/Helvetica 10 F
GS
[1 0 0 1 0 0] CT
-7 10 moveto 
1 -1 scale
(0.6) t 
GR
GR
GS
[1 0 0 1 463.60001 378] CT
0.149 GC
/Helvetica 10 F
GS
[1 0 0 1 0 0] CT
-7 10 moveto 
1 -1 scale
(0.8) t 
GR
GR
GS
[1 0 0 1 507 378] CT
0.149 GC
/Helvetica 10 F
GS
[1 0 0 1 0 0] CT
-3 10 moveto 
1 -1 scale
(1) t 
GR
GR
GS
0.149 GC
2 setlinecap
1 LJ
0.5 LW
N
73 374 M
73 31.5 L
S
GR
GS
0.149 GC
2 setlinecap
1 LJ
0.5 LW
N
73 374 M
77.34 374 L
S
GR
GS
0.149 GC
2 setlinecap
1 LJ
0.5 LW
N
73 339.75 M
77.34 339.75 L
S
GR
GS
0.149 GC
2 setlinecap
1 LJ
0.5 LW
N
73 305.5 M
77.34 305.5 L
S
GR
GS
0.149 GC
2 setlinecap
1 LJ
0.5 LW
N
73 271.25 M
77.34 271.25 L
S
GR
GS
0.149 GC
2 setlinecap
1 LJ
0.5 LW
N
73 237 M
77.34 237 L
S
GR
GS
0.149 GC
2 setlinecap
1 LJ
0.5 LW
N
73 202.75 M
77.34 202.75 L
S
GR
GS
0.149 GC
2 setlinecap
1 LJ
0.5 LW
N
73 168.5 M
77.34 168.5 L
S
GR
GS
0.149 GC
2 setlinecap
1 LJ
0.5 LW
N
73 134.25 M
77.34 134.25 L
S
GR
GS
0.149 GC
2 setlinecap
1 LJ
0.5 LW
N
73 100 M
77.34 100 L
S
GR
GS
0.149 GC
2 setlinecap
1 LJ
0.5 LW
N
73 65.75 M
77.34 65.75 L
S
GR
GS
0.149 GC
2 setlinecap
1 LJ
0.5 LW
N
73 31.5 M
77.34 31.5 L
S
GR
GS
[1 0 0 1 68.99999 374] CT
0.149 GC
/Helvetica 10 F
GS
[1 0 0 1 0 0] CT
-6 3.5 moveto 
1 -1 scale
(0) t 
GR
GR
GS
[1 0 0 1 68.99999 339.75] CT
0.149 GC
/Helvetica 10 F
GS
[1 0 0 1 0 0] CT
-14 3.5 moveto 
1 -1 scale
(0.1) t 
GR
GR
GS
[1 0 0 1 68.99999 305.5] CT
0.149 GC
/Helvetica 10 F
GS
[1 0 0 1 0 0] CT
-14 3.5 moveto 
1 -1 scale
(0.2) t 
GR
GR
GS
[1 0 0 1 68.99999 271.25] CT
0.149 GC
/Helvetica 10 F
GS
[1 0 0 1 0 0] CT
-14 3.5 moveto 
1 -1 scale
(0.3) t 
GR
GR
GS
[1 0 0 1 68.99999 237] CT
0.149 GC
/Helvetica 10 F
GS
[1 0 0 1 0 0] CT
-14 3.5 moveto 
1 -1 scale
(0.4) t 
GR
GR
GS
[1 0 0 1 68.99999 202.75] CT
0.149 GC
/Helvetica 10 F
GS
[1 0 0 1 0 0] CT
-14 3.5 moveto 
1 -1 scale
(0.5) t 
GR
GR
GS
[1 0 0 1 68.99999 168.49998] CT
0.149 GC
/Helvetica 10 F
GS
[1 0 0 1 0 0] CT
-14 3.5 moveto 
1 -1 scale
(0.6) t 
GR
GR
GS
[1 0 0 1 68.99999 134.25] CT
0.149 GC
/Helvetica 10 F
GS
[1 0 0 1 0 0] CT
-14 3.5 moveto 
1 -1 scale
(0.7) t 
GR
GR
GS
[1 0 0 1 68.99999 99.99999] CT
0.149 GC
/Helvetica 10 F
GS
[1 0 0 1 0 0] CT
-14 3.5 moveto 
1 -1 scale
(0.8) t 
GR
GR
GS
[1 0 0 1 68.99999 65.75001] CT
0.149 GC
/Helvetica 10 F
GS
[1 0 0 1 0 0] CT
-14 3.5 moveto 
1 -1 scale
(0.9) t 
GR
GR
GS
[1 0 0 1 68.99999 31.5] CT
0.149 GC
/Helvetica 10 F
GS
[1 0 0 1 0 0] CT
-6 3.5 moveto 
1 -1 scale
(1) t 
GR
GR
GS
0 0.447 0.741 RC
1 LJ
1.5 LW
N
73 374 M
77.384 367.081 L
81.768 360.162 L
86.152 353.242 L
90.535 346.323 L
94.919 339.404 L
99.303 332.485 L
103.687 325.566 L
108.071 318.646 L
112.455 311.727 L
116.838 304.808 L
121.222 297.889 L
125.606 290.97 L
129.99 284.051 L
134.374 277.131 L
138.758 270.212 L
143.141 263.293 L
147.525 256.374 L
151.909 249.455 L
156.293 242.535 L
160.677 235.616 L
165.061 228.697 L
169.444 221.778 L
173.828 214.859 L
178.212 207.939 L
182.596 201.02 L
186.98 194.101 L
191.364 187.182 L
195.747 180.263 L
200.131 173.343 L
204.515 166.424 L
208.899 159.505 L
213.283 152.586 L
217.667 145.667 L
222.051 138.747 L
226.434 131.828 L
230.818 124.909 L
235.202 117.99 L
239.586 111.071 L
243.97 104.152 L
248.354 97.232 L
252.737 90.313 L
257.121 83.394 L
261.505 76.475 L
265.889 69.556 L
270.273 62.636 L
274.657 55.717 L
279.04 48.798 L
283.424 41.879 L
287.808 34.96 L
292.192 34.96 L
296.576 41.879 L
300.96 48.798 L
305.343 55.717 L
309.727 62.636 L
314.111 69.556 L
318.495 76.475 L
322.879 83.394 L
327.263 90.313 L
331.646 97.232 L
336.03 104.152 L
340.414 111.071 L
344.798 117.99 L
349.182 124.909 L
353.566 131.828 L
357.949 138.747 L
362.333 145.667 L
366.717 152.586 L
371.101 159.505 L
375.485 166.424 L
379.869 173.343 L
384.253 180.263 L
388.636 187.182 L
393.02 194.101 L
397.404 201.02 L
401.788 207.939 L
406.172 214.859 L
410.556 221.778 L
414.939 228.697 L
419.323 235.616 L
423.707 242.535 L
428.091 249.455 L
432.475 256.374 L
436.859 263.293 L
441.242 270.212 L
445.626 277.131 L
450.01 284.051 L
454.394 290.97 L
458.778 297.889 L
463.162 304.808 L
467.545 311.727 L
471.929 318.646 L
476.313 325.566 L
480.697 332.485 L
485.081 339.404 L
489.465 346.323 L
493.848 353.242 L
498.232 360.162 L
502.616 367.081 L
507 374 L
S
GR
GS
0.851 0.325 0.098 RC
1 LJ
N
73 371.123 M
77.384 367.903 L
81.768 360.43 L
86.152 352.344 L
90.535 345.561 L
94.919 339.619 L
99.303 333.403 L
103.687 326.61 L
108.071 319.52 L
112.455 312.143 L
116.838 304.275 L
121.222 296.291 L
125.606 289.148 L
129.99 283.221 L
134.374 277.612 L
138.758 271.184 L
143.141 263.955 L
147.525 256.773 L
151.909 249.878 L
156.293 242.763 L
160.677 235.461 L
165.061 228.764 L
169.444 222.644 L
173.828 215.696 L
178.212 207.164 L
182.596 198.581 L
186.98 191.976 L
191.364 186.969 L
195.747 181.2 L
200.131 173.534 L
204.515 165.299 L
208.899 158.113 L
213.283 151.981 L
217.667 146.056 L
222.051 139.865 L
226.434 133.02 L
230.818 125.034 L
235.202 116.485 L
239.586 109.192 L
243.97 103.878 L
248.354 98.54 L
252.737 90.75 L
257.121 81.187 L
261.505 73.165 L
265.889 68.4 L
270.273 64.69 L
274.657 58.545 L
279.04 49.392 L
283.424 40.407 L
287.808 35.489 L
292.192 36.014 L
296.576 40.595 L
300.96 47.318 L
305.343 55.334 L
309.727 64.071 L
314.111 72.075 L
318.495 78.088 L
322.879 83.026 L
327.263 89.242 L
331.646 97.386 L
336.03 105.496 L
340.414 111.924 L
344.798 117.668 L
349.182 124.613 L
353.566 132.751 L
357.949 140.679 L
362.333 147.932 L
366.717 155.128 L
371.101 162.372 L
375.485 169.118 L
379.869 175.271 L
384.253 181.042 L
388.636 186.211 L
393.02 191.057 L
397.404 197.388 L
401.788 206.56 L
406.172 216.722 L
410.556 224.337 L
414.939 228.792 L
419.323 233.291 L
423.707 240.487 L
428.091 249.324 L
432.475 257.314 L
436.859 263.946 L
441.242 270.25 L
445.626 276.575 L
450.01 282.734 L
454.394 289.335 L
458.778 297.021 L
463.162 304.915 L
467.545 311.651 L
471.929 317.653 L
476.313 324.6 L
480.697 332.643 L
485.081 340.051 L
489.465 346.102 L
493.848 352.462 L
498.232 360.443 L
502.616 368.011 L
507 371.123 L
S
GR
GS
[1 0 0 1 73 371.12341] CT
0.851 0.325 0.098 RC
N
1 0 M
1 0.552 0.552 1 0 1 C
-0.552 1 -1 0.552 -1 0 C
-1 -0.552 -0.552 -1 0 -1 C
0.552 -1 1 -0.552 1 0 C
cp
f
GR
GS
[1 0 0 1 77.38384 367.9032] CT
0.851 0.325 0.098 RC
N
/f-891180347{1 0 M
1 0.552 0.552 1 0 1 C
-0.552 1 -1 0.552 -1 0 C
-1 -0.552 -0.552 -1 0 -1 C
0.552 -1 1 -0.552 1 0 C
cp}def
f-891180347
f
GR
GS
[1 0 0 1 81.76767 360.43015] CT
0.851 0.325 0.098 RC
N
f-891180347
f
GR
GS
[1 0 0 1 86.15151 352.34381] CT
0.851 0.325 0.098 RC
N
f-891180347
f
GR
GS
[1 0 0 1 90.53535 345.561] CT
0.851 0.325 0.098 RC
N
f-891180347
f
GR
GS
[1 0 0 1 94.91919 339.6189] CT
0.851 0.325 0.098 RC
N
f-891180347
f
GR
GS
[1 0 0 1 99.30303 333.40323] CT
0.851 0.325 0.098 RC
N
f-891180347
f
GR
GS
[1 0 0 1 103.68687 326.60965] CT
0.851 0.325 0.098 RC
N
f-891180347
f
GR
GS
[1 0 0 1 108.0707 319.51984] CT
0.851 0.325 0.098 RC
N
f-891180347
f
GR
GS
[1 0 0 1 112.45454 312.1427] CT
0.851 0.325 0.098 RC
N
f-891180347
f
GR
GS
[1 0 0 1 116.83839 304.27454] CT
0.851 0.325 0.098 RC
N
f-891180347
f
GR
GS
[1 0 0 1 121.22222 296.29083] CT
0.851 0.325 0.098 RC
N
f-891180347
f
GR
GS
[1 0 0 1 125.60606 289.14847] CT
0.851 0.325 0.098 RC
N
f-891180347
f
GR
GS
[1 0 0 1 129.9899 283.22095] CT
0.851 0.325 0.098 RC
N
f-891180347
f
GR
GS
[1 0 0 1 134.37373 277.61151] CT
0.851 0.325 0.098 RC
N
f-891180347
f
GR
GS
[1 0 0 1 138.75758 271.1843] CT
0.851 0.325 0.098 RC
N
f-891180347
f
GR
GS
[1 0 0 1 143.14142 263.95514] CT
0.851 0.325 0.098 RC
N
f-891180347
f
GR
GS
[1 0 0 1 147.52525 256.77264] CT
0.851 0.325 0.098 RC
N
f-891180347
f
GR
GS
[1 0 0 1 151.90909 249.87837] CT
0.851 0.325 0.098 RC
N
f-891180347
f
GR
GS
[1 0 0 1 156.29292 242.76305] CT
0.851 0.325 0.098 RC
N
f-891180347
f
GR
GS
[1 0 0 1 160.67677 235.46121] CT
0.851 0.325 0.098 RC
N
f-891180347
f
GR
GS
[1 0 0 1 165.06061 228.76378] CT
0.851 0.325 0.098 RC
N
f-891180347
f
GR
GS
[1 0 0 1 169.44444 222.64395] CT
0.851 0.325 0.098 RC
N
f-891180347
f
GR
GS
[1 0 0 1 173.82828 215.69589] CT
0.851 0.325 0.098 RC
N
f-891180347
f
GR
GS
[1 0 0 1 178.21213 207.16435] CT
0.851 0.325 0.098 RC
N
f-891180347
f
GR
GS
[1 0 0 1 182.59596 198.58148] CT
0.851 0.325 0.098 RC
N
f-891180347
f
GR
GS
[1 0 0 1 186.9798 191.97617] CT
0.851 0.325 0.098 RC
N
f-891180347
f
GR
GS
[1 0 0 1 191.36363 186.96912] CT
0.851 0.325 0.098 RC
N
f-891180347
f
GR
GS
[1 0 0 1 195.74748 181.19952] CT
0.851 0.325 0.098 RC
N
f-891180347
f
GR
GS
[1 0 0 1 200.13132 173.53351] CT
0.851 0.325 0.098 RC
N
f-891180347
f
GR
GS
[1 0 0 1 204.51515 165.29922] CT
0.851 0.325 0.098 RC
N
f-891180347
f
GR
GS
[1 0 0 1 208.89899 158.11342] CT
0.851 0.325 0.098 RC
N
f-891180347
f
GR
GS
[1 0 0 1 213.28282 151.98097] CT
0.851 0.325 0.098 RC
N
f-891180347
f
GR
GS
[1 0 0 1 217.66667 146.05551] CT
0.851 0.325 0.098 RC
N
f-891180347
f
GR
GS
[1 0 0 1 222.05051 139.86502] CT
0.851 0.325 0.098 RC
N
f-891180347
f
GR
GS
[1 0 0 1 226.43434 133.01981] CT
0.851 0.325 0.098 RC
N
f-891180347
f
GR
GS
[1 0 0 1 230.81818 125.03365] CT
0.851 0.325 0.098 RC
N
f-891180347
f
GR
GS
[1 0 0 1 235.20203 116.485] CT
0.851 0.325 0.098 RC
N
f-891180347
f
GR
GS
[1 0 0 1 239.58586 109.19151] CT
0.851 0.325 0.098 RC
N
f-891180347
f
GR
GS
[1 0 0 1 243.9697 103.87762] CT
0.851 0.325 0.098 RC
N
f-891180347
f
GR
GS
[1 0 0 1 248.35353 98.53992] CT
0.851 0.325 0.098 RC
N
f-891180347
f
GR
GS
[1 0 0 1 252.73738 90.75014] CT
0.851 0.325 0.098 RC
N
f-891180347
f
GR
GS
[1 0 0 1 257.12122 81.1874] CT
0.851 0.325 0.098 RC
N
f-891180347
f
GR
GS
[1 0 0 1 261.50507 73.16451] CT
0.851 0.325 0.098 RC
N
f-891180347
f
GR
GS
[1 0 0 1 265.88889 68.40005] CT
0.851 0.325 0.098 RC
N
f-891180347
f
GR
GS
[1 0 0 1 270.27274 64.68996] CT
0.851 0.325 0.098 RC
N
f-891180347
f
GR
GS
[1 0 0 1 274.65656 58.54533] CT
0.851 0.325 0.098 RC
N
f-891180347
f
GR
GS
[1 0 0 1 279.04041 49.3921] CT
0.851 0.325 0.098 RC
N
f-891180347
f
GR
GS
[1 0 0 1 283.42426 40.40727] CT
0.851 0.325 0.098 RC
N
f-891180347
f
GR
GS
[1 0 0 1 287.80807 35.48877] CT
0.851 0.325 0.098 RC
N
f-891180347
f
GR
GS
[1 0 0 1 292.19193 36.01446] CT
0.851 0.325 0.098 RC
N
f-891180347
f
GR
GS
[1 0 0 1 296.57574 40.59494] CT
0.851 0.325 0.098 RC
N
f-891180347
f
GR
GS
[1 0 0 1 300.95959 47.31773] CT
0.851 0.325 0.098 RC
N
f-891180347
f
GR
GS
[1 0 0 1 305.34344 55.33406] CT
0.851 0.325 0.098 RC
N
f-891180347
f
GR
GS
[1 0 0 1 309.72726 64.0712] CT
0.851 0.325 0.098 RC
N
f-891180347
f
GR
GS
[1 0 0 1 314.11111 72.0751] CT
0.851 0.325 0.098 RC
N
f-891180347
f
GR
GS
[1 0 0 1 318.49493 78.08783] CT
0.851 0.325 0.098 RC
N
f-891180347
f
GR
GS
[1 0 0 1 322.87878 83.02602] CT
0.851 0.325 0.098 RC
N
f-891180347
f
GR
GS
[1 0 0 1 327.26263 89.24157] CT
0.851 0.325 0.098 RC
N
f-891180347
f
GR
GS
[1 0 0 1 331.64645 97.38591] CT
0.851 0.325 0.098 RC
N
f-891180347
f
GR
GS
[1 0 0 1 336.0303 105.49615] CT
0.851 0.325 0.098 RC
N
f-891180347
f
GR
GS
[1 0 0 1 340.41415 111.92406] CT
0.851 0.325 0.098 RC
N
f-891180347
f
GR
GS
[1 0 0 1 344.79797 117.66803] CT
0.851 0.325 0.098 RC
N
f-891180347
f
GR
GS
[1 0 0 1 349.18182 124.61336] CT
0.851 0.325 0.098 RC
N
f-891180347
f
GR
GS
[1 0 0 1 353.56564 132.7511] CT
0.851 0.325 0.098 RC
N
f-891180347
f
GR
GS
[1 0 0 1 357.94949 140.67946] CT
0.851 0.325 0.098 RC
N
f-891180347
f
GR
GS
[1 0 0 1 362.33334 147.93202] CT
0.851 0.325 0.098 RC
N
f-891180347
f
GR
GS
[1 0 0 1 366.71716 155.12772] CT
0.851 0.325 0.098 RC
N
f-891180347
f
GR
GS
[1 0 0 1 371.10101 162.37228] CT
0.851 0.325 0.098 RC
N
f-891180347
f
GR
GS
[1 0 0 1 375.48486 169.11829] CT
0.851 0.325 0.098 RC
N
f-891180347
f
GR
GS
[1 0 0 1 379.86868 175.27098] CT
0.851 0.325 0.098 RC
N
f-891180347
f
GR
GS
[1 0 0 1 384.25253 181.04216] CT
0.851 0.325 0.098 RC
N
f-891180347
f
GR
GS
[1 0 0 1 388.63635 186.21051] CT
0.851 0.325 0.098 RC
N
f-891180347
f
GR
GS
[1 0 0 1 393.0202 191.05705] CT
0.851 0.325 0.098 RC
N
f-891180347
f
GR
GS
[1 0 0 1 397.40405 197.38782] CT
0.851 0.325 0.098 RC
N
f-891180347
f
GR
GS
[1 0 0 1 401.78787 206.55954] CT
0.851 0.325 0.098 RC
N
f-891180347
f
GR
GS
[1 0 0 1 406.17172 216.72177] CT
0.851 0.325 0.098 RC
N
f-891180347
f
GR
GS
[1 0 0 1 410.55557 224.33749] CT
0.851 0.325 0.098 RC
N
f-891180347
f
GR
GS
[1 0 0 1 414.93939 228.79176] CT
0.851 0.325 0.098 RC
N
f-891180347
f
GR
GS
[1 0 0 1 419.32324 233.29135] CT
0.851 0.325 0.098 RC
N
f-891180347
f
GR
GS
[1 0 0 1 423.70706 240.48746] CT
0.851 0.325 0.098 RC
N
f-891180347
f
GR
GS
[1 0 0 1 428.09091 249.32393] CT
0.851 0.325 0.098 RC
N
f-891180347
f
GR
GS
[1 0 0 1 432.47476 257.31366] CT
0.851 0.325 0.098 RC
N
f-891180347
f
GR
GS
[1 0 0 1 436.85858 263.94562] CT
0.851 0.325 0.098 RC
N
f-891180347
f
GR
GS
[1 0 0 1 441.24243 270.24951] CT
0.851 0.325 0.098 RC
N
f-891180347
f
GR
GS
[1 0 0 1 445.62625 276.57507] CT
0.851 0.325 0.098 RC
N
f-891180347
f
GR
GS
[1 0 0 1 450.0101 282.73395] CT
0.851 0.325 0.098 RC
N
f-891180347
f
GR
GS
[1 0 0 1 454.39395 289.33502] CT
0.851 0.325 0.098 RC
N
f-891180347
f
GR
GS
[1 0 0 1 458.77777 297.02063] CT
0.851 0.325 0.098 RC
N
f-891180347
f
GR
GS
[1 0 0 1 463.16162 304.91495] CT
0.851 0.325 0.098 RC
N
f-891180347
f
GR
GS
[1 0 0 1 467.54544 311.65097] CT
0.851 0.325 0.098 RC
N
f-891180347
f
GR
GS
[1 0 0 1 471.92929 317.65326] CT
0.851 0.325 0.098 RC
N
f-891180347
f
GR
GS
[1 0 0 1 476.31314 324.60031] CT
0.851 0.325 0.098 RC
N
f-891180347
f
GR
GS
[1 0 0 1 480.69696 332.64288] CT
0.851 0.325 0.098 RC
N
f-891180347
f
GR
GS
[1 0 0 1 485.08081 340.05139] CT
0.851 0.325 0.098 RC
N
f-891180347
f
GR
GS
[1 0 0 1 489.46463 346.10165] CT
0.851 0.325 0.098 RC
N
f-891180347
f
GR
GS
[1 0 0 1 493.84848 352.46164] CT
0.851 0.325 0.098 RC
N
f-891180347
f
GR
GS
[1 0 0 1 498.23233 360.44318] CT
0.851 0.325 0.098 RC
N
f-891180347
f
GR
GS
[1 0 0 1 502.61615 368.01132] CT
0.851 0.325 0.098 RC
N
f-891180347
f
GR
GS
[1 0 0 1 507 371.12341] CT
0.851 0.325 0.098 RC
N
f-891180347
f
GR
GS
1 GC
N
499 66 M
499 39.5 L
417.5 39.5 L
417.5 66 L
cp
f
GR
GS
[1 0 0 1 454.5 47] CT
/Helvetica 9 F
GS
[1 0 0 1 0 0] CT
0 3.5 moveto 
1 -1 scale
(Real) t 
GR
GR
GS
0 0.447 0.741 RC
1 LJ
1.5 LW
N
421.5 47 M
451.5 47 L
S
GR
GS
[1 0 0 1 454.5 58.5] CT
/Helvetica 9 F
GS
[1 0 0 1 0 0] CT
0 3.5 moveto 
1 -1 scale
(Estimated) t 
GR
GR
GS
0.851 0.325 0.098 RC
1 LJ
N
421.5 58.5 M
451.5 58.5 L
S
GR
GS
[1 0 0 1 436.5 58.5] CT
0.851 0.325 0.098 RC
N
f-891180347
f
GR
GS
0.149 GC
10.0 ML
0.5 LW
N
417.5 66 M
417.5 39.5 L
499 39.5 L
499 66 L
cp
S
GR
%%Trailer
%%Pages: 1
%%EOF
