%!PS-Adobe-3.0 EPSF-3.0
%%Creator: (MATLAB, The Mathworks, Inc. Version 23.2.0.2409890 \(R2023b\) Update 3. Operating System: Mac OS X)
%%Title: /Users/jakub/Projects/modeling-and-identification/report-02/images/lab6/0.001.eps
%%CreationDate: 2023-11-30T18:38:20
%%Pages: (atend)
%%BoundingBox:     0     0   560   420
%%LanguageLevel: 3
%%EndComments
%%BeginProlog
%%BeginResource: procset (Apache XML Graphics Std ProcSet) 1.2 0
%%Version: 1.2 0
%%Copyright: (Copyright 2001-2003,2010 The Apache Software Foundation. License terms: http://www.apache.org/licenses/LICENSE-2.0)
/bd{bind def}bind def
/ld{load def}bd
/GR/grestore ld
/GS/gsave ld
/RM/rmoveto ld
/C/curveto ld
/t/show ld
/L/lineto ld
/ML/setmiterlimit ld
/CT/concat ld
/f/fill ld
/N/newpath ld
/S/stroke ld
/CC/setcmykcolor ld
/A/ashow ld
/cp/closepath ld
/RC/setrgbcolor ld
/LJ/setlinejoin ld
/GC/setgray ld
/LW/setlinewidth ld
/M/moveto ld
/re {4 2 roll M
1 index 0 rlineto
0 exch rlineto
neg 0 rlineto
cp } bd
/_ctm matrix def
/_tm matrix def
/BT { _ctm currentmatrix pop matrix _tm copy pop 0 0 moveto } bd
/ET { _ctm setmatrix } bd
/iTm { _ctm setmatrix _tm concat } bd
/Tm { _tm astore pop iTm 0 0 moveto } bd
/ux 0.0 def
/uy 0.0 def
/F {
  /Tp exch def
  /Tf exch def
  Tf findfont Tp scalefont setfont
  /cf Tf def  /cs Tp def
} bd
/ULS {currentpoint /uy exch def /ux exch def} bd
/ULE {
  /Tcx currentpoint pop def
  gsave
  newpath
  cf findfont cs scalefont dup
  /FontMatrix get 0 get /Ts exch def /FontInfo get dup
  /UnderlinePosition get Ts mul /To exch def
  /UnderlineThickness get Ts mul /Tt exch def
  ux uy To add moveto  Tcx uy To add lineto
  Tt setlinewidth stroke
  grestore
} bd
/OLE {
  /Tcx currentpoint pop def
  gsave
  newpath
  cf findfont cs scalefont dup
  /FontMatrix get 0 get /Ts exch def /FontInfo get dup
  /UnderlinePosition get Ts mul /To exch def
  /UnderlineThickness get Ts mul /Tt exch def
  ux uy To add cs add moveto Tcx uy To add cs add lineto
  Tt setlinewidth stroke
  grestore
} bd
/SOE {
  /Tcx currentpoint pop def
  gsave
  newpath
  cf findfont cs scalefont dup
  /FontMatrix get 0 get /Ts exch def /FontInfo get dup
  /UnderlinePosition get Ts mul /To exch def
  /UnderlineThickness get Ts mul /Tt exch def
  ux uy To add cs 10 mul 26 idiv add moveto Tcx uy To add cs 10 mul 26 idiv add lineto
  Tt setlinewidth stroke
  grestore
} bd
/QT {
/Y22 exch store
/X22 exch store
/Y21 exch store
/X21 exch store
currentpoint
/Y21 load 2 mul add 3 div exch
/X21 load 2 mul add 3 div exch
/X21 load 2 mul /X22 load add 3 div
/Y21 load 2 mul /Y22 load add 3 div
/X22 load /Y22 load curveto
} bd
/SSPD {
dup length /d exch dict def
{
/v exch def
/k exch def
currentpagedevice k known {
/cpdv currentpagedevice k get def
v cpdv ne {
/upd false def
/nullv v type /nulltype eq def
/nullcpdv cpdv type /nulltype eq def
nullv nullcpdv or
{
/upd true def
} {
/sametype v type cpdv type eq def
sametype {
v type /arraytype eq {
/vlen v length def
/cpdvlen cpdv length def
vlen cpdvlen eq {
0 1 vlen 1 sub {
/i exch def
/obj v i get def
/cpdobj cpdv i get def
obj cpdobj ne {
/upd true def
exit
} if
} for
} {
/upd true def
} ifelse
} {
v type /dicttype eq {
v {
/dv exch def
/dk exch def
/cpddv cpdv dk get def
dv cpddv ne {
/upd true def
exit
} if
} forall
} {
/upd true def
} ifelse
} ifelse
} if
} ifelse
upd true eq {
d k v put
} if
} if
} if
} forall
d length 0 gt {
d setpagedevice
} if
} bd
/RE { % /NewFontName [NewEncodingArray] /FontName RE -
  findfont dup length dict begin
  {
    1 index /FID ne
    {def} {pop pop} ifelse
  } forall
  /Encoding exch def
  /FontName 1 index def
  currentdict definefont pop
  end
} bind def
%%EndResource
%%BeginResource: procset (Apache XML Graphics EPS ProcSet) 1.0 0
%%Version: 1.0 0
%%Copyright: (Copyright 2002-2003 The Apache Software Foundation. License terms: http://www.apache.org/licenses/LICENSE-2.0)
/BeginEPSF { %def
/b4_Inc_state save def         % Save state for cleanup
/dict_count countdictstack def % Count objects on dict stack
/op_count count 1 sub def      % Count objects on operand stack
userdict begin                 % Push userdict on dict stack
/showpage { } def              % Redefine showpage, { } = null proc
0 setgray 0 setlinecap         % Prepare graphics state
1 setlinewidth 0 setlinejoin
10 setmiterlimit [ ] 0 setdash newpath
/languagelevel where           % If level not equal to 1 then
{pop languagelevel             % set strokeadjust and
1 ne                           % overprint to their defaults.
{false setstrokeadjust false setoverprint
} if
} if
} bd
/EndEPSF { %def
count op_count sub {pop} repeat            % Clean up stacks
countdictstack dict_count sub {end} repeat
b4_Inc_state restore
} bd
%%EndResource
%FOPBeginFontDict
%%IncludeResource: font Courier-Oblique
%%IncludeResource: font Courier-BoldOblique
%%IncludeResource: font Courier-Bold
%%IncludeResource: font ZapfDingbats
%%IncludeResource: font Symbol
%%IncludeResource: font Helvetica
%%IncludeResource: font Helvetica-Oblique
%%IncludeResource: font Helvetica-Bold
%%IncludeResource: font Helvetica-BoldOblique
%%IncludeResource: font Times-Roman
%%IncludeResource: font Times-Italic
%%IncludeResource: font Times-Bold
%%IncludeResource: font Times-BoldItalic
%%IncludeResource: font Courier
%FOPEndFontDict
%%BeginResource: encoding WinAnsiEncoding
/WinAnsiEncoding [
/.notdef /.notdef /.notdef /.notdef /.notdef
/.notdef /.notdef /.notdef /.notdef /.notdef
/.notdef /.notdef /.notdef /.notdef /.notdef
/.notdef /.notdef /.notdef /.notdef /.notdef
/.notdef /.notdef /.notdef /.notdef /.notdef
/.notdef /.notdef /.notdef /.notdef /.notdef
/.notdef /.notdef /space /exclam /quotedbl
/numbersign /dollar /percent /ampersand /quotesingle
/parenleft /parenright /asterisk /plus /comma
/hyphen /period /slash /zero /one
/two /three /four /five /six
/seven /eight /nine /colon /semicolon
/less /equal /greater /question /at
/A /B /C /D /E
/F /G /H /I /J
/K /L /M /N /O
/P /Q /R /S /T
/U /V /W /X /Y
/Z /bracketleft /backslash /bracketright /asciicircum
/underscore /quoteleft /a /b /c
/d /e /f /g /h
/i /j /k /l /m
/n /o /p /q /r
/s /t /u /v /w
/x /y /z /braceleft /bar
/braceright /asciitilde /bullet /Euro /bullet
/quotesinglbase /florin /quotedblbase /ellipsis /dagger
/daggerdbl /circumflex /perthousand /Scaron /guilsinglleft
/OE /bullet /Zcaron /bullet /bullet
/quoteleft /quoteright /quotedblleft /quotedblright /bullet
/endash /emdash /asciitilde /trademark /scaron
/guilsinglright /oe /bullet /zcaron /Ydieresis
/space /exclamdown /cent /sterling /currency
/yen /brokenbar /section /dieresis /copyright
/ordfeminine /guillemotleft /logicalnot /sfthyphen /registered
/macron /degree /plusminus /twosuperior /threesuperior
/acute /mu /paragraph /middot /cedilla
/onesuperior /ordmasculine /guillemotright /onequarter /onehalf
/threequarters /questiondown /Agrave /Aacute /Acircumflex
/Atilde /Adieresis /Aring /AE /Ccedilla
/Egrave /Eacute /Ecircumflex /Edieresis /Igrave
/Iacute /Icircumflex /Idieresis /Eth /Ntilde
/Ograve /Oacute /Ocircumflex /Otilde /Odieresis
/multiply /Oslash /Ugrave /Uacute /Ucircumflex
/Udieresis /Yacute /Thorn /germandbls /agrave
/aacute /acircumflex /atilde /adieresis /aring
/ae /ccedilla /egrave /eacute /ecircumflex
/edieresis /igrave /iacute /icircumflex /idieresis
/eth /ntilde /ograve /oacute /ocircumflex
/otilde /odieresis /divide /oslash /ugrave
/uacute /ucircumflex /udieresis /yacute /thorn
/ydieresis
] def
%%EndResource
%FOPBeginFontReencode
/Courier-Oblique findfont
dup length dict begin
  {1 index /FID ne {def} {pop pop} ifelse} forall
  /Encoding WinAnsiEncoding def
  currentdict
end
/Courier-Oblique exch definefont pop
/Courier-BoldOblique findfont
dup length dict begin
  {1 index /FID ne {def} {pop pop} ifelse} forall
  /Encoding WinAnsiEncoding def
  currentdict
end
/Courier-BoldOblique exch definefont pop
/Courier-Bold findfont
dup length dict begin
  {1 index /FID ne {def} {pop pop} ifelse} forall
  /Encoding WinAnsiEncoding def
  currentdict
end
/Courier-Bold exch definefont pop
/Helvetica findfont
dup length dict begin
  {1 index /FID ne {def} {pop pop} ifelse} forall
  /Encoding WinAnsiEncoding def
  currentdict
end
/Helvetica exch definefont pop
/Helvetica-Oblique findfont
dup length dict begin
  {1 index /FID ne {def} {pop pop} ifelse} forall
  /Encoding WinAnsiEncoding def
  currentdict
end
/Helvetica-Oblique exch definefont pop
/Helvetica-Bold findfont
dup length dict begin
  {1 index /FID ne {def} {pop pop} ifelse} forall
  /Encoding WinAnsiEncoding def
  currentdict
end
/Helvetica-Bold exch definefont pop
/Helvetica-BoldOblique findfont
dup length dict begin
  {1 index /FID ne {def} {pop pop} ifelse} forall
  /Encoding WinAnsiEncoding def
  currentdict
end
/Helvetica-BoldOblique exch definefont pop
/Times-Roman findfont
dup length dict begin
  {1 index /FID ne {def} {pop pop} ifelse} forall
  /Encoding WinAnsiEncoding def
  currentdict
end
/Times-Roman exch definefont pop
/Times-Italic findfont
dup length dict begin
  {1 index /FID ne {def} {pop pop} ifelse} forall
  /Encoding WinAnsiEncoding def
  currentdict
end
/Times-Italic exch definefont pop
/Times-Bold findfont
dup length dict begin
  {1 index /FID ne {def} {pop pop} ifelse} forall
  /Encoding WinAnsiEncoding def
  currentdict
end
/Times-Bold exch definefont pop
/Times-BoldItalic findfont
dup length dict begin
  {1 index /FID ne {def} {pop pop} ifelse} forall
  /Encoding WinAnsiEncoding def
  currentdict
end
/Times-BoldItalic exch definefont pop
/Courier findfont
dup length dict begin
  {1 index /FID ne {def} {pop pop} ifelse} forall
  /Encoding WinAnsiEncoding def
  currentdict
end
/Courier exch definefont pop
%FOPEndFontReencode
%%EndProlog
%%Page: 1 1
%%PageBoundingBox: 0 0 560 420
%%BeginPageSetup
[1 0 0 -1 0 420] CT
%%EndPageSetup
GS
1 GC
N
0 0 560 420 re
f
GR
GS
1 GC
N
0 0 560 420 re
f
GR
GS
1 GC
N
73 374 M
507 374 L
507 31.5 L
73 31.5 L
cp
f
GR
GS
0.775 GC
[1 3] 0 setdash
2 LJ
0.5 LW
N
83.85 374 M
83.85 31.5 L
S
GR
GS
0.775 GC
[1 3] 0 setdash
2 LJ
0.5 LW
N
94.7 374 M
94.7 31.5 L
S
GR
GS
0.775 GC
[1 3] 0 setdash
2 LJ
0.5 LW
N
105.55 374 M
105.55 31.5 L
S
GR
GS
0.775 GC
[1 3] 0 setdash
2 LJ
0.5 LW
N
127.25 374 M
127.25 31.5 L
S
GR
GS
0.775 GC
[1 3] 0 setdash
2 LJ
0.5 LW
N
138.1 374 M
138.1 31.5 L
S
GR
GS
0.775 GC
[1 3] 0 setdash
2 LJ
0.5 LW
N
148.95 374 M
148.95 31.5 L
S
GR
GS
0.775 GC
[1 3] 0 setdash
2 LJ
0.5 LW
N
170.65 374 M
170.65 31.5 L
S
GR
GS
0.775 GC
[1 3] 0 setdash
2 LJ
0.5 LW
N
181.5 374 M
181.5 31.5 L
S
GR
GS
0.775 GC
[1 3] 0 setdash
2 LJ
0.5 LW
N
192.35 374 M
192.35 31.5 L
S
GR
GS
0.775 GC
[1 3] 0 setdash
2 LJ
0.5 LW
N
214.05 374 M
214.05 31.5 L
S
GR
GS
0.775 GC
[1 3] 0 setdash
2 LJ
0.5 LW
N
224.9 374 M
224.9 31.5 L
S
GR
GS
0.775 GC
[1 3] 0 setdash
2 LJ
0.5 LW
N
235.75 374 M
235.75 31.5 L
S
GR
GS
0.775 GC
[1 3] 0 setdash
2 LJ
0.5 LW
N
257.45 374 M
257.45 31.5 L
S
GR
GS
0.775 GC
[1 3] 0 setdash
2 LJ
0.5 LW
N
268.3 374 M
268.3 31.5 L
S
GR
GS
0.775 GC
[1 3] 0 setdash
2 LJ
0.5 LW
N
279.15 374 M
279.15 31.5 L
S
GR
GS
0.775 GC
[1 3] 0 setdash
2 LJ
0.5 LW
N
300.85 374 M
300.85 31.5 L
S
GR
GS
0.775 GC
[1 3] 0 setdash
2 LJ
0.5 LW
N
311.7 374 M
311.7 31.5 L
S
GR
GS
0.775 GC
[1 3] 0 setdash
2 LJ
0.5 LW
N
322.55 374 M
322.55 31.5 L
S
GR
GS
0.775 GC
[1 3] 0 setdash
2 LJ
0.5 LW
N
344.25 374 M
344.25 31.5 L
S
GR
GS
0.775 GC
[1 3] 0 setdash
2 LJ
0.5 LW
N
355.1 374 M
355.1 31.5 L
S
GR
GS
0.775 GC
[1 3] 0 setdash
2 LJ
0.5 LW
N
365.95 374 M
365.95 31.5 L
S
GR
GS
0.775 GC
[1 3] 0 setdash
2 LJ
0.5 LW
N
387.65 374 M
387.65 31.5 L
S
GR
GS
0.775 GC
[1 3] 0 setdash
2 LJ
0.5 LW
N
398.5 374 M
398.5 31.5 L
S
GR
GS
0.775 GC
[1 3] 0 setdash
2 LJ
0.5 LW
N
409.35 374 M
409.35 31.5 L
S
GR
GS
0.775 GC
[1 3] 0 setdash
2 LJ
0.5 LW
N
431.05 374 M
431.05 31.5 L
S
GR
GS
0.775 GC
[1 3] 0 setdash
2 LJ
0.5 LW
N
441.9 374 M
441.9 31.5 L
S
GR
GS
0.775 GC
[1 3] 0 setdash
2 LJ
0.5 LW
N
452.75 374 M
452.75 31.5 L
S
GR
GS
0.775 GC
[1 3] 0 setdash
2 LJ
0.5 LW
N
474.45 374 M
474.45 31.5 L
S
GR
GS
0.775 GC
[1 3] 0 setdash
2 LJ
0.5 LW
N
485.3 374 M
485.3 31.5 L
S
GR
GS
0.775 GC
[1 3] 0 setdash
2 LJ
0.5 LW
N
496.15 374 M
496.15 31.5 L
S
GR
GS
0.873 GC
1 LJ
0.5 LW
N
73 374 M
73 31.5 L
S
GR
GS
0.873 GC
1 LJ
0.5 LW
N
116.4 374 M
116.4 31.5 L
S
GR
GS
0.873 GC
1 LJ
0.5 LW
N
159.8 374 M
159.8 31.5 L
S
GR
GS
0.873 GC
1 LJ
0.5 LW
N
203.2 374 M
203.2 31.5 L
S
GR
GS
0.873 GC
1 LJ
0.5 LW
N
246.6 374 M
246.6 31.5 L
S
GR
GS
0.873 GC
1 LJ
0.5 LW
N
290 374 M
290 31.5 L
S
GR
GS
0.873 GC
1 LJ
0.5 LW
N
333.4 374 M
333.4 31.5 L
S
GR
GS
0.873 GC
1 LJ
0.5 LW
N
376.8 374 M
376.8 31.5 L
S
GR
GS
0.873 GC
1 LJ
0.5 LW
N
420.2 374 M
420.2 31.5 L
S
GR
GS
0.873 GC
1 LJ
0.5 LW
N
463.6 374 M
463.6 31.5 L
S
GR
GS
0.873 GC
1 LJ
0.5 LW
N
507 374 M
507 31.5 L
S
GR
GS
0.775 GC
[1 3] 0 setdash
2 LJ
0.5 LW
N
507 364.486 M
73 364.486 L
S
GR
GS
0.775 GC
[1 3] 0 setdash
2 LJ
0.5 LW
N
507 354.972 M
73 354.972 L
S
GR
GS
0.775 GC
[1 3] 0 setdash
2 LJ
0.5 LW
N
507 345.458 M
73 345.458 L
S
GR
GS
0.775 GC
[1 3] 0 setdash
2 LJ
0.5 LW
N
507 326.431 M
73 326.431 L
S
GR
GS
0.775 GC
[1 3] 0 setdash
2 LJ
0.5 LW
N
507 316.917 M
73 316.917 L
S
GR
GS
0.775 GC
[1 3] 0 setdash
2 LJ
0.5 LW
N
507 307.403 M
73 307.403 L
S
GR
GS
0.775 GC
[1 3] 0 setdash
2 LJ
0.5 LW
N
507 288.375 M
73 288.375 L
S
GR
GS
0.775 GC
[1 3] 0 setdash
2 LJ
0.5 LW
N
507 278.861 M
73 278.861 L
S
GR
GS
0.775 GC
[1 3] 0 setdash
2 LJ
0.5 LW
N
507 269.347 M
73 269.347 L
S
GR
GS
0.775 GC
[1 3] 0 setdash
2 LJ
0.5 LW
N
507 250.319 M
73 250.319 L
S
GR
GS
0.775 GC
[1 3] 0 setdash
2 LJ
0.5 LW
N
507 240.806 M
73 240.806 L
S
GR
GS
0.775 GC
[1 3] 0 setdash
2 LJ
0.5 LW
N
507 231.292 M
73 231.292 L
S
GR
GS
0.775 GC
[1 3] 0 setdash
2 LJ
0.5 LW
N
507 212.264 M
73 212.264 L
S
GR
GS
0.775 GC
[1 3] 0 setdash
2 LJ
0.5 LW
N
507 202.75 M
73 202.75 L
S
GR
GS
0.775 GC
[1 3] 0 setdash
2 LJ
0.5 LW
N
507 193.236 M
73 193.236 L
S
GR
GS
0.775 GC
[1 3] 0 setdash
2 LJ
0.5 LW
N
507 174.208 M
73 174.208 L
S
GR
GS
0.775 GC
[1 3] 0 setdash
2 LJ
0.5 LW
N
507 164.694 M
73 164.694 L
S
GR
GS
0.775 GC
[1 3] 0 setdash
2 LJ
0.5 LW
N
507 155.181 M
73 155.181 L
S
GR
GS
0.775 GC
[1 3] 0 setdash
2 LJ
0.5 LW
N
507 136.153 M
73 136.153 L
S
GR
GS
0.775 GC
[1 3] 0 setdash
2 LJ
0.5 LW
N
507 126.639 M
73 126.639 L
S
GR
GS
0.775 GC
[1 3] 0 setdash
2 LJ
0.5 LW
N
507 117.125 M
73 117.125 L
S
GR
GS
0.775 GC
[1 3] 0 setdash
2 LJ
0.5 LW
N
507 98.097 M
73 98.097 L
S
GR
GS
0.775 GC
[1 3] 0 setdash
2 LJ
0.5 LW
N
507 88.583 M
73 88.583 L
S
GR
GS
0.775 GC
[1 3] 0 setdash
2 LJ
0.5 LW
N
507 79.069 M
73 79.069 L
S
GR
GS
0.775 GC
[1 3] 0 setdash
2 LJ
0.5 LW
N
507 60.042 M
73 60.042 L
S
GR
GS
0.775 GC
[1 3] 0 setdash
2 LJ
0.5 LW
N
507 50.528 M
73 50.528 L
S
GR
GS
0.775 GC
[1 3] 0 setdash
2 LJ
0.5 LW
N
507 41.014 M
73 41.014 L
S
GR
GS
0.873 GC
1 LJ
0.5 LW
N
507 374 M
73 374 L
S
GR
GS
0.873 GC
1 LJ
0.5 LW
N
507 335.944 M
73 335.944 L
S
GR
GS
0.873 GC
1 LJ
0.5 LW
N
507 297.889 M
73 297.889 L
S
GR
GS
0.873 GC
1 LJ
0.5 LW
N
507 259.833 M
73 259.833 L
S
GR
GS
0.873 GC
1 LJ
0.5 LW
N
507 221.778 M
73 221.778 L
S
GR
GS
0.873 GC
1 LJ
0.5 LW
N
507 183.722 M
73 183.722 L
S
GR
GS
0.873 GC
1 LJ
0.5 LW
N
507 145.667 M
73 145.667 L
S
GR
GS
0.873 GC
1 LJ
0.5 LW
N
507 107.611 M
73 107.611 L
S
GR
GS
0.873 GC
1 LJ
0.5 LW
N
507 69.556 M
73 69.556 L
S
GR
GS
0.873 GC
1 LJ
0.5 LW
N
507 31.5 M
73 31.5 L
S
GR
GS
0.149 GC
2 setlinecap
1 LJ
0.5 LW
N
73 374 M
507 374 L
S
GR
GS
0.149 GC
2 setlinecap
1 LJ
0.5 LW
N
73 374 M
73 369.66 L
S
GR
GS
0.149 GC
2 setlinecap
1 LJ
0.5 LW
N
116.4 374 M
116.4 369.66 L
S
GR
GS
0.149 GC
2 setlinecap
1 LJ
0.5 LW
N
159.8 374 M
159.8 369.66 L
S
GR
GS
0.149 GC
2 setlinecap
1 LJ
0.5 LW
N
203.2 374 M
203.2 369.66 L
S
GR
GS
0.149 GC
2 setlinecap
1 LJ
0.5 LW
N
246.6 374 M
246.6 369.66 L
S
GR
GS
0.149 GC
2 setlinecap
1 LJ
0.5 LW
N
290 374 M
290 369.66 L
S
GR
GS
0.149 GC
2 setlinecap
1 LJ
0.5 LW
N
333.4 374 M
333.4 369.66 L
S
GR
GS
0.149 GC
2 setlinecap
1 LJ
0.5 LW
N
376.8 374 M
376.8 369.66 L
S
GR
GS
0.149 GC
2 setlinecap
1 LJ
0.5 LW
N
420.2 374 M
420.2 369.66 L
S
GR
GS
0.149 GC
2 setlinecap
1 LJ
0.5 LW
N
463.6 374 M
463.6 369.66 L
S
GR
GS
0.149 GC
2 setlinecap
1 LJ
0.5 LW
N
507 374 M
507 369.66 L
S
GR
GS
[1 0 0 1 73 378] CT
0.149 GC
/Helvetica 10 F
GS
[1 0 0 1 0 0] CT
-5 10 moveto 
1 -1 scale
(-1) t 
GR
GR
GS
[1 0 0 1 116.39999 378] CT
0.149 GC
/Helvetica 10 F
GS
[1 0 0 1 0 0] CT
-9 10 moveto 
1 -1 scale
(-0.8) t 
GR
GR
GS
[1 0 0 1 159.79999 378] CT
0.149 GC
/Helvetica 10 F
GS
[1 0 0 1 0 0] CT
-9 10 moveto 
1 -1 scale
(-0.6) t 
GR
GR
GS
[1 0 0 1 203.2 378] CT
0.149 GC
/Helvetica 10 F
GS
[1 0 0 1 0 0] CT
-9 10 moveto 
1 -1 scale
(-0.4) t 
GR
GR
GS
[1 0 0 1 246.60001 378] CT
0.149 GC
/Helvetica 10 F
GS
[1 0 0 1 0 0] CT
-9 10 moveto 
1 -1 scale
(-0.2) t 
GR
GR
GS
[1 0 0 1 290 378] CT
0.149 GC
/Helvetica 10 F
GS
[1 0 0 1 0 0] CT
-3 10 moveto 
1 -1 scale
(0) t 
GR
GR
GS
[1 0 0 1 333.39999 378] CT
0.149 GC
/Helvetica 10 F
GS
[1 0 0 1 0 0] CT
-7 10 moveto 
1 -1 scale
(0.2) t 
GR
GR
GS
[1 0 0 1 376.79999 378] CT
0.149 GC
/Helvetica 10 F
GS
[1 0 0 1 0 0] CT
-7 10 moveto 
1 -1 scale
(0.4) t 
GR
GR
GS
[1 0 0 1 420.20001 378] CT
0.149 GC
/Helvetica 10 F
GS
[1 0 0 1 0 0] CT
-7 10 moveto 
1 -1 scale
(0.6) t 
GR
GR
GS
[1 0 0 1 463.60001 378] CT
0.149 GC
/Helvetica 10 F
GS
[1 0 0 1 0 0] CT
-7 10 moveto 
1 -1 scale
(0.8) t 
GR
GR
GS
[1 0 0 1 507 378] CT
0.149 GC
/Helvetica 10 F
GS
[1 0 0 1 0 0] CT
-3 10 moveto 
1 -1 scale
(1) t 
GR
GR
GS
0.149 GC
2 setlinecap
1 LJ
0.5 LW
N
73 374 M
73 31.5 L
S
GR
GS
0.149 GC
2 setlinecap
1 LJ
0.5 LW
N
73 374 M
77.34 374 L
S
GR
GS
0.149 GC
2 setlinecap
1 LJ
0.5 LW
N
73 335.944 M
77.34 335.944 L
S
GR
GS
0.149 GC
2 setlinecap
1 LJ
0.5 LW
N
73 297.889 M
77.34 297.889 L
S
GR
GS
0.149 GC
2 setlinecap
1 LJ
0.5 LW
N
73 259.833 M
77.34 259.833 L
S
GR
GS
0.149 GC
2 setlinecap
1 LJ
0.5 LW
N
73 221.778 M
77.34 221.778 L
S
GR
GS
0.149 GC
2 setlinecap
1 LJ
0.5 LW
N
73 183.722 M
77.34 183.722 L
S
GR
GS
0.149 GC
2 setlinecap
1 LJ
0.5 LW
N
73 145.667 M
77.34 145.667 L
S
GR
GS
0.149 GC
2 setlinecap
1 LJ
0.5 LW
N
73 107.611 M
77.34 107.611 L
S
GR
GS
0.149 GC
2 setlinecap
1 LJ
0.5 LW
N
73 69.556 M
77.34 69.556 L
S
GR
GS
0.149 GC
2 setlinecap
1 LJ
0.5 LW
N
73 31.5 M
77.34 31.5 L
S
GR
GS
[1 0 0 1 68.99999 374] CT
0.149 GC
/Helvetica 10 F
GS
[1 0 0 1 0 0] CT
-6 3.5 moveto 
1 -1 scale
(0) t 
GR
GR
GS
[1 0 0 1 68.99999 335.94446] CT
0.149 GC
/Helvetica 10 F
GS
[1 0 0 1 0 0] CT
-14 3.5 moveto 
1 -1 scale
(0.2) t 
GR
GR
GS
[1 0 0 1 68.99999 297.88889] CT
0.149 GC
/Helvetica 10 F
GS
[1 0 0 1 0 0] CT
-14 3.5 moveto 
1 -1 scale
(0.4) t 
GR
GR
GS
[1 0 0 1 68.99999 259.83334] CT
0.149 GC
/Helvetica 10 F
GS
[1 0 0 1 0 0] CT
-14 3.5 moveto 
1 -1 scale
(0.6) t 
GR
GR
GS
[1 0 0 1 68.99999 221.77777] CT
0.149 GC
/Helvetica 10 F
GS
[1 0 0 1 0 0] CT
-14 3.5 moveto 
1 -1 scale
(0.8) t 
GR
GR
GS
[1 0 0 1 68.99999 183.72223] CT
0.149 GC
/Helvetica 10 F
GS
[1 0 0 1 0 0] CT
-6 3.5 moveto 
1 -1 scale
(1) t 
GR
GR
GS
[1 0 0 1 68.99999 145.66666] CT
0.149 GC
/Helvetica 10 F
GS
[1 0 0 1 0 0] CT
-14 3.5 moveto 
1 -1 scale
(1.2) t 
GR
GR
GS
[1 0 0 1 68.99999 107.61111] CT
0.149 GC
/Helvetica 10 F
GS
[1 0 0 1 0 0] CT
-14 3.5 moveto 
1 -1 scale
(1.4) t 
GR
GR
GS
[1 0 0 1 68.99999 69.55555] CT
0.149 GC
/Helvetica 10 F
GS
[1 0 0 1 0 0] CT
-14 3.5 moveto 
1 -1 scale
(1.6) t 
GR
GR
GS
[1 0 0 1 68.99999 31.50001] CT
0.149 GC
/Helvetica 10 F
GS
[1 0 0 1 0 0] CT
-14 3.5 moveto 
1 -1 scale
(1.8) t 
GR
GR
GS
0 0.447 0.741 RC
1 LJ
1.5 LW
N
73 374 M
77.384 366.39 L
81.768 358.935 L
86.152 351.635 L
90.535 344.491 L
94.919 337.501 L
99.303 330.668 L
103.687 323.989 L
108.071 317.466 L
112.455 311.098 L
116.838 304.886 L
121.222 298.829 L
125.606 292.927 L
129.99 287.18 L
134.374 281.589 L
138.758 276.153 L
143.141 270.872 L
147.525 265.747 L
151.909 260.777 L
156.293 255.962 L
160.677 251.303 L
165.061 246.799 L
169.444 242.45 L
173.828 238.256 L
178.212 234.218 L
182.596 230.336 L
186.98 226.608 L
191.364 223.036 L
195.747 219.619 L
200.131 216.357 L
204.515 213.251 L
208.899 210.3 L
213.283 207.505 L
217.667 204.864 L
222.051 202.379 L
226.434 200.049 L
230.818 197.875 L
235.202 195.856 L
239.586 193.992 L
243.97 192.284 L
248.354 190.731 L
252.737 189.333 L
257.121 188.09 L
261.505 187.003 L
265.889 186.071 L
270.273 185.295 L
274.657 184.674 L
279.04 184.208 L
283.424 183.897 L
287.808 183.742 L
292.192 183.742 L
296.576 183.897 L
300.96 184.208 L
305.343 184.674 L
309.727 185.295 L
314.111 186.071 L
318.495 187.003 L
322.879 188.09 L
327.263 189.333 L
331.646 190.731 L
336.03 192.284 L
340.414 193.992 L
344.798 195.856 L
349.182 197.875 L
353.566 200.049 L
357.949 202.379 L
362.333 204.864 L
366.717 207.505 L
371.101 210.3 L
375.485 213.251 L
379.869 216.357 L
384.253 219.619 L
388.636 223.036 L
393.02 226.608 L
397.404 230.336 L
401.788 234.218 L
406.172 238.256 L
410.556 242.45 L
414.939 246.799 L
419.323 251.303 L
423.707 255.962 L
428.091 260.777 L
432.475 265.747 L
436.859 270.872 L
441.242 276.153 L
445.626 281.589 L
450.01 287.18 L
454.394 292.927 L
458.778 298.829 L
463.162 304.886 L
467.545 311.098 L
471.929 317.466 L
476.313 323.989 L
480.697 330.668 L
485.081 337.501 L
489.465 344.491 L
493.848 351.635 L
498.232 358.935 L
502.616 366.39 L
507 374 L
S
GR
GS
0.851 0.325 0.098 RC
1 LJ
N
73 249.115 M
77.384 241.06 L
81.768 230.3 L
86.152 225.786 L
90.535 219.197 L
94.919 211.951 L
99.303 205.849 L
103.687 196.969 L
108.071 184.419 L
112.455 189.108 L
116.838 174.402 L
121.222 175.525 L
125.606 169.079 L
129.99 160.335 L
134.374 158.259 L
138.758 151.215 L
143.141 143.462 L
147.525 136.299 L
151.909 133.429 L
156.293 132.016 L
160.677 124.237 L
165.061 121.22 L
169.444 116.549 L
173.828 114.686 L
178.212 100.54 L
182.596 100.236 L
186.98 102.943 L
191.364 90.648 L
195.747 90.201 L
200.131 89.347 L
204.515 88.079 L
208.899 79.774 L
213.283 79.538 L
217.667 74.519 L
222.051 73.069 L
226.434 77.418 L
230.818 75.028 L
235.202 70.365 L
239.586 68.419 L
243.97 65.442 L
248.354 58.244 L
252.737 63.933 L
257.121 58.484 L
261.505 58.276 L
265.889 59.58 L
270.273 55.652 L
274.657 57.773 L
279.04 61.057 L
283.424 61.255 L
287.808 58.255 L
292.192 56.373 L
296.576 57.54 L
300.96 57.132 L
305.343 55.866 L
309.727 58.707 L
314.111 59.674 L
318.495 57.986 L
322.879 59.71 L
327.263 64.377 L
331.646 59.38 L
336.03 65.735 L
340.414 68.295 L
344.798 70.003 L
349.182 71.449 L
353.566 70.014 L
357.949 79.677 L
362.333 79.829 L
366.717 75.756 L
371.101 79.113 L
375.485 84.173 L
379.869 87.89 L
384.253 90.971 L
388.636 98.71 L
393.02 108.228 L
397.404 97.174 L
401.788 110.729 L
406.172 105.402 L
410.556 113.689 L
414.939 118.941 L
419.323 124.432 L
423.707 127.179 L
428.091 134.452 L
432.475 138.432 L
436.859 148.01 L
441.242 151.6 L
445.626 152.801 L
450.01 158.569 L
454.394 164.462 L
458.778 168.317 L
463.162 181.818 L
467.545 186.586 L
471.929 195.593 L
476.313 200.915 L
480.697 209.098 L
485.081 214.339 L
489.465 218.199 L
493.848 220.465 L
498.232 232.012 L
502.616 239.941 L
507 250.354 L
S
GR
GS
[1 0 0 1 73 249.11465] CT
0.851 0.325 0.098 RC
N
1 0 M
1 0.552 0.552 1 0 1 C
-0.552 1 -1 0.552 -1 0 C
-1 -0.552 -0.552 -1 0 -1 C
0.552 -1 1 -0.552 1 0 C
cp
f
GR
GS
[1 0 0 1 77.38384 241.05965] CT
0.851 0.325 0.098 RC
N
/f-891180347{1 0 M
1 0.552 0.552 1 0 1 C
-0.552 1 -1 0.552 -1 0 C
-1 -0.552 -0.552 -1 0 -1 C
0.552 -1 1 -0.552 1 0 C
cp}def
f-891180347
f
GR
GS
[1 0 0 1 81.76767 230.2997] CT
0.851 0.325 0.098 RC
N
f-891180347
f
GR
GS
[1 0 0 1 86.15151 225.78601] CT
0.851 0.325 0.098 RC
N
f-891180347
f
GR
GS
[1 0 0 1 90.53535 219.19713] CT
0.851 0.325 0.098 RC
N
f-891180347
f
GR
GS
[1 0 0 1 94.91919 211.95135] CT
0.851 0.325 0.098 RC
N
f-891180347
f
GR
GS
[1 0 0 1 99.30303 205.84857] CT
0.851 0.325 0.098 RC
N
f-891180347
f
GR
GS
[1 0 0 1 103.68687 196.96913] CT
0.851 0.325 0.098 RC
N
f-891180347
f
GR
GS
[1 0 0 1 108.0707 184.41924] CT
0.851 0.325 0.098 RC
N
f-891180347
f
GR
GS
[1 0 0 1 112.45454 189.10783] CT
0.851 0.325 0.098 RC
N
f-891180347
f
GR
GS
[1 0 0 1 116.83839 174.40173] CT
0.851 0.325 0.098 RC
N
f-891180347
f
GR
GS
[1 0 0 1 121.22222 175.52505] CT
0.851 0.325 0.098 RC
N
f-891180347
f
GR
GS
[1 0 0 1 125.60606 169.07898] CT
0.851 0.325 0.098 RC
N
f-891180347
f
GR
GS
[1 0 0 1 129.9899 160.33525] CT
0.851 0.325 0.098 RC
N
f-891180347
f
GR
GS
[1 0 0 1 134.37373 158.25912] CT
0.851 0.325 0.098 RC
N
f-891180347
f
GR
GS
[1 0 0 1 138.75758 151.2146] CT
0.851 0.325 0.098 RC
N
f-891180347
f
GR
GS
[1 0 0 1 143.14142 143.46159] CT
0.851 0.325 0.098 RC
N
f-891180347
f
GR
GS
[1 0 0 1 147.52525 136.29883] CT
0.851 0.325 0.098 RC
N
f-891180347
f
GR
GS
[1 0 0 1 151.90909 133.42915] CT
0.851 0.325 0.098 RC
N
f-891180347
f
GR
GS
[1 0 0 1 156.29292 132.01636] CT
0.851 0.325 0.098 RC
N
f-891180347
f
GR
GS
[1 0 0 1 160.67677 124.2371] CT
0.851 0.325 0.098 RC
N
f-891180347
f
GR
GS
[1 0 0 1 165.06061 121.2203] CT
0.851 0.325 0.098 RC
N
f-891180347
f
GR
GS
[1 0 0 1 169.44444 116.54869] CT
0.851 0.325 0.098 RC
N
f-891180347
f
GR
GS
[1 0 0 1 173.82828 114.68584] CT
0.851 0.325 0.098 RC
N
f-891180347
f
GR
GS
[1 0 0 1 178.21213 100.54032] CT
0.851 0.325 0.098 RC
N
f-891180347
f
GR
GS
[1 0 0 1 182.59596 100.23603] CT
0.851 0.325 0.098 RC
N
f-891180347
f
GR
GS
[1 0 0 1 186.9798 102.94341] CT
0.851 0.325 0.098 RC
N
f-891180347
f
GR
GS
[1 0 0 1 191.36363 90.64829] CT
0.851 0.325 0.098 RC
N
f-891180347
f
GR
GS
[1 0 0 1 195.74748 90.20132] CT
0.851 0.325 0.098 RC
N
f-891180347
f
GR
GS
[1 0 0 1 200.13132 89.34727] CT
0.851 0.325 0.098 RC
N
f-891180347
f
GR
GS
[1 0 0 1 204.51515 88.07921] CT
0.851 0.325 0.098 RC
N
f-891180347
f
GR
GS
[1 0 0 1 208.89899 79.7739] CT
0.851 0.325 0.098 RC
N
f-891180347
f
GR
GS
[1 0 0 1 213.28282 79.53849] CT
0.851 0.325 0.098 RC
N
f-891180347
f
GR
GS
[1 0 0 1 217.66667 74.51942] CT
0.851 0.325 0.098 RC
N
f-891180347
f
GR
GS
[1 0 0 1 222.05051 73.06908] CT
0.851 0.325 0.098 RC
N
f-891180347
f
GR
GS
[1 0 0 1 226.43434 77.41805] CT
0.851 0.325 0.098 RC
N
f-891180347
f
GR
GS
[1 0 0 1 230.81818 75.02807] CT
0.851 0.325 0.098 RC
N
f-891180347
f
GR
GS
[1 0 0 1 235.20203 70.36535] CT
0.851 0.325 0.098 RC
N
f-891180347
f
GR
GS
[1 0 0 1 239.58586 68.41869] CT
0.851 0.325 0.098 RC
N
f-891180347
f
GR
GS
[1 0 0 1 243.9697 65.44189] CT
0.851 0.325 0.098 RC
N
f-891180347
f
GR
GS
[1 0 0 1 248.35353 58.24428] CT
0.851 0.325 0.098 RC
N
f-891180347
f
GR
GS
[1 0 0 1 252.73738 63.93346] CT
0.851 0.325 0.098 RC
N
f-891180347
f
GR
GS
[1 0 0 1 257.12122 58.48449] CT
0.851 0.325 0.098 RC
N
f-891180347
f
GR
GS
[1 0 0 1 261.50507 58.27554] CT
0.851 0.325 0.098 RC
N
f-891180347
f
GR
GS
[1 0 0 1 265.88889 59.57998] CT
0.851 0.325 0.098 RC
N
f-891180347
f
GR
GS
[1 0 0 1 270.27274 55.65197] CT
0.851 0.325 0.098 RC
N
f-891180347
f
GR
GS
[1 0 0 1 274.65656 57.77286] CT
0.851 0.325 0.098 RC
N
f-891180347
f
GR
GS
[1 0 0 1 279.04041 61.05707] CT
0.851 0.325 0.098 RC
N
f-891180347
f
GR
GS
[1 0 0 1 283.42426 61.25539] CT
0.851 0.325 0.098 RC
N
f-891180347
f
GR
GS
[1 0 0 1 287.80807 58.25535] CT
0.851 0.325 0.098 RC
N
f-891180347
f
GR
GS
[1 0 0 1 292.19193 56.37294] CT
0.851 0.325 0.098 RC
N
f-891180347
f
GR
GS
[1 0 0 1 296.57574 57.54] CT
0.851 0.325 0.098 RC
N
f-891180347
f
GR
GS
[1 0 0 1 300.95959 57.13218] CT
0.851 0.325 0.098 RC
N
f-891180347
f
GR
GS
[1 0 0 1 305.34344 55.86591] CT
0.851 0.325 0.098 RC
N
f-891180347
f
GR
GS
[1 0 0 1 309.72726 58.7069] CT
0.851 0.325 0.098 RC
N
f-891180347
f
GR
GS
[1 0 0 1 314.11111 59.67412] CT
0.851 0.325 0.098 RC
N
f-891180347
f
GR
GS
[1 0 0 1 318.49493 57.98563] CT
0.851 0.325 0.098 RC
N
f-891180347
f
GR
GS
[1 0 0 1 322.87878 59.70971] CT
0.851 0.325 0.098 RC
N
f-891180347
f
GR
GS
[1 0 0 1 327.26263 64.37701] CT
0.851 0.325 0.098 RC
N
f-891180347
f
GR
GS
[1 0 0 1 331.64645 59.37992] CT
0.851 0.325 0.098 RC
N
f-891180347
f
GR
GS
[1 0 0 1 336.0303 65.73515] CT
0.851 0.325 0.098 RC
N
f-891180347
f
GR
GS
[1 0 0 1 340.41415 68.29547] CT
0.851 0.325 0.098 RC
N
f-891180347
f
GR
GS
[1 0 0 1 344.79797 70.00343] CT
0.851 0.325 0.098 RC
N
f-891180347
f
GR
GS
[1 0 0 1 349.18182 71.44857] CT
0.851 0.325 0.098 RC
N
f-891180347
f
GR
GS
[1 0 0 1 353.56564 70.01434] CT
0.851 0.325 0.098 RC
N
f-891180347
f
GR
GS
[1 0 0 1 357.94949 79.67674] CT
0.851 0.325 0.098 RC
N
f-891180347
f
GR
GS
[1 0 0 1 362.33334 79.82917] CT
0.851 0.325 0.098 RC
N
f-891180347
f
GR
GS
[1 0 0 1 366.71716 75.75612] CT
0.851 0.325 0.098 RC
N
f-891180347
f
GR
GS
[1 0 0 1 371.10101 79.11266] CT
0.851 0.325 0.098 RC
N
f-891180347
f
GR
GS
[1 0 0 1 375.48486 84.17339] CT
0.851 0.325 0.098 RC
N
f-891180347
f
GR
GS
[1 0 0 1 379.86868 87.88992] CT
0.851 0.325 0.098 RC
N
f-891180347
f
GR
GS
[1 0 0 1 384.25253 90.97148] CT
0.851 0.325 0.098 RC
N
f-891180347
f
GR
GS
[1 0 0 1 388.63635 98.71031] CT
0.851 0.325 0.098 RC
N
f-891180347
f
GR
GS
[1 0 0 1 393.0202 108.22809] CT
0.851 0.325 0.098 RC
N
f-891180347
f
GR
GS
[1 0 0 1 397.40405 97.17366] CT
0.851 0.325 0.098 RC
N
f-891180347
f
GR
GS
[1 0 0 1 401.78787 110.72906] CT
0.851 0.325 0.098 RC
N
f-891180347
f
GR
GS
[1 0 0 1 406.17172 105.40178] CT
0.851 0.325 0.098 RC
N
f-891180347
f
GR
GS
[1 0 0 1 410.55557 113.68945] CT
0.851 0.325 0.098 RC
N
f-891180347
f
GR
GS
[1 0 0 1 414.93939 118.94112] CT
0.851 0.325 0.098 RC
N
f-891180347
f
GR
GS
[1 0 0 1 419.32324 124.43163] CT
0.851 0.325 0.098 RC
N
f-891180347
f
GR
GS
[1 0 0 1 423.70706 127.17905] CT
0.851 0.325 0.098 RC
N
f-891180347
f
GR
GS
[1 0 0 1 428.09091 134.45195] CT
0.851 0.325 0.098 RC
N
f-891180347
f
GR
GS
[1 0 0 1 432.47476 138.43156] CT
0.851 0.325 0.098 RC
N
f-891180347
f
GR
GS
[1 0 0 1 436.85858 148.01036] CT
0.851 0.325 0.098 RC
N
f-891180347
f
GR
GS
[1 0 0 1 441.24243 151.5997] CT
0.851 0.325 0.098 RC
N
f-891180347
f
GR
GS
[1 0 0 1 445.62625 152.80148] CT
0.851 0.325 0.098 RC
N
f-891180347
f
GR
GS
[1 0 0 1 450.0101 158.56857] CT
0.851 0.325 0.098 RC
N
f-891180347
f
GR
GS
[1 0 0 1 454.39395 164.46194] CT
0.851 0.325 0.098 RC
N
f-891180347
f
GR
GS
[1 0 0 1 458.77777 168.31703] CT
0.851 0.325 0.098 RC
N
f-891180347
f
GR
GS
[1 0 0 1 463.16162 181.81827] CT
0.851 0.325 0.098 RC
N
f-891180347
f
GR
GS
[1 0 0 1 467.54544 186.58635] CT
0.851 0.325 0.098 RC
N
f-891180347
f
GR
GS
[1 0 0 1 471.92929 195.5928] CT
0.851 0.325 0.098 RC
N
f-891180347
f
GR
GS
[1 0 0 1 476.31314 200.9146] CT
0.851 0.325 0.098 RC
N
f-891180347
f
GR
GS
[1 0 0 1 480.69696 209.09842] CT
0.851 0.325 0.098 RC
N
f-891180347
f
GR
GS
[1 0 0 1 485.08081 214.33916] CT
0.851 0.325 0.098 RC
N
f-891180347
f
GR
GS
[1 0 0 1 489.46463 218.19948] CT
0.851 0.325 0.098 RC
N
f-891180347
f
GR
GS
[1 0 0 1 493.84848 220.46518] CT
0.851 0.325 0.098 RC
N
f-891180347
f
GR
GS
[1 0 0 1 498.23233 232.01228] CT
0.851 0.325 0.098 RC
N
f-891180347
f
GR
GS
[1 0 0 1 502.61615 239.94055] CT
0.851 0.325 0.098 RC
N
f-891180347
f
GR
GS
[1 0 0 1 507 250.35359] CT
0.851 0.325 0.098 RC
N
f-891180347
f
GR
GS
1 GC
N
499 66 M
499 39.5 L
417.5 39.5 L
417.5 66 L
cp
f
GR
GS
[1 0 0 1 454.5 47] CT
/Helvetica 9 F
GS
[1 0 0 1 0 0] CT
0 3.5 moveto 
1 -1 scale
(Real) t 
GR
GR
GS
0 0.447 0.741 RC
1 LJ
1.5 LW
N
421.5 47 M
451.5 47 L
S
GR
GS
[1 0 0 1 454.5 58.5] CT
/Helvetica 9 F
GS
[1 0 0 1 0 0] CT
0 3.5 moveto 
1 -1 scale
(Estimated) t 
GR
GR
GS
0.851 0.325 0.098 RC
1 LJ
N
421.5 58.5 M
451.5 58.5 L
S
GR
GS
[1 0 0 1 436.5 58.5] CT
0.851 0.325 0.098 RC
N
f-891180347
f
GR
GS
0.149 GC
10.0 ML
0.5 LW
N
417.5 66 M
417.5 39.5 L
499 39.5 L
499 66 L
cp
S
GR
%%Trailer
%%Pages: 1
%%EOF
