%!PS-Adobe-3.0 EPSF-3.0
%%Creator: (MATLAB, The Mathworks, Inc. Version 23.2.0.2409890 \(R2023b\) Update 3. Operating System: Mac OS X)
%%Title: /Users/jakub/Projects/modeling-and-identification/report-02/images/lab6/0.1.eps
%%CreationDate: 2023-11-30T18:39:09
%%Pages: (atend)
%%BoundingBox:     0     0   560   420
%%LanguageLevel: 3
%%EndComments
%%BeginProlog
%%BeginResource: procset (Apache XML Graphics Std ProcSet) 1.2 0
%%Version: 1.2 0
%%Copyright: (Copyright 2001-2003,2010 The Apache Software Foundation. License terms: http://www.apache.org/licenses/LICENSE-2.0)
/bd{bind def}bind def
/ld{load def}bd
/GR/grestore ld
/GS/gsave ld
/RM/rmoveto ld
/C/curveto ld
/t/show ld
/L/lineto ld
/ML/setmiterlimit ld
/CT/concat ld
/f/fill ld
/N/newpath ld
/S/stroke ld
/CC/setcmykcolor ld
/A/ashow ld
/cp/closepath ld
/RC/setrgbcolor ld
/LJ/setlinejoin ld
/GC/setgray ld
/LW/setlinewidth ld
/M/moveto ld
/re {4 2 roll M
1 index 0 rlineto
0 exch rlineto
neg 0 rlineto
cp } bd
/_ctm matrix def
/_tm matrix def
/BT { _ctm currentmatrix pop matrix _tm copy pop 0 0 moveto } bd
/ET { _ctm setmatrix } bd
/iTm { _ctm setmatrix _tm concat } bd
/Tm { _tm astore pop iTm 0 0 moveto } bd
/ux 0.0 def
/uy 0.0 def
/F {
  /Tp exch def
  /Tf exch def
  Tf findfont Tp scalefont setfont
  /cf Tf def  /cs Tp def
} bd
/ULS {currentpoint /uy exch def /ux exch def} bd
/ULE {
  /Tcx currentpoint pop def
  gsave
  newpath
  cf findfont cs scalefont dup
  /FontMatrix get 0 get /Ts exch def /FontInfo get dup
  /UnderlinePosition get Ts mul /To exch def
  /UnderlineThickness get Ts mul /Tt exch def
  ux uy To add moveto  Tcx uy To add lineto
  Tt setlinewidth stroke
  grestore
} bd
/OLE {
  /Tcx currentpoint pop def
  gsave
  newpath
  cf findfont cs scalefont dup
  /FontMatrix get 0 get /Ts exch def /FontInfo get dup
  /UnderlinePosition get Ts mul /To exch def
  /UnderlineThickness get Ts mul /Tt exch def
  ux uy To add cs add moveto Tcx uy To add cs add lineto
  Tt setlinewidth stroke
  grestore
} bd
/SOE {
  /Tcx currentpoint pop def
  gsave
  newpath
  cf findfont cs scalefont dup
  /FontMatrix get 0 get /Ts exch def /FontInfo get dup
  /UnderlinePosition get Ts mul /To exch def
  /UnderlineThickness get Ts mul /Tt exch def
  ux uy To add cs 10 mul 26 idiv add moveto Tcx uy To add cs 10 mul 26 idiv add lineto
  Tt setlinewidth stroke
  grestore
} bd
/QT {
/Y22 exch store
/X22 exch store
/Y21 exch store
/X21 exch store
currentpoint
/Y21 load 2 mul add 3 div exch
/X21 load 2 mul add 3 div exch
/X21 load 2 mul /X22 load add 3 div
/Y21 load 2 mul /Y22 load add 3 div
/X22 load /Y22 load curveto
} bd
/SSPD {
dup length /d exch dict def
{
/v exch def
/k exch def
currentpagedevice k known {
/cpdv currentpagedevice k get def
v cpdv ne {
/upd false def
/nullv v type /nulltype eq def
/nullcpdv cpdv type /nulltype eq def
nullv nullcpdv or
{
/upd true def
} {
/sametype v type cpdv type eq def
sametype {
v type /arraytype eq {
/vlen v length def
/cpdvlen cpdv length def
vlen cpdvlen eq {
0 1 vlen 1 sub {
/i exch def
/obj v i get def
/cpdobj cpdv i get def
obj cpdobj ne {
/upd true def
exit
} if
} for
} {
/upd true def
} ifelse
} {
v type /dicttype eq {
v {
/dv exch def
/dk exch def
/cpddv cpdv dk get def
dv cpddv ne {
/upd true def
exit
} if
} forall
} {
/upd true def
} ifelse
} ifelse
} if
} ifelse
upd true eq {
d k v put
} if
} if
} if
} forall
d length 0 gt {
d setpagedevice
} if
} bd
/RE { % /NewFontName [NewEncodingArray] /FontName RE -
  findfont dup length dict begin
  {
    1 index /FID ne
    {def} {pop pop} ifelse
  } forall
  /Encoding exch def
  /FontName 1 index def
  currentdict definefont pop
  end
} bind def
%%EndResource
%%BeginResource: procset (Apache XML Graphics EPS ProcSet) 1.0 0
%%Version: 1.0 0
%%Copyright: (Copyright 2002-2003 The Apache Software Foundation. License terms: http://www.apache.org/licenses/LICENSE-2.0)
/BeginEPSF { %def
/b4_Inc_state save def         % Save state for cleanup
/dict_count countdictstack def % Count objects on dict stack
/op_count count 1 sub def      % Count objects on operand stack
userdict begin                 % Push userdict on dict stack
/showpage { } def              % Redefine showpage, { } = null proc
0 setgray 0 setlinecap         % Prepare graphics state
1 setlinewidth 0 setlinejoin
10 setmiterlimit [ ] 0 setdash newpath
/languagelevel where           % If level not equal to 1 then
{pop languagelevel             % set strokeadjust and
1 ne                           % overprint to their defaults.
{false setstrokeadjust false setoverprint
} if
} if
} bd
/EndEPSF { %def
count op_count sub {pop} repeat            % Clean up stacks
countdictstack dict_count sub {end} repeat
b4_Inc_state restore
} bd
%%EndResource
%FOPBeginFontDict
%%IncludeResource: font Courier-Oblique
%%IncludeResource: font Courier-BoldOblique
%%IncludeResource: font Courier-Bold
%%IncludeResource: font ZapfDingbats
%%IncludeResource: font Symbol
%%IncludeResource: font Helvetica
%%IncludeResource: font Helvetica-Oblique
%%IncludeResource: font Helvetica-Bold
%%IncludeResource: font Helvetica-BoldOblique
%%IncludeResource: font Times-Roman
%%IncludeResource: font Times-Italic
%%IncludeResource: font Times-Bold
%%IncludeResource: font Times-BoldItalic
%%IncludeResource: font Courier
%FOPEndFontDict
%%BeginResource: encoding WinAnsiEncoding
/WinAnsiEncoding [
/.notdef /.notdef /.notdef /.notdef /.notdef
/.notdef /.notdef /.notdef /.notdef /.notdef
/.notdef /.notdef /.notdef /.notdef /.notdef
/.notdef /.notdef /.notdef /.notdef /.notdef
/.notdef /.notdef /.notdef /.notdef /.notdef
/.notdef /.notdef /.notdef /.notdef /.notdef
/.notdef /.notdef /space /exclam /quotedbl
/numbersign /dollar /percent /ampersand /quotesingle
/parenleft /parenright /asterisk /plus /comma
/hyphen /period /slash /zero /one
/two /three /four /five /six
/seven /eight /nine /colon /semicolon
/less /equal /greater /question /at
/A /B /C /D /E
/F /G /H /I /J
/K /L /M /N /O
/P /Q /R /S /T
/U /V /W /X /Y
/Z /bracketleft /backslash /bracketright /asciicircum
/underscore /quoteleft /a /b /c
/d /e /f /g /h
/i /j /k /l /m
/n /o /p /q /r
/s /t /u /v /w
/x /y /z /braceleft /bar
/braceright /asciitilde /bullet /Euro /bullet
/quotesinglbase /florin /quotedblbase /ellipsis /dagger
/daggerdbl /circumflex /perthousand /Scaron /guilsinglleft
/OE /bullet /Zcaron /bullet /bullet
/quoteleft /quoteright /quotedblleft /quotedblright /bullet
/endash /emdash /asciitilde /trademark /scaron
/guilsinglright /oe /bullet /zcaron /Ydieresis
/space /exclamdown /cent /sterling /currency
/yen /brokenbar /section /dieresis /copyright
/ordfeminine /guillemotleft /logicalnot /sfthyphen /registered
/macron /degree /plusminus /twosuperior /threesuperior
/acute /mu /paragraph /middot /cedilla
/onesuperior /ordmasculine /guillemotright /onequarter /onehalf
/threequarters /questiondown /Agrave /Aacute /Acircumflex
/Atilde /Adieresis /Aring /AE /Ccedilla
/Egrave /Eacute /Ecircumflex /Edieresis /Igrave
/Iacute /Icircumflex /Idieresis /Eth /Ntilde
/Ograve /Oacute /Ocircumflex /Otilde /Odieresis
/multiply /Oslash /Ugrave /Uacute /Ucircumflex
/Udieresis /Yacute /Thorn /germandbls /agrave
/aacute /acircumflex /atilde /adieresis /aring
/ae /ccedilla /egrave /eacute /ecircumflex
/edieresis /igrave /iacute /icircumflex /idieresis
/eth /ntilde /ograve /oacute /ocircumflex
/otilde /odieresis /divide /oslash /ugrave
/uacute /ucircumflex /udieresis /yacute /thorn
/ydieresis
] def
%%EndResource
%FOPBeginFontReencode
/Courier-Oblique findfont
dup length dict begin
  {1 index /FID ne {def} {pop pop} ifelse} forall
  /Encoding WinAnsiEncoding def
  currentdict
end
/Courier-Oblique exch definefont pop
/Courier-BoldOblique findfont
dup length dict begin
  {1 index /FID ne {def} {pop pop} ifelse} forall
  /Encoding WinAnsiEncoding def
  currentdict
end
/Courier-BoldOblique exch definefont pop
/Courier-Bold findfont
dup length dict begin
  {1 index /FID ne {def} {pop pop} ifelse} forall
  /Encoding WinAnsiEncoding def
  currentdict
end
/Courier-Bold exch definefont pop
/Helvetica findfont
dup length dict begin
  {1 index /FID ne {def} {pop pop} ifelse} forall
  /Encoding WinAnsiEncoding def
  currentdict
end
/Helvetica exch definefont pop
/Helvetica-Oblique findfont
dup length dict begin
  {1 index /FID ne {def} {pop pop} ifelse} forall
  /Encoding WinAnsiEncoding def
  currentdict
end
/Helvetica-Oblique exch definefont pop
/Helvetica-Bold findfont
dup length dict begin
  {1 index /FID ne {def} {pop pop} ifelse} forall
  /Encoding WinAnsiEncoding def
  currentdict
end
/Helvetica-Bold exch definefont pop
/Helvetica-BoldOblique findfont
dup length dict begin
  {1 index /FID ne {def} {pop pop} ifelse} forall
  /Encoding WinAnsiEncoding def
  currentdict
end
/Helvetica-BoldOblique exch definefont pop
/Times-Roman findfont
dup length dict begin
  {1 index /FID ne {def} {pop pop} ifelse} forall
  /Encoding WinAnsiEncoding def
  currentdict
end
/Times-Roman exch definefont pop
/Times-Italic findfont
dup length dict begin
  {1 index /FID ne {def} {pop pop} ifelse} forall
  /Encoding WinAnsiEncoding def
  currentdict
end
/Times-Italic exch definefont pop
/Times-Bold findfont
dup length dict begin
  {1 index /FID ne {def} {pop pop} ifelse} forall
  /Encoding WinAnsiEncoding def
  currentdict
end
/Times-Bold exch definefont pop
/Times-BoldItalic findfont
dup length dict begin
  {1 index /FID ne {def} {pop pop} ifelse} forall
  /Encoding WinAnsiEncoding def
  currentdict
end
/Times-BoldItalic exch definefont pop
/Courier findfont
dup length dict begin
  {1 index /FID ne {def} {pop pop} ifelse} forall
  /Encoding WinAnsiEncoding def
  currentdict
end
/Courier exch definefont pop
%FOPEndFontReencode
%%EndProlog
%%Page: 1 1
%%PageBoundingBox: 0 0 560 420
%%BeginPageSetup
[1 0 0 -1 0 420] CT
%%EndPageSetup
GS
1 GC
N
0 0 560 420 re
f
GR
GS
1 GC
N
0 0 560 420 re
f
GR
GS
1 GC
N
73 374 M
507 374 L
507 31.5 L
73 31.5 L
cp
f
GR
GS
0.775 GC
[1 3] 0 setdash
2 LJ
0.5 LW
N
83.85 374 M
83.85 31.5 L
S
GR
GS
0.775 GC
[1 3] 0 setdash
2 LJ
0.5 LW
N
94.7 374 M
94.7 31.5 L
S
GR
GS
0.775 GC
[1 3] 0 setdash
2 LJ
0.5 LW
N
105.55 374 M
105.55 31.5 L
S
GR
GS
0.775 GC
[1 3] 0 setdash
2 LJ
0.5 LW
N
127.25 374 M
127.25 31.5 L
S
GR
GS
0.775 GC
[1 3] 0 setdash
2 LJ
0.5 LW
N
138.1 374 M
138.1 31.5 L
S
GR
GS
0.775 GC
[1 3] 0 setdash
2 LJ
0.5 LW
N
148.95 374 M
148.95 31.5 L
S
GR
GS
0.775 GC
[1 3] 0 setdash
2 LJ
0.5 LW
N
170.65 374 M
170.65 31.5 L
S
GR
GS
0.775 GC
[1 3] 0 setdash
2 LJ
0.5 LW
N
181.5 374 M
181.5 31.5 L
S
GR
GS
0.775 GC
[1 3] 0 setdash
2 LJ
0.5 LW
N
192.35 374 M
192.35 31.5 L
S
GR
GS
0.775 GC
[1 3] 0 setdash
2 LJ
0.5 LW
N
214.05 374 M
214.05 31.5 L
S
GR
GS
0.775 GC
[1 3] 0 setdash
2 LJ
0.5 LW
N
224.9 374 M
224.9 31.5 L
S
GR
GS
0.775 GC
[1 3] 0 setdash
2 LJ
0.5 LW
N
235.75 374 M
235.75 31.5 L
S
GR
GS
0.775 GC
[1 3] 0 setdash
2 LJ
0.5 LW
N
257.45 374 M
257.45 31.5 L
S
GR
GS
0.775 GC
[1 3] 0 setdash
2 LJ
0.5 LW
N
268.3 374 M
268.3 31.5 L
S
GR
GS
0.775 GC
[1 3] 0 setdash
2 LJ
0.5 LW
N
279.15 374 M
279.15 31.5 L
S
GR
GS
0.775 GC
[1 3] 0 setdash
2 LJ
0.5 LW
N
300.85 374 M
300.85 31.5 L
S
GR
GS
0.775 GC
[1 3] 0 setdash
2 LJ
0.5 LW
N
311.7 374 M
311.7 31.5 L
S
GR
GS
0.775 GC
[1 3] 0 setdash
2 LJ
0.5 LW
N
322.55 374 M
322.55 31.5 L
S
GR
GS
0.775 GC
[1 3] 0 setdash
2 LJ
0.5 LW
N
344.25 374 M
344.25 31.5 L
S
GR
GS
0.775 GC
[1 3] 0 setdash
2 LJ
0.5 LW
N
355.1 374 M
355.1 31.5 L
S
GR
GS
0.775 GC
[1 3] 0 setdash
2 LJ
0.5 LW
N
365.95 374 M
365.95 31.5 L
S
GR
GS
0.775 GC
[1 3] 0 setdash
2 LJ
0.5 LW
N
387.65 374 M
387.65 31.5 L
S
GR
GS
0.775 GC
[1 3] 0 setdash
2 LJ
0.5 LW
N
398.5 374 M
398.5 31.5 L
S
GR
GS
0.775 GC
[1 3] 0 setdash
2 LJ
0.5 LW
N
409.35 374 M
409.35 31.5 L
S
GR
GS
0.775 GC
[1 3] 0 setdash
2 LJ
0.5 LW
N
431.05 374 M
431.05 31.5 L
S
GR
GS
0.775 GC
[1 3] 0 setdash
2 LJ
0.5 LW
N
441.9 374 M
441.9 31.5 L
S
GR
GS
0.775 GC
[1 3] 0 setdash
2 LJ
0.5 LW
N
452.75 374 M
452.75 31.5 L
S
GR
GS
0.775 GC
[1 3] 0 setdash
2 LJ
0.5 LW
N
474.45 374 M
474.45 31.5 L
S
GR
GS
0.775 GC
[1 3] 0 setdash
2 LJ
0.5 LW
N
485.3 374 M
485.3 31.5 L
S
GR
GS
0.775 GC
[1 3] 0 setdash
2 LJ
0.5 LW
N
496.15 374 M
496.15 31.5 L
S
GR
GS
0.873 GC
1 LJ
0.5 LW
N
73 374 M
73 31.5 L
S
GR
GS
0.873 GC
1 LJ
0.5 LW
N
116.4 374 M
116.4 31.5 L
S
GR
GS
0.873 GC
1 LJ
0.5 LW
N
159.8 374 M
159.8 31.5 L
S
GR
GS
0.873 GC
1 LJ
0.5 LW
N
203.2 374 M
203.2 31.5 L
S
GR
GS
0.873 GC
1 LJ
0.5 LW
N
246.6 374 M
246.6 31.5 L
S
GR
GS
0.873 GC
1 LJ
0.5 LW
N
290 374 M
290 31.5 L
S
GR
GS
0.873 GC
1 LJ
0.5 LW
N
333.4 374 M
333.4 31.5 L
S
GR
GS
0.873 GC
1 LJ
0.5 LW
N
376.8 374 M
376.8 31.5 L
S
GR
GS
0.873 GC
1 LJ
0.5 LW
N
420.2 374 M
420.2 31.5 L
S
GR
GS
0.873 GC
1 LJ
0.5 LW
N
463.6 374 M
463.6 31.5 L
S
GR
GS
0.873 GC
1 LJ
0.5 LW
N
507 374 M
507 31.5 L
S
GR
GS
0.775 GC
[1 3] 0 setdash
2 LJ
0.5 LW
N
507 364.486 M
73 364.486 L
S
GR
GS
0.775 GC
[1 3] 0 setdash
2 LJ
0.5 LW
N
507 354.972 M
73 354.972 L
S
GR
GS
0.775 GC
[1 3] 0 setdash
2 LJ
0.5 LW
N
507 345.458 M
73 345.458 L
S
GR
GS
0.775 GC
[1 3] 0 setdash
2 LJ
0.5 LW
N
507 326.431 M
73 326.431 L
S
GR
GS
0.775 GC
[1 3] 0 setdash
2 LJ
0.5 LW
N
507 316.917 M
73 316.917 L
S
GR
GS
0.775 GC
[1 3] 0 setdash
2 LJ
0.5 LW
N
507 307.403 M
73 307.403 L
S
GR
GS
0.775 GC
[1 3] 0 setdash
2 LJ
0.5 LW
N
507 288.375 M
73 288.375 L
S
GR
GS
0.775 GC
[1 3] 0 setdash
2 LJ
0.5 LW
N
507 278.861 M
73 278.861 L
S
GR
GS
0.775 GC
[1 3] 0 setdash
2 LJ
0.5 LW
N
507 269.347 M
73 269.347 L
S
GR
GS
0.775 GC
[1 3] 0 setdash
2 LJ
0.5 LW
N
507 250.319 M
73 250.319 L
S
GR
GS
0.775 GC
[1 3] 0 setdash
2 LJ
0.5 LW
N
507 240.806 M
73 240.806 L
S
GR
GS
0.775 GC
[1 3] 0 setdash
2 LJ
0.5 LW
N
507 231.292 M
73 231.292 L
S
GR
GS
0.775 GC
[1 3] 0 setdash
2 LJ
0.5 LW
N
507 212.264 M
73 212.264 L
S
GR
GS
0.775 GC
[1 3] 0 setdash
2 LJ
0.5 LW
N
507 202.75 M
73 202.75 L
S
GR
GS
0.775 GC
[1 3] 0 setdash
2 LJ
0.5 LW
N
507 193.236 M
73 193.236 L
S
GR
GS
0.775 GC
[1 3] 0 setdash
2 LJ
0.5 LW
N
507 174.208 M
73 174.208 L
S
GR
GS
0.775 GC
[1 3] 0 setdash
2 LJ
0.5 LW
N
507 164.694 M
73 164.694 L
S
GR
GS
0.775 GC
[1 3] 0 setdash
2 LJ
0.5 LW
N
507 155.181 M
73 155.181 L
S
GR
GS
0.775 GC
[1 3] 0 setdash
2 LJ
0.5 LW
N
507 136.153 M
73 136.153 L
S
GR
GS
0.775 GC
[1 3] 0 setdash
2 LJ
0.5 LW
N
507 126.639 M
73 126.639 L
S
GR
GS
0.775 GC
[1 3] 0 setdash
2 LJ
0.5 LW
N
507 117.125 M
73 117.125 L
S
GR
GS
0.775 GC
[1 3] 0 setdash
2 LJ
0.5 LW
N
507 98.097 M
73 98.097 L
S
GR
GS
0.775 GC
[1 3] 0 setdash
2 LJ
0.5 LW
N
507 88.583 M
73 88.583 L
S
GR
GS
0.775 GC
[1 3] 0 setdash
2 LJ
0.5 LW
N
507 79.069 M
73 79.069 L
S
GR
GS
0.775 GC
[1 3] 0 setdash
2 LJ
0.5 LW
N
507 60.042 M
73 60.042 L
S
GR
GS
0.775 GC
[1 3] 0 setdash
2 LJ
0.5 LW
N
507 50.528 M
73 50.528 L
S
GR
GS
0.775 GC
[1 3] 0 setdash
2 LJ
0.5 LW
N
507 41.014 M
73 41.014 L
S
GR
GS
0.873 GC
1 LJ
0.5 LW
N
507 374 M
73 374 L
S
GR
GS
0.873 GC
1 LJ
0.5 LW
N
507 335.944 M
73 335.944 L
S
GR
GS
0.873 GC
1 LJ
0.5 LW
N
507 297.889 M
73 297.889 L
S
GR
GS
0.873 GC
1 LJ
0.5 LW
N
507 259.833 M
73 259.833 L
S
GR
GS
0.873 GC
1 LJ
0.5 LW
N
507 221.778 M
73 221.778 L
S
GR
GS
0.873 GC
1 LJ
0.5 LW
N
507 183.722 M
73 183.722 L
S
GR
GS
0.873 GC
1 LJ
0.5 LW
N
507 145.667 M
73 145.667 L
S
GR
GS
0.873 GC
1 LJ
0.5 LW
N
507 107.611 M
73 107.611 L
S
GR
GS
0.873 GC
1 LJ
0.5 LW
N
507 69.556 M
73 69.556 L
S
GR
GS
0.873 GC
1 LJ
0.5 LW
N
507 31.5 M
73 31.5 L
S
GR
GS
0.149 GC
2 setlinecap
1 LJ
0.5 LW
N
73 374 M
507 374 L
S
GR
GS
0.149 GC
2 setlinecap
1 LJ
0.5 LW
N
73 374 M
73 369.66 L
S
GR
GS
0.149 GC
2 setlinecap
1 LJ
0.5 LW
N
116.4 374 M
116.4 369.66 L
S
GR
GS
0.149 GC
2 setlinecap
1 LJ
0.5 LW
N
159.8 374 M
159.8 369.66 L
S
GR
GS
0.149 GC
2 setlinecap
1 LJ
0.5 LW
N
203.2 374 M
203.2 369.66 L
S
GR
GS
0.149 GC
2 setlinecap
1 LJ
0.5 LW
N
246.6 374 M
246.6 369.66 L
S
GR
GS
0.149 GC
2 setlinecap
1 LJ
0.5 LW
N
290 374 M
290 369.66 L
S
GR
GS
0.149 GC
2 setlinecap
1 LJ
0.5 LW
N
333.4 374 M
333.4 369.66 L
S
GR
GS
0.149 GC
2 setlinecap
1 LJ
0.5 LW
N
376.8 374 M
376.8 369.66 L
S
GR
GS
0.149 GC
2 setlinecap
1 LJ
0.5 LW
N
420.2 374 M
420.2 369.66 L
S
GR
GS
0.149 GC
2 setlinecap
1 LJ
0.5 LW
N
463.6 374 M
463.6 369.66 L
S
GR
GS
0.149 GC
2 setlinecap
1 LJ
0.5 LW
N
507 374 M
507 369.66 L
S
GR
GS
[1 0 0 1 73 378] CT
0.149 GC
/Helvetica 10 F
GS
[1 0 0 1 0 0] CT
-5 10 moveto 
1 -1 scale
(-1) t 
GR
GR
GS
[1 0 0 1 116.39999 378] CT
0.149 GC
/Helvetica 10 F
GS
[1 0 0 1 0 0] CT
-9 10 moveto 
1 -1 scale
(-0.8) t 
GR
GR
GS
[1 0 0 1 159.79999 378] CT
0.149 GC
/Helvetica 10 F
GS
[1 0 0 1 0 0] CT
-9 10 moveto 
1 -1 scale
(-0.6) t 
GR
GR
GS
[1 0 0 1 203.2 378] CT
0.149 GC
/Helvetica 10 F
GS
[1 0 0 1 0 0] CT
-9 10 moveto 
1 -1 scale
(-0.4) t 
GR
GR
GS
[1 0 0 1 246.60001 378] CT
0.149 GC
/Helvetica 10 F
GS
[1 0 0 1 0 0] CT
-9 10 moveto 
1 -1 scale
(-0.2) t 
GR
GR
GS
[1 0 0 1 290 378] CT
0.149 GC
/Helvetica 10 F
GS
[1 0 0 1 0 0] CT
-3 10 moveto 
1 -1 scale
(0) t 
GR
GR
GS
[1 0 0 1 333.39999 378] CT
0.149 GC
/Helvetica 10 F
GS
[1 0 0 1 0 0] CT
-7 10 moveto 
1 -1 scale
(0.2) t 
GR
GR
GS
[1 0 0 1 376.79999 378] CT
0.149 GC
/Helvetica 10 F
GS
[1 0 0 1 0 0] CT
-7 10 moveto 
1 -1 scale
(0.4) t 
GR
GR
GS
[1 0 0 1 420.20001 378] CT
0.149 GC
/Helvetica 10 F
GS
[1 0 0 1 0 0] CT
-7 10 moveto 
1 -1 scale
(0.6) t 
GR
GR
GS
[1 0 0 1 463.60001 378] CT
0.149 GC
/Helvetica 10 F
GS
[1 0 0 1 0 0] CT
-7 10 moveto 
1 -1 scale
(0.8) t 
GR
GR
GS
[1 0 0 1 507 378] CT
0.149 GC
/Helvetica 10 F
GS
[1 0 0 1 0 0] CT
-3 10 moveto 
1 -1 scale
(1) t 
GR
GR
GS
0.149 GC
2 setlinecap
1 LJ
0.5 LW
N
73 374 M
73 31.5 L
S
GR
GS
0.149 GC
2 setlinecap
1 LJ
0.5 LW
N
73 374 M
77.34 374 L
S
GR
GS
0.149 GC
2 setlinecap
1 LJ
0.5 LW
N
73 335.944 M
77.34 335.944 L
S
GR
GS
0.149 GC
2 setlinecap
1 LJ
0.5 LW
N
73 297.889 M
77.34 297.889 L
S
GR
GS
0.149 GC
2 setlinecap
1 LJ
0.5 LW
N
73 259.833 M
77.34 259.833 L
S
GR
GS
0.149 GC
2 setlinecap
1 LJ
0.5 LW
N
73 221.778 M
77.34 221.778 L
S
GR
GS
0.149 GC
2 setlinecap
1 LJ
0.5 LW
N
73 183.722 M
77.34 183.722 L
S
GR
GS
0.149 GC
2 setlinecap
1 LJ
0.5 LW
N
73 145.667 M
77.34 145.667 L
S
GR
GS
0.149 GC
2 setlinecap
1 LJ
0.5 LW
N
73 107.611 M
77.34 107.611 L
S
GR
GS
0.149 GC
2 setlinecap
1 LJ
0.5 LW
N
73 69.556 M
77.34 69.556 L
S
GR
GS
0.149 GC
2 setlinecap
1 LJ
0.5 LW
N
73 31.5 M
77.34 31.5 L
S
GR
GS
[1 0 0 1 68.99999 374] CT
0.149 GC
/Helvetica 10 F
GS
[1 0 0 1 0 0] CT
-6 3.5 moveto 
1 -1 scale
(0) t 
GR
GR
GS
[1 0 0 1 68.99999 335.94446] CT
0.149 GC
/Helvetica 10 F
GS
[1 0 0 1 0 0] CT
-14 3.5 moveto 
1 -1 scale
(0.2) t 
GR
GR
GS
[1 0 0 1 68.99999 297.88889] CT
0.149 GC
/Helvetica 10 F
GS
[1 0 0 1 0 0] CT
-14 3.5 moveto 
1 -1 scale
(0.4) t 
GR
GR
GS
[1 0 0 1 68.99999 259.83334] CT
0.149 GC
/Helvetica 10 F
GS
[1 0 0 1 0 0] CT
-14 3.5 moveto 
1 -1 scale
(0.6) t 
GR
GR
GS
[1 0 0 1 68.99999 221.77777] CT
0.149 GC
/Helvetica 10 F
GS
[1 0 0 1 0 0] CT
-14 3.5 moveto 
1 -1 scale
(0.8) t 
GR
GR
GS
[1 0 0 1 68.99999 183.72223] CT
0.149 GC
/Helvetica 10 F
GS
[1 0 0 1 0 0] CT
-6 3.5 moveto 
1 -1 scale
(1) t 
GR
GR
GS
[1 0 0 1 68.99999 145.66666] CT
0.149 GC
/Helvetica 10 F
GS
[1 0 0 1 0 0] CT
-14 3.5 moveto 
1 -1 scale
(1.2) t 
GR
GR
GS
[1 0 0 1 68.99999 107.61111] CT
0.149 GC
/Helvetica 10 F
GS
[1 0 0 1 0 0] CT
-14 3.5 moveto 
1 -1 scale
(1.4) t 
GR
GR
GS
[1 0 0 1 68.99999 69.55555] CT
0.149 GC
/Helvetica 10 F
GS
[1 0 0 1 0 0] CT
-14 3.5 moveto 
1 -1 scale
(1.6) t 
GR
GR
GS
[1 0 0 1 68.99999 31.50001] CT
0.149 GC
/Helvetica 10 F
GS
[1 0 0 1 0 0] CT
-14 3.5 moveto 
1 -1 scale
(1.8) t 
GR
GR
GS
0 0.447 0.741 RC
1 LJ
1.5 LW
N
73 374 M
77.384 366.39 L
81.768 358.935 L
86.152 351.635 L
90.535 344.491 L
94.919 337.501 L
99.303 330.668 L
103.687 323.989 L
108.071 317.466 L
112.455 311.098 L
116.838 304.886 L
121.222 298.829 L
125.606 292.927 L
129.99 287.18 L
134.374 281.589 L
138.758 276.153 L
143.141 270.872 L
147.525 265.747 L
151.909 260.777 L
156.293 255.962 L
160.677 251.303 L
165.061 246.799 L
169.444 242.45 L
173.828 238.256 L
178.212 234.218 L
182.596 230.336 L
186.98 226.608 L
191.364 223.036 L
195.747 219.619 L
200.131 216.357 L
204.515 213.251 L
208.899 210.3 L
213.283 207.505 L
217.667 204.864 L
222.051 202.379 L
226.434 200.049 L
230.818 197.875 L
235.202 195.856 L
239.586 193.992 L
243.97 192.284 L
248.354 190.731 L
252.737 189.333 L
257.121 188.09 L
261.505 187.003 L
265.889 186.071 L
270.273 185.295 L
274.657 184.674 L
279.04 184.208 L
283.424 183.897 L
287.808 183.742 L
292.192 183.742 L
296.576 183.897 L
300.96 184.208 L
305.343 184.674 L
309.727 185.295 L
314.111 186.071 L
318.495 187.003 L
322.879 188.09 L
327.263 189.333 L
331.646 190.731 L
336.03 192.284 L
340.414 193.992 L
344.798 195.856 L
349.182 197.875 L
353.566 200.049 L
357.949 202.379 L
362.333 204.864 L
366.717 207.505 L
371.101 210.3 L
375.485 213.251 L
379.869 216.357 L
384.253 219.619 L
388.636 223.036 L
393.02 226.608 L
397.404 230.336 L
401.788 234.218 L
406.172 238.256 L
410.556 242.45 L
414.939 246.799 L
419.323 251.303 L
423.707 255.962 L
428.091 260.777 L
432.475 265.747 L
436.859 270.872 L
441.242 276.153 L
445.626 281.589 L
450.01 287.18 L
454.394 292.927 L
458.778 298.829 L
463.162 304.886 L
467.545 311.098 L
471.929 317.466 L
476.313 323.989 L
480.697 330.668 L
485.081 337.501 L
489.465 344.491 L
493.848 351.635 L
498.232 358.935 L
502.616 366.39 L
507 374 L
S
GR
GS
0.851 0.325 0.098 RC
1 LJ
N
73 237.9 M
77.384 233.902 L
81.768 230.702 L
86.152 224.953 L
90.535 218.117 L
94.919 211.33 L
99.303 204.816 L
103.687 197.559 L
108.071 191.031 L
112.455 184.275 L
116.838 178.028 L
121.222 171.83 L
125.606 166.475 L
129.99 160.703 L
134.374 155.227 L
138.758 149.761 L
143.141 144.528 L
147.525 139.426 L
151.909 134.406 L
156.293 129.559 L
160.677 124.87 L
165.061 120.213 L
169.444 115.563 L
173.828 111.481 L
178.212 107.783 L
182.596 103.83 L
186.98 99.82 L
191.364 96.266 L
195.747 92.331 L
200.131 89.261 L
204.515 86.619 L
208.899 84.015 L
213.283 81.089 L
217.667 78.758 L
222.051 76.025 L
226.434 73.524 L
230.818 71.34 L
235.202 69.55 L
239.586 67.591 L
243.97 65.965 L
248.354 64.329 L
252.737 62.792 L
257.121 61.864 L
261.505 60.495 L
265.889 59.596 L
270.273 58.775 L
274.657 58.237 L
279.04 57.508 L
283.424 57.458 L
287.808 57.151 L
292.192 57.247 L
296.576 57.245 L
300.96 57.738 L
305.343 58.104 L
309.727 58.831 L
314.111 59.597 L
318.495 60.37 L
322.879 61.43 L
327.263 62.846 L
331.646 63.883 L
336.03 65.525 L
340.414 67.582 L
344.798 69.334 L
349.182 71.132 L
353.566 73.476 L
357.949 75.487 L
362.333 77.804 L
366.717 80.433 L
371.101 83.381 L
375.485 86.212 L
379.869 89.776 L
384.253 93.182 L
388.636 96.939 L
393.02 100.424 L
397.404 104.414 L
401.788 107.994 L
406.172 111.841 L
410.556 115.869 L
414.939 120.119 L
419.323 124.497 L
423.707 129.309 L
428.091 134.266 L
432.475 139.308 L
436.859 144.636 L
441.242 149.723 L
445.626 155.029 L
450.01 160.622 L
454.394 166.236 L
458.778 171.948 L
463.162 178.066 L
467.545 184.182 L
471.929 190.431 L
476.313 197.09 L
480.697 203.779 L
485.081 210.916 L
489.465 218.133 L
493.848 225.4 L
498.232 230.7 L
502.616 234.209 L
507 237.663 L
S
GR
GS
[1 0 0 1 73 237.90015] CT
0.851 0.325 0.098 RC
N
1 0 M
1 0.552 0.552 1 0 1 C
-0.552 1 -1 0.552 -1 0 C
-1 -0.552 -0.552 -1 0 -1 C
0.552 -1 1 -0.552 1 0 C
cp
f
GR
GS
[1 0 0 1 77.38384 233.90152] CT
0.851 0.325 0.098 RC
N
/f-891180347{1 0 M
1 0.552 0.552 1 0 1 C
-0.552 1 -1 0.552 -1 0 C
-1 -0.552 -0.552 -1 0 -1 C
0.552 -1 1 -0.552 1 0 C
cp}def
f-891180347
f
GR
GS
[1 0 0 1 81.76767 230.70244] CT
0.851 0.325 0.098 RC
N
f-891180347
f
GR
GS
[1 0 0 1 86.15151 224.95264] CT
0.851 0.325 0.098 RC
N
f-891180347
f
GR
GS
[1 0 0 1 90.53535 218.11728] CT
0.851 0.325 0.098 RC
N
f-891180347
f
GR
GS
[1 0 0 1 94.91919 211.32983] CT
0.851 0.325 0.098 RC
N
f-891180347
f
GR
GS
[1 0 0 1 99.30303 204.81583] CT
0.851 0.325 0.098 RC
N
f-891180347
f
GR
GS
[1 0 0 1 103.68687 197.55876] CT
0.851 0.325 0.098 RC
N
f-891180347
f
GR
GS
[1 0 0 1 108.0707 191.03149] CT
0.851 0.325 0.098 RC
N
f-891180347
f
GR
GS
[1 0 0 1 112.45454 184.27498] CT
0.851 0.325 0.098 RC
N
f-891180347
f
GR
GS
[1 0 0 1 116.83839 178.02771] CT
0.851 0.325 0.098 RC
N
f-891180347
f
GR
GS
[1 0 0 1 121.22222 171.82983] CT
0.851 0.325 0.098 RC
N
f-891180347
f
GR
GS
[1 0 0 1 125.60606 166.4745] CT
0.851 0.325 0.098 RC
N
f-891180347
f
GR
GS
[1 0 0 1 129.9899 160.703] CT
0.851 0.325 0.098 RC
N
f-891180347
f
GR
GS
[1 0 0 1 134.37373 155.22688] CT
0.851 0.325 0.098 RC
N
f-891180347
f
GR
GS
[1 0 0 1 138.75758 149.76091] CT
0.851 0.325 0.098 RC
N
f-891180347
f
GR
GS
[1 0 0 1 143.14142 144.52762] CT
0.851 0.325 0.098 RC
N
f-891180347
f
GR
GS
[1 0 0 1 147.52525 139.42624] CT
0.851 0.325 0.098 RC
N
f-891180347
f
GR
GS
[1 0 0 1 151.90909 134.40579] CT
0.851 0.325 0.098 RC
N
f-891180347
f
GR
GS
[1 0 0 1 156.29292 129.5587] CT
0.851 0.325 0.098 RC
N
f-891180347
f
GR
GS
[1 0 0 1 160.67677 124.87013] CT
0.851 0.325 0.098 RC
N
f-891180347
f
GR
GS
[1 0 0 1 165.06061 120.21342] CT
0.851 0.325 0.098 RC
N
f-891180347
f
GR
GS
[1 0 0 1 169.44444 115.56298] CT
0.851 0.325 0.098 RC
N
f-891180347
f
GR
GS
[1 0 0 1 173.82828 111.48083] CT
0.851 0.325 0.098 RC
N
f-891180347
f
GR
GS
[1 0 0 1 178.21213 107.7833] CT
0.851 0.325 0.098 RC
N
f-891180347
f
GR
GS
[1 0 0 1 182.59596 103.83049] CT
0.851 0.325 0.098 RC
N
f-891180347
f
GR
GS
[1 0 0 1 186.9798 99.82034] CT
0.851 0.325 0.098 RC
N
f-891180347
f
GR
GS
[1 0 0 1 191.36363 96.26589] CT
0.851 0.325 0.098 RC
N
f-891180347
f
GR
GS
[1 0 0 1 195.74748 92.33057] CT
0.851 0.325 0.098 RC
N
f-891180347
f
GR
GS
[1 0 0 1 200.13132 89.26118] CT
0.851 0.325 0.098 RC
N
f-891180347
f
GR
GS
[1 0 0 1 204.51515 86.61859] CT
0.851 0.325 0.098 RC
N
f-891180347
f
GR
GS
[1 0 0 1 208.89899 84.01482] CT
0.851 0.325 0.098 RC
N
f-891180347
f
GR
GS
[1 0 0 1 213.28282 81.08862] CT
0.851 0.325 0.098 RC
N
f-891180347
f
GR
GS
[1 0 0 1 217.66667 78.75804] CT
0.851 0.325 0.098 RC
N
f-891180347
f
GR
GS
[1 0 0 1 222.05051 76.02544] CT
0.851 0.325 0.098 RC
N
f-891180347
f
GR
GS
[1 0 0 1 226.43434 73.52396] CT
0.851 0.325 0.098 RC
N
f-891180347
f
GR
GS
[1 0 0 1 230.81818 71.33958] CT
0.851 0.325 0.098 RC
N
f-891180347
f
GR
GS
[1 0 0 1 235.20203 69.55002] CT
0.851 0.325 0.098 RC
N
f-891180347
f
GR
GS
[1 0 0 1 239.58586 67.59078] CT
0.851 0.325 0.098 RC
N
f-891180347
f
GR
GS
[1 0 0 1 243.9697 65.96494] CT
0.851 0.325 0.098 RC
N
f-891180347
f
GR
GS
[1 0 0 1 248.35353 64.32887] CT
0.851 0.325 0.098 RC
N
f-891180347
f
GR
GS
[1 0 0 1 252.73738 62.79188] CT
0.851 0.325 0.098 RC
N
f-891180347
f
GR
GS
[1 0 0 1 257.12122 61.86424] CT
0.851 0.325 0.098 RC
N
f-891180347
f
GR
GS
[1 0 0 1 261.50507 60.49544] CT
0.851 0.325 0.098 RC
N
f-891180347
f
GR
GS
[1 0 0 1 265.88889 59.59593] CT
0.851 0.325 0.098 RC
N
f-891180347
f
GR
GS
[1 0 0 1 270.27274 58.77458] CT
0.851 0.325 0.098 RC
N
f-891180347
f
GR
GS
[1 0 0 1 274.65656 58.23711] CT
0.851 0.325 0.098 RC
N
f-891180347
f
GR
GS
[1 0 0 1 279.04041 57.50754] CT
0.851 0.325 0.098 RC
N
f-891180347
f
GR
GS
[1 0 0 1 283.42426 57.45771] CT
0.851 0.325 0.098 RC
N
f-891180347
f
GR
GS
[1 0 0 1 287.80807 57.15071] CT
0.851 0.325 0.098 RC
N
f-891180347
f
GR
GS
[1 0 0 1 292.19193 57.24698] CT
0.851 0.325 0.098 RC
N
f-891180347
f
GR
GS
[1 0 0 1 296.57574 57.24521] CT
0.851 0.325 0.098 RC
N
f-891180347
f
GR
GS
[1 0 0 1 300.95959 57.73834] CT
0.851 0.325 0.098 RC
N
f-891180347
f
GR
GS
[1 0 0 1 305.34344 58.10367] CT
0.851 0.325 0.098 RC
N
f-891180347
f
GR
GS
[1 0 0 1 309.72726 58.83109] CT
0.851 0.325 0.098 RC
N
f-891180347
f
GR
GS
[1 0 0 1 314.11111 59.59663] CT
0.851 0.325 0.098 RC
N
f-891180347
f
GR
GS
[1 0 0 1 318.49493 60.36978] CT
0.851 0.325 0.098 RC
N
f-891180347
f
GR
GS
[1 0 0 1 322.87878 61.43002] CT
0.851 0.325 0.098 RC
N
f-891180347
f
GR
GS
[1 0 0 1 327.26263 62.84625] CT
0.851 0.325 0.098 RC
N
f-891180347
f
GR
GS
[1 0 0 1 331.64645 63.88343] CT
0.851 0.325 0.098 RC
N
f-891180347
f
GR
GS
[1 0 0 1 336.0303 65.52485] CT
0.851 0.325 0.098 RC
N
f-891180347
f
GR
GS
[1 0 0 1 340.41415 67.58246] CT
0.851 0.325 0.098 RC
N
f-891180347
f
GR
GS
[1 0 0 1 344.79797 69.33426] CT
0.851 0.325 0.098 RC
N
f-891180347
f
GR
GS
[1 0 0 1 349.18182 71.13248] CT
0.851 0.325 0.098 RC
N
f-891180347
f
GR
GS
[1 0 0 1 353.56564 73.4759] CT
0.851 0.325 0.098 RC
N
f-891180347
f
GR
GS
[1 0 0 1 357.94949 75.48733] CT
0.851 0.325 0.098 RC
N
f-891180347
f
GR
GS
[1 0 0 1 362.33334 77.80415] CT
0.851 0.325 0.098 RC
N
f-891180347
f
GR
GS
[1 0 0 1 366.71716 80.43285] CT
0.851 0.325 0.098 RC
N
f-891180347
f
GR
GS
[1 0 0 1 371.10101 83.3812] CT
0.851 0.325 0.098 RC
N
f-891180347
f
GR
GS
[1 0 0 1 375.48486 86.21152] CT
0.851 0.325 0.098 RC
N
f-891180347
f
GR
GS
[1 0 0 1 379.86868 89.7765] CT
0.851 0.325 0.098 RC
N
f-891180347
f
GR
GS
[1 0 0 1 384.25253 93.18156] CT
0.851 0.325 0.098 RC
N
f-891180347
f
GR
GS
[1 0 0 1 388.63635 96.93871] CT
0.851 0.325 0.098 RC
N
f-891180347
f
GR
GS
[1 0 0 1 393.0202 100.42368] CT
0.851 0.325 0.098 RC
N
f-891180347
f
GR
GS
[1 0 0 1 397.40405 104.4144] CT
0.851 0.325 0.098 RC
N
f-891180347
f
GR
GS
[1 0 0 1 401.78787 107.99423] CT
0.851 0.325 0.098 RC
N
f-891180347
f
GR
GS
[1 0 0 1 406.17172 111.84074] CT
0.851 0.325 0.098 RC
N
f-891180347
f
GR
GS
[1 0 0 1 410.55557 115.86922] CT
0.851 0.325 0.098 RC
N
f-891180347
f
GR
GS
[1 0 0 1 414.93939 120.1192] CT
0.851 0.325 0.098 RC
N
f-891180347
f
GR
GS
[1 0 0 1 419.32324 124.49657] CT
0.851 0.325 0.098 RC
N
f-891180347
f
GR
GS
[1 0 0 1 423.70706 129.30923] CT
0.851 0.325 0.098 RC
N
f-891180347
f
GR
GS
[1 0 0 1 428.09091 134.26608] CT
0.851 0.325 0.098 RC
N
f-891180347
f
GR
GS
[1 0 0 1 432.47476 139.30779] CT
0.851 0.325 0.098 RC
N
f-891180347
f
GR
GS
[1 0 0 1 436.85858 144.63644] CT
0.851 0.325 0.098 RC
N
f-891180347
f
GR
GS
[1 0 0 1 441.24243 149.7227] CT
0.851 0.325 0.098 RC
N
f-891180347
f
GR
GS
[1 0 0 1 445.62625 155.02937] CT
0.851 0.325 0.098 RC
N
f-891180347
f
GR
GS
[1 0 0 1 450.0101 160.62216] CT
0.851 0.325 0.098 RC
N
f-891180347
f
GR
GS
[1 0 0 1 454.39395 166.2365] CT
0.851 0.325 0.098 RC
N
f-891180347
f
GR
GS
[1 0 0 1 458.77777 171.94806] CT
0.851 0.325 0.098 RC
N
f-891180347
f
GR
GS
[1 0 0 1 463.16162 178.06628] CT
0.851 0.325 0.098 RC
N
f-891180347
f
GR
GS
[1 0 0 1 467.54544 184.18236] CT
0.851 0.325 0.098 RC
N
f-891180347
f
GR
GS
[1 0 0 1 471.92929 190.43095] CT
0.851 0.325 0.098 RC
N
f-891180347
f
GR
GS
[1 0 0 1 476.31314 197.08987] CT
0.851 0.325 0.098 RC
N
f-891180347
f
GR
GS
[1 0 0 1 480.69696 203.77948] CT
0.851 0.325 0.098 RC
N
f-891180347
f
GR
GS
[1 0 0 1 485.08081 210.91563] CT
0.851 0.325 0.098 RC
N
f-891180347
f
GR
GS
[1 0 0 1 489.46463 218.13341] CT
0.851 0.325 0.098 RC
N
f-891180347
f
GR
GS
[1 0 0 1 493.84848 225.39972] CT
0.851 0.325 0.098 RC
N
f-891180347
f
GR
GS
[1 0 0 1 498.23233 230.69995] CT
0.851 0.325 0.098 RC
N
f-891180347
f
GR
GS
[1 0 0 1 502.61615 234.20923] CT
0.851 0.325 0.098 RC
N
f-891180347
f
GR
GS
[1 0 0 1 507 237.66321] CT
0.851 0.325 0.098 RC
N
f-891180347
f
GR
GS
1 GC
N
499 66 M
499 39.5 L
417.5 39.5 L
417.5 66 L
cp
f
GR
GS
[1 0 0 1 454.5 47] CT
/Helvetica 9 F
GS
[1 0 0 1 0 0] CT
0 3.5 moveto 
1 -1 scale
(Real) t 
GR
GR
GS
0 0.447 0.741 RC
1 LJ
1.5 LW
N
421.5 47 M
451.5 47 L
S
GR
GS
[1 0 0 1 454.5 58.5] CT
/Helvetica 9 F
GS
[1 0 0 1 0 0] CT
0 3.5 moveto 
1 -1 scale
(Estimated) t 
GR
GR
GS
0.851 0.325 0.098 RC
1 LJ
N
421.5 58.5 M
451.5 58.5 L
S
GR
GS
[1 0 0 1 436.5 58.5] CT
0.851 0.325 0.098 RC
N
f-891180347
f
GR
GS
0.149 GC
10.0 ML
0.5 LW
N
417.5 66 M
417.5 39.5 L
499 39.5 L
499 66 L
cp
S
GR
%%Trailer
%%Pages: 1
%%EOF
