%!PS-Adobe-3.0 EPSF-3.0
%%Creator: (MATLAB, The Mathworks, Inc. Version 23.2.0.2409890 \(R2023b\) Update 3. Operating System: Mac OS X)
%%Title: /Users/jakub/Projects/modeling-and-identification/report-02/images/lab5/legrende/5.eps
%%CreationDate: 2023-11-30T17:20:57
%%Pages: (atend)
%%BoundingBox:     0     0   560   420
%%LanguageLevel: 3
%%EndComments
%%BeginProlog
%%BeginResource: procset (Apache XML Graphics Std ProcSet) 1.2 0
%%Version: 1.2 0
%%Copyright: (Copyright 2001-2003,2010 The Apache Software Foundation. License terms: http://www.apache.org/licenses/LICENSE-2.0)
/bd{bind def}bind def
/ld{load def}bd
/GR/grestore ld
/GS/gsave ld
/RM/rmoveto ld
/C/curveto ld
/t/show ld
/L/lineto ld
/ML/setmiterlimit ld
/CT/concat ld
/f/fill ld
/N/newpath ld
/S/stroke ld
/CC/setcmykcolor ld
/A/ashow ld
/cp/closepath ld
/RC/setrgbcolor ld
/LJ/setlinejoin ld
/GC/setgray ld
/LW/setlinewidth ld
/M/moveto ld
/re {4 2 roll M
1 index 0 rlineto
0 exch rlineto
neg 0 rlineto
cp } bd
/_ctm matrix def
/_tm matrix def
/BT { _ctm currentmatrix pop matrix _tm copy pop 0 0 moveto } bd
/ET { _ctm setmatrix } bd
/iTm { _ctm setmatrix _tm concat } bd
/Tm { _tm astore pop iTm 0 0 moveto } bd
/ux 0.0 def
/uy 0.0 def
/F {
  /Tp exch def
  /Tf exch def
  Tf findfont Tp scalefont setfont
  /cf Tf def  /cs Tp def
} bd
/ULS {currentpoint /uy exch def /ux exch def} bd
/ULE {
  /Tcx currentpoint pop def
  gsave
  newpath
  cf findfont cs scalefont dup
  /FontMatrix get 0 get /Ts exch def /FontInfo get dup
  /UnderlinePosition get Ts mul /To exch def
  /UnderlineThickness get Ts mul /Tt exch def
  ux uy To add moveto  Tcx uy To add lineto
  Tt setlinewidth stroke
  grestore
} bd
/OLE {
  /Tcx currentpoint pop def
  gsave
  newpath
  cf findfont cs scalefont dup
  /FontMatrix get 0 get /Ts exch def /FontInfo get dup
  /UnderlinePosition get Ts mul /To exch def
  /UnderlineThickness get Ts mul /Tt exch def
  ux uy To add cs add moveto Tcx uy To add cs add lineto
  Tt setlinewidth stroke
  grestore
} bd
/SOE {
  /Tcx currentpoint pop def
  gsave
  newpath
  cf findfont cs scalefont dup
  /FontMatrix get 0 get /Ts exch def /FontInfo get dup
  /UnderlinePosition get Ts mul /To exch def
  /UnderlineThickness get Ts mul /Tt exch def
  ux uy To add cs 10 mul 26 idiv add moveto Tcx uy To add cs 10 mul 26 idiv add lineto
  Tt setlinewidth stroke
  grestore
} bd
/QT {
/Y22 exch store
/X22 exch store
/Y21 exch store
/X21 exch store
currentpoint
/Y21 load 2 mul add 3 div exch
/X21 load 2 mul add 3 div exch
/X21 load 2 mul /X22 load add 3 div
/Y21 load 2 mul /Y22 load add 3 div
/X22 load /Y22 load curveto
} bd
/SSPD {
dup length /d exch dict def
{
/v exch def
/k exch def
currentpagedevice k known {
/cpdv currentpagedevice k get def
v cpdv ne {
/upd false def
/nullv v type /nulltype eq def
/nullcpdv cpdv type /nulltype eq def
nullv nullcpdv or
{
/upd true def
} {
/sametype v type cpdv type eq def
sametype {
v type /arraytype eq {
/vlen v length def
/cpdvlen cpdv length def
vlen cpdvlen eq {
0 1 vlen 1 sub {
/i exch def
/obj v i get def
/cpdobj cpdv i get def
obj cpdobj ne {
/upd true def
exit
} if
} for
} {
/upd true def
} ifelse
} {
v type /dicttype eq {
v {
/dv exch def
/dk exch def
/cpddv cpdv dk get def
dv cpddv ne {
/upd true def
exit
} if
} forall
} {
/upd true def
} ifelse
} ifelse
} if
} ifelse
upd true eq {
d k v put
} if
} if
} if
} forall
d length 0 gt {
d setpagedevice
} if
} bd
/RE { % /NewFontName [NewEncodingArray] /FontName RE -
  findfont dup length dict begin
  {
    1 index /FID ne
    {def} {pop pop} ifelse
  } forall
  /Encoding exch def
  /FontName 1 index def
  currentdict definefont pop
  end
} bind def
%%EndResource
%%BeginResource: procset (Apache XML Graphics EPS ProcSet) 1.0 0
%%Version: 1.0 0
%%Copyright: (Copyright 2002-2003 The Apache Software Foundation. License terms: http://www.apache.org/licenses/LICENSE-2.0)
/BeginEPSF { %def
/b4_Inc_state save def         % Save state for cleanup
/dict_count countdictstack def % Count objects on dict stack
/op_count count 1 sub def      % Count objects on operand stack
userdict begin                 % Push userdict on dict stack
/showpage { } def              % Redefine showpage, { } = null proc
0 setgray 0 setlinecap         % Prepare graphics state
1 setlinewidth 0 setlinejoin
10 setmiterlimit [ ] 0 setdash newpath
/languagelevel where           % If level not equal to 1 then
{pop languagelevel             % set strokeadjust and
1 ne                           % overprint to their defaults.
{false setstrokeadjust false setoverprint
} if
} if
} bd
/EndEPSF { %def
count op_count sub {pop} repeat            % Clean up stacks
countdictstack dict_count sub {end} repeat
b4_Inc_state restore
} bd
%%EndResource
%FOPBeginFontDict
%%IncludeResource: font Courier-Oblique
%%IncludeResource: font Courier-BoldOblique
%%IncludeResource: font Courier-Bold
%%IncludeResource: font ZapfDingbats
%%IncludeResource: font Symbol
%%IncludeResource: font Helvetica
%%IncludeResource: font Helvetica-Oblique
%%IncludeResource: font Helvetica-Bold
%%IncludeResource: font Helvetica-BoldOblique
%%IncludeResource: font Times-Roman
%%IncludeResource: font Times-Italic
%%IncludeResource: font Times-Bold
%%IncludeResource: font Times-BoldItalic
%%IncludeResource: font Courier
%FOPEndFontDict
%%BeginResource: encoding WinAnsiEncoding
/WinAnsiEncoding [
/.notdef /.notdef /.notdef /.notdef /.notdef
/.notdef /.notdef /.notdef /.notdef /.notdef
/.notdef /.notdef /.notdef /.notdef /.notdef
/.notdef /.notdef /.notdef /.notdef /.notdef
/.notdef /.notdef /.notdef /.notdef /.notdef
/.notdef /.notdef /.notdef /.notdef /.notdef
/.notdef /.notdef /space /exclam /quotedbl
/numbersign /dollar /percent /ampersand /quotesingle
/parenleft /parenright /asterisk /plus /comma
/hyphen /period /slash /zero /one
/two /three /four /five /six
/seven /eight /nine /colon /semicolon
/less /equal /greater /question /at
/A /B /C /D /E
/F /G /H /I /J
/K /L /M /N /O
/P /Q /R /S /T
/U /V /W /X /Y
/Z /bracketleft /backslash /bracketright /asciicircum
/underscore /quoteleft /a /b /c
/d /e /f /g /h
/i /j /k /l /m
/n /o /p /q /r
/s /t /u /v /w
/x /y /z /braceleft /bar
/braceright /asciitilde /bullet /Euro /bullet
/quotesinglbase /florin /quotedblbase /ellipsis /dagger
/daggerdbl /circumflex /perthousand /Scaron /guilsinglleft
/OE /bullet /Zcaron /bullet /bullet
/quoteleft /quoteright /quotedblleft /quotedblright /bullet
/endash /emdash /asciitilde /trademark /scaron
/guilsinglright /oe /bullet /zcaron /Ydieresis
/space /exclamdown /cent /sterling /currency
/yen /brokenbar /section /dieresis /copyright
/ordfeminine /guillemotleft /logicalnot /sfthyphen /registered
/macron /degree /plusminus /twosuperior /threesuperior
/acute /mu /paragraph /middot /cedilla
/onesuperior /ordmasculine /guillemotright /onequarter /onehalf
/threequarters /questiondown /Agrave /Aacute /Acircumflex
/Atilde /Adieresis /Aring /AE /Ccedilla
/Egrave /Eacute /Ecircumflex /Edieresis /Igrave
/Iacute /Icircumflex /Idieresis /Eth /Ntilde
/Ograve /Oacute /Ocircumflex /Otilde /Odieresis
/multiply /Oslash /Ugrave /Uacute /Ucircumflex
/Udieresis /Yacute /Thorn /germandbls /agrave
/aacute /acircumflex /atilde /adieresis /aring
/ae /ccedilla /egrave /eacute /ecircumflex
/edieresis /igrave /iacute /icircumflex /idieresis
/eth /ntilde /ograve /oacute /ocircumflex
/otilde /odieresis /divide /oslash /ugrave
/uacute /ucircumflex /udieresis /yacute /thorn
/ydieresis
] def
%%EndResource
%FOPBeginFontReencode
/Courier-Oblique findfont
dup length dict begin
  {1 index /FID ne {def} {pop pop} ifelse} forall
  /Encoding WinAnsiEncoding def
  currentdict
end
/Courier-Oblique exch definefont pop
/Courier-BoldOblique findfont
dup length dict begin
  {1 index /FID ne {def} {pop pop} ifelse} forall
  /Encoding WinAnsiEncoding def
  currentdict
end
/Courier-BoldOblique exch definefont pop
/Courier-Bold findfont
dup length dict begin
  {1 index /FID ne {def} {pop pop} ifelse} forall
  /Encoding WinAnsiEncoding def
  currentdict
end
/Courier-Bold exch definefont pop
/Helvetica findfont
dup length dict begin
  {1 index /FID ne {def} {pop pop} ifelse} forall
  /Encoding WinAnsiEncoding def
  currentdict
end
/Helvetica exch definefont pop
/Helvetica-Oblique findfont
dup length dict begin
  {1 index /FID ne {def} {pop pop} ifelse} forall
  /Encoding WinAnsiEncoding def
  currentdict
end
/Helvetica-Oblique exch definefont pop
/Helvetica-Bold findfont
dup length dict begin
  {1 index /FID ne {def} {pop pop} ifelse} forall
  /Encoding WinAnsiEncoding def
  currentdict
end
/Helvetica-Bold exch definefont pop
/Helvetica-BoldOblique findfont
dup length dict begin
  {1 index /FID ne {def} {pop pop} ifelse} forall
  /Encoding WinAnsiEncoding def
  currentdict
end
/Helvetica-BoldOblique exch definefont pop
/Times-Roman findfont
dup length dict begin
  {1 index /FID ne {def} {pop pop} ifelse} forall
  /Encoding WinAnsiEncoding def
  currentdict
end
/Times-Roman exch definefont pop
/Times-Italic findfont
dup length dict begin
  {1 index /FID ne {def} {pop pop} ifelse} forall
  /Encoding WinAnsiEncoding def
  currentdict
end
/Times-Italic exch definefont pop
/Times-Bold findfont
dup length dict begin
  {1 index /FID ne {def} {pop pop} ifelse} forall
  /Encoding WinAnsiEncoding def
  currentdict
end
/Times-Bold exch definefont pop
/Times-BoldItalic findfont
dup length dict begin
  {1 index /FID ne {def} {pop pop} ifelse} forall
  /Encoding WinAnsiEncoding def
  currentdict
end
/Times-BoldItalic exch definefont pop
/Courier findfont
dup length dict begin
  {1 index /FID ne {def} {pop pop} ifelse} forall
  /Encoding WinAnsiEncoding def
  currentdict
end
/Courier exch definefont pop
%FOPEndFontReencode
%%EndProlog
%%Page: 1 1
%%PageBoundingBox: 0 0 560 420
%%BeginPageSetup
[1 0 0 -1 0 420] CT
%%EndPageSetup
GS
1 GC
N
0 0 560 420 re
f
GR
GS
1 GC
N
0 0 560 420 re
f
GR
GS
1 GC
N
73 374 M
507 374 L
507 31.5 L
73 31.5 L
cp
f
GR
GS
0.775 GC
[1 3] 0 setdash
2 LJ
0.5 LW
N
83.85 374 M
83.85 31.5 L
S
GR
GS
0.775 GC
[1 3] 0 setdash
2 LJ
0.5 LW
N
94.7 374 M
94.7 31.5 L
S
GR
GS
0.775 GC
[1 3] 0 setdash
2 LJ
0.5 LW
N
105.55 374 M
105.55 31.5 L
S
GR
GS
0.775 GC
[1 3] 0 setdash
2 LJ
0.5 LW
N
127.25 374 M
127.25 31.5 L
S
GR
GS
0.775 GC
[1 3] 0 setdash
2 LJ
0.5 LW
N
138.1 374 M
138.1 31.5 L
S
GR
GS
0.775 GC
[1 3] 0 setdash
2 LJ
0.5 LW
N
148.95 374 M
148.95 31.5 L
S
GR
GS
0.775 GC
[1 3] 0 setdash
2 LJ
0.5 LW
N
170.65 374 M
170.65 31.5 L
S
GR
GS
0.775 GC
[1 3] 0 setdash
2 LJ
0.5 LW
N
181.5 374 M
181.5 31.5 L
S
GR
GS
0.775 GC
[1 3] 0 setdash
2 LJ
0.5 LW
N
192.35 374 M
192.35 31.5 L
S
GR
GS
0.775 GC
[1 3] 0 setdash
2 LJ
0.5 LW
N
214.05 374 M
214.05 31.5 L
S
GR
GS
0.775 GC
[1 3] 0 setdash
2 LJ
0.5 LW
N
224.9 374 M
224.9 31.5 L
S
GR
GS
0.775 GC
[1 3] 0 setdash
2 LJ
0.5 LW
N
235.75 374 M
235.75 31.5 L
S
GR
GS
0.775 GC
[1 3] 0 setdash
2 LJ
0.5 LW
N
257.45 374 M
257.45 31.5 L
S
GR
GS
0.775 GC
[1 3] 0 setdash
2 LJ
0.5 LW
N
268.3 374 M
268.3 31.5 L
S
GR
GS
0.775 GC
[1 3] 0 setdash
2 LJ
0.5 LW
N
279.15 374 M
279.15 31.5 L
S
GR
GS
0.775 GC
[1 3] 0 setdash
2 LJ
0.5 LW
N
300.85 374 M
300.85 31.5 L
S
GR
GS
0.775 GC
[1 3] 0 setdash
2 LJ
0.5 LW
N
311.7 374 M
311.7 31.5 L
S
GR
GS
0.775 GC
[1 3] 0 setdash
2 LJ
0.5 LW
N
322.55 374 M
322.55 31.5 L
S
GR
GS
0.775 GC
[1 3] 0 setdash
2 LJ
0.5 LW
N
344.25 374 M
344.25 31.5 L
S
GR
GS
0.775 GC
[1 3] 0 setdash
2 LJ
0.5 LW
N
355.1 374 M
355.1 31.5 L
S
GR
GS
0.775 GC
[1 3] 0 setdash
2 LJ
0.5 LW
N
365.95 374 M
365.95 31.5 L
S
GR
GS
0.775 GC
[1 3] 0 setdash
2 LJ
0.5 LW
N
387.65 374 M
387.65 31.5 L
S
GR
GS
0.775 GC
[1 3] 0 setdash
2 LJ
0.5 LW
N
398.5 374 M
398.5 31.5 L
S
GR
GS
0.775 GC
[1 3] 0 setdash
2 LJ
0.5 LW
N
409.35 374 M
409.35 31.5 L
S
GR
GS
0.775 GC
[1 3] 0 setdash
2 LJ
0.5 LW
N
431.05 374 M
431.05 31.5 L
S
GR
GS
0.775 GC
[1 3] 0 setdash
2 LJ
0.5 LW
N
441.9 374 M
441.9 31.5 L
S
GR
GS
0.775 GC
[1 3] 0 setdash
2 LJ
0.5 LW
N
452.75 374 M
452.75 31.5 L
S
GR
GS
0.775 GC
[1 3] 0 setdash
2 LJ
0.5 LW
N
474.45 374 M
474.45 31.5 L
S
GR
GS
0.775 GC
[1 3] 0 setdash
2 LJ
0.5 LW
N
485.3 374 M
485.3 31.5 L
S
GR
GS
0.775 GC
[1 3] 0 setdash
2 LJ
0.5 LW
N
496.15 374 M
496.15 31.5 L
S
GR
GS
0.873 GC
1 LJ
0.5 LW
N
73 374 M
73 31.5 L
S
GR
GS
0.873 GC
1 LJ
0.5 LW
N
116.4 374 M
116.4 31.5 L
S
GR
GS
0.873 GC
1 LJ
0.5 LW
N
159.8 374 M
159.8 31.5 L
S
GR
GS
0.873 GC
1 LJ
0.5 LW
N
203.2 374 M
203.2 31.5 L
S
GR
GS
0.873 GC
1 LJ
0.5 LW
N
246.6 374 M
246.6 31.5 L
S
GR
GS
0.873 GC
1 LJ
0.5 LW
N
290 374 M
290 31.5 L
S
GR
GS
0.873 GC
1 LJ
0.5 LW
N
333.4 374 M
333.4 31.5 L
S
GR
GS
0.873 GC
1 LJ
0.5 LW
N
376.8 374 M
376.8 31.5 L
S
GR
GS
0.873 GC
1 LJ
0.5 LW
N
420.2 374 M
420.2 31.5 L
S
GR
GS
0.873 GC
1 LJ
0.5 LW
N
463.6 374 M
463.6 31.5 L
S
GR
GS
0.873 GC
1 LJ
0.5 LW
N
507 374 M
507 31.5 L
S
GR
GS
0.775 GC
[1 3] 0 setdash
2 LJ
0.5 LW
N
507 365.438 M
73 365.438 L
S
GR
GS
0.775 GC
[1 3] 0 setdash
2 LJ
0.5 LW
N
507 356.875 M
73 356.875 L
S
GR
GS
0.775 GC
[1 3] 0 setdash
2 LJ
0.5 LW
N
507 348.313 M
73 348.313 L
S
GR
GS
0.775 GC
[1 3] 0 setdash
2 LJ
0.5 LW
N
507 331.188 M
73 331.188 L
S
GR
GS
0.775 GC
[1 3] 0 setdash
2 LJ
0.5 LW
N
507 322.625 M
73 322.625 L
S
GR
GS
0.775 GC
[1 3] 0 setdash
2 LJ
0.5 LW
N
507 314.063 M
73 314.063 L
S
GR
GS
0.775 GC
[1 3] 0 setdash
2 LJ
0.5 LW
N
507 296.938 M
73 296.938 L
S
GR
GS
0.775 GC
[1 3] 0 setdash
2 LJ
0.5 LW
N
507 288.375 M
73 288.375 L
S
GR
GS
0.775 GC
[1 3] 0 setdash
2 LJ
0.5 LW
N
507 279.813 M
73 279.813 L
S
GR
GS
0.775 GC
[1 3] 0 setdash
2 LJ
0.5 LW
N
507 262.688 M
73 262.688 L
S
GR
GS
0.775 GC
[1 3] 0 setdash
2 LJ
0.5 LW
N
507 254.125 M
73 254.125 L
S
GR
GS
0.775 GC
[1 3] 0 setdash
2 LJ
0.5 LW
N
507 245.563 M
73 245.563 L
S
GR
GS
0.775 GC
[1 3] 0 setdash
2 LJ
0.5 LW
N
507 228.438 M
73 228.438 L
S
GR
GS
0.775 GC
[1 3] 0 setdash
2 LJ
0.5 LW
N
507 219.875 M
73 219.875 L
S
GR
GS
0.775 GC
[1 3] 0 setdash
2 LJ
0.5 LW
N
507 211.313 M
73 211.313 L
S
GR
GS
0.775 GC
[1 3] 0 setdash
2 LJ
0.5 LW
N
507 194.188 M
73 194.188 L
S
GR
GS
0.775 GC
[1 3] 0 setdash
2 LJ
0.5 LW
N
507 185.625 M
73 185.625 L
S
GR
GS
0.775 GC
[1 3] 0 setdash
2 LJ
0.5 LW
N
507 177.063 M
73 177.063 L
S
GR
GS
0.775 GC
[1 3] 0 setdash
2 LJ
0.5 LW
N
507 159.938 M
73 159.938 L
S
GR
GS
0.775 GC
[1 3] 0 setdash
2 LJ
0.5 LW
N
507 151.375 M
73 151.375 L
S
GR
GS
0.775 GC
[1 3] 0 setdash
2 LJ
0.5 LW
N
507 142.813 M
73 142.813 L
S
GR
GS
0.775 GC
[1 3] 0 setdash
2 LJ
0.5 LW
N
507 125.688 M
73 125.688 L
S
GR
GS
0.775 GC
[1 3] 0 setdash
2 LJ
0.5 LW
N
507 117.125 M
73 117.125 L
S
GR
GS
0.775 GC
[1 3] 0 setdash
2 LJ
0.5 LW
N
507 108.563 M
73 108.563 L
S
GR
GS
0.775 GC
[1 3] 0 setdash
2 LJ
0.5 LW
N
507 91.438 M
73 91.438 L
S
GR
GS
0.775 GC
[1 3] 0 setdash
2 LJ
0.5 LW
N
507 82.875 M
73 82.875 L
S
GR
GS
0.775 GC
[1 3] 0 setdash
2 LJ
0.5 LW
N
507 74.313 M
73 74.313 L
S
GR
GS
0.775 GC
[1 3] 0 setdash
2 LJ
0.5 LW
N
507 57.187 M
73 57.187 L
S
GR
GS
0.775 GC
[1 3] 0 setdash
2 LJ
0.5 LW
N
507 48.625 M
73 48.625 L
S
GR
GS
0.775 GC
[1 3] 0 setdash
2 LJ
0.5 LW
N
507 40.063 M
73 40.063 L
S
GR
GS
0.873 GC
1 LJ
0.5 LW
N
507 374 M
73 374 L
S
GR
GS
0.873 GC
1 LJ
0.5 LW
N
507 339.75 M
73 339.75 L
S
GR
GS
0.873 GC
1 LJ
0.5 LW
N
507 305.5 M
73 305.5 L
S
GR
GS
0.873 GC
1 LJ
0.5 LW
N
507 271.25 M
73 271.25 L
S
GR
GS
0.873 GC
1 LJ
0.5 LW
N
507 237 M
73 237 L
S
GR
GS
0.873 GC
1 LJ
0.5 LW
N
507 202.75 M
73 202.75 L
S
GR
GS
0.873 GC
1 LJ
0.5 LW
N
507 168.5 M
73 168.5 L
S
GR
GS
0.873 GC
1 LJ
0.5 LW
N
507 134.25 M
73 134.25 L
S
GR
GS
0.873 GC
1 LJ
0.5 LW
N
507 100 M
73 100 L
S
GR
GS
0.873 GC
1 LJ
0.5 LW
N
507 65.75 M
73 65.75 L
S
GR
GS
0.873 GC
1 LJ
0.5 LW
N
507 31.5 M
73 31.5 L
S
GR
GS
0.149 GC
2 setlinecap
1 LJ
0.5 LW
N
73 374 M
507 374 L
S
GR
GS
0.149 GC
2 setlinecap
1 LJ
0.5 LW
N
73 374 M
73 369.66 L
S
GR
GS
0.149 GC
2 setlinecap
1 LJ
0.5 LW
N
116.4 374 M
116.4 369.66 L
S
GR
GS
0.149 GC
2 setlinecap
1 LJ
0.5 LW
N
159.8 374 M
159.8 369.66 L
S
GR
GS
0.149 GC
2 setlinecap
1 LJ
0.5 LW
N
203.2 374 M
203.2 369.66 L
S
GR
GS
0.149 GC
2 setlinecap
1 LJ
0.5 LW
N
246.6 374 M
246.6 369.66 L
S
GR
GS
0.149 GC
2 setlinecap
1 LJ
0.5 LW
N
290 374 M
290 369.66 L
S
GR
GS
0.149 GC
2 setlinecap
1 LJ
0.5 LW
N
333.4 374 M
333.4 369.66 L
S
GR
GS
0.149 GC
2 setlinecap
1 LJ
0.5 LW
N
376.8 374 M
376.8 369.66 L
S
GR
GS
0.149 GC
2 setlinecap
1 LJ
0.5 LW
N
420.2 374 M
420.2 369.66 L
S
GR
GS
0.149 GC
2 setlinecap
1 LJ
0.5 LW
N
463.6 374 M
463.6 369.66 L
S
GR
GS
0.149 GC
2 setlinecap
1 LJ
0.5 LW
N
507 374 M
507 369.66 L
S
GR
GS
[1 0 0 1 73 378] CT
0.149 GC
/Helvetica 10 F
GS
[1 0 0 1 0 0] CT
-5 10 moveto 
1 -1 scale
(-1) t 
GR
GR
GS
[1 0 0 1 116.39999 378] CT
0.149 GC
/Helvetica 10 F
GS
[1 0 0 1 0 0] CT
-9 10 moveto 
1 -1 scale
(-0.8) t 
GR
GR
GS
[1 0 0 1 159.79999 378] CT
0.149 GC
/Helvetica 10 F
GS
[1 0 0 1 0 0] CT
-9 10 moveto 
1 -1 scale
(-0.6) t 
GR
GR
GS
[1 0 0 1 203.2 378] CT
0.149 GC
/Helvetica 10 F
GS
[1 0 0 1 0 0] CT
-9 10 moveto 
1 -1 scale
(-0.4) t 
GR
GR
GS
[1 0 0 1 246.60001 378] CT
0.149 GC
/Helvetica 10 F
GS
[1 0 0 1 0 0] CT
-9 10 moveto 
1 -1 scale
(-0.2) t 
GR
GR
GS
[1 0 0 1 290 378] CT
0.149 GC
/Helvetica 10 F
GS
[1 0 0 1 0 0] CT
-3 10 moveto 
1 -1 scale
(0) t 
GR
GR
GS
[1 0 0 1 333.39999 378] CT
0.149 GC
/Helvetica 10 F
GS
[1 0 0 1 0 0] CT
-7 10 moveto 
1 -1 scale
(0.2) t 
GR
GR
GS
[1 0 0 1 376.79999 378] CT
0.149 GC
/Helvetica 10 F
GS
[1 0 0 1 0 0] CT
-7 10 moveto 
1 -1 scale
(0.4) t 
GR
GR
GS
[1 0 0 1 420.20001 378] CT
0.149 GC
/Helvetica 10 F
GS
[1 0 0 1 0 0] CT
-7 10 moveto 
1 -1 scale
(0.6) t 
GR
GR
GS
[1 0 0 1 463.60001 378] CT
0.149 GC
/Helvetica 10 F
GS
[1 0 0 1 0 0] CT
-7 10 moveto 
1 -1 scale
(0.8) t 
GR
GR
GS
[1 0 0 1 507 378] CT
0.149 GC
/Helvetica 10 F
GS
[1 0 0 1 0 0] CT
-3 10 moveto 
1 -1 scale
(1) t 
GR
GR
GS
0.149 GC
2 setlinecap
1 LJ
0.5 LW
N
73 374 M
73 31.5 L
S
GR
GS
0.149 GC
2 setlinecap
1 LJ
0.5 LW
N
73 374 M
77.34 374 L
S
GR
GS
0.149 GC
2 setlinecap
1 LJ
0.5 LW
N
73 339.75 M
77.34 339.75 L
S
GR
GS
0.149 GC
2 setlinecap
1 LJ
0.5 LW
N
73 305.5 M
77.34 305.5 L
S
GR
GS
0.149 GC
2 setlinecap
1 LJ
0.5 LW
N
73 271.25 M
77.34 271.25 L
S
GR
GS
0.149 GC
2 setlinecap
1 LJ
0.5 LW
N
73 237 M
77.34 237 L
S
GR
GS
0.149 GC
2 setlinecap
1 LJ
0.5 LW
N
73 202.75 M
77.34 202.75 L
S
GR
GS
0.149 GC
2 setlinecap
1 LJ
0.5 LW
N
73 168.5 M
77.34 168.5 L
S
GR
GS
0.149 GC
2 setlinecap
1 LJ
0.5 LW
N
73 134.25 M
77.34 134.25 L
S
GR
GS
0.149 GC
2 setlinecap
1 LJ
0.5 LW
N
73 100 M
77.34 100 L
S
GR
GS
0.149 GC
2 setlinecap
1 LJ
0.5 LW
N
73 65.75 M
77.34 65.75 L
S
GR
GS
0.149 GC
2 setlinecap
1 LJ
0.5 LW
N
73 31.5 M
77.34 31.5 L
S
GR
GS
[1 0 0 1 68.99999 374] CT
0.149 GC
/Helvetica 10 F
GS
[1 0 0 1 0 0] CT
-10 3.5 moveto 
1 -1 scale
(-1) t 
GR
GR
GS
[1 0 0 1 68.99999 339.75] CT
0.149 GC
/Helvetica 10 F
GS
[1 0 0 1 0 0] CT
-18 3.5 moveto 
1 -1 scale
(-0.8) t 
GR
GR
GS
[1 0 0 1 68.99999 305.5] CT
0.149 GC
/Helvetica 10 F
GS
[1 0 0 1 0 0] CT
-18 3.5 moveto 
1 -1 scale
(-0.6) t 
GR
GR
GS
[1 0 0 1 68.99999 271.25] CT
0.149 GC
/Helvetica 10 F
GS
[1 0 0 1 0 0] CT
-18 3.5 moveto 
1 -1 scale
(-0.4) t 
GR
GR
GS
[1 0 0 1 68.99999 237] CT
0.149 GC
/Helvetica 10 F
GS
[1 0 0 1 0 0] CT
-18 3.5 moveto 
1 -1 scale
(-0.2) t 
GR
GR
GS
[1 0 0 1 68.99999 202.75] CT
0.149 GC
/Helvetica 10 F
GS
[1 0 0 1 0 0] CT
-6 3.5 moveto 
1 -1 scale
(0) t 
GR
GR
GS
[1 0 0 1 68.99999 168.5] CT
0.149 GC
/Helvetica 10 F
GS
[1 0 0 1 0 0] CT
-14 3.5 moveto 
1 -1 scale
(0.2) t 
GR
GR
GS
[1 0 0 1 68.99999 134.25] CT
0.149 GC
/Helvetica 10 F
GS
[1 0 0 1 0 0] CT
-14 3.5 moveto 
1 -1 scale
(0.4) t 
GR
GR
GS
[1 0 0 1 68.99999 99.99999] CT
0.149 GC
/Helvetica 10 F
GS
[1 0 0 1 0 0] CT
-14 3.5 moveto 
1 -1 scale
(0.6) t 
GR
GR
GS
[1 0 0 1 68.99999 65.75] CT
0.149 GC
/Helvetica 10 F
GS
[1 0 0 1 0 0] CT
-14 3.5 moveto 
1 -1 scale
(0.8) t 
GR
GR
GS
[1 0 0 1 68.99999 31.5] CT
0.149 GC
/Helvetica 10 F
GS
[1 0 0 1 0 0] CT
-6 3.5 moveto 
1 -1 scale
(1) t 
GR
GR
GS
0 0.447 0.741 RC
1 LJ
1.5 LW
N
73 202.75 M
77.384 209.669 L
81.768 216.588 L
86.152 223.508 L
90.535 230.427 L
94.919 237.346 L
99.303 244.265 L
103.687 251.184 L
108.071 258.104 L
112.455 265.023 L
116.838 271.942 L
121.222 278.861 L
125.606 285.78 L
129.99 292.699 L
134.374 299.619 L
138.758 306.538 L
143.141 313.457 L
147.525 320.376 L
151.909 327.295 L
156.293 334.215 L
160.677 341.134 L
165.061 348.053 L
169.444 354.972 L
173.828 361.891 L
178.212 368.811 L
182.596 372.27 L
186.98 365.351 L
191.364 358.432 L
195.747 351.513 L
200.131 344.593 L
204.515 337.674 L
208.899 330.755 L
213.283 323.836 L
217.667 316.917 L
222.051 309.997 L
226.434 303.078 L
230.818 296.159 L
235.202 289.24 L
239.586 282.321 L
243.97 275.402 L
248.354 268.482 L
252.737 261.563 L
257.121 254.644 L
261.505 247.725 L
265.889 240.806 L
270.273 233.886 L
274.657 226.967 L
279.04 220.048 L
283.424 213.129 L
287.808 206.21 L
292.192 199.29 L
296.576 192.371 L
300.96 185.452 L
305.343 178.533 L
309.727 171.614 L
314.111 164.694 L
318.495 157.775 L
322.879 150.856 L
327.263 143.937 L
331.646 137.018 L
336.03 130.098 L
340.414 123.179 L
344.798 116.26 L
349.182 109.341 L
353.566 102.422 L
357.949 95.503 L
362.333 88.583 L
366.717 81.664 L
371.101 74.745 L
375.485 67.826 L
379.869 60.907 L
384.253 53.987 L
388.636 47.068 L
393.02 40.149 L
397.404 33.23 L
401.788 36.689 L
406.172 43.609 L
410.556 50.528 L
414.939 57.447 L
419.323 64.366 L
423.707 71.285 L
428.091 78.205 L
432.475 85.124 L
436.859 92.043 L
441.242 98.962 L
445.626 105.881 L
450.01 112.801 L
454.394 119.72 L
458.778 126.639 L
463.162 133.558 L
467.545 140.477 L
471.929 147.396 L
476.313 154.316 L
480.697 161.235 L
485.081 168.154 L
489.465 175.073 L
493.848 181.992 L
498.232 188.912 L
502.616 195.831 L
507 202.75 L
S
GR
GS
0.851 0.325 0.098 RC
1 LJ
N
77.384 171.434 M
81.768 167.991 L
86.152 171.059 L
90.535 177.865 L
94.919 187.099 L
99.303 197.964 L
103.687 209.912 L
108.071 222.538 L
112.455 235.526 L
116.838 248.628 L
121.222 261.638 L
125.606 274.39 L
129.99 286.743 L
134.374 298.581 L
138.758 309.805 L
143.141 320.336 L
147.525 330.105 L
151.909 339.057 L
156.293 347.147 L
160.677 354.341 L
165.061 360.612 L
169.444 365.939 L
173.828 370.311 L
178.212 373.721 L
178.785 374.041 L
S
GR
GS
0.851 0.325 0.098 RC
1 LJ
N
204.851 374.041 M
208.899 371.193 L
213.283 367.264 L
217.667 362.52 L
222.051 356.994 L
226.434 350.721 L
230.818 343.741 L
235.202 336.092 L
239.586 327.816 L
243.97 318.957 L
248.354 309.56 L
252.737 299.671 L
257.121 289.339 L
261.505 278.613 L
265.889 267.543 L
270.273 256.179 L
274.657 244.574 L
279.04 232.78 L
283.424 220.85 L
287.808 208.837 L
292.192 196.795 L
296.576 184.778 L
300.96 172.839 L
305.343 161.032 L
309.727 149.409 L
314.111 138.025 L
318.495 126.931 L
322.879 116.179 L
327.263 105.82 L
331.646 95.904 L
336.03 86.479 L
340.414 77.593 L
344.798 69.292 L
349.182 61.621 L
353.566 54.621 L
357.949 48.335 L
362.333 42.799 L
366.717 38.051 L
371.101 34.124 L
374.9 31.459 L
S
GR
GS
0.851 0.325 0.098 RC
1 LJ
N
401.206 31.459 M
401.788 31.79 L
406.172 35.249 L
410.556 39.672 L
414.939 45.052 L
419.323 51.375 L
423.707 58.619 L
428.091 66.756 L
432.475 75.75 L
436.859 85.553 L
441.242 96.108 L
445.626 107.346 L
450.01 119.184 L
454.394 131.524 L
458.778 144.248 L
463.162 157.215 L
467.545 170.258 L
471.929 183.175 L
476.313 195.715 L
480.697 207.569 L
485.081 218.336 L
489.465 227.472 L
493.848 234.189 L
498.232 237.186 L
502.616 233.703 L
S
GR
GS
[1 0 0 1 77.38384 171.43355] CT
0.851 0.325 0.098 RC
N
1 0 M
1 0.552 0.552 1 0 1 C
-0.552 1 -1 0.552 -1 0 C
-1 -0.552 -0.552 -1 0 -1 C
0.552 -1 1 -0.552 1 0 C
cp
f
GR
GS
[1 0 0 1 81.76767 167.99103] CT
0.851 0.325 0.098 RC
N
/f-891180347{1 0 M
1 0.552 0.552 1 0 1 C
-0.552 1 -1 0.552 -1 0 C
-1 -0.552 -0.552 -1 0 -1 C
0.552 -1 1 -0.552 1 0 C
cp}def
f-891180347
f
GR
GS
[1 0 0 1 86.15151 171.05898] CT
0.851 0.325 0.098 RC
N
f-891180347
f
GR
GS
[1 0 0 1 90.53535 177.8649] CT
0.851 0.325 0.098 RC
N
f-891180347
f
GR
GS
[1 0 0 1 94.91919 187.09875] CT
0.851 0.325 0.098 RC
N
f-891180347
f
GR
GS
[1 0 0 1 99.30303 197.96393] CT
0.851 0.325 0.098 RC
N
f-891180347
f
GR
GS
[1 0 0 1 103.68687 209.91208] CT
0.851 0.325 0.098 RC
N
f-891180347
f
GR
GS
[1 0 0 1 108.0707 222.53752] CT
0.851 0.325 0.098 RC
N
f-891180347
f
GR
GS
[1 0 0 1 112.45454 235.52626] CT
0.851 0.325 0.098 RC
N
f-891180347
f
GR
GS
[1 0 0 1 116.83839 248.62782] CT
0.851 0.325 0.098 RC
N
f-891180347
f
GR
GS
[1 0 0 1 121.22222 261.63846] CT
0.851 0.325 0.098 RC
N
f-891180347
f
GR
GS
[1 0 0 1 125.60606 274.39008] CT
0.851 0.325 0.098 RC
N
f-891180347
f
GR
GS
[1 0 0 1 129.9899 286.74301] CT
0.851 0.325 0.098 RC
N
f-891180347
f
GR
GS
[1 0 0 1 134.37373 298.58057] CT
0.851 0.325 0.098 RC
N
f-891180347
f
GR
GS
[1 0 0 1 138.75758 309.80524] CT
0.851 0.325 0.098 RC
N
f-891180347
f
GR
GS
[1 0 0 1 143.14142 320.33575] CT
0.851 0.325 0.098 RC
N
f-891180347
f
GR
GS
[1 0 0 1 147.52525 330.10471] CT
0.851 0.325 0.098 RC
N
f-891180347
f
GR
GS
[1 0 0 1 151.90909 339.05685] CT
0.851 0.325 0.098 RC
N
f-891180347
f
GR
GS
[1 0 0 1 156.29292 347.14749] CT
0.851 0.325 0.098 RC
N
f-891180347
f
GR
GS
[1 0 0 1 160.67677 354.34137] CT
0.851 0.325 0.098 RC
N
f-891180347
f
GR
GS
[1 0 0 1 165.06061 360.61166] CT
0.851 0.325 0.098 RC
N
f-891180347
f
GR
GS
[1 0 0 1 169.44444 365.939] CT
0.851 0.325 0.098 RC
N
f-891180347
f
GR
GS
[1 0 0 1 173.82828 370.31088] CT
0.851 0.325 0.098 RC
N
f-891180347
f
GR
GS
[1 0 0 1 178.21213 373.72092] CT
0.851 0.325 0.098 RC
N
f-891180347
f
GR
GS
[1 0 0 1 208.89899 371.19321] CT
0.851 0.325 0.098 RC
N
f-891180347
f
GR
GS
[1 0 0 1 213.28282 367.26389] CT
0.851 0.325 0.098 RC
N
f-891180347
f
GR
GS
[1 0 0 1 217.66667 362.51971] CT
0.851 0.325 0.098 RC
N
f-891180347
f
GR
GS
[1 0 0 1 222.05051 356.99368] CT
0.851 0.325 0.098 RC
N
f-891180347
f
GR
GS
[1 0 0 1 226.43434 350.72144] CT
0.851 0.325 0.098 RC
N
f-891180347
f
GR
GS
[1 0 0 1 230.81818 343.74078] CT
0.851 0.325 0.098 RC
N
f-891180347
f
GR
GS
[1 0 0 1 235.20203 336.09155] CT
0.851 0.325 0.098 RC
N
f-891180347
f
GR
GS
[1 0 0 1 239.58586 327.81564] CT
0.851 0.325 0.098 RC
N
f-891180347
f
GR
GS
[1 0 0 1 243.9697 318.95657] CT
0.851 0.325 0.098 RC
N
f-891180347
f
GR
GS
[1 0 0 1 248.35353 309.55954] CT
0.851 0.325 0.098 RC
N
f-891180347
f
GR
GS
[1 0 0 1 252.73738 299.67111] CT
0.851 0.325 0.098 RC
N
f-891180347
f
GR
GS
[1 0 0 1 257.12122 289.33929] CT
0.851 0.325 0.098 RC
N
f-891180347
f
GR
GS
[1 0 0 1 261.50507 278.6131] CT
0.851 0.325 0.098 RC
N
f-891180347
f
GR
GS
[1 0 0 1 265.88889 267.54269] CT
0.851 0.325 0.098 RC
N
f-891180347
f
GR
GS
[1 0 0 1 270.27274 256.17911] CT
0.851 0.325 0.098 RC
N
f-891180347
f
GR
GS
[1 0 0 1 274.65656 244.5741] CT
0.851 0.325 0.098 RC
N
f-891180347
f
GR
GS
[1 0 0 1 279.04041 232.78011] CT
0.851 0.325 0.098 RC
N
f-891180347
f
GR
GS
[1 0 0 1 283.42426 220.85007] CT
0.851 0.325 0.098 RC
N
f-891180347
f
GR
GS
[1 0 0 1 287.80807 208.83731] CT
0.851 0.325 0.098 RC
N
f-891180347
f
GR
GS
[1 0 0 1 292.19193 196.79538] CT
0.851 0.325 0.098 RC
N
f-891180347
f
GR
GS
[1 0 0 1 296.57574 184.778] CT
0.851 0.325 0.098 RC
N
f-891180347
f
GR
GS
[1 0 0 1 300.95959 172.83887] CT
0.851 0.325 0.098 RC
N
f-891180347
f
GR
GS
[1 0 0 1 305.34344 161.03152] CT
0.851 0.325 0.098 RC
N
f-891180347
f
GR
GS
[1 0 0 1 309.72726 149.40927] CT
0.851 0.325 0.098 RC
N
f-891180347
f
GR
GS
[1 0 0 1 314.11111 138.02499] CT
0.851 0.325 0.098 RC
N
f-891180347
f
GR
GS
[1 0 0 1 318.49493 126.93106] CT
0.851 0.325 0.098 RC
N
f-891180347
f
GR
GS
[1 0 0 1 322.87878 116.17913] CT
0.851 0.325 0.098 RC
N
f-891180347
f
GR
GS
[1 0 0 1 327.26263 105.82005] CT
0.851 0.325 0.098 RC
N
f-891180347
f
GR
GS
[1 0 0 1 331.64645 95.90372] CT
0.851 0.325 0.098 RC
N
f-891180347
f
GR
GS
[1 0 0 1 336.0303 86.47887] CT
0.851 0.325 0.098 RC
N
f-891180347
f
GR
GS
[1 0 0 1 340.41415 77.59299] CT
0.851 0.325 0.098 RC
N
f-891180347
f
GR
GS
[1 0 0 1 344.79797 69.29212] CT
0.851 0.325 0.098 RC
N
f-891180347
f
GR
GS
[1 0 0 1 349.18182 61.62068] CT
0.851 0.325 0.098 RC
N
f-891180347
f
GR
GS
[1 0 0 1 353.56564 54.6213] CT
0.851 0.325 0.098 RC
N
f-891180347
f
GR
GS
[1 0 0 1 357.94949 48.33466] CT
0.851 0.325 0.098 RC
N
f-891180347
f
GR
GS
[1 0 0 1 362.33334 42.79925] CT
0.851 0.325 0.098 RC
N
f-891180347
f
GR
GS
[1 0 0 1 366.71716 38.05124] CT
0.851 0.325 0.098 RC
N
f-891180347
f
GR
GS
[1 0 0 1 371.10101 34.12417] CT
0.851 0.325 0.098 RC
N
f-891180347
f
GR
GS
[1 0 0 1 401.78787 31.79006] CT
0.851 0.325 0.098 RC
N
f-891180347
f
GR
GS
[1 0 0 1 406.17172 35.24874] CT
0.851 0.325 0.098 RC
N
f-891180347
f
GR
GS
[1 0 0 1 410.55557 39.67193] CT
0.851 0.325 0.098 RC
N
f-891180347
f
GR
GS
[1 0 0 1 414.93939 45.05188] CT
0.851 0.325 0.098 RC
N
f-891180347
f
GR
GS
[1 0 0 1 419.32324 51.37455] CT
0.851 0.325 0.098 RC
N
f-891180347
f
GR
GS
[1 0 0 1 423.70706 58.61895] CT
0.851 0.325 0.098 RC
N
f-891180347
f
GR
GS
[1 0 0 1 428.09091 66.75641] CT
0.851 0.325 0.098 RC
N
f-891180347
f
GR
GS
[1 0 0 1 432.47476 75.74981] CT
0.851 0.325 0.098 RC
N
f-891180347
f
GR
GS
[1 0 0 1 436.85858 85.55261] CT
0.851 0.325 0.098 RC
N
f-891180347
f
GR
GS
[1 0 0 1 441.24243 96.10767] CT
0.851 0.325 0.098 RC
N
f-891180347
f
GR
GS
[1 0 0 1 445.62625 107.34585] CT
0.851 0.325 0.098 RC
N
f-891180347
f
GR
GS
[1 0 0 1 450.0101 119.18427] CT
0.851 0.325 0.098 RC
N
f-891180347
f
GR
GS
[1 0 0 1 454.39395 131.52414] CT
0.851 0.325 0.098 RC
N
f-891180347
f
GR
GS
[1 0 0 1 458.77777 144.24783] CT
0.851 0.325 0.098 RC
N
f-891180347
f
GR
GS
[1 0 0 1 463.16162 157.21521] CT
0.851 0.325 0.098 RC
N
f-891180347
f
GR
GS
[1 0 0 1 467.54544 170.25841] CT
0.851 0.325 0.098 RC
N
f-891180347
f
GR
GS
[1 0 0 1 471.92929 183.17462] CT
0.851 0.325 0.098 RC
N
f-891180347
f
GR
GS
[1 0 0 1 476.31314 195.71532] CT
0.851 0.325 0.098 RC
N
f-891180347
f
GR
GS
[1 0 0 1 480.69696 207.56949] CT
0.851 0.325 0.098 RC
N
f-891180347
f
GR
GS
[1 0 0 1 485.08081 218.33582] CT
0.851 0.325 0.098 RC
N
f-891180347
f
GR
GS
[1 0 0 1 489.46463 227.47185] CT
0.851 0.325 0.098 RC
N
f-891180347
f
GR
GS
[1 0 0 1 493.84848 234.18861] CT
0.851 0.325 0.098 RC
N
f-891180347
f
GR
GS
[1 0 0 1 498.23233 237.18581] CT
0.851 0.325 0.098 RC
N
f-891180347
f
GR
GS
[1 0 0 1 502.61615 233.70294] CT
0.851 0.325 0.098 RC
N
f-891180347
f
GR
GS
1 GC
N
499 66 M
499 39.5 L
417.5 39.5 L
417.5 66 L
cp
f
GR
GS
[1 0 0 1 454.5 47] CT
/Helvetica 9 F
GS
[1 0 0 1 0 0] CT
0 3.5 moveto 
1 -1 scale
(Real) t 
GR
GR
GS
0 0.447 0.741 RC
1 LJ
1.5 LW
N
421.5 47 M
451.5 47 L
S
GR
GS
[1 0 0 1 454.5 58.5] CT
/Helvetica 9 F
GS
[1 0 0 1 0 0] CT
0 3.5 moveto 
1 -1 scale
(Estimated) t 
GR
GR
GS
0.851 0.325 0.098 RC
1 LJ
N
421.5 58.5 M
451.5 58.5 L
S
GR
GS
[1 0 0 1 436.5 58.5] CT
0.851 0.325 0.098 RC
N
f-891180347
f
GR
GS
0.149 GC
10.0 ML
0.5 LW
N
417.5 66 M
417.5 39.5 L
499 39.5 L
499 66 L
cp
S
GR
%%Trailer
%%Pages: 1
%%EOF
