%!PS-Adobe-3.0 EPSF-3.0
%%Creator: (MATLAB, The Mathworks, Inc. Version 23.2.0.2409890 \(R2023b\) Update 3. Operating System: Mac OS X)
%%Title: /Users/jakub/Projects/modeling-and-identification/report-03/images/lab8/100_000.eps
%%CreationDate: 2024-01-04T18:11:43
%%Pages: (atend)
%%BoundingBox:     0     0   306   215
%%LanguageLevel: 3
%%EndComments
%%BeginProlog
%%BeginResource: procset (Apache XML Graphics Std ProcSet) 1.2 0
%%Version: 1.2 0
%%Copyright: (Copyright 2001-2003,2010 The Apache Software Foundation. License terms: http://www.apache.org/licenses/LICENSE-2.0)
/bd{bind def}bind def
/ld{load def}bd
/GR/grestore ld
/GS/gsave ld
/RM/rmoveto ld
/C/curveto ld
/t/show ld
/L/lineto ld
/ML/setmiterlimit ld
/CT/concat ld
/f/fill ld
/N/newpath ld
/S/stroke ld
/CC/setcmykcolor ld
/A/ashow ld
/cp/closepath ld
/RC/setrgbcolor ld
/LJ/setlinejoin ld
/GC/setgray ld
/LW/setlinewidth ld
/M/moveto ld
/re {4 2 roll M
1 index 0 rlineto
0 exch rlineto
neg 0 rlineto
cp } bd
/_ctm matrix def
/_tm matrix def
/BT { _ctm currentmatrix pop matrix _tm copy pop 0 0 moveto } bd
/ET { _ctm setmatrix } bd
/iTm { _ctm setmatrix _tm concat } bd
/Tm { _tm astore pop iTm 0 0 moveto } bd
/ux 0.0 def
/uy 0.0 def
/F {
  /Tp exch def
  /Tf exch def
  Tf findfont Tp scalefont setfont
  /cf Tf def  /cs Tp def
} bd
/ULS {currentpoint /uy exch def /ux exch def} bd
/ULE {
  /Tcx currentpoint pop def
  gsave
  newpath
  cf findfont cs scalefont dup
  /FontMatrix get 0 get /Ts exch def /FontInfo get dup
  /UnderlinePosition get Ts mul /To exch def
  /UnderlineThickness get Ts mul /Tt exch def
  ux uy To add moveto  Tcx uy To add lineto
  Tt setlinewidth stroke
  grestore
} bd
/OLE {
  /Tcx currentpoint pop def
  gsave
  newpath
  cf findfont cs scalefont dup
  /FontMatrix get 0 get /Ts exch def /FontInfo get dup
  /UnderlinePosition get Ts mul /To exch def
  /UnderlineThickness get Ts mul /Tt exch def
  ux uy To add cs add moveto Tcx uy To add cs add lineto
  Tt setlinewidth stroke
  grestore
} bd
/SOE {
  /Tcx currentpoint pop def
  gsave
  newpath
  cf findfont cs scalefont dup
  /FontMatrix get 0 get /Ts exch def /FontInfo get dup
  /UnderlinePosition get Ts mul /To exch def
  /UnderlineThickness get Ts mul /Tt exch def
  ux uy To add cs 10 mul 26 idiv add moveto Tcx uy To add cs 10 mul 26 idiv add lineto
  Tt setlinewidth stroke
  grestore
} bd
/QT {
/Y22 exch store
/X22 exch store
/Y21 exch store
/X21 exch store
currentpoint
/Y21 load 2 mul add 3 div exch
/X21 load 2 mul add 3 div exch
/X21 load 2 mul /X22 load add 3 div
/Y21 load 2 mul /Y22 load add 3 div
/X22 load /Y22 load curveto
} bd
/SSPD {
dup length /d exch dict def
{
/v exch def
/k exch def
currentpagedevice k known {
/cpdv currentpagedevice k get def
v cpdv ne {
/upd false def
/nullv v type /nulltype eq def
/nullcpdv cpdv type /nulltype eq def
nullv nullcpdv or
{
/upd true def
} {
/sametype v type cpdv type eq def
sametype {
v type /arraytype eq {
/vlen v length def
/cpdvlen cpdv length def
vlen cpdvlen eq {
0 1 vlen 1 sub {
/i exch def
/obj v i get def
/cpdobj cpdv i get def
obj cpdobj ne {
/upd true def
exit
} if
} for
} {
/upd true def
} ifelse
} {
v type /dicttype eq {
v {
/dv exch def
/dk exch def
/cpddv cpdv dk get def
dv cpddv ne {
/upd true def
exit
} if
} forall
} {
/upd true def
} ifelse
} ifelse
} if
} ifelse
upd true eq {
d k v put
} if
} if
} if
} forall
d length 0 gt {
d setpagedevice
} if
} bd
/RE { % /NewFontName [NewEncodingArray] /FontName RE -
  findfont dup length dict begin
  {
    1 index /FID ne
    {def} {pop pop} ifelse
  } forall
  /Encoding exch def
  /FontName 1 index def
  currentdict definefont pop
  end
} bind def
%%EndResource
%%BeginResource: procset (Apache XML Graphics EPS ProcSet) 1.0 0
%%Version: 1.0 0
%%Copyright: (Copyright 2002-2003 The Apache Software Foundation. License terms: http://www.apache.org/licenses/LICENSE-2.0)
/BeginEPSF { %def
/b4_Inc_state save def         % Save state for cleanup
/dict_count countdictstack def % Count objects on dict stack
/op_count count 1 sub def      % Count objects on operand stack
userdict begin                 % Push userdict on dict stack
/showpage { } def              % Redefine showpage, { } = null proc
0 setgray 0 setlinecap         % Prepare graphics state
1 setlinewidth 0 setlinejoin
10 setmiterlimit [ ] 0 setdash newpath
/languagelevel where           % If level not equal to 1 then
{pop languagelevel             % set strokeadjust and
1 ne                           % overprint to their defaults.
{false setstrokeadjust false setoverprint
} if
} if
} bd
/EndEPSF { %def
count op_count sub {pop} repeat            % Clean up stacks
countdictstack dict_count sub {end} repeat
b4_Inc_state restore
} bd
%%EndResource
%FOPBeginFontDict
%%IncludeResource: font Courier-Oblique
%%IncludeResource: font Courier-BoldOblique
%%IncludeResource: font Courier-Bold
%%IncludeResource: font ZapfDingbats
%%IncludeResource: font Symbol
%%IncludeResource: font Helvetica
%%IncludeResource: font Helvetica-Oblique
%%IncludeResource: font Helvetica-Bold
%%IncludeResource: font Helvetica-BoldOblique
%%IncludeResource: font Times-Roman
%%IncludeResource: font Times-Italic
%%IncludeResource: font Times-Bold
%%IncludeResource: font Times-BoldItalic
%%IncludeResource: font Courier
%FOPEndFontDict
%%BeginResource: encoding WinAnsiEncoding
/WinAnsiEncoding [
/.notdef /.notdef /.notdef /.notdef /.notdef
/.notdef /.notdef /.notdef /.notdef /.notdef
/.notdef /.notdef /.notdef /.notdef /.notdef
/.notdef /.notdef /.notdef /.notdef /.notdef
/.notdef /.notdef /.notdef /.notdef /.notdef
/.notdef /.notdef /.notdef /.notdef /.notdef
/.notdef /.notdef /space /exclam /quotedbl
/numbersign /dollar /percent /ampersand /quotesingle
/parenleft /parenright /asterisk /plus /comma
/hyphen /period /slash /zero /one
/two /three /four /five /six
/seven /eight /nine /colon /semicolon
/less /equal /greater /question /at
/A /B /C /D /E
/F /G /H /I /J
/K /L /M /N /O
/P /Q /R /S /T
/U /V /W /X /Y
/Z /bracketleft /backslash /bracketright /asciicircum
/underscore /quoteleft /a /b /c
/d /e /f /g /h
/i /j /k /l /m
/n /o /p /q /r
/s /t /u /v /w
/x /y /z /braceleft /bar
/braceright /asciitilde /bullet /Euro /bullet
/quotesinglbase /florin /quotedblbase /ellipsis /dagger
/daggerdbl /circumflex /perthousand /Scaron /guilsinglleft
/OE /bullet /Zcaron /bullet /bullet
/quoteleft /quoteright /quotedblleft /quotedblright /bullet
/endash /emdash /asciitilde /trademark /scaron
/guilsinglright /oe /bullet /zcaron /Ydieresis
/space /exclamdown /cent /sterling /currency
/yen /brokenbar /section /dieresis /copyright
/ordfeminine /guillemotleft /logicalnot /sfthyphen /registered
/macron /degree /plusminus /twosuperior /threesuperior
/acute /mu /paragraph /middot /cedilla
/onesuperior /ordmasculine /guillemotright /onequarter /onehalf
/threequarters /questiondown /Agrave /Aacute /Acircumflex
/Atilde /Adieresis /Aring /AE /Ccedilla
/Egrave /Eacute /Ecircumflex /Edieresis /Igrave
/Iacute /Icircumflex /Idieresis /Eth /Ntilde
/Ograve /Oacute /Ocircumflex /Otilde /Odieresis
/multiply /Oslash /Ugrave /Uacute /Ucircumflex
/Udieresis /Yacute /Thorn /germandbls /agrave
/aacute /acircumflex /atilde /adieresis /aring
/ae /ccedilla /egrave /eacute /ecircumflex
/edieresis /igrave /iacute /icircumflex /idieresis
/eth /ntilde /ograve /oacute /ocircumflex
/otilde /odieresis /divide /oslash /ugrave
/uacute /ucircumflex /udieresis /yacute /thorn
/ydieresis
] def
%%EndResource
%FOPBeginFontReencode
/Courier-Oblique findfont
dup length dict begin
  {1 index /FID ne {def} {pop pop} ifelse} forall
  /Encoding WinAnsiEncoding def
  currentdict
end
/Courier-Oblique exch definefont pop
/Courier-BoldOblique findfont
dup length dict begin
  {1 index /FID ne {def} {pop pop} ifelse} forall
  /Encoding WinAnsiEncoding def
  currentdict
end
/Courier-BoldOblique exch definefont pop
/Courier-Bold findfont
dup length dict begin
  {1 index /FID ne {def} {pop pop} ifelse} forall
  /Encoding WinAnsiEncoding def
  currentdict
end
/Courier-Bold exch definefont pop
/Helvetica findfont
dup length dict begin
  {1 index /FID ne {def} {pop pop} ifelse} forall
  /Encoding WinAnsiEncoding def
  currentdict
end
/Helvetica exch definefont pop
/Helvetica-Oblique findfont
dup length dict begin
  {1 index /FID ne {def} {pop pop} ifelse} forall
  /Encoding WinAnsiEncoding def
  currentdict
end
/Helvetica-Oblique exch definefont pop
/Helvetica-Bold findfont
dup length dict begin
  {1 index /FID ne {def} {pop pop} ifelse} forall
  /Encoding WinAnsiEncoding def
  currentdict
end
/Helvetica-Bold exch definefont pop
/Helvetica-BoldOblique findfont
dup length dict begin
  {1 index /FID ne {def} {pop pop} ifelse} forall
  /Encoding WinAnsiEncoding def
  currentdict
end
/Helvetica-BoldOblique exch definefont pop
/Times-Roman findfont
dup length dict begin
  {1 index /FID ne {def} {pop pop} ifelse} forall
  /Encoding WinAnsiEncoding def
  currentdict
end
/Times-Roman exch definefont pop
/Times-Italic findfont
dup length dict begin
  {1 index /FID ne {def} {pop pop} ifelse} forall
  /Encoding WinAnsiEncoding def
  currentdict
end
/Times-Italic exch definefont pop
/Times-Bold findfont
dup length dict begin
  {1 index /FID ne {def} {pop pop} ifelse} forall
  /Encoding WinAnsiEncoding def
  currentdict
end
/Times-Bold exch definefont pop
/Times-BoldItalic findfont
dup length dict begin
  {1 index /FID ne {def} {pop pop} ifelse} forall
  /Encoding WinAnsiEncoding def
  currentdict
end
/Times-BoldItalic exch definefont pop
/Courier findfont
dup length dict begin
  {1 index /FID ne {def} {pop pop} ifelse} forall
  /Encoding WinAnsiEncoding def
  currentdict
end
/Courier exch definefont pop
%FOPEndFontReencode
%%EndProlog
%%Page: 1 1
%%PageBoundingBox: 0 0 306 215
%%BeginPageSetup
[1 0 0 -1 0 215] CT
%%EndPageSetup
GS
1 GC
N
0 0 306 215 re
f
GR
GS
1 GC
N
0 0 306 215 re
f
GR
GS
1 GC
N
40 191.5 M
277 191.5 L
277 16.5 L
40 16.5 L
cp
f
GR
GS
0.873 GC
1 LJ
0.5 LW
N
40 191.5 M
40 16.5 L
S
GR
GS
0.873 GC
1 LJ
0.5 LW
N
79.5 191.5 M
79.5 16.5 L
S
GR
GS
0.873 GC
1 LJ
0.5 LW
N
119 191.5 M
119 16.5 L
S
GR
GS
0.873 GC
1 LJ
0.5 LW
N
158.5 191.5 M
158.5 16.5 L
S
GR
GS
0.873 GC
1 LJ
0.5 LW
N
198 191.5 M
198 16.5 L
S
GR
GS
0.873 GC
1 LJ
0.5 LW
N
237.5 191.5 M
237.5 16.5 L
S
GR
GS
0.873 GC
1 LJ
0.5 LW
N
277 191.5 M
277 16.5 L
S
GR
GS
0.873 GC
1 LJ
0.5 LW
N
277 191.5 M
40 191.5 L
S
GR
GS
0.873 GC
1 LJ
0.5 LW
N
277 162.333 M
40 162.333 L
S
GR
GS
0.873 GC
1 LJ
0.5 LW
N
277 133.167 M
40 133.167 L
S
GR
GS
0.873 GC
1 LJ
0.5 LW
N
277 104 M
40 104 L
S
GR
GS
0.873 GC
1 LJ
0.5 LW
N
277 74.833 M
40 74.833 L
S
GR
GS
0.873 GC
1 LJ
0.5 LW
N
277 45.667 M
40 45.667 L
S
GR
GS
0.873 GC
1 LJ
0.5 LW
N
277 16.5 M
40 16.5 L
S
GR
GS
0.149 GC
2 setlinecap
1 LJ
0.5 LW
N
40 191.5 M
277 191.5 L
S
GR
GS
0.149 GC
2 setlinecap
1 LJ
0.5 LW
N
40 191.5 M
40 189.13 L
S
GR
GS
0.149 GC
2 setlinecap
1 LJ
0.5 LW
N
79.5 191.5 M
79.5 189.13 L
S
GR
GS
0.149 GC
2 setlinecap
1 LJ
0.5 LW
N
119 191.5 M
119 189.13 L
S
GR
GS
0.149 GC
2 setlinecap
1 LJ
0.5 LW
N
158.5 191.5 M
158.5 189.13 L
S
GR
GS
0.149 GC
2 setlinecap
1 LJ
0.5 LW
N
198 191.5 M
198 189.13 L
S
GR
GS
0.149 GC
2 setlinecap
1 LJ
0.5 LW
N
237.5 191.5 M
237.5 189.13 L
S
GR
GS
0.149 GC
2 setlinecap
1 LJ
0.5 LW
N
277 191.5 M
277 189.13 L
S
GR
GS
[1 0 0 1 40 195.5] CT
0.149 GC
/Helvetica 10 F
GS
[1 0 0 1 0 0] CT
-5 10 moveto 
1 -1 scale
(-6) t 
GR
GR
GS
[1 0 0 1 79.5 195.5] CT
0.149 GC
/Helvetica 10 F
GS
[1 0 0 1 0 0] CT
-5 10 moveto 
1 -1 scale
(-4) t 
GR
GR
GS
[1 0 0 1 119 195.5] CT
0.149 GC
/Helvetica 10 F
GS
[1 0 0 1 0 0] CT
-5 10 moveto 
1 -1 scale
(-2) t 
GR
GR
GS
[1 0 0 1 158.5 195.5] CT
0.149 GC
/Helvetica 10 F
GS
[1 0 0 1 0 0] CT
-3 10 moveto 
1 -1 scale
(0) t 
GR
GR
GS
[1 0 0 1 198 195.5] CT
0.149 GC
/Helvetica 10 F
GS
[1 0 0 1 0 0] CT
-3 10 moveto 
1 -1 scale
(2) t 
GR
GR
GS
[1 0 0 1 237.5 195.5] CT
0.149 GC
/Helvetica 10 F
GS
[1 0 0 1 0 0] CT
-3 10 moveto 
1 -1 scale
(4) t 
GR
GR
GS
[1 0 0 1 277 195.5] CT
0.149 GC
/Helvetica 10 F
GS
[1 0 0 1 0 0] CT
-3 10 moveto 
1 -1 scale
(6) t 
GR
GR
GS
0.149 GC
2 setlinecap
1 LJ
0.5 LW
N
40 191.5 M
40 16.5 L
S
GR
GS
0.149 GC
2 setlinecap
1 LJ
0.5 LW
N
40 191.5 M
42.37 191.5 L
S
GR
GS
0.149 GC
2 setlinecap
1 LJ
0.5 LW
N
40 162.333 M
42.37 162.333 L
S
GR
GS
0.149 GC
2 setlinecap
1 LJ
0.5 LW
N
40 133.167 M
42.37 133.167 L
S
GR
GS
0.149 GC
2 setlinecap
1 LJ
0.5 LW
N
40 104 M
42.37 104 L
S
GR
GS
0.149 GC
2 setlinecap
1 LJ
0.5 LW
N
40 74.833 M
42.37 74.833 L
S
GR
GS
0.149 GC
2 setlinecap
1 LJ
0.5 LW
N
40 45.667 M
42.37 45.667 L
S
GR
GS
0.149 GC
2 setlinecap
1 LJ
0.5 LW
N
40 16.5 M
42.37 16.5 L
S
GR
GS
[1 0 0 1 36 191.5] CT
0.149 GC
/Helvetica 10 F
GS
[1 0 0 1 0 0] CT
-16 3.5 moveto 
1 -1 scale
(-10) t 
GR
GR
GS
[1 0 0 1 36 162.33333] CT
0.149 GC
/Helvetica 10 F
GS
[1 0 0 1 0 0] CT
-6 3.5 moveto 
1 -1 scale
(0) t 
GR
GR
GS
[1 0 0 1 36 133.16667] CT
0.149 GC
/Helvetica 10 F
GS
[1 0 0 1 0 0] CT
-12 3.5 moveto 
1 -1 scale
(10) t 
GR
GR
GS
[1 0 0 1 36 104] CT
0.149 GC
/Helvetica 10 F
GS
[1 0 0 1 0 0] CT
-12 3.5 moveto 
1 -1 scale
(20) t 
GR
GR
GS
[1 0 0 1 36 74.83334] CT
0.149 GC
/Helvetica 10 F
GS
[1 0 0 1 0 0] CT
-12 3.5 moveto 
1 -1 scale
(30) t 
GR
GR
GS
[1 0 0 1 36 45.66667] CT
0.149 GC
/Helvetica 10 F
GS
[1 0 0 1 0 0] CT
-12 3.5 moveto 
1 -1 scale
(40) t 
GR
GR
GS
[1 0 0 1 36 16.5] CT
0.149 GC
/Helvetica 10 F
GS
[1 0 0 1 0 0] CT
-12 3.5 moveto 
1 -1 scale
(50) t 
GR
GR
GS
[1 0 0 1 158.50015 15.12892] CT
/Helvetica-Bold 11 F
GS
[1 0 0 1 0 0] CT
-87 -3 moveto 
1 -1 scale
(Estimation for N = 100000 H = 0.7) t 
GR
GR
GS
0 0.447 0.741 RC
1 LJ
1.5 LW
N
40 74.833 M
42.394 78.679 L
44.788 82.44 L
47.182 86.114 L
49.576 89.703 L
51.97 93.206 L
54.364 96.624 L
56.758 99.956 L
59.152 103.202 L
61.545 106.362 L
63.939 109.437 L
66.333 112.426 L
68.727 115.329 L
71.121 118.147 L
73.515 120.879 L
75.909 123.525 L
78.303 126.085 L
80.697 128.56 L
83.091 130.949 L
85.485 133.252 L
87.879 135.47 L
90.273 137.602 L
92.667 139.648 L
95.061 141.609 L
97.455 143.483 L
99.848 145.273 L
102.242 146.976 L
104.636 148.594 L
107.03 150.126 L
109.424 151.572 L
111.818 152.933 L
114.212 154.207 L
116.606 155.397 L
119 156.5 L
121.394 157.518 L
123.788 158.45 L
126.182 159.296 L
128.576 160.057 L
130.97 160.732 L
133.364 161.321 L
135.758 161.824 L
138.152 162.242 L
140.545 162.574 L
142.939 162.821 L
145.333 162.981 L
147.727 163.056 L
150.121 163.046 L
152.515 162.949 L
154.909 162.767 L
157.303 162.499 L
159.697 162.146 L
162.091 161.707 L
164.485 161.182 L
166.879 160.571 L
169.273 159.875 L
171.667 159.093 L
174.061 158.225 L
176.455 157.271 L
178.848 156.232 L
181.242 155.107 L
183.636 153.897 L
186.03 152.6 L
188.424 151.218 L
190.818 149.751 L
193.212 148.197 L
195.606 146.558 L
198 144.833 L
200.394 143.023 L
202.788 141.127 L
205.182 139.145 L
207.576 137.077 L
209.97 134.924 L
212.364 132.685 L
214.758 130.36 L
217.152 127.949 L
219.545 125.453 L
221.939 122.871 L
224.333 120.204 L
226.727 117.45 L
229.121 114.611 L
231.515 111.687 L
233.909 108.676 L
236.303 105.58 L
238.697 102.398 L
241.091 99.131 L
243.485 95.778 L
245.879 92.339 L
248.273 88.814 L
250.667 85.204 L
253.061 81.508 L
255.455 77.726 L
257.848 73.858 L
260.242 69.905 L
262.636 65.866 L
265.03 61.742 L
267.424 57.532 L
269.818 53.236 L
272.212 48.854 L
274.606 44.386 L
277 39.833 L
S
GR
GS
0.851 0.325 0.098 RC
1 LJ
N
40 87.446 M
42.394 89.879 L
44.788 92.013 L
47.182 94.68 L
49.576 97.175 L
51.97 100.377 L
54.364 103.579 L
56.758 106.207 L
59.152 108.942 L
61.545 111.859 L
63.939 114.482 L
66.333 117.225 L
68.727 119.882 L
71.121 122.408 L
73.515 124.745 L
75.909 127.155 L
78.303 129.413 L
80.697 131.73 L
83.091 133.829 L
85.485 135.912 L
87.879 137.915 L
90.273 139.86 L
92.667 141.668 L
95.061 143.48 L
97.455 145.177 L
99.848 146.799 L
102.242 148.4 L
104.636 149.857 L
107.03 151.258 L
109.424 152.583 L
111.818 153.781 L
114.212 154.957 L
116.606 156.029 L
119 157.023 L
121.394 157.98 L
123.788 158.848 L
126.182 159.592 L
128.576 160.282 L
130.97 160.873 L
133.364 161.413 L
135.758 161.868 L
138.152 162.253 L
140.545 162.545 L
142.939 162.764 L
145.333 162.9 L
147.727 162.956 L
150.121 162.93 L
152.515 162.822 L
154.909 162.639 L
157.303 162.382 L
159.697 162.045 L
162.091 161.635 L
164.485 161.125 L
166.879 160.537 L
169.273 159.877 L
171.667 159.142 L
174.061 158.327 L
176.455 157.427 L
178.848 156.452 L
181.242 155.392 L
183.636 154.263 L
186.03 153.038 L
188.424 151.778 L
190.818 150.438 L
193.212 148.994 L
195.606 147.422 L
198 145.79 L
200.394 144.099 L
202.788 142.341 L
205.182 140.572 L
207.576 138.729 L
209.97 136.738 L
212.364 134.567 L
214.758 132.429 L
217.152 130.221 L
219.545 127.934 L
221.939 125.651 L
224.333 123.142 L
226.727 120.54 L
229.121 117.845 L
231.515 115.161 L
233.909 112.389 L
236.303 109.724 L
238.697 106.81 L
241.091 103.888 L
243.485 100.857 L
245.879 97.525 L
248.273 94.285 L
250.667 91.04 L
253.061 87.872 L
255.455 84.565 L
257.848 81.033 L
260.242 77.502 L
262.636 74.031 L
265.03 70.743 L
267.424 67.06 L
269.818 63.584 L
272.212 59.802 L
274.606 56.028 L
277 53.807 L
S
GR
GS
[1 0 0 1 40 87.44647] CT
0.851 0.325 0.098 RC
N
1 0 M
1 0.552 0.552 1 0 1 C
-0.552 1 -1 0.552 -1 0 C
-1 -0.552 -0.552 -1 0 -1 C
0.552 -1 1 -0.552 1 0 C
cp
f
GR
GS
[1 0 0 1 42.39394 89.87871] CT
0.851 0.325 0.098 RC
N
/f-891180347{1 0 M
1 0.552 0.552 1 0 1 C
-0.552 1 -1 0.552 -1 0 C
-1 -0.552 -0.552 -1 0 -1 C
0.552 -1 1 -0.552 1 0 C
cp}def
f-891180347
f
GR
GS
[1 0 0 1 44.78788 92.01335] CT
0.851 0.325 0.098 RC
N
f-891180347
f
GR
GS
[1 0 0 1 47.18182 94.68015] CT
0.851 0.325 0.098 RC
N
f-891180347
f
GR
GS
[1 0 0 1 49.57576 97.17522] CT
0.851 0.325 0.098 RC
N
f-891180347
f
GR
GS
[1 0 0 1 51.9697 100.37698] CT
0.851 0.325 0.098 RC
N
f-891180347
f
GR
GS
[1 0 0 1 54.36363 103.57908] CT
0.851 0.325 0.098 RC
N
f-891180347
f
GR
GS
[1 0 0 1 56.75758 106.20716] CT
0.851 0.325 0.098 RC
N
f-891180347
f
GR
GS
[1 0 0 1 59.15152 108.94248] CT
0.851 0.325 0.098 RC
N
f-891180347
f
GR
GS
[1 0 0 1 61.54545 111.8591] CT
0.851 0.325 0.098 RC
N
f-891180347
f
GR
GS
[1 0 0 1 63.93939 114.48245] CT
0.851 0.325 0.098 RC
N
f-891180347
f
GR
GS
[1 0 0 1 66.33334 117.2252] CT
0.851 0.325 0.098 RC
N
f-891180347
f
GR
GS
[1 0 0 1 68.72727 119.88245] CT
0.851 0.325 0.098 RC
N
f-891180347
f
GR
GS
[1 0 0 1 71.12121 122.40796] CT
0.851 0.325 0.098 RC
N
f-891180347
f
GR
GS
[1 0 0 1 73.51514 124.74472] CT
0.851 0.325 0.098 RC
N
f-891180347
f
GR
GS
[1 0 0 1 75.9091 127.15514] CT
0.851 0.325 0.098 RC
N
f-891180347
f
GR
GS
[1 0 0 1 78.30303 129.41338] CT
0.851 0.325 0.098 RC
N
f-891180347
f
GR
GS
[1 0 0 1 80.69697 131.72989] CT
0.851 0.325 0.098 RC
N
f-891180347
f
GR
GS
[1 0 0 1 83.09091 133.82893] CT
0.851 0.325 0.098 RC
N
f-891180347
f
GR
GS
[1 0 0 1 85.48485 135.91231] CT
0.851 0.325 0.098 RC
N
f-891180347
f
GR
GS
[1 0 0 1 87.87879 137.91475] CT
0.851 0.325 0.098 RC
N
f-891180347
f
GR
GS
[1 0 0 1 90.27273 139.85995] CT
0.851 0.325 0.098 RC
N
f-891180347
f
GR
GS
[1 0 0 1 92.66667 141.66838] CT
0.851 0.325 0.098 RC
N
f-891180347
f
GR
GS
[1 0 0 1 95.06061 143.48007] CT
0.851 0.325 0.098 RC
N
f-891180347
f
GR
GS
[1 0 0 1 97.45454 145.17699] CT
0.851 0.325 0.098 RC
N
f-891180347
f
GR
GS
[1 0 0 1 99.84849 146.79869] CT
0.851 0.325 0.098 RC
N
f-891180347
f
GR
GS
[1 0 0 1 102.24242 148.40007] CT
0.851 0.325 0.098 RC
N
f-891180347
f
GR
GS
[1 0 0 1 104.63636 149.85681] CT
0.851 0.325 0.098 RC
N
f-891180347
f
GR
GS
[1 0 0 1 107.0303 151.25758] CT
0.851 0.325 0.098 RC
N
f-891180347
f
GR
GS
[1 0 0 1 109.42424 152.58287] CT
0.851 0.325 0.098 RC
N
f-891180347
f
GR
GS
[1 0 0 1 111.81818 153.78145] CT
0.851 0.325 0.098 RC
N
f-891180347
f
GR
GS
[1 0 0 1 114.21212 154.95731] CT
0.851 0.325 0.098 RC
N
f-891180347
f
GR
GS
[1 0 0 1 116.60606 156.0291] CT
0.851 0.325 0.098 RC
N
f-891180347
f
GR
GS
[1 0 0 1 119 157.02299] CT
0.851 0.325 0.098 RC
N
f-891180347
f
GR
GS
[1 0 0 1 121.39394 157.97954] CT
0.851 0.325 0.098 RC
N
f-891180347
f
GR
GS
[1 0 0 1 123.78788 158.84842] CT
0.851 0.325 0.098 RC
N
f-891180347
f
GR
GS
[1 0 0 1 126.18182 159.59245] CT
0.851 0.325 0.098 RC
N
f-891180347
f
GR
GS
[1 0 0 1 128.57576 160.28181] CT
0.851 0.325 0.098 RC
N
f-891180347
f
GR
GS
[1 0 0 1 130.9697 160.87326] CT
0.851 0.325 0.098 RC
N
f-891180347
f
GR
GS
[1 0 0 1 133.36363 161.41347] CT
0.851 0.325 0.098 RC
N
f-891180347
f
GR
GS
[1 0 0 1 135.75758 161.86806] CT
0.851 0.325 0.098 RC
N
f-891180347
f
GR
GS
[1 0 0 1 138.15152 162.25259] CT
0.851 0.325 0.098 RC
N
f-891180347
f
GR
GS
[1 0 0 1 140.54546 162.54539] CT
0.851 0.325 0.098 RC
N
f-891180347
f
GR
GS
[1 0 0 1 142.93939 162.76443] CT
0.851 0.325 0.098 RC
N
f-891180347
f
GR
GS
[1 0 0 1 145.33333 162.90018] CT
0.851 0.325 0.098 RC
N
f-891180347
f
GR
GS
[1 0 0 1 147.72728 162.95648] CT
0.851 0.325 0.098 RC
N
f-891180347
f
GR
GS
[1 0 0 1 150.12122 162.92979] CT
0.851 0.325 0.098 RC
N
f-891180347
f
GR
GS
[1 0 0 1 152.51515 162.8223] CT
0.851 0.325 0.098 RC
N
f-891180347
f
GR
GS
[1 0 0 1 154.90909 162.63864] CT
0.851 0.325 0.098 RC
N
f-891180347
f
GR
GS
[1 0 0 1 157.30302 162.38158] CT
0.851 0.325 0.098 RC
N
f-891180347
f
GR
GS
[1 0 0 1 159.69698 162.04509] CT
0.851 0.325 0.098 RC
N
f-891180347
f
GR
GS
[1 0 0 1 162.09091 161.6348] CT
0.851 0.325 0.098 RC
N
f-891180347
f
GR
GS
[1 0 0 1 164.48485 161.12468] CT
0.851 0.325 0.098 RC
N
f-891180347
f
GR
GS
[1 0 0 1 166.87878 160.53673] CT
0.851 0.325 0.098 RC
N
f-891180347
f
GR
GS
[1 0 0 1 169.27272 159.87697] CT
0.851 0.325 0.098 RC
N
f-891180347
f
GR
GS
[1 0 0 1 171.66667 159.14243] CT
0.851 0.325 0.098 RC
N
f-891180347
f
GR
GS
[1 0 0 1 174.06061 158.32664] CT
0.851 0.325 0.098 RC
N
f-891180347
f
GR
GS
[1 0 0 1 176.45454 157.42673] CT
0.851 0.325 0.098 RC
N
f-891180347
f
GR
GS
[1 0 0 1 178.84848 156.45212] CT
0.851 0.325 0.098 RC
N
f-891180347
f
GR
GS
[1 0 0 1 181.24242 155.39185] CT
0.851 0.325 0.098 RC
N
f-891180347
f
GR
GS
[1 0 0 1 183.63637 154.26324] CT
0.851 0.325 0.098 RC
N
f-891180347
f
GR
GS
[1 0 0 1 186.0303 153.03802] CT
0.851 0.325 0.098 RC
N
f-891180347
f
GR
GS
[1 0 0 1 188.42424 151.778] CT
0.851 0.325 0.098 RC
N
f-891180347
f
GR
GS
[1 0 0 1 190.81818 150.43826] CT
0.851 0.325 0.098 RC
N
f-891180347
f
GR
GS
[1 0 0 1 193.21213 148.99435] CT
0.851 0.325 0.098 RC
N
f-891180347
f
GR
GS
[1 0 0 1 195.60606 147.42201] CT
0.851 0.325 0.098 RC
N
f-891180347
f
GR
GS
[1 0 0 1 198 145.78954] CT
0.851 0.325 0.098 RC
N
f-891180347
f
GR
GS
[1 0 0 1 200.39394 144.09917] CT
0.851 0.325 0.098 RC
N
f-891180347
f
GR
GS
[1 0 0 1 202.78787 142.34084] CT
0.851 0.325 0.098 RC
N
f-891180347
f
GR
GS
[1 0 0 1 205.18181 140.57152] CT
0.851 0.325 0.098 RC
N
f-891180347
f
GR
GS
[1 0 0 1 207.57576 138.7287] CT
0.851 0.325 0.098 RC
N
f-891180347
f
GR
GS
[1 0 0 1 209.9697 136.73793] CT
0.851 0.325 0.098 RC
N
f-891180347
f
GR
GS
[1 0 0 1 212.36363 134.56685] CT
0.851 0.325 0.098 RC
N
f-891180347
f
GR
GS
[1 0 0 1 214.75757 132.42856] CT
0.851 0.325 0.098 RC
N
f-891180347
f
GR
GS
[1 0 0 1 217.15152 130.22066] CT
0.851 0.325 0.098 RC
N
f-891180347
f
GR
GS
[1 0 0 1 219.54546 127.93393] CT
0.851 0.325 0.098 RC
N
f-891180347
f
GR
GS
[1 0 0 1 221.93939 125.65125] CT
0.851 0.325 0.098 RC
N
f-891180347
f
GR
GS
[1 0 0 1 224.33333 123.14233] CT
0.851 0.325 0.098 RC
N
f-891180347
f
GR
GS
[1 0 0 1 226.72728 120.53983] CT
0.851 0.325 0.098 RC
N
f-891180347
f
GR
GS
[1 0 0 1 229.12122 117.84488] CT
0.851 0.325 0.098 RC
N
f-891180347
f
GR
GS
[1 0 0 1 231.51515 115.1613] CT
0.851 0.325 0.098 RC
N
f-891180347
f
GR
GS
[1 0 0 1 233.90909 112.38902] CT
0.851 0.325 0.098 RC
N
f-891180347
f
GR
GS
[1 0 0 1 236.30302 109.72392] CT
0.851 0.325 0.098 RC
N
f-891180347
f
GR
GS
[1 0 0 1 238.69698 106.81047] CT
0.851 0.325 0.098 RC
N
f-891180347
f
GR
GS
[1 0 0 1 241.09091 103.88847] CT
0.851 0.325 0.098 RC
N
f-891180347
f
GR
GS
[1 0 0 1 243.48485 100.857] CT
0.851 0.325 0.098 RC
N
f-891180347
f
GR
GS
[1 0 0 1 245.87878 97.52487] CT
0.851 0.325 0.098 RC
N
f-891180347
f
GR
GS
[1 0 0 1 248.27272 94.28524] CT
0.851 0.325 0.098 RC
N
f-891180347
f
GR
GS
[1 0 0 1 250.66666 91.04039] CT
0.851 0.325 0.098 RC
N
f-891180347
f
GR
GS
[1 0 0 1 253.06061 87.87162] CT
0.851 0.325 0.098 RC
N
f-891180347
f
GR
GS
[1 0 0 1 255.45454 84.56467] CT
0.851 0.325 0.098 RC
N
f-891180347
f
GR
GS
[1 0 0 1 257.84848 81.03325] CT
0.851 0.325 0.098 RC
N
f-891180347
f
GR
GS
[1 0 0 1 260.24243 77.50245] CT
0.851 0.325 0.098 RC
N
f-891180347
f
GR
GS
[1 0 0 1 262.63638 74.03127] CT
0.851 0.325 0.098 RC
N
f-891180347
f
GR
GS
[1 0 0 1 265.0303 70.74311] CT
0.851 0.325 0.098 RC
N
f-891180347
f
GR
GS
[1 0 0 1 267.42426 67.05958] CT
0.851 0.325 0.098 RC
N
f-891180347
f
GR
GS
[1 0 0 1 269.81818 63.5843] CT
0.851 0.325 0.098 RC
N
f-891180347
f
GR
GS
[1 0 0 1 272.21213 59.80154] CT
0.851 0.325 0.098 RC
N
f-891180347
f
GR
GS
[1 0 0 1 274.60605 56.02834] CT
0.851 0.325 0.098 RC
N
f-891180347
f
GR
GS
[1 0 0 1 277 53.80655] CT
0.851 0.325 0.098 RC
N
f-891180347
f
GR
GS
1 GC
N
140 51.5 M
140 25 L
58.5 25 L
58.5 51.5 L
cp
f
GR
GS
[1 0 0 1 95.5 32.5] CT
/Helvetica 9 F
GS
[1 0 0 1 0 0] CT
0 3.5 moveto 
1 -1 scale
(Real) t 
GR
GR
GS
0 0.447 0.741 RC
1 LJ
1.5 LW
N
62.5 32.5 M
92.5 32.5 L
S
GR
GS
[1 0 0 1 95.5 44] CT
/Helvetica 9 F
GS
[1 0 0 1 0 0] CT
0 3.5 moveto 
1 -1 scale
(Estimated) t 
GR
GR
GS
0.851 0.325 0.098 RC
1 LJ
N
62.5 44 M
92.5 44 L
S
GR
GS
[1 0 0 1 77.5 44] CT
0.851 0.325 0.098 RC
N
f-891180347
f
GR
GS
0.149 GC
10.0 ML
0.5 LW
N
58.5 51.5 M
58.5 25 L
140 25 L
140 51.5 L
cp
S
GR
%%Trailer
%%Pages: 1
%%EOF
