%!PS-Adobe-3.0 EPSF-3.0
%%Creator: (MATLAB, The Mathworks, Inc. Version 23.2.0.2409890 \(R2023b\) Update 3. Operating System: Mac OS X)
%%Title: /Users/jakub/Projects/modeling-and-identification/report-03/images/lab8/1000.eps
%%CreationDate: 2024-01-04T18:12:14
%%Pages: (atend)
%%BoundingBox:     0     0   305   216
%%LanguageLevel: 3
%%EndComments
%%BeginProlog
%%BeginResource: procset (Apache XML Graphics Std ProcSet) 1.2 0
%%Version: 1.2 0
%%Copyright: (Copyright 2001-2003,2010 The Apache Software Foundation. License terms: http://www.apache.org/licenses/LICENSE-2.0)
/bd{bind def}bind def
/ld{load def}bd
/GR/grestore ld
/GS/gsave ld
/RM/rmoveto ld
/C/curveto ld
/t/show ld
/L/lineto ld
/ML/setmiterlimit ld
/CT/concat ld
/f/fill ld
/N/newpath ld
/S/stroke ld
/CC/setcmykcolor ld
/A/ashow ld
/cp/closepath ld
/RC/setrgbcolor ld
/LJ/setlinejoin ld
/GC/setgray ld
/LW/setlinewidth ld
/M/moveto ld
/re {4 2 roll M
1 index 0 rlineto
0 exch rlineto
neg 0 rlineto
cp } bd
/_ctm matrix def
/_tm matrix def
/BT { _ctm currentmatrix pop matrix _tm copy pop 0 0 moveto } bd
/ET { _ctm setmatrix } bd
/iTm { _ctm setmatrix _tm concat } bd
/Tm { _tm astore pop iTm 0 0 moveto } bd
/ux 0.0 def
/uy 0.0 def
/F {
  /Tp exch def
  /Tf exch def
  Tf findfont Tp scalefont setfont
  /cf Tf def  /cs Tp def
} bd
/ULS {currentpoint /uy exch def /ux exch def} bd
/ULE {
  /Tcx currentpoint pop def
  gsave
  newpath
  cf findfont cs scalefont dup
  /FontMatrix get 0 get /Ts exch def /FontInfo get dup
  /UnderlinePosition get Ts mul /To exch def
  /UnderlineThickness get Ts mul /Tt exch def
  ux uy To add moveto  Tcx uy To add lineto
  Tt setlinewidth stroke
  grestore
} bd
/OLE {
  /Tcx currentpoint pop def
  gsave
  newpath
  cf findfont cs scalefont dup
  /FontMatrix get 0 get /Ts exch def /FontInfo get dup
  /UnderlinePosition get Ts mul /To exch def
  /UnderlineThickness get Ts mul /Tt exch def
  ux uy To add cs add moveto Tcx uy To add cs add lineto
  Tt setlinewidth stroke
  grestore
} bd
/SOE {
  /Tcx currentpoint pop def
  gsave
  newpath
  cf findfont cs scalefont dup
  /FontMatrix get 0 get /Ts exch def /FontInfo get dup
  /UnderlinePosition get Ts mul /To exch def
  /UnderlineThickness get Ts mul /Tt exch def
  ux uy To add cs 10 mul 26 idiv add moveto Tcx uy To add cs 10 mul 26 idiv add lineto
  Tt setlinewidth stroke
  grestore
} bd
/QT {
/Y22 exch store
/X22 exch store
/Y21 exch store
/X21 exch store
currentpoint
/Y21 load 2 mul add 3 div exch
/X21 load 2 mul add 3 div exch
/X21 load 2 mul /X22 load add 3 div
/Y21 load 2 mul /Y22 load add 3 div
/X22 load /Y22 load curveto
} bd
/SSPD {
dup length /d exch dict def
{
/v exch def
/k exch def
currentpagedevice k known {
/cpdv currentpagedevice k get def
v cpdv ne {
/upd false def
/nullv v type /nulltype eq def
/nullcpdv cpdv type /nulltype eq def
nullv nullcpdv or
{
/upd true def
} {
/sametype v type cpdv type eq def
sametype {
v type /arraytype eq {
/vlen v length def
/cpdvlen cpdv length def
vlen cpdvlen eq {
0 1 vlen 1 sub {
/i exch def
/obj v i get def
/cpdobj cpdv i get def
obj cpdobj ne {
/upd true def
exit
} if
} for
} {
/upd true def
} ifelse
} {
v type /dicttype eq {
v {
/dv exch def
/dk exch def
/cpddv cpdv dk get def
dv cpddv ne {
/upd true def
exit
} if
} forall
} {
/upd true def
} ifelse
} ifelse
} if
} ifelse
upd true eq {
d k v put
} if
} if
} if
} forall
d length 0 gt {
d setpagedevice
} if
} bd
/RE { % /NewFontName [NewEncodingArray] /FontName RE -
  findfont dup length dict begin
  {
    1 index /FID ne
    {def} {pop pop} ifelse
  } forall
  /Encoding exch def
  /FontName 1 index def
  currentdict definefont pop
  end
} bind def
%%EndResource
%%BeginResource: procset (Apache XML Graphics EPS ProcSet) 1.0 0
%%Version: 1.0 0
%%Copyright: (Copyright 2002-2003 The Apache Software Foundation. License terms: http://www.apache.org/licenses/LICENSE-2.0)
/BeginEPSF { %def
/b4_Inc_state save def         % Save state for cleanup
/dict_count countdictstack def % Count objects on dict stack
/op_count count 1 sub def      % Count objects on operand stack
userdict begin                 % Push userdict on dict stack
/showpage { } def              % Redefine showpage, { } = null proc
0 setgray 0 setlinecap         % Prepare graphics state
1 setlinewidth 0 setlinejoin
10 setmiterlimit [ ] 0 setdash newpath
/languagelevel where           % If level not equal to 1 then
{pop languagelevel             % set strokeadjust and
1 ne                           % overprint to their defaults.
{false setstrokeadjust false setoverprint
} if
} if
} bd
/EndEPSF { %def
count op_count sub {pop} repeat            % Clean up stacks
countdictstack dict_count sub {end} repeat
b4_Inc_state restore
} bd
%%EndResource
%FOPBeginFontDict
%%IncludeResource: font Courier-Oblique
%%IncludeResource: font Courier-BoldOblique
%%IncludeResource: font Courier-Bold
%%IncludeResource: font ZapfDingbats
%%IncludeResource: font Symbol
%%IncludeResource: font Helvetica
%%IncludeResource: font Helvetica-Oblique
%%IncludeResource: font Helvetica-Bold
%%IncludeResource: font Helvetica-BoldOblique
%%IncludeResource: font Times-Roman
%%IncludeResource: font Times-Italic
%%IncludeResource: font Times-Bold
%%IncludeResource: font Times-BoldItalic
%%IncludeResource: font Courier
%FOPEndFontDict
%%BeginResource: encoding WinAnsiEncoding
/WinAnsiEncoding [
/.notdef /.notdef /.notdef /.notdef /.notdef
/.notdef /.notdef /.notdef /.notdef /.notdef
/.notdef /.notdef /.notdef /.notdef /.notdef
/.notdef /.notdef /.notdef /.notdef /.notdef
/.notdef /.notdef /.notdef /.notdef /.notdef
/.notdef /.notdef /.notdef /.notdef /.notdef
/.notdef /.notdef /space /exclam /quotedbl
/numbersign /dollar /percent /ampersand /quotesingle
/parenleft /parenright /asterisk /plus /comma
/hyphen /period /slash /zero /one
/two /three /four /five /six
/seven /eight /nine /colon /semicolon
/less /equal /greater /question /at
/A /B /C /D /E
/F /G /H /I /J
/K /L /M /N /O
/P /Q /R /S /T
/U /V /W /X /Y
/Z /bracketleft /backslash /bracketright /asciicircum
/underscore /quoteleft /a /b /c
/d /e /f /g /h
/i /j /k /l /m
/n /o /p /q /r
/s /t /u /v /w
/x /y /z /braceleft /bar
/braceright /asciitilde /bullet /Euro /bullet
/quotesinglbase /florin /quotedblbase /ellipsis /dagger
/daggerdbl /circumflex /perthousand /Scaron /guilsinglleft
/OE /bullet /Zcaron /bullet /bullet
/quoteleft /quoteright /quotedblleft /quotedblright /bullet
/endash /emdash /asciitilde /trademark /scaron
/guilsinglright /oe /bullet /zcaron /Ydieresis
/space /exclamdown /cent /sterling /currency
/yen /brokenbar /section /dieresis /copyright
/ordfeminine /guillemotleft /logicalnot /sfthyphen /registered
/macron /degree /plusminus /twosuperior /threesuperior
/acute /mu /paragraph /middot /cedilla
/onesuperior /ordmasculine /guillemotright /onequarter /onehalf
/threequarters /questiondown /Agrave /Aacute /Acircumflex
/Atilde /Adieresis /Aring /AE /Ccedilla
/Egrave /Eacute /Ecircumflex /Edieresis /Igrave
/Iacute /Icircumflex /Idieresis /Eth /Ntilde
/Ograve /Oacute /Ocircumflex /Otilde /Odieresis
/multiply /Oslash /Ugrave /Uacute /Ucircumflex
/Udieresis /Yacute /Thorn /germandbls /agrave
/aacute /acircumflex /atilde /adieresis /aring
/ae /ccedilla /egrave /eacute /ecircumflex
/edieresis /igrave /iacute /icircumflex /idieresis
/eth /ntilde /ograve /oacute /ocircumflex
/otilde /odieresis /divide /oslash /ugrave
/uacute /ucircumflex /udieresis /yacute /thorn
/ydieresis
] def
%%EndResource
%FOPBeginFontReencode
/Courier-Oblique findfont
dup length dict begin
  {1 index /FID ne {def} {pop pop} ifelse} forall
  /Encoding WinAnsiEncoding def
  currentdict
end
/Courier-Oblique exch definefont pop
/Courier-BoldOblique findfont
dup length dict begin
  {1 index /FID ne {def} {pop pop} ifelse} forall
  /Encoding WinAnsiEncoding def
  currentdict
end
/Courier-BoldOblique exch definefont pop
/Courier-Bold findfont
dup length dict begin
  {1 index /FID ne {def} {pop pop} ifelse} forall
  /Encoding WinAnsiEncoding def
  currentdict
end
/Courier-Bold exch definefont pop
/Helvetica findfont
dup length dict begin
  {1 index /FID ne {def} {pop pop} ifelse} forall
  /Encoding WinAnsiEncoding def
  currentdict
end
/Helvetica exch definefont pop
/Helvetica-Oblique findfont
dup length dict begin
  {1 index /FID ne {def} {pop pop} ifelse} forall
  /Encoding WinAnsiEncoding def
  currentdict
end
/Helvetica-Oblique exch definefont pop
/Helvetica-Bold findfont
dup length dict begin
  {1 index /FID ne {def} {pop pop} ifelse} forall
  /Encoding WinAnsiEncoding def
  currentdict
end
/Helvetica-Bold exch definefont pop
/Helvetica-BoldOblique findfont
dup length dict begin
  {1 index /FID ne {def} {pop pop} ifelse} forall
  /Encoding WinAnsiEncoding def
  currentdict
end
/Helvetica-BoldOblique exch definefont pop
/Times-Roman findfont
dup length dict begin
  {1 index /FID ne {def} {pop pop} ifelse} forall
  /Encoding WinAnsiEncoding def
  currentdict
end
/Times-Roman exch definefont pop
/Times-Italic findfont
dup length dict begin
  {1 index /FID ne {def} {pop pop} ifelse} forall
  /Encoding WinAnsiEncoding def
  currentdict
end
/Times-Italic exch definefont pop
/Times-Bold findfont
dup length dict begin
  {1 index /FID ne {def} {pop pop} ifelse} forall
  /Encoding WinAnsiEncoding def
  currentdict
end
/Times-Bold exch definefont pop
/Times-BoldItalic findfont
dup length dict begin
  {1 index /FID ne {def} {pop pop} ifelse} forall
  /Encoding WinAnsiEncoding def
  currentdict
end
/Times-BoldItalic exch definefont pop
/Courier findfont
dup length dict begin
  {1 index /FID ne {def} {pop pop} ifelse} forall
  /Encoding WinAnsiEncoding def
  currentdict
end
/Courier exch definefont pop
%FOPEndFontReencode
%%EndProlog
%%Page: 1 1
%%PageBoundingBox: 0 0 305 216
%%BeginPageSetup
[1 0 0 -1 0 216] CT
%%EndPageSetup
GS
1 GC
N
0 0 305 216 re
f
GR
GS
1 GC
N
0 0 305 216 re
f
GR
GS
1 GC
N
39.5 192 M
276 192 L
276 16.5 L
39.5 16.5 L
cp
f
GR
GS
0.873 GC
1 LJ
0.5 LW
N
39.5 192 M
39.5 16.5 L
S
GR
GS
0.873 GC
1 LJ
0.5 LW
N
78.917 192 M
78.917 16.5 L
S
GR
GS
0.873 GC
1 LJ
0.5 LW
N
118.333 192 M
118.333 16.5 L
S
GR
GS
0.873 GC
1 LJ
0.5 LW
N
157.75 192 M
157.75 16.5 L
S
GR
GS
0.873 GC
1 LJ
0.5 LW
N
197.167 192 M
197.167 16.5 L
S
GR
GS
0.873 GC
1 LJ
0.5 LW
N
236.583 192 M
236.583 16.5 L
S
GR
GS
0.873 GC
1 LJ
0.5 LW
N
276 192 M
276 16.5 L
S
GR
GS
0.873 GC
1 LJ
0.5 LW
N
276 192 M
39.5 192 L
S
GR
GS
0.873 GC
1 LJ
0.5 LW
N
276 162.75 M
39.5 162.75 L
S
GR
GS
0.873 GC
1 LJ
0.5 LW
N
276 133.5 M
39.5 133.5 L
S
GR
GS
0.873 GC
1 LJ
0.5 LW
N
276 104.25 M
39.5 104.25 L
S
GR
GS
0.873 GC
1 LJ
0.5 LW
N
276 75 M
39.5 75 L
S
GR
GS
0.873 GC
1 LJ
0.5 LW
N
276 45.75 M
39.5 45.75 L
S
GR
GS
0.873 GC
1 LJ
0.5 LW
N
276 16.5 M
39.5 16.5 L
S
GR
GS
0.149 GC
2 setlinecap
1 LJ
0.5 LW
N
39.5 192 M
276 192 L
S
GR
GS
0.149 GC
2 setlinecap
1 LJ
0.5 LW
N
39.5 192 M
39.5 189.635 L
S
GR
GS
0.149 GC
2 setlinecap
1 LJ
0.5 LW
N
78.917 192 M
78.917 189.635 L
S
GR
GS
0.149 GC
2 setlinecap
1 LJ
0.5 LW
N
118.333 192 M
118.333 189.635 L
S
GR
GS
0.149 GC
2 setlinecap
1 LJ
0.5 LW
N
157.75 192 M
157.75 189.635 L
S
GR
GS
0.149 GC
2 setlinecap
1 LJ
0.5 LW
N
197.167 192 M
197.167 189.635 L
S
GR
GS
0.149 GC
2 setlinecap
1 LJ
0.5 LW
N
236.583 192 M
236.583 189.635 L
S
GR
GS
0.149 GC
2 setlinecap
1 LJ
0.5 LW
N
276 192 M
276 189.635 L
S
GR
GS
[1 0 0 1 39.5 196] CT
0.149 GC
/Helvetica 10 F
GS
[1 0 0 1 0 0] CT
-5 10 moveto 
1 -1 scale
(-6) t 
GR
GR
GS
[1 0 0 1 78.91666 196] CT
0.149 GC
/Helvetica 10 F
GS
[1 0 0 1 0 0] CT
-5 10 moveto 
1 -1 scale
(-4) t 
GR
GR
GS
[1 0 0 1 118.33334 196] CT
0.149 GC
/Helvetica 10 F
GS
[1 0 0 1 0 0] CT
-5 10 moveto 
1 -1 scale
(-2) t 
GR
GR
GS
[1 0 0 1 157.75 196] CT
0.149 GC
/Helvetica 10 F
GS
[1 0 0 1 0 0] CT
-3 10 moveto 
1 -1 scale
(0) t 
GR
GR
GS
[1 0 0 1 197.16667 196] CT
0.149 GC
/Helvetica 10 F
GS
[1 0 0 1 0 0] CT
-3 10 moveto 
1 -1 scale
(2) t 
GR
GR
GS
[1 0 0 1 236.58333 196] CT
0.149 GC
/Helvetica 10 F
GS
[1 0 0 1 0 0] CT
-3 10 moveto 
1 -1 scale
(4) t 
GR
GR
GS
[1 0 0 1 276 196] CT
0.149 GC
/Helvetica 10 F
GS
[1 0 0 1 0 0] CT
-3 10 moveto 
1 -1 scale
(6) t 
GR
GR
GS
0.149 GC
2 setlinecap
1 LJ
0.5 LW
N
39.5 192 M
39.5 16.5 L
S
GR
GS
0.149 GC
2 setlinecap
1 LJ
0.5 LW
N
39.5 192 M
41.865 192 L
S
GR
GS
0.149 GC
2 setlinecap
1 LJ
0.5 LW
N
39.5 162.75 M
41.865 162.75 L
S
GR
GS
0.149 GC
2 setlinecap
1 LJ
0.5 LW
N
39.5 133.5 M
41.865 133.5 L
S
GR
GS
0.149 GC
2 setlinecap
1 LJ
0.5 LW
N
39.5 104.25 M
41.865 104.25 L
S
GR
GS
0.149 GC
2 setlinecap
1 LJ
0.5 LW
N
39.5 75 M
41.865 75 L
S
GR
GS
0.149 GC
2 setlinecap
1 LJ
0.5 LW
N
39.5 45.75 M
41.865 45.75 L
S
GR
GS
0.149 GC
2 setlinecap
1 LJ
0.5 LW
N
39.5 16.5 M
41.865 16.5 L
S
GR
GS
[1 0 0 1 35.5 192] CT
0.149 GC
/Helvetica 10 F
GS
[1 0 0 1 0 0] CT
-16 3.5 moveto 
1 -1 scale
(-10) t 
GR
GR
GS
[1 0 0 1 35.5 162.75] CT
0.149 GC
/Helvetica 10 F
GS
[1 0 0 1 0 0] CT
-6 3.5 moveto 
1 -1 scale
(0) t 
GR
GR
GS
[1 0 0 1 35.5 133.5] CT
0.149 GC
/Helvetica 10 F
GS
[1 0 0 1 0 0] CT
-12 3.5 moveto 
1 -1 scale
(10) t 
GR
GR
GS
[1 0 0 1 35.5 104.25] CT
0.149 GC
/Helvetica 10 F
GS
[1 0 0 1 0 0] CT
-12 3.5 moveto 
1 -1 scale
(20) t 
GR
GR
GS
[1 0 0 1 35.5 75] CT
0.149 GC
/Helvetica 10 F
GS
[1 0 0 1 0 0] CT
-12 3.5 moveto 
1 -1 scale
(30) t 
GR
GR
GS
[1 0 0 1 35.5 45.75] CT
0.149 GC
/Helvetica 10 F
GS
[1 0 0 1 0 0] CT
-12 3.5 moveto 
1 -1 scale
(40) t 
GR
GR
GS
[1 0 0 1 35.5 16.5] CT
0.149 GC
/Helvetica 10 F
GS
[1 0 0 1 0 0] CT
-12 3.5 moveto 
1 -1 scale
(50) t 
GR
GR
GS
[1 0 0 1 157.75015 15.12891] CT
/Helvetica-Bold 11 F
GS
[1 0 0 1 0 0] CT
-81 -3 moveto 
1 -1 scale
(Estimation for N = 1000 H = 0.7) t 
GR
GR
GS
0 0.447 0.741 RC
1 LJ
1.5 LW
N
39.5 75 M
41.889 78.857 L
44.278 82.628 L
46.667 86.313 L
49.056 89.912 L
51.444 93.426 L
53.833 96.853 L
56.222 100.194 L
58.611 103.45 L
61 106.619 L
63.389 109.702 L
65.778 112.7 L
68.167 115.612 L
70.556 118.437 L
72.944 121.177 L
75.333 123.831 L
77.722 126.398 L
80.111 128.88 L
82.5 131.276 L
84.889 133.586 L
87.278 135.81 L
89.667 137.948 L
92.056 140 L
94.444 141.966 L
96.833 143.846 L
99.222 145.641 L
101.611 147.349 L
104 148.971 L
106.389 150.507 L
108.778 151.958 L
111.167 153.322 L
113.556 154.601 L
115.944 155.793 L
118.333 156.9 L
120.722 157.921 L
123.111 158.855 L
125.5 159.704 L
127.889 160.467 L
130.278 161.144 L
132.667 161.735 L
135.056 162.24 L
137.444 162.659 L
139.833 162.992 L
142.222 163.239 L
144.611 163.4 L
147 163.475 L
149.389 163.464 L
151.778 163.368 L
154.167 163.185 L
156.556 162.917 L
158.944 162.562 L
161.333 162.121 L
163.722 161.595 L
166.111 160.983 L
168.5 160.284 L
170.889 159.5 L
173.278 158.63 L
175.667 157.674 L
178.056 156.631 L
180.444 155.503 L
182.833 154.289 L
185.222 152.989 L
187.611 151.603 L
190 150.131 L
192.389 148.574 L
194.778 146.93 L
197.167 145.2 L
199.556 143.384 L
201.944 141.483 L
204.333 139.495 L
206.722 137.421 L
209.111 135.262 L
211.5 133.017 L
213.889 130.685 L
216.278 128.268 L
218.667 125.764 L
221.056 123.175 L
223.444 120.5 L
225.833 117.739 L
228.222 114.892 L
230.611 111.959 L
233 108.94 L
235.389 105.835 L
237.778 102.644 L
240.167 99.367 L
242.556 96.004 L
244.944 92.555 L
247.333 89.021 L
249.722 85.4 L
252.111 81.693 L
254.5 77.901 L
256.889 74.022 L
259.278 70.058 L
261.667 66.007 L
264.056 61.871 L
266.444 57.649 L
268.833 53.34 L
271.222 48.946 L
273.611 44.466 L
276 39.9 L
S
GR
GS
0.851 0.325 0.098 RC
1 LJ
N
70.556 92.834 M
72.944 97.122 L
75.333 99.289 L
77.722 103.707 L
80.111 105.499 L
82.5 110.675 L
84.889 114.788 L
87.278 120.115 L
89.667 123.724 L
92.056 127.362 L
94.444 131.463 L
96.833 135.287 L
99.222 136.469 L
101.611 137.951 L
104 139.573 L
106.389 142.67 L
108.778 145.849 L
111.167 147.871 L
113.556 149.34 L
115.944 151.407 L
118.333 152.767 L
120.722 154.582 L
123.111 155.691 L
125.5 157.324 L
127.889 158.779 L
130.278 159.734 L
132.667 160.57 L
135.056 161.228 L
137.444 161.714 L
139.833 162.185 L
142.222 162.625 L
144.611 162.901 L
147 163.093 L
149.389 163.153 L
151.778 162.957 L
154.167 162.777 L
156.556 162.458 L
158.944 162.041 L
161.333 161.612 L
163.722 161.132 L
166.111 160.466 L
168.5 159.552 L
170.889 158.71 L
173.278 157.513 L
175.667 155.89 L
178.056 154.366 L
180.444 153.081 L
182.833 151.574 L
185.222 149.597 L
187.611 147.861 L
190 146.081 L
192.389 143.091 L
194.778 140.4 L
197.167 138.362 L
199.556 136.393 L
201.944 133.997 L
204.333 130.801 L
206.722 127.14 L
209.111 123.899 L
211.5 119.56 L
213.889 116.154 L
216.278 112.592 L
218.667 109.839 L
221.056 107.746 L
223.444 102.829 L
225.833 96.991 L
228.222 91.291 L
230.611 88.842 L
233 83.327 L
235.389 83.327 L
237.778 79.98 L
240.167 75.296 L
242.556 74.451 L
S
GR
GS
[1 0 0 1 70.55556 92.83436] CT
0.851 0.325 0.098 RC
N
1 0 M
1 0.552 0.552 1 0 1 C
-0.552 1 -1 0.552 -1 0 C
-1 -0.552 -0.552 -1 0 -1 C
0.552 -1 1 -0.552 1 0 C
cp
f
GR
GS
[1 0 0 1 72.94444 97.1217] CT
0.851 0.325 0.098 RC
N
/f-891180347{1 0 M
1 0.552 0.552 1 0 1 C
-0.552 1 -1 0.552 -1 0 C
-1 -0.552 -0.552 -1 0 -1 C
0.552 -1 1 -0.552 1 0 C
cp}def
f-891180347
f
GR
GS
[1 0 0 1 75.33334 99.28866] CT
0.851 0.325 0.098 RC
N
f-891180347
f
GR
GS
[1 0 0 1 77.72222 103.70663] CT
0.851 0.325 0.098 RC
N
f-891180347
f
GR
GS
[1 0 0 1 80.11111 105.49928] CT
0.851 0.325 0.098 RC
N
f-891180347
f
GR
GS
[1 0 0 1 82.5 110.67462] CT
0.851 0.325 0.098 RC
N
f-891180347
f
GR
GS
[1 0 0 1 84.88889 114.78804] CT
0.851 0.325 0.098 RC
N
f-891180347
f
GR
GS
[1 0 0 1 87.27778 120.11536] CT
0.851 0.325 0.098 RC
N
f-891180347
f
GR
GS
[1 0 0 1 89.66666 123.72362] CT
0.851 0.325 0.098 RC
N
f-891180347
f
GR
GS
[1 0 0 1 92.05556 127.36182] CT
0.851 0.325 0.098 RC
N
f-891180347
f
GR
GS
[1 0 0 1 94.44444 131.46321] CT
0.851 0.325 0.098 RC
N
f-891180347
f
GR
GS
[1 0 0 1 96.83334 135.28691] CT
0.851 0.325 0.098 RC
N
f-891180347
f
GR
GS
[1 0 0 1 99.22222 136.46881] CT
0.851 0.325 0.098 RC
N
f-891180347
f
GR
GS
[1 0 0 1 101.61111 137.9511] CT
0.851 0.325 0.098 RC
N
f-891180347
f
GR
GS
[1 0 0 1 104 139.57259] CT
0.851 0.325 0.098 RC
N
f-891180347
f
GR
GS
[1 0 0 1 106.38889 142.67027] CT
0.851 0.325 0.098 RC
N
f-891180347
f
GR
GS
[1 0 0 1 108.77778 145.84926] CT
0.851 0.325 0.098 RC
N
f-891180347
f
GR
GS
[1 0 0 1 111.16667 147.87062] CT
0.851 0.325 0.098 RC
N
f-891180347
f
GR
GS
[1 0 0 1 113.55556 149.33995] CT
0.851 0.325 0.098 RC
N
f-891180347
f
GR
GS
[1 0 0 1 115.94445 151.40741] CT
0.851 0.325 0.098 RC
N
f-891180347
f
GR
GS
[1 0 0 1 118.33334 152.76694] CT
0.851 0.325 0.098 RC
N
f-891180347
f
GR
GS
[1 0 0 1 120.72222 154.58238] CT
0.851 0.325 0.098 RC
N
f-891180347
f
GR
GS
[1 0 0 1 123.11111 155.69121] CT
0.851 0.325 0.098 RC
N
f-891180347
f
GR
GS
[1 0 0 1 125.5 157.32393] CT
0.851 0.325 0.098 RC
N
f-891180347
f
GR
GS
[1 0 0 1 127.88889 158.77943] CT
0.851 0.325 0.098 RC
N
f-891180347
f
GR
GS
[1 0 0 1 130.27777 159.73364] CT
0.851 0.325 0.098 RC
N
f-891180347
f
GR
GS
[1 0 0 1 132.66667 160.56993] CT
0.851 0.325 0.098 RC
N
f-891180347
f
GR
GS
[1 0 0 1 135.05556 161.22775] CT
0.851 0.325 0.098 RC
N
f-891180347
f
GR
GS
[1 0 0 1 137.44444 161.71449] CT
0.851 0.325 0.098 RC
N
f-891180347
f
GR
GS
[1 0 0 1 139.83333 162.18474] CT
0.851 0.325 0.098 RC
N
f-891180347
f
GR
GS
[1 0 0 1 142.22223 162.62531] CT
0.851 0.325 0.098 RC
N
f-891180347
f
GR
GS
[1 0 0 1 144.61111 162.90099] CT
0.851 0.325 0.098 RC
N
f-891180347
f
GR
GS
[1 0 0 1 147 163.0927] CT
0.851 0.325 0.098 RC
N
f-891180347
f
GR
GS
[1 0 0 1 149.38889 163.15251] CT
0.851 0.325 0.098 RC
N
f-891180347
f
GR
GS
[1 0 0 1 151.77777 162.95706] CT
0.851 0.325 0.098 RC
N
f-891180347
f
GR
GS
[1 0 0 1 154.16667 162.77687] CT
0.851 0.325 0.098 RC
N
f-891180347
f
GR
GS
[1 0 0 1 156.55556 162.45821] CT
0.851 0.325 0.098 RC
N
f-891180347
f
GR
GS
[1 0 0 1 158.94444 162.04102] CT
0.851 0.325 0.098 RC
N
f-891180347
f
GR
GS
[1 0 0 1 161.33333 161.61182] CT
0.851 0.325 0.098 RC
N
f-891180347
f
GR
GS
[1 0 0 1 163.72223 161.13248] CT
0.851 0.325 0.098 RC
N
f-891180347
f
GR
GS
[1 0 0 1 166.11111 160.4664] CT
0.851 0.325 0.098 RC
N
f-891180347
f
GR
GS
[1 0 0 1 168.5 159.55219] CT
0.851 0.325 0.098 RC
N
f-891180347
f
GR
GS
[1 0 0 1 170.88889 158.70982] CT
0.851 0.325 0.098 RC
N
f-891180347
f
GR
GS
[1 0 0 1 173.27777 157.51297] CT
0.851 0.325 0.098 RC
N
f-891180347
f
GR
GS
[1 0 0 1 175.66667 155.89001] CT
0.851 0.325 0.098 RC
N
f-891180347
f
GR
GS
[1 0 0 1 178.05556 154.36623] CT
0.851 0.325 0.098 RC
N
f-891180347
f
GR
GS
[1 0 0 1 180.44444 153.08148] CT
0.851 0.325 0.098 RC
N
f-891180347
f
GR
GS
[1 0 0 1 182.83333 151.57436] CT
0.851 0.325 0.098 RC
N
f-891180347
f
GR
GS
[1 0 0 1 185.22223 149.59734] CT
0.851 0.325 0.098 RC
N
f-891180347
f
GR
GS
[1 0 0 1 187.61111 147.86081] CT
0.851 0.325 0.098 RC
N
f-891180347
f
GR
GS
[1 0 0 1 190 146.08125] CT
0.851 0.325 0.098 RC
N
f-891180347
f
GR
GS
[1 0 0 1 192.38889 143.09109] CT
0.851 0.325 0.098 RC
N
f-891180347
f
GR
GS
[1 0 0 1 194.77777 140.40027] CT
0.851 0.325 0.098 RC
N
f-891180347
f
GR
GS
[1 0 0 1 197.16667 138.36183] CT
0.851 0.325 0.098 RC
N
f-891180347
f
GR
GS
[1 0 0 1 199.55556 136.39331] CT
0.851 0.325 0.098 RC
N
f-891180347
f
GR
GS
[1 0 0 1 201.94444 133.99747] CT
0.851 0.325 0.098 RC
N
f-891180347
f
GR
GS
[1 0 0 1 204.33333 130.80069] CT
0.851 0.325 0.098 RC
N
f-891180347
f
GR
GS
[1 0 0 1 206.72223 127.13956] CT
0.851 0.325 0.098 RC
N
f-891180347
f
GR
GS
[1 0 0 1 209.11111 123.89905] CT
0.851 0.325 0.098 RC
N
f-891180347
f
GR
GS
[1 0 0 1 211.5 119.55978] CT
0.851 0.325 0.098 RC
N
f-891180347
f
GR
GS
[1 0 0 1 213.88889 116.15421] CT
0.851 0.325 0.098 RC
N
f-891180347
f
GR
GS
[1 0 0 1 216.27777 112.59174] CT
0.851 0.325 0.098 RC
N
f-891180347
f
GR
GS
[1 0 0 1 218.66667 109.83855] CT
0.851 0.325 0.098 RC
N
f-891180347
f
GR
GS
[1 0 0 1 221.05556 107.74567] CT
0.851 0.325 0.098 RC
N
f-891180347
f
GR
GS
[1 0 0 1 223.44444 102.82927] CT
0.851 0.325 0.098 RC
N
f-891180347
f
GR
GS
[1 0 0 1 225.83333 96.99113] CT
0.851 0.325 0.098 RC
N
f-891180347
f
GR
GS
[1 0 0 1 228.22221 91.29145] CT
0.851 0.325 0.098 RC
N
f-891180347
f
GR
GS
[1 0 0 1 230.61111 88.84159] CT
0.851 0.325 0.098 RC
N
f-891180347
f
GR
GS
[1 0 0 1 233 83.32691] CT
0.851 0.325 0.098 RC
N
f-891180347
f
GR
GS
[1 0 0 1 235.38889 83.32691] CT
0.851 0.325 0.098 RC
N
f-891180347
f
GR
GS
[1 0 0 1 237.77777 79.98022] CT
0.851 0.325 0.098 RC
N
f-891180347
f
GR
GS
[1 0 0 1 240.16666 75.29623] CT
0.851 0.325 0.098 RC
N
f-891180347
f
GR
GS
[1 0 0 1 242.55556 74.45062] CT
0.851 0.325 0.098 RC
N
f-891180347
f
GR
GS
1 GC
N
139.5 47.5 M
139.5 21 L
58 21 L
58 47.5 L
cp
f
GR
GS
[1 0 0 1 95 28.5] CT
/Helvetica 9 F
GS
[1 0 0 1 0 0] CT
0 3.5 moveto 
1 -1 scale
(Real) t 
GR
GR
GS
0 0.447 0.741 RC
1 LJ
1.5 LW
N
62 28.5 M
92 28.5 L
S
GR
GS
[1 0 0 1 95 40] CT
/Helvetica 9 F
GS
[1 0 0 1 0 0] CT
0 3.5 moveto 
1 -1 scale
(Estimated) t 
GR
GR
GS
0.851 0.325 0.098 RC
1 LJ
N
62 40 M
92 40 L
S
GR
GS
[1 0 0 1 77 40] CT
0.851 0.325 0.098 RC
N
f-891180347
f
GR
GS
0.149 GC
10.0 ML
0.5 LW
N
58 47.5 M
58 21 L
139.5 21 L
139.5 47.5 L
cp
S
GR
%%Trailer
%%Pages: 1
%%EOF
