digraph "Drone::calculateTranslation"
{
 // LATEX_PDF_SIZE
  edge [fontname="Helvetica",fontsize="10",labelfontname="Helvetica",labelfontsize="10"];
  node [fontname="Helvetica",fontsize="10",shape=record];
  rankdir="RL";
  Node1 [label="Drone::calculateTranslation",height=0.2,width=0.4,color="black", fillcolor="grey75", style="filled", fontcolor="black",tooltip="Wylicza wektor przesunięcia."];
  Node1 -> Node2 [dir="back",color="midnightblue",fontsize="10",style="solid",fontname="Helvetica"];
  Node2 [label="Drone::moveForward",height=0.2,width=0.4,color="black", fillcolor="white", style="filled",URL="$class_drone.html#a72b51743436557dbb7c3d4dae30f09c4",tooltip="Zadaje ruch na wprost."];
}
