  0 -25  20
 30 -25  40
 30  25  40
  0  25  20

  0 -25  20
 30 -25   0
 30  25   0
  0  25  20

  0 -25  20
-30 -25   0
-30  25   0
  0  25  20

  0 -25  20
-30 -25  40
-30  25  40
  0  25  20

  0 -25  20
 30 -25  40
 30  25  40
  0  25  20
