digraph "Drone::calculateTranslation"
{
 // LATEX_PDF_SIZE
  edge [fontname="Helvetica",fontsize="10",labelfontname="Helvetica",labelfontsize="10"];
  node [fontname="Helvetica",fontsize="10",shape=record];
  rankdir="LR";
  Node1 [label="Drone::calculateTranslation",height=0.2,width=0.4,color="black", fillcolor="grey75", style="filled", fontcolor="black",tooltip="Wylicza wektor przesunięcia."];
  Node1 -> Node2 [color="midnightblue",fontsize="10",style="solid",fontname="Helvetica"];
  Node2 [label="Shape::makeRadians",height=0.2,width=0.4,color="black", fillcolor="white", style="filled",URL="$class_shape.html#a9bd798fd7f03957c56372df7570421b1",tooltip="Przelicza stopnie na radiany."];
}
