{
  "connection_string": "example-proj:example-region-us6:example-instance",
  "driver": "pymysql",
  "credentials":
  {
    "user": "user_name",
    "password": "password",
    "db": "database_name"
  }
}

