1.816204833	1.423313412
1.104350053	1.742953036
0.065879785	0.657379223
0.107725853	1.300236051
1.610126457	1.949672296
0.902749709	0.151934723
0.765292459	1.174038334
1.579287407	0.827772996
0.728573739	0.618272853
1.06469987	0.527668083