{ 
    "_id" : "58ae07869fd2e026f43ea569", 
    "className" : "regiec.knast.erp.api.entities.ProviderEntity", 
    "name" : "Petroestry", 
    "nip" : "92378469283492", 
    "postalCode" : "62-200", 
    "city" : "Gniezno", 
    "street" : "gnieźnieńska 10", 
    "payDeadline" : "21", 
    "phone" : "987654789", 
    "email" : "petro.dolay@wp.pl"
}
{ 
    "_id" : "58ae07899fd2e026f43ea56a", 
    "className" : "regiec.knast.erp.api.entities.ProviderEntity", 
    "name" : "Petroestry", 
    "nip" : "92378469283492", 
    "postalCode" : "62-200", 
    "city" : "Gniezno", 
    "street" : "gnieźnieńska 10", 
    "payDeadline" : "21", 
    "phone" : "987654789", 
    "email" : "petro.dolay@wp.pl"
}
{ 
    "_id" : "58b5e9a413d6280fc48eae4f", 
    "className" : "regiec.knast.erp.api.entities.ProviderEntity", 
    "name" : "asdasd"
}
{ 
    "_id" : "58b71d27d8c780221c9fb853", 
    "className" : "regiec.knast.erp.api.entities.ProviderEntity"
}
