%YAML 1.1
%TAG !u! tag:unity3d.com,2011:
--- !u!1001 &100100000
Prefab:
  m_ObjectHideFlags: 1
  serializedVersion: 2
  m_Modification:
    m_TransformParent: {fileID: 0}
    m_Modifications: []
    m_RemovedComponents: []
  m_SourcePrefab: {fileID: 0}
  m_RootGameObject: {fileID: 1486604873696270}
  m_IsPrefabAsset: 1
--- !u!1 &1486604873696270
GameObject:
  m_ObjectHideFlags: 0
  m_CorrespondingSourceObject: {fileID: 0}
  m_PrefabInternal: {fileID: 100100000}
  serializedVersion: 6
  m_Component:
  - component: {fileID: 4408135068257552}
  - component: {fileID: 114964370623907892}
  m_Layer: 0
  m_Name: SimulationManager
  m_TagString: Untagged
  m_Icon: {fileID: 0}
  m_NavMeshLayer: 0
  m_StaticEditorFlags: 0
  m_IsActive: 1
--- !u!4 &4408135068257552
Transform:
  m_ObjectHideFlags: 1
  m_CorrespondingSourceObject: {fileID: 0}
  m_PrefabInternal: {fileID: 100100000}
  m_GameObject: {fileID: 1486604873696270}
  m_LocalRotation: {x: 0, y: 0, z: 0, w: 1}
  m_LocalPosition: {x: 0, y: 0, z: 0}
  m_LocalScale: {x: 1, y: 1, z: 1}
  m_Children: []
  m_Father: {fileID: 0}
  m_RootOrder: 0
  m_LocalEulerAnglesHint: {x: 0, y: 0, z: 0}
--- !u!114 &114964370623907892
MonoBehaviour:
  m_ObjectHideFlags: 1
  m_CorrespondingSourceObject: {fileID: 0}
  m_PrefabInternal: {fileID: 100100000}
  m_GameObject: {fileID: 1486604873696270}
  m_Enabled: 1
  m_EditorHideFlags: 0
  m_Script: {fileID: 11500000, guid: 3a0f0277eeb3faa43bbb7d647e4f485d, type: 3}
  m_Name: 
  m_EditorClassIdentifier: 
  currentConfig:
    m_IsGeneralActivationFunction: 0
    m_GeneralActivationFunctionType: 0
    m_UseUserInput: 0
    m_PopulationSize: 15
    m_CheckpointsTimeExceededCapInSeconds: 2
    m_ANNTopology:
      m_LayersTopologies:
      - m_NeuronsCount: 7
        m_ActivationFunction: 0
      - m_NeuronsCount: 6
        m_ActivationFunction: 0
      - m_NeuronsCount: 4
        m_ActivationFunction: 0
      - m_NeuronsCount: 3
        m_ActivationFunction: 2
      - m_NeuronsCount: 2
        m_ActivationFunction: 2
    m_NeuronsConfig:
      m_BiasRange: 1
      m_WeightsRange: 8
      m_WeightsDeviationFactor: 0.15
      m_WeightsDeviationProbability: 0.33
      m_WeightsMutationProbability: 0.01
    m_CarConfig:
      m_SensorMaxDistance: 10
      m_IsSensorRayVisible: 1
      m_VelocityMaxSpeed: 30
      m_VelocityChangeSpeed: 4
      m_SteerChangeSpeed: 65
      m_Friction: 7
      m_ColorsConfig:
        m_NormalDriving: {r: 0, g: 1, b: 1, a: 1}
        m_FocusedDriving: {r: 0, g: 0, b: 1, a: 1}
        m_LastBestCarDriving: {r: 1, g: 0.92156863, b: 0.015686275, a: 1}
        m_MutationDriving: {r: 1, g: 0, b: 0, a: 1}
        m_Finished: {r: 0, g: 1, b: 0, a: 1}
        m_NotDriving: {r: 0.5, g: 0.5, b: 0.5, a: 1}
    m_GAConfig:
      m_GenotypeMixingMode: 2
      m_CarsConsideredInGenotypeMixing: 2
      m_ShouldAddBestCarsFromLastGeneration: 1
      m_BestCarsFromLastGenerationToAddCount: 1
      m_CustomWeightedAvgWeights: 0a00000001000000
