{
  "project_info": {
    "project_number": "821629670248",
    "firebase_url": "https://hair-144ca-default-rtdb.firebaseio.com",
    "project_id": "hair-144ca",
    "storage_bucket": "hair-144ca.appspot.com"
  },
  "client": [
    {
      "client_info": {
        "mobilesdk_app_id": "1:821629670248:android:99a73982f792908ded7cdd",
        "android_client_info": {
          "package_name": "com.example.hair"
        }
      },
      "oauth_client": [],
      "api_key": [
        {
          "current_key": "AIzaSyBln9eRn7ZwdXfAr4Sd1Z86QnZIJvMpXaM"
        }
      ],
      "services": {
        "appinvite_service": {
          "other_platform_oauth_client": []
        }
      }
    }
  ],
  "configuration_version": "1"
}