Division,WeightClassKg,Place,Name,Team,BodyweightKg,Best3SquatKg,Best3BenchKg,Best3DeadliftKg,TotalKg,Equipment,Event,Sex,BirthDate
Boys,74.84,1,Michael Martinez,Ennis,71.21,206.38,113.4,190.51,510.29,Single-ply,SBD,M,
Boys,74.84,2,Damion Miller,Midlothian Heritage,72.12,149.69,77.11,161.03,387.82,Single-ply,SBD,M,
Boys,82.1,1,Dillon Miller,Midlothian Heritage,82.1,138.35,88.45,167.83,394.63,Single-ply,SBD,M,
Boys,82.1,2,Issac Rice,Midlothian Heritage,80.74,88.45,56.7,120.2,265.35,Single-ply,SBD,M,
Boys,82.1,3,Jeffery Knapp,Midlothian Heritage,78.93,92.99,47.63,120.2,260.82,Single-ply,SBD,M,
Boys,82.1,4,Brayden Gardner,Ennis,75.75,219.99,,,219.99,Single-ply,S,M,
Boys,89.81,1,Sam Meeker,Ennis,88,240.4,138.35,204.12,582.87,Single-ply,SBD,M,
Boys,89.81,2,Ryan Kosa,Midlothian Heritage,85.73,120.2,70.31,147.42,337.93,Single-ply,SBD,M,
Boys,89.81,3,Brady Henke,Midlothian Heritage,84.37,122.47,74.84,136.08,333.39,Single-ply,SBD,M,
Boys,99.79,1,Lucas Hagler,Ennis,99.34,192.78,151.95,181.44,526.17,Single-ply,SBD,M,
Boys,99.79,2,Jace Oliver,Midlothian Heritage,96.16,199.58,108.86,206.38,514.83,Single-ply,SBD,M,
Boys,99.79,3,Rodrigo Molina,Ennis,93.89,188.24,124.74,192.78,505.76,Single-ply,SBD,M,
Boys,99.79,4,Jaryn Watson,Midlothian Heritage,97.98,167.83,102.06,161.03,430.91,Single-ply,SBD,M,
Boys,109.77,1,Damian Alexander,Midlothian Heritage,100.47,167.83,117.93,170.1,455.86,Single-ply,SBD,M,
Boys,109.77,2,Kasen Carpenter,Midlothian Heritage,102.51,136.08,95.25,136.08,367.41,Single-ply,SBD,M,
Boys,124.74,1,Reid White,Ennis,124.28,226.8,174.63,210.92,612.35,Single-ply,SBD,M,
Boys,139.71,1,Cody Jurcik,Ennis,129.27,215.46,158.76,185.97,560.19,Single-ply,SBD,M,
Boys,139.71+,1,Xavier Perez,Ennis,142.43,272.16,154.22,217.72,644.1,Single-ply,SBD,M,
Boys,,NS,Rylan Caldwell,Midlothian Heritage,,,,,,Single-ply,SBD,M,
