Name,Sex,Age,Division,Equipment,BodyweightKg,WeightClassKg,Squat1Kg,Squat2Kg,Squat3Kg,Best3SquatKg,Bench1Kg,Bench2Kg,Bench3Kg,Best3BenchKg,Deadlift1Kg,Deadlift2Kg,Deadlift3Kg,Best3DeadliftKg,TotalKg,Event,Place
Andrew French #1,M,,M_O_R_BPU,Raw,65.7,67.5,120,142.5,-152.5,142.5,105,115,-120,115,140,170,175,175,432.5,SBD,1
Andrew Pearson,M,,M_O_R_BPU,Raw,96.8,100,180,-200,-200,180,140,-145,145,145,200,240,-260,240,565,SBD,3
Ashraf Ali,M,,M_T1_R_BPU,Raw,74.2,75,105,115,120,120,80,-95,-95,80,160,170,180,180,380,SBD,1
Cameron Couldwell,M,,M_J_R_BPU,Raw,99.3,100,180,190,200,200,130,-140,140,140,240,260,270,270,610,SBD,2
Chris Arnold #5,M,,M_O_R_BPU,Raw,106.9,110,170,-180,-180,170,100,-105,-105,100,180,205,-212.5,205,475,SBD,5
Chris Croucher,M,,M_O_R_BPU,Raw,87.2,90,,,,,150,160,-165,160,,,,,160,B,1
Dan Stewart,M,,M_J_R_BPU,Raw,96.8,100,220,-240,-242.5,220,130,140,-145,140,240,265,282.5,282.5,642.5,SBD,1
Darren Crouch,M,,M_J_S_BPU,Single-ply,97.7,100,310,-330,340,340,190,210,220,220,270,300,320,320,880,SBD,1
Darren Hammond,M,,M_M1_R_BPU,Raw,106.6,110,220,235,-252.5,235,-135,135,-145,135,270,290,-310,290,660,SBD,1
Darren McCormac,M,,M_O_R_BPU,Raw,129.8,140,,,,,,,,,300,320,330,330,330,D,1
Darren McCormac,M,,M_O_CR_BPU,Wraps,129.8,140,245,260,270,270,155,165,175,175,300,320,330,330,775,SBD,1
David Jenkinson,M,,M_O_R_BPU,Raw,106.8,110,225,250,270,270,205,212.5,-220,212.5,285,300,317.5,317.5,800,SBD,1
Dwayne Taylor #1,M,,M_M1_R_BPU,Raw,119,125,225,237.5,252.5,252.5,180,190,-200,190,240,255,-265,255,697.5,SBD,1
Emmy Louise,F,,F_O_R_BPU,Raw,55.2,56,,,,,60,70,72.5,72.5,,,,,72.5,B,1
Emmy Louise,F,,F_O_R_BPU,Raw,55.2,56,,,,,,,,,135,150,-160,150,150,D,1
Gary Croft,M,,M_O_CR_BPU,Wraps,95.6,100,220,-230,-230,220,160,-170,-170,160,240,-242.5,-242.5,240,620,SBD,1
Gary Croft,M,,M_O_R_BPU,Raw,95.6,100,,,,,160,-170,-170,160,,,,,160,B,1
George Briley,M,,M_T2_R_BPU,Raw,118.7,125,160,180,210,210,122.5,130,-140,130,210,220,-222.5,220,560,SBD,1
Hassan Zaid,M,,M_O_M_BPU,Multi-ply,91.1,100,-310,310,-340,310,160,175,-185,175,300,-317.5,-317.5,300,785,SBD,1
Hannah Venn-Munns,F,,F_O_R_BPU,Raw,73.9,75,50,60,-70,60,-45,45,-50,45,85,92.5,100,100,205,SBD,1
Hassan Mahmood,M,,M_T2_R_BPU,Raw,73.5,75,-110,115,125,125,80,85,-90,85,145,155,165,165,375,SBD,1
Jack Chambers,M,,M_J_S_BPU,Single-ply,88.6,90,,,,,200,-210,-210,200,,,,,200,B,1
Jacob Reilly,M,,M_T2_R_BPU,Raw,66.9,67.5,110,115,120,120,85,87.5,-90,87.5,150,160,-165,160,367.5,SBD,1
Jake Gifford,M,,M_J_R_BPU,Raw,70.6,75,120,-140,140,140,90,-100,-100,90,200,220,-230,220,450,SBD,1
James Bergin,M,,M_J_R_BPU,Raw,87,90,-165,-170,170,170,120,130,-140,130,170,190,-210,190,490,SBD,1
James Gilbert #1,M,,M_O_R_BPU,Raw,121.3,125,200,220,240,240,-180,190,-200,190,260,280,-300,280,710,SBD,1
Joe Reeves #1,M,,M_O_R_BPU,Raw,108.5,110,290,-310,310,310,190,200,-210,200,245,270,290,290,800,SBD,2
Jon Hobson,M,,M_O_M_BPU,Multi-ply,101.8,110,-250,250,265,265,-135,-135,-135,,-310,-310,-310,,,SBD,DQ
Kish Naib,M,,M_O_R_BPU,Raw,87.7,90,180,-190,200,200,140,150,155,155,220,240,260,260,615,SBD,1
Leslie Watson,F,,F_O_R_BPU,Raw,,48,,,,,,,,,,,,,,SBD,DQ
Liam Wilkinson,M,,M_J_R_BPU,Raw,81.2,82.5,170,180,187.5,187.5,115,120,125,125,210,220,230,230,542.5,SBD,1
Linda Broom,F,,F_M3_S_BPU,Single-ply,67,67.5,105,112.5,117.5,117.5,80,-82.5,-82.5,80,140,-152.5,-152.5,140,337.5,SBD,1
Michael Phipps,M,,M_O_R_BPU,Raw,64.4,67.5,110,-130,-130,110,-85,-87.5,87.5,87.5,160,170,-175,170,367.5,SBD,2
Mitchell Tutt,M,,M_O_CR_BPU,Wraps,106.6,110,215,235,250,250,150,160,-167.5,160,240,265,-272.5,265,675,SBD,1
Neil Deighton,M,,M_O_R_BPU,Raw,80.2,82.5,220,-240,240,240,175,182.5,-185,182.5,270,-290,-290,270,692.5,SBD,1
Nicky Price,F,,F_J_R_BPU,Raw,63.4,67.5,130,140,145,145,70,80,-85,80,140,150,160,160,385,SBD,1
Paul Wood #2,M,,M_M2_CR_BPU,Wraps,107.2,110,220,235,240,240,140,155,-160,155,270,302.5,-305,302.5,697.5,SBD,1
Rhys Browning,M,,M_O_R_BPU,Raw,101.6,110,230,250,-260,250,150,165,-175,165,290,-292.5,-292.5,290,705,SBD,3
Rob Maguire,M,,M_O_R_BPU,Raw,99.7,100,180,195,-205,195,150,157.5,-165,157.5,210,220,232.5,232.5,585,SBD,2
Russel Willers,M,,M_O_R_BPU,Raw,106.8,110,205,215,225,225,140,147.5,-152.5,147.5,212.5,220,230,230,602.5,SBD,4
Sabrina Wallace King,F,,F_O_R_BPU,Raw,66,67.5,85,100,-112.5,100,52.5,55,-57.5,55,125,-135,-135,125,280,SBD,1
Shane Harrison,M,,M_O_M_BPU,Multi-ply,106.5,110,-390,390,-425,390,280,-300,-300,280,280,300,-310,300,970,SBD,1
Simon Norcup,M,,M_M3_R_BPU,Raw,106.7,110,180,200,220,220,120,135,145,145,200,220,-222.5,220,585,SBD,1
Steve Day,M,,M_O_R_BPU,Raw,98.9,100,175,190,200,200,140,155,165,165,240,255,-257.5,255,620,SBD,1
Steve Macneil,M,,M_O_M_BPU,Multi-ply,120.9,125,350,-377.5,-385,350,270,285,-290,285,260,282.5,-287.5,282.5,917.5,SBD,1
Steve Plunkett,M,,M_M1_S_BPU,Single-ply,95.4,100,300,-320,320,320,200,220,-230,220,240,260,-270,260,800,SBD,1
Tom Oates,M,,M_J_R_BPU,Raw,108.4,110,170,180,190,190,105,110,-115,110,190,210,-225,210,510,SBD,1
Zach Baggett #2,M,,M_T3_R_BPU,Raw,54.2,56,-100,100,-120,100,65,75,-85,75,140,155,170,170,345,SBD,1
