Division,WeightClassKg,Place,Name,Team,BodyweightKg,Best3SquatKg,Best3BenchKg,Best3DeadliftKg,TotalKg,Equipment,Event,Sex
Boys,55.79,1,JoJo Talavera,Glen Rose,55.52,97.52,49.9,124.74,272.16,Single-ply,SBD,M
Boys,55.79,2,Logan Thomas,Aledo,52.62,88.45,54.43,106.59,249.48,Single-ply,SBD,M
Boys,55.79,3,Baird Jernigan,Aledo,55.34,68.04,63.5,115.67,247.21,Single-ply,SBD,M
Boys,59.87,1,Otis Jackson,Aledo,58.79,117.93,79.38,138.35,335.66,Single-ply,SBD,M
Boys,59.87,DQ,Noah Duvall,Springtown,58.88,,,,,Single-ply,SBD,M
Boys,67.13,1,Joe Rousseau,Aledo,66.45,140.61,106.59,190.51,437.72,Single-ply,SBD,M
Boys,67.13,2,Steven Burns,Aledo,63.41,151.95,86.18,170.1,408.23,Single-ply,SBD,M
Boys,67.13,3,Cage Teague,Springtown,64.91,124.74,97.52,147.42,369.68,Single-ply,SBD,M
Boys,67.13,4,Austin Ritchey,Springtown,66.27,122.47,92.99,142.88,358.34,Single-ply,SBD,M
Boys,67.13,5,Justin Straw,Springtown,60.6,115.67,88.45,120.2,324.32,Single-ply,SBD,M
Boys,67.13,6,Isiah Hurtado,Glen Rose,66.86,95.25,65.77,129.27,290.3,Single-ply,SBD,M
Boys,67.13,7,Barron Barnes,Glen Rose,64.77,97.52,58.97,122.47,278.96,Single-ply,SBD,M
Boys,67.13,DQ,Gabe Barton,Springtown,66.04,,,,,Single-ply,SBD,M
Boys,67.13,DQ,Holden Fry,Springtown,65.36,,,,,Single-ply,SBD,M
Boys,74.84,1,Mariano Arriaga,Aledo,70.17,188.24,115.67,192.78,496.68,Single-ply,SBD,M
Boys,74.84,2,Aaron Foster,Springtown,73.66,154.22,102.06,188.24,444.52,Single-ply,SBD,M
Boys,74.84,3,Harrison Jones,Aledo,74.62,147.42,113.4,158.76,419.57,Single-ply,SBD,M
Boys,74.84,4,Elijah Valencia,Aledo,70.94,140.61,92.99,158.76,392.36,Single-ply,SBD,M
Boys,74.84,5,Jesus Najera,Springtown,68.58,145.15,90.72,145.15,381.02,Single-ply,SBD,M
Boys,74.84,6,Austin Roach,Glen Rose,74.39,136.08,83.91,158.76,378.75,Single-ply,SBD,M
Boys,74.84,DQ,Braylen Meador,Glen Rose,74.48,154.22,,158.76,,Single-ply,SBD,M
Boys,74.84,DQ,Dawson Adams,Springtown,73.89,,86.18,151.95,,Single-ply,SBD,M
Boys,74.84,DQ,Rickey Bell,Springtown,73.71,,,,,Single-ply,SBD,M
Boys,74.84,DQ,Jesse Martin,Springtown,68.99,,,,,Single-ply,SBD,M
Boys,82.1,1,Tatum Price #1,Aledo,77.11,206.38,131.54,206.38,544.31,Single-ply,SBD,M
Boys,82.1,2,Jaquan Cummings,Springtown,81.96,167.83,115.67,226.8,510.29,Single-ply,SBD,M
Boys,82.1,3,Ricky Douglas,Glen Rose,81.83,181.44,124.74,197.31,503.49,Single-ply,SBD,M
Boys,82.1,4,Noah Loth,Aledo,80.74,172.37,111.13,174.63,458.13,Single-ply,SBD,M
Boys,82.1,5,Riley Davis #1,Aledo,77.11,136.08,106.59,140.61,383.29,Single-ply,SBD,M
Boys,82.1,6,Britt Blanchette,Glen Rose,79.38,124.74,104.33,154.22,383.29,Single-ply,SBD,M
Boys,82.1,7,Caden Anderson,Aledo,81.92,133.81,97.52,140.61,371.95,Single-ply,SBD,M
Boys,82.1,8,Matthew Locke,Glen Rose,78.11,136.08,83.91,147.42,367.41,Single-ply,SBD,M
Boys,89.81,1,Weston Reese,Aledo,86,185.97,127.01,192.78,505.76,Single-ply,SBD,M
Boys,89.81,2,Marcus Moseley,Glen Rose,86.73,181.44,108.86,199.58,489.88,Single-ply,SBD,M
Boys,89.81,3,Baker Butler,Glen Rose,89.72,158.76,86.18,174.63,419.57,Single-ply,SBD,M
Boys,89.81,4,Sammy Aldriedge,Glen Rose,89.63,147.42,90.72,145.15,383.29,Single-ply,SBD,M
Boys,89.81,DQ,Ryan Goodenough,Aledo,89.54,170.1,124.74,,,Single-ply,SBD,M
Boys,89.81,DQ,Corey Aper,Glen Rose,89.81,,,,,Single-ply,SBD,M
Boys,89.81,DQ,Cameron Ricket,Springtown,88.13,,,,,Single-ply,SBD,M
Boys,99.79,1,Blake Price,Aledo,92.9,210.92,117.93,183.7,512.56,Single-ply,SBD,M
Boys,99.79,2,Tyler Holder,Springtown,99.61,170.1,106.59,201.85,478.54,Single-ply,SBD,M
Boys,99.79,3,Brady Wood,Aledo,95.35,181.44,120.2,170.1,471.74,Single-ply,SBD,M
Boys,99.79,4,Tony Ramos,Glen Rose,93.44,163.29,106.59,190.51,460.4,Single-ply,SBD,M
Boys,99.79,5,Angel Flores,Springtown,98.97,147.42,102.06,167.83,417.3,Single-ply,SBD,M
Boys,99.79,6,Brandt Moore,Glen Rose,99.7,154.22,95.25,158.76,408.23,Single-ply,SBD,M
Boys,109.77,1,Zach Powell,Glen Rose,108.23,217.72,142.88,229.06,589.67,Single-ply,SBD,M
Boys,109.77,2,Logan Michael,Aledo,109.77,215.46,127.01,226.8,569.26,Single-ply,SBD,M
Boys,109.77,3,Martin Guitierrez,Springtown,107.23,204.12,147.42,204.12,555.65,Single-ply,SBD,M
Boys,109.77,4,Oliver Crow,Aledo,103.33,197.31,120.2,197.31,514.83,Single-ply,SBD,M
Boys,109.77,5,Grant McGarity,Glen Rose,104.42,197.31,113.4,174.63,485.34,Single-ply,SBD,M
Boys,109.77,6,Hunter Baldwin,Springtown,107.55,167.83,117.93,185.97,471.74,Single-ply,SBD,M
Boys,109.77,7,Matthew Bell,Aledo,106.32,170.1,111.13,185.97,467.2,Single-ply,SBD,M
Boys,109.77,8,Jacob Pena,Glen Rose,109.04,170.1,102.06,158.76,430.91,Single-ply,SBD,M
Boys,109.77,9,Haden Chenault,Aledo,102.33,154.22,95.25,170.1,419.57,Single-ply,SBD,M
Boys,109.77,DQ,Saul Delgado,Glen Rose,108.86,163.29,,181.44,,Single-ply,SBD,M
Boys,109.77,DQ,Nolan McGrath,Springtown,106.5,,,,,Single-ply,SBD,M
Boys,109.77,DQ,Devin Snell,Springtown,104.55,,,,,Single-ply,SBD,M
Boys,124.74,1,Hayden Shaw,Glen Rose,123.38,272.16,142.88,254.01,669.05,Single-ply,SBD,M
Boys,124.74,2,Zac Haynes,Aledo,124.01,238.14,149.69,204.12,591.94,Single-ply,SBD,M
Boys,124.74,3,Zack Prestwood,Aledo,115.35,181.44,115.67,170.1,467.2,Single-ply,SBD,M
Boys,124.74,4,Grant Jefferis,Aledo,120.84,158.76,102.06,167.83,428.64,Single-ply,SBD,M
Boys,124.74,5,Jake Rollen,Glen Rose,122.83,147.42,79.38,158.76,385.55,Single-ply,SBD,M
Boys,124.74+,1,Alex Striejewske,Aledo,133.9,140.61,102.06,170.1,412.77,Single-ply,SBD,M
Boys,124.74+,2,Daniel Macias,Springtown,127.14,142.88,86.18,147.42,376.48,Single-ply,SBD,M
Boys,124.74+,DQ,Ty Smith,Glen Rose,127.19,,,,,Single-ply,SBD,M
