Division,WeightClassKg,Place,Name,Team,BodyweightKg,Best3SquatKg,Best3BenchKg,Best3DeadliftKg,TotalKg,Equipment,Event,Sex,BirthDate
Boys,51.71,1,Andrew Rangel,Fort Stockton,50.8,81.65,56.7,113.4,251.74,Single-ply,SBD,M,
Boys,51.71,DQ,Quaylon Rios,Fort Stockton,49.44,97.52,,,,Single-ply,SBD,M,
Boys,55.79,1,Zaniel Florez,Kermit,54.43,179.17,92.99,179.17,451.32,Single-ply,SBD,M,
Boys,55.79,2,Cristian Orona,Monahans,53.71,172.37,83.91,176.9,433.18,Single-ply,SBD,M,
Boys,55.79,3,Nick Morales,Pecos,55.7,136.08,83.91,138.35,358.34,Single-ply,SBD,M,
Boys,59.87,1,Isaac Estrada,Odessa,59.33,215.46,138.35,208.65,562.45,Single-ply,SBD,M,
Boys,59.87,2,Caison Burrus,Fort Stockton,56.97,163.29,74.84,158.76,396.89,Single-ply,SBD,M,
Boys,59.87,3,Andy Martinez,Odessa,58.88,129.27,65.77,102.06,297.1,Single-ply,SBD,M,
Boys,59.87,4,Bryan Wilcox,Wink,57.79,97.52,74.84,113.4,285.76,Single-ply,SBD,M,
Boys,67.13,1,Jaylee Ibarra,Fort Stockton,66.32,204.12,117.93,176.9,498.95,Single-ply,SBD,M,
Boys,67.13,2,Jesus Villegas,Kermit,66.22,188.24,102.06,172.37,462.66,Single-ply,SBD,M,
Boys,67.13,3,Matthew Rosas,McCamey,65.86,172.37,92.99,183.7,449.06,Single-ply,SBD,M,
Boys,67.13,4,Xavier Urias,McCamey,64.95,154.22,95.25,136.08,385.55,Single-ply,SBD,M,
Boys,67.13,5,Gaviel Burrola,Kermit,66.77,140.61,77.11,140.61,358.34,Single-ply,SBD,M,
Boys,67.13,6,Xavier Villalobos,Kermit,64.59,147.42,74.84,120.2,342.46,Single-ply,SBD,M,
Boys,67.13,7,Alex Miranda,Monahans,65.95,115.67,65.77,147.42,328.85,Single-ply,SBD,M,
Boys,67.13,8,Martin Stone,McCamey,64.05,90.72,61.23,95.25,247.21,Single-ply,SBD,M,
Boys,74.84,1,Bryan Lee Rivera,Fort Stockton,69.22,188.24,104.33,183.7,476.27,Single-ply,SBD,M,
Boys,74.84,2,Jose Armendariz,Andrews,71.03,136.08,81.65,158.76,376.48,Single-ply,SBD,M,
Boys,74.84,3,Brody Ward,Wink,67.95,104.33,79.38,108.86,292.57,Single-ply,SBD,M,
Boys,74.84,DQ,Ian Leal,Odessa,69.85,102.06,,,,Single-ply,SBD,M,
Boys,82.1,1,Adiel Rodriguez,Kermit,77.75,192.78,99.79,176.9,469.47,Single-ply,SBD,M,
Boys,82.1,2,Ramiro Lopez,Andrews,75.84,190.51,102.06,158.76,451.32,Single-ply,SBD,M,
Boys,82.1,3,Kevin Martinez,Andrews,78.83,170.1,106.59,158.76,435.45,Single-ply,SBD,M,
Boys,82.1,4,Conner McCrarey,Andrews,75.02,167.83,81.65,170.1,419.57,Single-ply,SBD,M,
Boys,82.1,5,Jesus Montes,Odessa,80.83,147.42,97.52,142.88,387.82,Single-ply,SBD,M,
Boys,82.1,6,Cole Purcell,Wink,76.57,145.15,79.38,142.88,367.41,Single-ply,SBD,M,
Boys,82.1,DQ,Ronnie Romero,Fort Stockton,79.56,206.38,,,,Single-ply,SBD,M,
Boys,82.1,DQ,David Madrid,Pecos,76.75,172.37,,,,Single-ply,SBD,M,
Boys,89.81,1,Victor Salazar,Pecos,84.82,210.92,124.74,215.46,551.11,Single-ply,SBD,M,
Boys,89.81,2,Joel Mungia,Kermit,87.82,201.85,92.99,192.78,487.61,Single-ply,SBD,M,
Boys,89.81,3,Adam Marquez,Fort Stockton,89.36,158.76,81.65,165.56,405.97,Single-ply,SBD,M,
Boys,89.81,4,Jose Hernandez #22,Fort Stockton,83.55,149.69,90.72,142.88,383.29,Single-ply,SBD,M,
Boys,89.81,5,Rowdy Mendoza,Odessa,88.72,111.13,68.04,124.74,303.91,Single-ply,SBD,M,
Boys,99.79,1,Everett McGhee,Pecos,96.89,238.14,156.49,188.24,582.87,Single-ply,SBD,M,
Boys,99.79,2,Josh Lackey,Monahans,99.61,183.7,136.08,208.65,528.44,Single-ply,SBD,M,
Boys,99.79,3,Damian Herrera,Monahans,95.62,167.83,129.27,206.38,503.49,Single-ply,SBD,M,
Boys,99.79,4,Lucas Ordonez #1,Monahans,96.16,190.51,113.4,183.7,487.61,Single-ply,SBD,M,
Boys,99.79,5,Cameron Saldivar,Andrews,98.61,188.24,117.93,176.9,483.08,Single-ply,SBD,M,
Boys,99.79,6,Dustin Rodriguez,Fort Stockton,90.54,172.37,81.65,197.31,451.32,Single-ply,SBD,M,
Boys,99.79,7,Oscar Carnero,Andrews,92.62,165.56,111.13,167.83,444.52,Single-ply,SBD,M,
Boys,99.79,8,Damian Dominguez,Odessa,99.79,167.83,108.86,161.03,437.72,Single-ply,SBD,M,
Boys,99.79,9,Rigo Molina,McCamey,95.07,179.17,95.25,161.03,435.45,Single-ply,SBD,M,
Boys,99.79,10,Jesus Carrillo,Wink,96.25,163.29,108.86,142.88,415.04,Single-ply,SBD,M,
Boys,99.79,11,Vidal Diaz,McCamey,95.71,165.56,81.65,145.15,392.36,Single-ply,SBD,M,
Boys,99.79,DQ,Mack Payne,Wink,99.61,,,,,Single-ply,SBD,M,
Boys,109.77,1,Gary Brooks,Odessa,108.59,347,174.63,242.67,764.3,Single-ply,SBD,M,
Boys,109.77,2,Mason Morgan,Wink,103.42,226.8,151.95,226.8,605.55,Single-ply,SBD,M,
Boys,109.77,3,Seth McCrarey,Andrews,103.87,217.72,136.08,226.8,580.6,Single-ply,SBD,M,
Boys,109.77,4,Gage Strain,Pecos,106.59,229.06,122.47,204.12,555.65,Single-ply,SBD,M,
Boys,109.77,5,Juan Carreon,Odessa,100.43,206.38,136.08,195.04,537.51,Single-ply,SBD,M,
Boys,109.77,6,Kaleb Sims,Odessa,100.88,206.38,151.95,147.42,505.76,Single-ply,SBD,M,
Boys,109.77,7,Tucker Tippin,Andrews,100.52,181.44,95.25,176.9,453.59,Single-ply,SBD,M,
Boys,109.77,8,Joel Avitia,Odessa,100.24,142.88,92.99,142.88,378.75,Single-ply,SBD,M,
Boys,109.77,9,Jonathan Santiago,McCamey,107.86,120.2,77.11,122.47,319.78,Single-ply,SBD,M,
Boys,109.77,DQ,Mikial Burrola,Kermit,103.24,276.69,,,,Single-ply,SBD,M,
Boys,124.74,1,Jayson Pagan,McCamey,116.12,274.42,149.69,226.8,650.91,Single-ply,SBD,M,
Boys,124.74,2,Cade Bayer,Fort Stockton,114.58,217.72,120.2,213.19,551.11,Single-ply,SBD,M,
Boys,124.74,3,Daniel Perea,Pecos,117.57,217.72,145.15,188.24,551.11,Single-ply,SBD,M,
Boys,124.74,4,Moises Rodriguez,Monahans,113.94,195.04,136.08,192.78,523.9,Single-ply,SBD,M,
Boys,124.74,5,Kenneth Ramsey,Monahans,115.48,181.44,127.01,213.19,521.63,Single-ply,SBD,M,
Boys,124.74,6,Jacob Alston,Monahans,115.39,195.04,129.27,195.04,519.36,Single-ply,SBD,M,
Boys,124.74,7,Eliseo Bonilla,Kermit,109.86,201.85,127.01,188.24,517.1,Single-ply,SBD,M,
Boys,124.74,8,Jacob Payne,Monahans,110.95,210.92,117.93,185.97,514.83,Single-ply,SBD,M,
Boys,124.74,9,Drew Coker,Monahans,116.57,192.78,113.4,192.78,498.95,Single-ply,SBD,M,
Boys,124.74,10,Xavier Carrillo,Odessa,112.76,174.63,117.93,167.83,460.4,Single-ply,SBD,M,
Boys,124.74,DQ,Camdon Thatcher,Andrews,122.38,,,,,Single-ply,SBD,M,
Boys,124.74,DQ,Candelario Saldana,McCamey,116.21,145.15,74.84,,,Single-ply,SBD,M,
Boys,139.71,1,Luis Mendoza,Fort Stockton,136.26,240.4,149.69,183.7,573.79,Single-ply,SBD,M,
Boys,139.71,2,Isaac Morales,Pecos,130.91,235.87,142.88,185.97,564.72,Single-ply,SBD,M,
Boys,139.71,3,Carlos Ramirez,Pecos,127.55,231.33,131.54,199.58,562.45,Single-ply,SBD,M,
Boys,139.71,4,Roberto Ramirez,Fort Stockton,136.35,208.65,124.74,163.29,496.68,Single-ply,SBD,M,
Boys,139.71,5,Jayce Harris,Pecos,125.55,192.78,127.01,172.37,492.15,Single-ply,SBD,M,
Boys,139.71,DQ,Isaiah Garcia,McCamey,127.1,263.08,,,,Single-ply,SBD,M,
Boys,139.71+,1,Hunter Cobb,Pecos,152.23,235.87,165.56,201.85,603.28,Single-ply,SBD,M,
Boys,139.71+,2,Jalen Ramirez,Wink,144.51,222.26,117.93,226.8,566.99,Single-ply,SBD,M,
Boys,139.71+,3,Chico Delgado,Andrews,140.25,199.58,122.47,197.31,519.36,Single-ply,SBD,M,
Boys,,NS,Alexavier Santibanez,Andrews,,,,,,Single-ply,SBD,M,
Boys,,NS,Robert Burrow,Monahans,,,,,,Single-ply,SBD,M,
Boys,,NS,Syreal Biaza,McCamey,,,,,,Single-ply,SBD,M,
Boys,,NS,Jesse Putnam,Wink,,,,,,Single-ply,SBD,M,
