Division,WeightClassKg,Place,Name,Team,BodyweightKg,Best3SquatKg,Best3BenchKg,Best3DeadliftKg,TotalKg,Equipment,Event,Sex
Boys,55.79,1,Michael Latapie,Palacios,53.98,136.08,102.06,136.08,374.21,Single-ply,SBD,M
Boys,55.79,2,Harley Hnatek,Splendora,55.34,102.06,56.7,124.74,283.5,Single-ply,SBD,M
Boys,59.87,3,Nathan Van Houten,Magnolia West,55.97,86.18,63.5,124.74,274.42,Single-ply,SBD,M
Boys,55.79,4,Marco Zamora,Palacios,53.71,79.38,47.63,113.4,240.4,Single-ply,SBD,M
Boys,55.79,5,Joshua Richards,Huntsville,55.34,61.23,47.63,79.38,188.24,Single-ply,SBD,M
Boys,55.79,DQ,Andrew Reamer,New Caney,55.61,99.79,,,,Single-ply,SBD,M
Boys,55.79,DQ,Josh Courvelle,Shepherd,53.89,102.06,,,,Single-ply,SBD,M
Boys,59.87,1,Josh Vasquez,Cleveland,59.15,156.49,79.38,174.63,410.5,Single-ply,SBD,M
Boys,59.87,2,Nate Jones,Shepherd,59.87,136.08,88.45,151.95,376.48,Single-ply,SBD,M
Boys,67.13,3,Eric Dally,Magnolia West,59.96,129.27,70.31,127.01,326.59,Single-ply,SBD,M
Boys,59.87,4,Gabe Ramirez,New Caney,59.69,83.91,63.5,104.33,251.74,Single-ply,SBD,M
Boys,59.87,5,Jesse Wills,Magnolia West,59.51,74.84,56.7,113.4,244.94,Single-ply,SBD,M
Boys,59.87,6,Roger Kinder,Shepherd,58.97,81.65,56.7,97.52,235.87,Single-ply,SBD,M
Boys,59.87,DQ,Josh Goolsby,Huntsville,59.69,113.4,,,,Single-ply,SBD,M
Boys,67.13,1,Jose Jimenez #11,Palacios,64.05,154.22,102.06,174.63,430.91,Single-ply,SBD,M
Boys,67.13,2,Domonique Wilson,Willis,64.5,142.88,113.4,165.56,421.84,Single-ply,SBD,M
Boys,74.84,3,Zach Randolph,Willis,67.22,136.08,88.45,174.63,399.16,Single-ply,SBD,M
Boys,67.13,4,Daniel Coleman,Splendora,62.96,156.49,90.72,149.69,396.89,Single-ply,SBD,M
Boys,67.13,5,Ivan Espinosa,Cleveland,62.78,156.49,68.04,136.08,360.61,Single-ply,SBD,M
Boys,67.13,6,Noah Seaman,Palacios,66.59,124.74,72.57,154.22,351.53,Single-ply,SBD,M
Boys,67.13,7,Cameron Camp,Splendora,65.86,133.81,90.72,124.74,349.27,Single-ply,SBD,M
Boys,67.13,8,Aaron Valdez,Huntsville,66.77,115.67,83.91,142.88,342.46,Single-ply,SBD,M
Boys,67.13,9,Christian Egans,Crosby,63.14,108.86,81.65,138.35,328.85,Single-ply,SBD,M
Boys,67.13,10,Justin Anderson,New Caney,64.86,108.86,83.91,136.08,328.85,Single-ply,SBD,M
Boys,67.13,11,James Bowen,Shepherd,62.14,104.33,90.72,129.27,324.32,Single-ply,SBD,M
Boys,67.13,12,Cody Young,New Caney,66.95,111.13,63.5,129.27,303.91,Single-ply,SBD,M
Boys,67.13,13,Sebastian Viezcas,Cleveland,60.33,117.93,68.04,113.4,299.37,Single-ply,SBD,M
Boys,67.13,DQ,Tristan Groh,Splendora,60.78,92.99,65.77,95.25,,Single-ply,SBD,M
Boys,67.13,DQ,Anthony McMullins,Splendora,65.14,99.79,68.04,83.91,,Single-ply,SBD,M
Boys,67.13,DQ,Carlos Hernandez #11,Splendora,65.59,92.99,,,,Single-ply,SBD,M
Boys,67.13,DQ,Jose Montoya,Willis,65.14,,,,,Single-ply,SBD,M
Boys,67.13,DQ,Abel Stendahl,Splendora,65.59,133.81,,,,Single-ply,SBD,M
Boys,74.84,1,Matthew Nguyen,Palacios,72.57,190.51,97.52,199.58,487.61,Single-ply,SBD,M
Boys,74.84,2,David Saucedo,Shepherd,72.76,174.63,106.59,190.51,471.74,Single-ply,SBD,M
Boys,74.84,3,Xavier Green,Crosby,74.39,174.63,102.06,188.24,464.93,Single-ply,SBD,M
Boys,74.84,4,Ekikere Etokebe,New Caney Porter,73.94,174.63,108.86,170.1,453.59,Single-ply,SBD,M
Boys,74.84,5,David Muñoz,Shepherd,67.68,149.69,102.06,190.51,442.25,Single-ply,SBD,M
Boys,74.84,6,Luis Guzman,Cleveland,73.48,167.83,90.72,151.95,410.5,Single-ply,SBD,M
Boys,74.84,7,Egon Lyttle,New Caney Porter,68.31,161.03,92.99,154.22,408.23,Single-ply,SBD,M
Boys,74.84,8,Brendan Lopez,Palacios,70.58,142.88,92.99,170.1,405.97,Single-ply,SBD,M
Boys,74.84,9,Ty Higginbotham,Splendora,73.48,149.69,88.45,161.03,399.16,Single-ply,SBD,M
Boys,74.84,10,Jacob Cook,Splendora,73.94,147.42,90.72,151.95,390.09,Single-ply,SBD,M
Boys,74.84,11,Nick Soza,Crosby,70.31,138.35,92.99,147.42,378.75,Single-ply,SBD,M
Boys,74.84,12,Johnathan Murphy,Huntsville,74.12,136.08,88.45,142.88,367.41,Single-ply,SBD,M
Boys,74.84,13,Benny Garcia,Palacios,72.12,117.93,83.91,161.03,362.87,Single-ply,SBD,M
Boys,74.84,14,Luis Gallaga,Willis,68.76,115.67,74.84,129.27,319.78,Single-ply,SBD,M
Boys,74.84,15,Dave Bagwell,New Caney Porter,67.86,131.54,65.77,113.4,310.71,Single-ply,SBD,M
Boys,74.84,16,John Lovelady,Willis,72.67,90.72,58.97,140.61,290.3,Single-ply,SBD,M
Boys,74.84,DQ,Kevin Gonzalez,Splendora,74.66,120.2,77.11,131.54,,Single-ply,SBD,M
Boys,74.84,DQ,Kody Quibideaux,Shepherd,74.12,92.99,52.16,97.52,,Single-ply,SBD,M
Boys,74.84,DQ,Jason Matthews,Shepherd,68.58,86.18,,,,Single-ply,SBD,M
Boys,74.84,DQ,Arthur Maxwell,Shepherd,72.3,,,,,Single-ply,SBD,M
Boys,82.1,1,Tyrell Franks,Cleveland,80.92,226.8,129.27,190.51,546.58,Single-ply,SBD,M
Boys,82.1,2,Greg Sexton,Palacios,81.83,192.78,113.4,217.72,523.9,Single-ply,SBD,M
Boys,82.1,3,Kyle Leal,Crosby,77.84,149.69,102.06,183.7,435.45,Single-ply,SBD,M
Boys,89.81,4,Dalton Ramon,Huntsville,82.19,151.95,108.86,170.1,430.91,Single-ply,SBD,M
Boys,82.1,5,Chris Ferguson,New Caney,76.66,149.69,92.99,165.56,408.23,Single-ply,SBD,M
Boys,82.1,6,Clay McGuire,New Caney,78.29,108.86,77.11,136.08,322.05,Single-ply,SBD,M
Boys,82.1,7,Jacob Daigle,Magnolia West,80.38,106.59,90.72,113.4,310.71,Single-ply,SBD,M
Boys,82.1,DQ,Blake Whitton,Cleveland,82.1,,,,,Single-ply,SBD,M
Boys,89.81,1,Cesar Yepes,New Caney Porter,89.09,183.7,161.03,192.78,537.51,Single-ply,SBD,M
Boys,89.81,2,Jacob Little,Splendora,87.82,197.31,120.2,204.12,521.63,Single-ply,SBD,M
Boys,89.81,3,Joe Jack,Crosby,83.91,197.31,90.72,170.1,458.13,Single-ply,SBD,M
Boys,89.81,4,Juan Lopez,Palacios,86.36,140.61,97.52,199.58,437.72,Single-ply,SBD,M
Boys,89.81,5,Chase Nix,Crosby,82.92,136.08,77.11,170.1,383.29,Single-ply,SBD,M
Boys,89.81,6,Preston Thomas,Shepherd,88.36,145.15,83.91,154.22,383.29,Single-ply,SBD,M
Boys,89.81,7,Jimmy Pinkard,New Caney,85.37,147.42,92.99,131.54,371.95,Single-ply,SBD,M
Boys,89.81,8,Chris Mann,Cleveland,85.82,142.88,79.38,149.69,371.95,Single-ply,SBD,M
Boys,89.81,9,Jacob Bennett,Magnolia West,86.18,102.06,79.38,149.69,331.12,Single-ply,SBD,M
Boys,89.81,DQ,Kyle Ray,Splendora,88.36,147.42,,,,Single-ply,SBD,M
Boys,99.79,1,Darren Stewart,Splendora,97.25,267.62,154.22,249.48,671.32,Single-ply,SBD,M
Boys,109.77,2,Jacob Courvelle,Shepherd,100.02,226.8,124.74,238.14,589.67,Single-ply,SBD,M
Boys,99.79,3,Dominic Merka,Crosby,99.34,174.63,129.27,226.8,530.7,Single-ply,SBD,M
Boys,99.79,4,Mitch Kight,Willis,96.62,183.7,106.59,179.17,469.47,Single-ply,SBD,M
Boys,99.79,5,Ray Mendez,Crosby,97.79,158.76,120.2,188.24,467.2,Single-ply,SBD,M
Boys,99.79,6,Michael Rottiger,Huntsville,94.53,156.49,106.59,170.1,433.18,Single-ply,SBD,M
Boys,99.79,7,Adrian White,Crosby,95.98,151.95,106.59,154.22,412.77,Single-ply,SBD,M
Boys,99.79,8,Brett Attwood,Cleveland,96.71,161.03,95.25,156.49,412.77,Single-ply,SBD,M
Boys,99.79,9,Cody Skrivanek,Magnolia West,99.43,156.49,88.45,158.76,403.7,Single-ply,SBD,M
Boys,109.77,1,Adam Aucoin,Palacios,102.15,272.16,151.95,226.8,650.91,Single-ply,SBD,M
Boys,109.77,2,Michael Garcia,Palacios,106.14,222.26,140.61,226.8,589.67,Single-ply,SBD,M
Boys,109.77,3,Caleb Etheridge,New Caney,104.33,215.46,149.69,190.51,555.65,Single-ply,SBD,M
Boys,109.77,4,Justin Walker,Crosby,103.96,165.56,111.13,226.8,503.49,Single-ply,SBD,M
Boys,109.77,5,Randall Richards,Cleveland,101.7,172.37,102.06,204.12,478.54,Single-ply,SBD,M
Boys,109.77,6,Austin Ray,Magnolia West,106.87,183.7,111.13,147.42,442.25,Single-ply,SBD,M
Boys,109.77,7,Jacoby Callahan,New Caney Porter,109.32,181.44,83.91,136.08,401.43,Single-ply,SBD,M
Boys,109.77,8,Seth Blenderman,Magnolia West,108.5,111.13,83.91,154.22,349.27,Single-ply,SBD,M
Boys,109.77,DQ,David Kierum,New Caney,109.04,215.46,136.08,,,Single-ply,SBD,M
Boys,109.77,DQ,Jaleel Williams,New Caney Porter,109.41,156.49,,,,Single-ply,SBD,M
Boys,124.74,1,Charlie Courvelle,Shepherd,123.2,283.5,165.56,226.8,675.85,Single-ply,SBD,M
Boys,124.74,2,Travis Randall,Splendora,123.92,244.94,165.56,226.8,637.3,Single-ply,SBD,M
Boys,124.74,3,Caleb Clark,Crosby,121.56,197.31,111.13,206.38,514.83,Single-ply,SBD,M
Boys,124.74,4,Miguel Banda,Cleveland,114.12,204.12,127.01,174.63,505.76,Single-ply,SBD,M
Boys,124.74,5,Tyler Cromeens,Splendora,117.84,188.24,106.59,192.78,487.61,Single-ply,SBD,M
Boys,124.74,6,Ivan Estipona,New Caney Porter,123.92,206.38,102.06,142.88,451.32,Single-ply,SBD,M
Boys,124.74,DQ,T'Vondre Carter,Huntsville,119.39,156.49,,,,Single-ply,SBD,M
Boys,124.74+,1,Cullen Burch,Cleveland,138.25,260.82,183.7,208.65,653.17,Single-ply,SBD,M
Boys,124.74+,2,Justin Smith #18,New Caney,131.09,244.94,197.31,188.24,630.49,Single-ply,SBD,M
Boys,124.74+,3,JR Venette,Huntsville,125.46,208.65,145.15,195.04,548.85,Single-ply,SBD,M
