Division,WeightClassKg,Place,Name,Team,BodyweightKg,Best3SquatKg,Best3BenchKg,Best3DeadliftKg,TotalKg,Equipment,Event,Sex
Boys,51.71,1,Martin Alaniz,Sharyland Pioneer,51.71,127.01,68.04,154.22,349.27,Single-ply,SBD,M
Boys,51.71,DQ,Victor Vasquez,Sharyland Pioneer,50.21,97.52,,,,Single-ply,SBD,M
Boys,55.79,1,Javier Farias,Mission,55.02,174.63,81.65,213.19,469.47,Single-ply,SBD,M
Boys,55.79,2,Jesus Puente,La Joya Palmview,51.85,170.1,95.25,167.83,433.18,Single-ply,SBD,M
Boys,55.79,3,Andy Oleguerra,Edcouch-Elsa,55.16,165.56,72.57,174.63,412.77,Single-ply,SBD,M
Boys,55.79,4,Luis Garcia #9,Sharyland Pioneer,51.89,124.74,56.7,145.15,326.59,Single-ply,SBD,M
Boys,59.87,1,San Juan Rodriguez,Edcouch-Elsa,59.87,195.04,106.59,188.24,489.88,Single-ply,SBD,M
Boys,59.87,2,Adrian Garcia,Edinburg Economedes,55.84,170.1,102.06,172.37,444.52,Single-ply,SBD,M
Boys,59.87,3,Ethan Inucando,Mission Sharyland,59.56,149.69,79.38,174.63,403.7,Single-ply,SBD,M
Boys,59.87,4,Fernando Mendoza,McAllen Rowe,55.88,136.08,83.91,170.1,390.09,Single-ply,SBD,M
Boys,59.87,DQ,Anthony Trevino,Rio Grande City Grulla,59.6,136.08,90.72,,,Single-ply,SBD,M
Boys,67.13,1,Mario Marquez,Mission,64.05,231.33,115.67,210.92,557.92,Single-ply,SBD,M
Boys,67.13,2,Mike Tamez,La Joya Palmview,65.82,204.12,104.33,206.38,514.83,Single-ply,SBD,M
Boys,67.13,3,Fernie Briones,McAllen Memorial,67,190.51,129.27,188.24,508.02,Single-ply,SBD,M
Boys,67.13,4,Eleazar Garcia,Rio Grande City,65,158.76,111.13,154.22,424.11,Single-ply,SBD,M
Boys,67.13,5,Fidencio Ortega,La Joya Juarez-Lincoln,63.37,147.42,97.52,156.49,401.43,Single-ply,SBD,M
Boys,67.13,6,Raul Ramirez,McAllen,67.13,124.74,99.79,147.42,371.95,Single-ply,SBD,M
Boys,67.13,7,Ethan Noyola,McAllen,62.55,136.08,79.38,147.42,362.87,Single-ply,SBD,M
Boys,67.13,8,Balerio Andrade,Sharyland Pioneer,60.01,117.93,74.84,145.15,337.93,Single-ply,SBD,M
Boys,67.13,DQ,Eduardo Garcia #4,McAllen,60.01,104.33,,,,Single-ply,SBD,M
Boys,67.13,DQ,Justin Chairez,McAllen Memorial,64.18,176.9,,,,Single-ply,SBD,M
Boys,67.13,DQ,Dylan Bazarte,Mission Sharyland,67.09,219.99,117.93,,,Single-ply,SBD,M
Boys,67.13,DQ,Emilano Becerril,Mission Sharyland,66.59,185.97,,,,Single-ply,SBD,M
Boys,74.84,1,Ricky Ortiz #1,Edcouch-Elsa,70.31,294.84,183.7,265.35,743.89,Single-ply,SBD,M
Boys,74.84,2,Robert Farias,Mission Sharyland,72.98,235.87,131.54,215.46,582.87,Single-ply,SBD,M
Boys,74.84,3,Jesus Sepulveda,Edinburg Economedes,73.26,240.4,138.35,204.12,582.87,Single-ply,SBD,M
Boys,74.84,4,Fabian Rodriguez,McAllen Memorial,74.71,206.38,142.88,204.12,553.38,Single-ply,SBD,M
Boys,74.84,5,Brian Pena,Rio Grande City,74.21,195.04,122.47,179.17,496.68,Single-ply,SBD,M
Boys,74.84,6,Carlos Arojona,La Joya Palmview,69.58,199.58,108.86,183.7,492.15,Single-ply,SBD,M
Boys,74.84,7,Rolando Saenz,Mission Sharyland,67.18,188.24,90.72,174.63,453.59,Single-ply,SBD,M
Boys,74.84,8,Leo Perez,Mission,70.53,158.76,102.06,185.97,446.79,Single-ply,SBD,M
Boys,74.84,DQ,Albert Troncoso,Mission Veterans Memorial,72.26,192.78,111.13,,,Single-ply,SBD,M
Boys,82.1,1,Oscar Mendoza,La Joya Palmview,81.92,213.19,158.76,226.8,598.74,Single-ply,SBD,M
Boys,82.1,2,Coy Burrows,Sharyland Pioneer,74.93,231.33,142.88,217.72,591.94,Single-ply,SBD,M
Boys,82.1,3,Tony Gil,Edcouch-Elsa,81.78,226.8,142.88,208.65,578.33,Single-ply,SBD,M
Boys,82.1,4,Erik Guzman,La Joya Juarez-Lincoln,82.01,224.53,136.08,208.65,569.26,Single-ply,SBD,M
Boys,82.1,5,Sadge Diaz,McAllen,81.19,215.46,108.86,204.12,528.44,Single-ply,SBD,M
Boys,82.1,6,Tripp Potter,McAllen,81.65,195.04,108.86,204.12,508.02,Single-ply,SBD,M
Boys,82.1,7,Armando Resendez,McAllen Memorial,81.56,213.19,120.2,165.56,498.95,Single-ply,SBD,M
Boys,82.1,8,Mauricio Sanchez,Mission Sharyland,78.34,181.44,113.4,183.7,478.54,Single-ply,SBD,M
Boys,82.1,9,Elian Padilla,La Joya Juarez-Lincoln,81.15,183.7,113.4,176.9,474,Single-ply,SBD,M
Boys,82.1,10,Rosbel Zamarripa,La Joya Palmview,81.42,172.37,108.86,183.7,464.93,Single-ply,SBD,M
Boys,82.1,11,Jose Ibarra,Mission Veterans Memorial,81.87,185.97,106.59,172.37,464.93,Single-ply,SBD,M
Boys,82.1,12,Alejandro Reyes,McAllen Memorial,74.93,170.1,102.06,183.7,455.86,Single-ply,SBD,M
Boys,82.1,13,Enrique Ibarra,McAllen Memorial,78.47,154.22,97.52,165.56,417.3,Single-ply,SBD,M
Boys,82.1,DQ,Gonzalo Perez,Mission,81.83,,,,,Single-ply,SBD,M
Boys,89.81,1,Obed Hernandez,Sharyland Pioneer,89.72,285.76,167.83,283.5,737.09,Single-ply,SBD,M
Boys,89.81,2,Jacob Perez #4,Edcouch-Elsa,86.95,251.74,129.27,251.74,632.76,Single-ply,SBD,M
Boys,89.81,3,Robert Sumbillo,Edcouch-Elsa,88.95,215.46,124.74,206.38,546.58,Single-ply,SBD,M
Boys,89.81,4,Aaron Longoria,Mission Veterans Memorial,88.04,224.53,122.47,190.51,537.51,Single-ply,SBD,M
Boys,89.81,5,Leo Gonzalez,Mission Veterans Memorial,85.96,199.58,102.06,192.78,494.42,Single-ply,SBD,M
Boys,89.81,6,Alejandro Garcia,McAllen,88.9,206.38,95.25,183.7,485.34,Single-ply,SBD,M
Boys,89.81,7,Juan Villarreal,Sharyland Pioneer,83.82,172.37,108.86,197.31,478.54,Single-ply,SBD,M
Boys,89.81,8,Maurcio Galindo,Mission Sharyland,86.45,174.63,99.79,131.54,405.97,Single-ply,SBD,M
Boys,89.81,9,Ruben Ramirez,Mission Veterans Memorial,89.63,151.95,92.99,161.03,405.97,Single-ply,SBD,M
Boys,89.81,10,Jacob Cano,Mission Sharyland,87.54,158.76,79.38,156.49,394.63,Single-ply,SBD,M
Boys,89.81,DQ,Sebastian Sanchez,Mission Sharyland,82.28,238.14,129.27,,,Single-ply,SBD,M
Boys,89.81,DQ,Miguel Rendon,Mission,82.24,226.8,127.01,,,Single-ply,SBD,M
Boys,89.81,DQ,Armando Garza,La Joya Palmview,88.77,,,,,Single-ply,SBD,M
Boys,99.79,1,Nate Vallejo,Edcouch-Elsa,98.79,272.16,192.78,278.96,743.89,Single-ply,SBD,M
Boys,99.79,2,Eric Gutierrez,Mission,93.17,240.4,151.95,226.8,619.15,Single-ply,SBD,M
Boys,99.79,3,John Garcia,Mission Veterans Memorial,96.84,238.14,142.88,192.78,573.79,Single-ply,SBD,M
Boys,99.79,4,Daniel Alejandro,McAllen Rowe,96.89,226.8,133.81,213.19,573.79,Single-ply,SBD,M
Boys,99.79,5,Aj Flores,Mission,93.94,206.38,124.74,238.14,569.26,Single-ply,SBD,M
Boys,99.79,6,Luis Venecia,La Joya Juarez-Lincoln,93.98,226.8,120.2,213.19,560.19,Single-ply,SBD,M
Boys,99.79,7,Bryan Rosales,Mission,95.07,213.19,129.27,215.46,557.92,Single-ply,SBD,M
Boys,99.79,8,Erik Flores,La Joya Juarez-Lincoln,93.98,195.04,113.4,181.44,489.88,Single-ply,SBD,M
Boys,99.79,9,Alvaro Ramirez,La Joya Juarez-Lincoln,95.53,192.78,117.93,176.9,487.61,Single-ply,SBD,M
Boys,99.79,10,Mark Pacheco,McAllen Rowe,91.63,167.83,124.74,190.51,483.08,Single-ply,SBD,M
Boys,99.79,11,Abelino Lopez,Rio Grande City Grulla,94.12,181.44,102.06,192.78,476.27,Single-ply,SBD,M
Boys,99.79,12,Abraham Guevaza,McAllen Rowe,89.9,167.83,106.59,185.97,460.4,Single-ply,SBD,M
Boys,99.79,13,Victoriano Chapa,Rio Grande City Grulla,96.07,142.88,86.18,142.88,371.95,Single-ply,SBD,M
Boys,99.79,DQ,Alberto Vargas,La Joya Palmview,93.89,183.7,158.76,,,Single-ply,SBD,M
Boys,99.79,DQ,Juan Cantu,McAllen,99.29,158.76,,,,Single-ply,SBD,M
Boys,99.79,DQ,Julian Hernandez,McAllen Memorial,93.26,,,,,Single-ply,SBD,M
Boys,109.77,1,Cody Alvarado,Edcouch-Elsa,109.27,322.05,199.58,294.84,816.47,Single-ply,SBD,M
Boys,109.77,2,Matthew Alfaro,Edinburg Economedes,109.23,288.03,156.49,244.94,689.46,Single-ply,SBD,M
Boys,109.77,3,Fabian Ahumada,Mission,100.24,247.21,136.08,226.8,610.08,Single-ply,SBD,M
Boys,109.77,4,Christian Hernandez,La Joya Juarez-Lincoln,104.73,217.72,120.2,183.7,521.63,Single-ply,SBD,M
Boys,109.77,5,Gonzalo Montalvo,Rio Grande City Grulla,106.23,197.31,136.08,188.24,521.63,Single-ply,SBD,M
Boys,109.77,6,Alexander Guerra,McAllen Memorial,107.59,213.19,106.59,179.17,498.95,Single-ply,SBD,M
Boys,109.77,7,Jose Cavazos,McAllen Rowe,100.43,154.22,81.65,149.69,385.55,Single-ply,SBD,M
Boys,109.77,DQ,Andrew Torres,Sharyland Pioneer,104.24,249.48,,,,Single-ply,SBD,M
Boys,109.77,DQ,Benjamin Rios,Rio Grande City Grulla,104.73,145.15,92.99,,,Single-ply,SBD,M
Boys,109.77,DQ,Juan Gomez,Mission Sharyland,108.45,,,,,Single-ply,SBD,M
Boys,109.77,DQ,Rusbel Alanis,Rio Grande City Grulla,106.1,,,,,Single-ply,SBD,M
Boys,109.77,DQ,Ezequiel Garcia,La Joya Juarez-Lincoln,103.65,226.8,147.42,,,Single-ply,SBD,M
Boys,124.74,1,Imanol Rodriguez,Edcouch-Elsa,120.43,294.84,197.31,229.06,721.21,Single-ply,SBD,M
Boys,124.74,2,Sergio Reyna,McAllen Memorial,124.33,285.76,185.97,219.99,691.73,Single-ply,SBD,M
Boys,124.74,3,Steven Alvarez,Mission,123.56,260.82,172.37,238.14,671.32,Single-ply,SBD,M
Boys,124.74,4,Joshua Williams,Mission Sharyland,123.06,260.82,158.76,249.48,669.05,Single-ply,SBD,M
Boys,124.74,5,Isreal Moncivais,La Joya Juarez-Lincoln,119.88,247.21,145.15,233.6,625.96,Single-ply,SBD,M
Boys,124.74,6,Osiel Alonso,La Joya Juarez-Lincoln,120.88,263.08,156.49,201.85,621.42,Single-ply,SBD,M
Boys,124.74,7,Jesse Garza,McAllen Rowe,116.57,208.65,140.61,224.53,573.79,Single-ply,SBD,M
Boys,124.74,8,Kris Garza,Rio Grande City,110.59,224.53,136.08,190.51,551.11,Single-ply,SBD,M
Boys,124.74,9,Diego Ochoa,Mission Sharyland,120.02,240.4,113.4,176.9,530.7,Single-ply,SBD,M
Boys,124.74,10,Anthony Ortiz,Rio Grande City,123.1,208.65,136.08,185.97,530.7,Single-ply,SBD,M
Boys,124.74,11,Humberto Gonzalez,Rio Grande City,113.35,179.17,106.59,145.15,430.91,Single-ply,SBD,M
Boys,124.74,DQ,Miguel Salazar,Rio Grande City Grulla,119.79,,,,,Single-ply,SBD,M
Boys,124.74,DQ,Martin Rodriguez #5,McAllen,119.39,217.72,124.74,,,Single-ply,SBD,M
Boys,124.74+,1,Bryan Aguillon,McAllen Rowe,138.8,297.1,156.49,274.42,728.02,Single-ply,SBD,M
Boys,124.74+,2,Jason Vasquez,Edcouch-Elsa,127.91,240.4,142.88,208.65,591.94,Single-ply,SBD,M
Boys,124.74+,3,Jacob Mata,McAllen Rowe,143.43,210.92,174.63,201.85,587.4,Single-ply,SBD,M
Boys,124.74+,4,Aalok Zimmerman,McAllen Rowe,124.92,235.87,149.69,190.51,576.06,Single-ply,SBD,M
Boys,124.74+,5,Jimmy Talamantes,McAllen Rowe,141.97,222.26,127.01,165.56,514.83,Single-ply,SBD,M
Boys,124.74+,6,Juan Villagomez,La Joya Juarez-Lincoln,130.91,190.51,140.61,172.37,503.49,Single-ply,SBD,M
Boys,124.74+,DQ,Zack Clemmons,Mission,131.86,272.16,183.7,,,Single-ply,SBD,M
