Place,Name,BodyweightKg,Squat1Kg,Squat2Kg,Squat3Kg,Best3SquatKg,Bench1Kg,Bench2Kg,Bench3Kg,Best3BenchKg,Deadlift1Kg,Deadlift2Kg,Deadlift3Kg,Deadlift4Kg,Best3DeadliftKg,TotalKg,WeightClassKg,Sex,CyrillicName,BirthYear,Equipment,Event,Division
1,Alexey Romanov,51,205,215,220,220,135,145,155,155,185,195,-205,,195,570,52,M,Алексей Романов,1981,Single-ply,SBD,Open
2,Alexander Baykov,51,205,215,-220,215,120,130,-140,130,150,160,167.5,,167.5,512.5,52,M,Александр Байков,1982,Single-ply,SBD,Open
3,Vladimir Talankin,51,185,197.5,-207.5,197.5,105,110,,110,182.5,202.5,-207.5,,202.5,510,52,M,Владимир Таланкин,1985,Single-ply,SBD,Open
4,Yevgeny Kalabin,51,-175,175,-190,175,120,-127.5,130,130,185,192.5,-195,,192.5,497.5,52,M,Евгений Калабин,1986,Single-ply,SBD,Open
5,Vladimir Druzhinin,51,170,185,190,190,115,122.5,127.5,127.5,170,-180,-182.5,,170,487.5,52,M,Владимир Дружинин,1985,Single-ply,SBD,Open
6,Leonid Asabin,52,175,-185,-190,175,115,120,-125,120,-175,175,-185,,175,470,52,M,Леонид Асабин,1978,Single-ply,SBD,Open
DQ,Vladimir Balynets,47,-215,-215,-215,,130,137.5,-145,137.5,,,,,,,52,M,Владимир Балынец,1985,Single-ply,SBD,Open
1,Konstantin Pavlov,55,230,245,250,250,170,177.5,-182.5,177.5,200,210,215,,215,642.5,56,M,Константин Павлов,1973,Single-ply,SBD,Open
2,Sergey Gladkikh,55,220,230,235,235,-140,140,145,145,200,210,217.5,,217.5,597.5,56,M,Сергей Гладких,1989,Single-ply,SBD,Open
3,Vitaly Poberezhny,55,210,220,230,230,140,150,-157.5,150,200,-207.5,-210,,200,580,56,M,Виталий Побережный,1984,Single-ply,SBD,Open
4,Vladimir Obozhin,56,205,215,-225,215,130,-140,140,140,200,207.5,-212.5,,207.5,562.5,56,M,Владимир Обожин,1985,Single-ply,SBD,Open
5,Aleksandr Li,55,210,-220,220,220,140,-145,145,145,-190,190,-230,,190,555,56,M,Александр Ли,1983,Single-ply,SBD,Open
6,Andrey Svistunov,56,185,-192.5,-192.5,185,105,-110,-110,105,185,-190,192.5,,192.5,482.5,56,M,Андрей Свистунов,1977,Single-ply,SBD,Open
7,Mikhail Gorkunov,54,175,-185,-190,175,100,107.5,-112.5,107.5,180,-190,-190,,180,462.5,56,M,Михаил Горкунов,1986,Single-ply,SBD,Open
1,Konstantin Danilov,59.1,240,250,-255,250,-130,130,137.5,137.5,220,230,235,,235,622.5,60,M,Константин Данилов,1986,Single-ply,SBD,Open
2,Ivan Mylnikov,59,230,-240,240,240,140,150,155,155,212.5,220,-230,,220,615,60,M,Иван Мыльников,1986,Single-ply,SBD,Open
3,Mikhail Voskresenskiy,59,225,235,240,240,140,145,150,150,215,222.5,,,222.5,612.5,60,M,Михаил Воскресенский,1983,Single-ply,SBD,Open
4,Andrey Kravtsov,59,200,215,,215,125,130,-140,130,205,-215,215,,215,560,60,M,Андрей Кравцов,1986,Single-ply,SBD,Open
5,Artem Tavastsherna,60,210,-230,-230,210,-150,150,-160,150,190,200,-202.5,,200,560,60,M,Артем Тавастшерна,1985,Single-ply,SBD,Open
DQ,Dmitriy Alekseev,58,240,250,-260,250,-140,-140,-140,,,,,,,,60,M,Дмитрий Алексеев,1983,Single-ply,SBD,Open
1,Mikhail Andryukhin,64,-270,270,-285,270,-170,170,177.5,177.5,260,280,-290,,280,727.5,67.5,M,Михаил Андрюхин,1970,Single-ply,SBD,Open
2,Sergey Agafonov,66,250,260,267.5,267.5,175,-180,,175,240,260,-265,,260,702.5,67.5,M,Сергей Агафонов,1984,Single-ply,SBD,Open
DQ,Mikhail Buravov,67,260,270,-280,270,155,-165,,155,-260,-265,-265,,,,67.5,M,Михаил Буравов,1986,Single-ply,SBD,Open
DQ,Aleksandr Vosrkesenskiy,65,,,,,,,,,,,,,,,67.5,M,Александр Воскресенский,1986,Single-ply,SBD,Open
1,Artem Korotygin,74,310,320,330,330,-220,220,232.5,232.5,270,280,287.5,,287.5,850,75,M,Артем Коротыгин,1980,Single-ply,SBD,Open
2,Viktor Baranov,74,295,-310,310,310,170,180,190,190,290,-300,300,,300,800,75,M,Виктор Баранов,1967,Single-ply,SBD,Open
3,Nikolay Sokolov,70,270,-285,285,285,180,187.5,192.5,192.5,250,265,277.5,,277.5,755,75,M,Николай Соколов,1979,Single-ply,SBD,Open
4,Konstantin Girin,72,300,310,-315,310,190,200,205,205,240,-250,-250,,240,755,75,M,Константин Гирин,1981,Single-ply,SBD,Open
5,Aleksey Bizyaev,74,265,280,290,290,-165,165,-172.5,165,275,300,-305,,300,755,75,M,Алексей Бизяев,1983,Single-ply,SBD,Open
6,Aleksey Ganichev,74,265,280,285,285,170,-180,180,180,270,280,-287.5,,280,745,75,M,Алексей Ганичев,1980,Single-ply,SBD,Open
7,Sergey Melekhin,75,255,270,277.5,277.5,180,190,195,195,245,250,-257.5,,250,722.5,75,M,Сергей Мелехин,1972,Single-ply,SBD,Open
8,Vladimir Filippov,74,270,280,285,285,170,-180,-180,170,240,250,-260,,250,705,75,M,Владимир Филиппов,1986,Single-ply,SBD,Open
9,Igor Solyannikov,74,-250,250,260,260,160,-165,165,165,-215,215,-230,,215,640,75,M,Игорь Солянников,1976,Single-ply,SBD,Open
DQ,Aleksandr Bykov,74,-300,-300,-300,,,,,,,,,,,,75,M,Александр Быков,1982,Single-ply,SBD,Open
DQ,Aleksandr Gromov,74,,,,,,,,,,,,,,,75,M,Александр Громов,1981,Single-ply,SBD,Open
1,Gennadiy Eryomin,81,310,-320,-320,310,215,222.5,235,235,300,310,320,,320,865,82.5,M,Геннадий Ерёмин,1977,Single-ply,SBD,Open
2,Aleksey Zhukov,80,320,-335,-335,320,235,240,245,245,250,255,260,,260,825,82.5,M,Алексей Жуков,1980,Single-ply,SBD,Open
3,Ivan Dmitriev,82,-270,-270,270,270,192.5,-200,200,200,310,320,-322.5,,320,790,82.5,M,Иван Дмитриев,1970,Single-ply,SBD,Open
4,Vladimir Zhabin,82,285,-295,295,295,180,-190,-190,180,285,295,-300,,295,770,82.5,M,Владимир Жабин,1980,Single-ply,SBD,Open
5,Sergey Negara,79,275,290,-305,290,185,195,205,205,-270,270,-295,,270,765,82.5,M,Сергей Негара,1978,Single-ply,SBD,Open
6,Ivan Kallya,77.7,255,265,275,275,155,165,-170,165,300,315,320,,320,760,82.5,M,Иван Калля,1962,Single-ply,SBD,Open
7,Aleksey Krasnoperov,81,280,300,-312.5,300,-180,180,-187.5,180,255,270,-280,,270,750,82.5,M,Алексей Красноперов,1986,Single-ply,SBD,Open
8,Roman Chesnokov,80,260,,,260,200,210,-220,210,260,,,,260,730,82.5,M,Роман Чесноков,1980,Single-ply,SBD,Open
9,Aleksey Egorov,81,280,-290,-290,280,-170,-170,170,170,250,265,-272.5,,265,715,82.5,M,Алексей Егоров,1977,Single-ply,SBD,Open
10,Pavel Kuzmich,81,265,-275,275,275,-155,155,-165,155,270,-290,-290,,270,700,82.5,M,Павел Кузьмич,1987,Single-ply,SBD,Open
11,Artur Bashkirov,82,-225,225,235,235,-202.5,202.5,207.5,207.5,225,240,-277.5,,240,682.5,82.5,M,Артур Башкиров,1970,Single-ply,SBD,Open
1,Andrey Belyaev #1,89,360,375,-382.5,375,250,-257.5,257.5,257.5,350,367.5,380,,380,1012.5,90,M,Андрей Беляев,1983,Single-ply,SBD,Open
2,Vladimir Grishaev,86,330,-345,350,350,230,245,255,255,265,280,-290,,280,885,90,M,Владимир Гришаев,1981,Single-ply,SBD,Open
3,Aleksey Onofrienko,89,-320,325,340,340,185,195,200,200,310,325,330,,330,870,90,M,Алексей Онофриенко,1974,Single-ply,SBD,Open
4,Aleksandr Babin,88,285,300,-305,300,230,237.5,242.5,242.5,290,307.5,-315,,307.5,850,90,M,Александр Бабин,1982,Single-ply,SBD,Open
5,Andrey Pankov #1,89,280,297.5,310,310,220,225,227.5,227.5,280,-297.5,312.5,,312.5,850,90,M,Андрей Паньков,1986,Single-ply,SBD,Open
6,Igor Rudnev,88,305,-315,315,315,215,220,225,225,290,305,-310,,305,845,90,M,Игорь Руднев,1983,Single-ply,SBD,Open
7,Dmitriy Stepanov,89,295,307.5,315,315,197.5,207.5,212.5,212.5,295,307.5,317.5,,317.5,845,90,M,Дмитрий Степанов,1982,Single-ply,SBD,Open
9,Aleksandr Glushakov,87,310,320,,320,170,190,202.5,202.5,270,300,-302.5,,300,822.5,90,M,Александр Глушаков,1978,Single-ply,SBD,Open
8,Aleksandr Belousov,89,315,-322.5,-322.5,315,210,-220,-220,210,260,290,-325,,290,815,90,M,Александр Белоусов,1981,Single-ply,SBD,Open
10,Artem Razzhivin,86,-300,300,-310,300,210,-215,,210,280,300,-312.5,,300,810,90,M,Артем Разживин,1983,Single-ply,SBD,Open
11,Sergey Lygin,89,-300,300,-310,300,200,-210,,200,285,-295,,,285,785,90,M,Сергей Лыгин,1979,Single-ply,SBD,Open
12,Vladimir Agafovov,89,270,280,,280,190,200,210,210,270,285,,,285,775,90,M,Владимир Агафонов,1976,Single-ply,SBD,Open
13,Sergey Gvozdev,89,280,290,-300,290,170,182.5,-190,182.5,280,295,300,,300,772.5,90,M,Сергей Гвоздев,1985,Single-ply,SBD,Open
14,Stanislav Vishnyakov,88,270,-280,,270,175,-180,-180,175,275,290,305,,305,750,90,M,Станислав Вишняков,1976,Single-ply,SBD,Open
15,Yuriy Stefanovich,87,-270,270,-280,270,190,200,210,210,240,255,-270,,255,735,90,M,Юрий Стефанович,1983,Single-ply,SBD,Open
16,Viktor Mikhaylov,89,190,,,190,200,210,215,215,195,,,,195,600,90,M,Виктор Михайлов,1977,Single-ply,SBD,Open
DQ,Nikolay Ponomarev,86,,,,,,,,,,,,,,,90,M,Николай Пономарев,1981,Single-ply,SBD,Open
1,Aleksey Zvarykin,96,350,370,-380,370,220,230,237.5,237.5,340,365,377.5,,377.5,985,100,M,Алексей Зварыкин,1979,Single-ply,SBD,Open
2,Aleksey Malunin,98,-365,365,375,375,255,265,-271,265,330,345,-350,,345,985,100,M,Алексей Малунин,1978,Single-ply,SBD,Open
3,Andrey Sorokin,100,365,-380,387.5,387.5,220,230,237.5,237.5,310,330,340,,340,965,100,M,Андрей Сорокин,1974,Single-ply,SBD,Open
4,Konstantin Pozdeev,95,340,360,-375,360,195,205,215,215,320,350,-375,,350,925,100,M,Константин Поздеев,1984,Single-ply,SBD,Open
5,Mikhail Kim,98,310,320,-325,320,195,202.5,207.5,207.5,340,360,-375,,360,887.5,100,M,Михаил Ким,1980,Single-ply,SBD,Open
6,Yuriy Sergienko,97,370,-380,,370,190,200,205,205,305,-320,-320,,305,880,100,M,Юрий Сергиенко,1983,Single-ply,SBD,Open
7,Lev Shtaryov,98,360,,,360,190,200,207.5,207.5,310,-330,,,310,877.5,100,M,Лев Штарёв,1975,Single-ply,SBD,Open
8,Ilya Tsvetkov,100,330,-350,-360,330,210,215,-220,215,310,330,-345,,330,875,100,M,Илья Цветков,1975,Single-ply,SBD,Open
9,Aleksandr Deryagin,98,-300,310,330,330,200,-210,-210,200,285,300,-320,,300,830,100,M,Александр Дерягин,1973,Single-ply,SBD,Open
10,Sergey Burov,99,300,315,-325,315,185,-195,-195,185,290,305,-320,,305,805,100,M,Сергей Буров,1977,Single-ply,SBD,Open
11,Andrey Veber,95,285,-300,302.5,302.5,172.5,182.5,192.5,192.5,285,295,-300,,295,790,100,M,Андрей Вебер,1973,Single-ply,SBD,Open
12,Anton Kamov,93,290,-305,-310,290,170,180,-190,180,290,-300,305,,305,775,100,M,Антон Камов,1973,Single-ply,SBD,Open
DQ,Andrey Tikhonov,98,-350,-350,-350,,,,,,,,,,,,100,M,Андрей Тихонов,1983,Single-ply,SBD,Open
DQ,Oleg Timofeev,98,340,352.5,-360,352.5,250,257.5,-262.5,257.5,-325,-325,-325,,,,100,M,Олег Тимофеев,1976,Single-ply,SBD,Open
DQ,Ernst Gross,99,345,-360,-360,345,190,-195,-195,190,-310,-310,-310,,,,100,M,Эрнст Гросс,1987,Single-ply,SBD,Open
DQ,Amiran Basov,92,340,350,355,355,-200,-205,-205,,,,,,,,100,M,Амиран Басов,1987,Single-ply,SBD,Open
DQ,Viktor Koltakov,98,310,320,-325,320,-207.5,-207.5,-207.5,,,,,,,,100,M,Виктор Колтаков,1981,Single-ply,SBD,Open
DQ,Pavel Antonov,97,-335,335,-340,335,-215,-215,-215,,,,,,,,100,M,Павел Антонов,1979,Single-ply,SBD,Open
DQ,Aleksandr Shikov,99,275,290,-295,290,-205,-205,-205,,,,,,,,100,M,Александр Шиков,1969,Single-ply,SBD,Open
DQ,Eduard Surov,98,-280,-280,-280,,,,,,,,,,,,100,M,Эдуард Суров,1976,Single-ply,SBD,Open
1,Aleksandr Drogobuzhev,108,375,-385,390,390,255,265,-270,265,330,345,352.5,,352.5,1007.5,110,M,Александр Дрогобужев,1975,Single-ply,SBD,Open
2,Yuriy Fedorenko,107,360,375,-380,375,230,245,252.5,252.5,360,372.5,-380,,372.5,1000,110,M,Юрий Федоренко,1974,Single-ply,SBD,Open
3,Mikhail Frolov,109,365,380,-390,380,245,257.5,260,260,315,330,-340,,330,970,110,M,Михаил Фролов,1979,Single-ply,SBD,Open
4,Andrei Drachev,107,350,360,365,365,240,250,-260,250,340,-355,-355,,340,955,110,M,Андрей Драчев,1985,Single-ply,SBD,Open
5,Sergey Salov,107,340,360,375,375,195,205,210,210,-330,340,357.5,,357.5,942.5,110,M,Сергей Салов,1985,Single-ply,SBD,Open
6,Aleksey Markelov,106,335,345,-352.5,345,230,240,245,245,300,315,-325,,315,905,110,M,Алексей Маркелов,1984,Single-ply,SBD,Open
7,Boris Fedoseev,106,315,-325,-325,315,-250,250,255,255,310,317.5,,,317.5,887.5,110,M,Борис Федосеев,1970,Single-ply,SBD,Open
8,Eduard Gavrilov,105,330,350,360,360,-200,200,-205,200,305,320,-327.5,,320,880,110,M,Эдуард Гаврилов,1985,Single-ply,SBD,Open
9,Sergey Yuzhakov,108,295,315,-320,315,215,225,235,235,280,290,-297.5,,290,840,110,M,Сергей Южаков,1966,Single-ply,SBD,Open
10,Aleksey Kharchev,108,-330,330,-340,330,190,200,-205,200,-300,300,-315,,300,830,110,M,Алексей Харчев,1976,Single-ply,SBD,Open
11,Guram Chikhradze,108,290,-305,-320,290,-200,200,215,215,290,310,320,,320,825,110,M,Гурам Чихрадзе,1981,Single-ply,SBD,Open
12,Nikolay Shylo,101,310,325,-335,325,200,210,215,215,270,280,-285,,280,820,110,M,Николай Шыло,1987,Single-ply,SBD,Open
13,Igor Strekalovskiy,105,290,300,-310,300,200,210,-217.5,210,290,300,307.5,,307.5,817.5,110,M,Игорь Стрекаловский,1981,Single-ply,SBD,Open
14,Evgeniy Pertsev,102.65,-335,335,350,350,-180,-180,180,180,275,-285,-285,,275,805,110,M,Евгений Перцев,1982,Single-ply,SBD,Open
15,Nikolay Uglyankin,104,290,-310,,290,220,235,-245,235,270,-290,,,270,795,110,M,Николай Углянкин,1967,Single-ply,SBD,Open
DQ,Dmitriy Fedenko,103,,,,,,,,,,,,,,,110,M,Дмитрий Феденко,1975,Single-ply,SBD,Open
1,Anton Kibirev,123,380,-400,-400,380,250,-265,265,265,330,350,352.5,,352.5,997.5,125,M,Антон Кибирев,1982,Single-ply,SBD,Open
2,Vadim Sosnovskiy,119,375,390,402.5,402.5,242.5,250,257.5,257.5,335,-350,-375,,335,995,125,M,Вадим Сосновский,1977,Single-ply,SBD,Open
3,Kirill Golberg,122,330,350,365,365,270,280,285.5,285.5,310,330,-340,,330,980.5,125,M,Кирилл Гольберг,1977,Single-ply,SBD,Open
4,Mikhail Mochalov,112,340,355,-360,355,255,-262.5,-262.5,255,340,355,365,,365,975,125,M,Михаил Мочалов,1974,Single-ply,SBD,Open
5,Aleksey Pankov,117,325,345,360,360,210,220,225,225,330,355,380,,380,965,125,M,Алексей Панков,1983,Single-ply,SBD,Open
6,Artem Kovalchuk #1,124,380,-400,,380,230,-245,245,245,320,340,-350,,340,965,125,M,Артём Ковальчук,1982,Single-ply,SBD,Open
7,Igor Gagin,120,-380,380,-390,380,240,257.5,-265,257.5,300,322.5,-342.5,,322.5,960,125,M,Игорь Гагин,1969,Single-ply,SBD,Open
8,Nikolay Simankov,124,340,360,370,370,240,-250,250,250,327.5,335,-340,,335,955,125,M,Николай Симаньков,1967,Single-ply,SBD,Open
9,Maksim Korotkov #1,119,375,-390,-390,375,-240,-240,240,240,310,330,-345,,330,945,125,M,Максим Коротков,1974,Single-ply,SBD,Open
10,Stanislav Polyakov,120,330,-340,340,340,245,-255,255,255,300,325,,,325,920,125,M,Станислав Поляков,1973,Single-ply,SBD,Open
11,Alexander Berezin,124,-320,320,-340,320,260,275,280,280,280,320,-345,,320,920,125,M,Александр Березин,1974,Single-ply,SBD,Open
12,Sergey Daragan,119,300,320,335,335,190,200,-205,200,320,340,-350,,340,875,125,M,Сергей Дараган,1978,Single-ply,SBD,Open
13,Yuriy Musikhin,119,-315,315,-330,315,200,210,-215,210,310,320,-325,,320,845,125,M,Юрий Мусихин,1984,Single-ply,SBD,Open
14,Alexey Gankov,120,205,,,205,267.5,-277.5,-277.5,267.5,122.5,,,,122.5,595,125,M,Алексей Ганьков,1970,Single-ply,SBD,Open
DQ,Ivan Balakshin,114,300,310,320,320,-200,-200,-200,,,,,,,,125,M,Иван Балакшин,1970,Single-ply,SBD,Open
DQ,Aleksey Rudenko,122,-370,-370,-370,,,,,,,,,,,,125,M,Алексей Руденко,1979,Single-ply,SBD,Open
DQ,Vyacheslav Zelenov,120,,,,,,,,,,,,,,,125,M,Вячеслав Зеленов,1965,Single-ply,SBD,Open
1,Vladimir Bondarenko #1,155,410,430,-440,430,270,290,,290,365,380,-401,,380,1100,125+,M,Владимир Бондаренко,1978,Single-ply,SBD,Open
2,Oleg Gagin,154,400,415,-425,415,250,260,-270,260,310,325,-330,,325,1000,125+,M,Олег Гагин,1975,Single-ply,SBD,Open
3,Mikhail Viasovskiy,129,335,350,360,360,210,220,225,225,315,330,337.5,,337.5,922.5,125+,M,Михаил Виасовский,1984,Single-ply,SBD,Open
4,Sergey Bystrov,125.01,360,-380,-380,360,240,-250,250,250,310,-320,-320,,310,920,125+,M,Сергей Быстров,1977,Single-ply,SBD,Open
5,Viktor Medvedev,125.01,-320,320,340,340,-230,230,-235,230,310,325,-330,,325,895,125+,M,Виктор Медведев,1967,Single-ply,SBD,Open
6,Andrey Egorov,125.01,-290,-290,300,300,-220,220,230,230,290,310,-325,,310,840,125+,M,Андрей Егоров,1970,Single-ply,SBD,Open
7,Nikolay Ilalov,133,320,-337.5,-337.5,320,210,-222.5,-222.5,210,280,295,-305,,295,825,125+,M,Николай Илалов,1983,Single-ply,SBD,Open
1,Valentina Vermenyuk,43.75,140,147.5,155,155,70,80,,80,140,150,162.5,,162.5,397.5,44,F,Валентина Верменюк,1986,Single-ply,SBD,Open
2,Karina Simonyants,43.5,122.5,127.5,-135,127.5,-77.5,77.5,80,80,115,-120,122.5,,122.5,330,44,F,Карина Симонянц,1977,Single-ply,SBD,Open
3,Zhanna Eliseeva,43.75,110,117.5,122.5,122.5,62.5,-67.5,-67.5,62.5,130,-140,-140,,130,315,44,F,Жанна Елисеева,1974,Single-ply,SBD,Open
4,Vera Kuzmina,43.3,125,-135,135,135,50,55,-57.5,55,110,122.5,-127.5,,122.5,312.5,44,F,Вера Кузьмина,1978,Single-ply,SBD,Open
1,Olga Golubeva,44.3,140,147.5,152.5,152.5,65,70,75,75,140,147.5,152.5,,152.5,380,48,F,Ольга Голубева,1970,Single-ply,SBD,Open
2,Kadriya Volkova,47.95,125,132.5,137.5,137.5,77.5,82.5,85,85,135,142.5,150,,150,372.5,48,F,Кадрия Волкова,1986,Single-ply,SBD,Open
3,Natalya Krikunova,47.55,140,145,150,150,65,70,-75,70,-130,130,-135,,130,350,48,F,Наталья Крикунова,1981,Single-ply,SBD,Open
4,Lyudmila Belova,46.6,130,-140,-140,130,65,-70,70,70,130,140,-150,,140,340,48,F,Людмила Белова,1967,Single-ply,SBD,Open
DQ,Marina Nikiforova,47.95,132.5,-140,-140,132.5,-70,-72.5,72.5,72.5,-122.5,-122.5,-122.5,,,,48,F,Марина Никифорова,1983,Single-ply,SBD,Open
1,Landysh Gavina,51.9,150,165,175,175,95,100,105,105,160,175,-185,,175,455,52,F,Ландыш Гавина,1980,Single-ply,SBD,Open
2,Anna Komlaeva,51.55,175,-182.5,-182.5,175,90,-95,-95,90,155,-160,,,155,420,52,F,Анна Комлаева,1979,Single-ply,SBD,Open
3,Elena Kaneva,52,130,145,-155,145,65,70,72.5,72.5,150,-160,-160,,150,367.5,52,F,Елена Канева,1980,Single-ply,SBD,Open
4,Irina Sergeeva,51.95,-120,125,137.5,137.5,50,60,-62.5,60,120,-130,-130,,120,317.5,52,F,Ирина Сергеева,1987,Single-ply,SBD,Open
DQ,Anzhela Rodygina,50.9,135,142.5,147.5,147.5,75,-80,-82.5,75,-125,-125,-125,,,,52,F,Анжела Родыгина,1970,Single-ply,SBD,Open
DQ,Marina Yurina,50.5,150,155,-157.5,155,82.5,-87.5,-87.5,82.5,-140,-140,-140,,,,52,F,Марина Юрина,1986,Single-ply,SBD,Open
1,Inna Filimonova #1,55.95,200,225,232.5,232.5,105,112.5,115,115,180,190,200,,200,547.5,56,F,Инна Филимонова,1976,Single-ply,SBD,Open
2,Anna Ryzhkova,55.65,200,212.5,217.5,217.5,112.5,117.5,122.5,122.5,-180,187.5,195,,195,535,56,F,Анна Рыжкова,1986,Single-ply,SBD,Open
3,Olesya Pokidko,55.35,185,-195,195,195,100,107.5,-112.5,107.5,170,-175,-175,,170,472.5,56,F,Олеся Покидько,1982,Single-ply,SBD,Open
4,Irina Ryaskova,55.6,160,165,170,170,85,90,92.5,92.5,155,162.5,167.5,,167.5,430,56,F,Ирина Ряскова,1984,Single-ply,SBD,Open
5,Anastasia Pavlova,55.85,150,-160,160,160,100,105,-107.5,105,150,155,-160,,155,420,56,F,Анастасия Павлова,1983,Single-ply,SBD,Open
6,Olga Ogorodova,54.85,150,160,-170,160,-85,85,-90,85,140,-150,-150,,140,385,56,F,Ольга Огородова,1975,Single-ply,SBD,Open
7,Olga Kildeshova,55.55,140,150,-160,150,70,80,-87.5,80,140,-147.5,-147.5,,140,370,56,F,Ольга Кильдешова,1988,Single-ply,SBD,Open
8,Aleksandra Kuschiy,54.5,130,-140,140,140,65,70,-75,70,140,147.5,152.5,,152.5,362.5,56,F,Александра Кущий,1981,Single-ply,SBD,Open
DQ,Olga Kabanova,55.75,182.5,-195,-200,182.5,-115,-120,-120,,,,,,,,56,F,Ольга Кабанова,1978,Single-ply,SBD,Open
1,Irina Poletaeva,59.9,210,220,,220,150,157.5,-162.5,157.5,200,,,,200,577.5,60,F,Ирина Полетаева,1982,Single-ply,SBD,Open
2,Yulia Lukina,59.95,190,200,205,205,125,132.5,137.5,137.5,180,190,202.5,,202.5,545,60,F,Юлия Лукина,1988,Single-ply,SBD,Open
3,Kira Pavlovskaya,59.75,190,195,-202.5,195,102.5,110,112.5,112.5,185,195,202.5,,202.5,510,60,F,Кира Павловская,1983,Single-ply,SBD,Open
4,Lyudmila Spesivtseva,59.2,170,180,195,195,100,-107.5,,100,172.5,187.5,-207.5,,187.5,482.5,60,F,Людмила Спесивцева,1984,Single-ply,SBD,Open
5,Natalya Samarina,59.8,180,-190,-195,180,110,-117.5,-117.5,110,150,165,175,,175,465,60,F,Наталья Самарина,1984,Single-ply,SBD,Open
6,Anastasiya Lyubimova,59.4,170,177.5,,177.5,105,110,,110,165,-175,-175,,165,452.5,60,F,Анастасия Любимова,1982,Single-ply,SBD,Open
7,Natalya Igosheva,59.95,150,160,165,165,115,122.5,127.5,127.5,140,150,,,150,442.5,60,F,Наталья Игошева,1981,Single-ply,SBD,Open
8,Mariya Ushakova,59.4,150,-160,160,160,102.5,-107.5,-107.5,102.5,150,165,-167.5,,165,427.5,60,F,Мария Ушакова,1986,Single-ply,SBD,Open
9,Lidiya Pakhomova,58.85,-170,170,,170,70,-75,-75,70,150,-155,-155,,150,390,60,F,Лидия Пахомова,1988,Single-ply,SBD,Open
10,Natalya Moiseeva,58.75,135,147.5,-157.5,147.5,80,85,90,90,125,135,-140,,135,372.5,60,F,Наталья Моисеева,1979,Single-ply,SBD,Open
DQ,Natalya Seregina,59.3,-165,-165,-165,,,,,,,,,,,,60,F,Наталья Серегина,1979,Single-ply,SBD,Open
DQ,Viktoriya Poltoratskaya,60,140,-150,-150,140,-90,90,-95,90,-120,,,,,,60,F,Виктория Полторацкая,1981,Single-ply,SBD,Open
1,Galina Lyubeznaya,67.35,240,255,260,260,150,-160,-160,150,200,210,220,,220,630,67.5,F,Галина Любезная,1980,Single-ply,SBD,Open
2,Evgeniya Goncharova,67.05,-230,230,-240,230,130,137.5,142.5,142.5,215,225,230,230.5,230,602.5,67.5,F,Евгения Гончарова,1981,Single-ply,SBD,Open
3,Yulia Medvedeva,67.15,210,220,230,230,140,150,157.5,157.5,190,205,-222.5,,205,592.5,67.5,F,Юлия Медведева,1986,Single-ply,SBD,Open
4,Maria Gulidova,64.45,190,200,-210,200,102.5,110,115,115,170,180,-187.5,,180,495,67.5,F,Мария Гулидова,1989,Single-ply,SBD,Open
5,Irina Kashuba,66.6,170,180,190,190,105,110,-115,110,170,182.5,-190,,182.5,482.5,67.5,F,Ирина Кашуба,1982,Single-ply,SBD,Open
6,Elena Kozina,67.45,190,200,-205,200,-90,90,92.5,92.5,180,-192.5,-192.5,,180,472.5,67.5,F,Елена Козина,1987,Single-ply,SBD,Open
7,Gulfiya Khisametdinova,64.95,180,187.5,-190,187.5,100,110,112.5,112.5,155,162.5,-167.5,,162.5,462.5,67.5,F,Гульфия Хисаметдинова,1985,Single-ply,SBD,Open
8,Tatyana Efremova,67.35,175,190,-195,190,90,100,105,105,155,165,-170,,165,460,67.5,F,Татьяна Ефремова,1982,Single-ply,SBD,Open
9,Tatyana Fomina,65.8,175,185,-200,185,62.5,67.5,72.5,72.5,165,175,185,,185,442.5,67.5,F,Татьяна Фомина,1946,Single-ply,SBD,Open
10,Stella Vavilova,61.85,130,140,145,145,80,90,,90,130,140,145,,145,380,67.5,F,Стэлла Вавилова,1987,Single-ply,SBD,Open
DQ,Olga Pantina,67.45,-217.5,-217.5,-217.5,,,,,,,,,,,,67.5,F,Ольга Пантина,1979,Single-ply,SBD,Open
1,Yulia Zaugolova,73.6,250,270,-282.5,270,150,160,165,165,-237.5,237.5,-245,,237.5,672.5,75,F,Юлия Зауголова,1981,Single-ply,SBD,Open
2,Yulia Goman,72.65,230,240,-245,240,130,137.5,140,140,210,220,-230,,220,600,75,F,Юлия Гоман,1984,Single-ply,SBD,Open
3,Svetlana Bochko,74.9,180,195,205,205,110,120,-125,120,205,220,-227.5,,220,545,75,F,Светлана Бочко,1963,Single-ply,SBD,Open
4,Zhanna Gorunovskaya,70.85,190,200,205,205,100,107.5,-110,107.5,180,190,-195,,190,502.5,75,F,Жанна Горуновская,1983,Single-ply,SBD,Open
5,Valentina Kharina,69.9,-180,180,190,190,120,130,-140,130,170,-180,180,,180,500,75,F,Валентина Харина,1977,Single-ply,SBD,Open
6,Nadezhda Sindikas,72,-200,200,-207.5,200,90,95,-97.5,95,150,160,170,,170,465,75,F,Надежда Синдикас,1986,Single-ply,SBD,Open
7,Victoria Bedoidze,68.55,170,180,-190,180,82.5,90,-95,90,170,-180,,,170,440,75,F,Виктория Бедоидзе,1987,Single-ply,SBD,Open
1,Svetlana Dedyulya,82.45,240,250,,250,180,200,,200,220,240,,,240,690,82.5,F,Светлана Дедюля,1975,Single-ply,SBD,Open
2,Mariya Panferova,76.45,220,230,237.5,237.5,142.5,150,157.5,157.5,195,205,215,,215,610,82.5,F,Мария Панферова,1977,Single-ply,SBD,Open
3,Olga Kharabarkina,79.1,180,200,-205,200,100,-110,-110,100,190,200,210,,210,510,82.5,F,Ольга Харабаркина,1976,Single-ply,SBD,Open
DQ,Natalya Forsunova,82.5,162.5,-172.5,-172.5,162.5,-75,-75,-75,,,,,,,,82.5,F,Наталья Форсунова,1972,Single-ply,SBD,Open
1,Valeriya Kholodova,88.2,255,270,280.5,280.5,160,170,-180,170,240,250,260,,260,710.5,90,F,Валерия Холодова,1983,Single-ply,SBD,Open
2,Liudmila Protchenko,84.85,220,-235,-235,220,120,-130,132.5,132.5,200,-207.5,-207.5,,200,552.5,90,F,Людмила Протченко,1986,Single-ply,SBD,Open
3,Yevgeniya Shabanova,89.45,180,190,200,200,110,117.5,125,125,160,170,175,,175,500,90,F,Евгения Шабанова,1977,Single-ply,SBD,Open
4,Tamara Nekoshnova,86.95,160,170,175,175,125,132.5,-137.5,132.5,150,-160,,,150,457.5,90,F,Тамара Некошнова,1982,Single-ply,SBD,Open
1,Irina Lugovaya,96,220,240,250,250,150,160,170,170,210,220,230,,230,650,90+,F,Ирина Луговая,1974,Single-ply,SBD,Open
2,Anastasia Pavlova,119.6,-230,-250,250,250,145,152.5,157.5,157.5,200,220,227.5,,227.5,635,90+,F,Анастасия Павлова,1968,Single-ply,SBD,Open
3,Olga Gemaletdinova,115.45,235,245,255,255,130,135,140,140,215,225,232.5,,232.5,627.5,90+,F,Ольга Гемалетдинова,1986,Single-ply,SBD,Open
4,Marina Dzhavikhishvili,107.3,170,-180,180,180,95,102.5,-105,102.5,170,175,-180,,175,457.5,90+,F,Марина Джавихишвили,1988,Single-ply,SBD,Open
