Library\Bee\artifacts\mvdfrm\Unity.2D.Animation.Editor.ref.dll_A13BD6459BB26E0B.mvfrm
Library\Bee\artifacts\mvdfrm\Unity.2D.Animation.Runtime.ref.dll_6747672A37E369F0.mvfrm
Library\Bee\artifacts\mvdfrm\Unity.2D.Common.Editor.ref.dll_BD59A5CBF9D52B22.mvfrm
Library\Bee\artifacts\mvdfrm\Unity.2D.Common.Runtime.ref.dll_77798F371487C3E9.mvfrm
Library\Bee\artifacts\mvdfrm\Unity.2D.IK.Editor.ref.dll_F60355C05B38283B.mvfrm
Library\Bee\artifacts\mvdfrm\Unity.2D.IK.Runtime.ref.dll_16F22BA31A1D34C0.mvfrm
Library\Bee\artifacts\mvdfrm\Unity.2D.Path.Editor.ref.dll_583975DB52C81A78.mvfrm
Library\Bee\artifacts\mvdfrm\Unity.2D.PixelPerfect.Editor.ref.dll_500201FE28D4C516.mvfrm
Library\Bee\artifacts\mvdfrm\Unity.2D.PixelPerfect.ref.dll_88C9F7A57CCB704B.mvfrm
Library\Bee\artifacts\mvdfrm\Unity.2D.Psdimporter.Editor.ref.dll_B76AC6E0D8C9839C.mvfrm
Library\Bee\artifacts\mvdfrm\Unity.2D.Sprite.Editor.ref.dll_DDBAA27A82CE9E28.mvfrm
Library\Bee\artifacts\mvdfrm\Unity.2D.SpriteShape.Editor.ref.dll_1AEEC37E15960FB3.mvfrm
Library\Bee\artifacts\mvdfrm\Unity.2D.SpriteShape.Runtime.ref.dll_BCD600250821B9C8.mvfrm
Library\Bee\artifacts\mvdfrm\Unity.2D.Tilemap.Editor.ref.dll_436C0E2610862891.mvfrm
Library\Bee\artifacts\mvdfrm\Unity.2D.Tilemap.Extras.Editor.ref.dll_8DA00406C36CC6AA.mvfrm
Library\Bee\artifacts\mvdfrm\Unity.2D.Tilemap.Extras.ref.dll_371E356D6F5B6577.mvfrm
Library\Bee\artifacts\mvdfrm\Unity.Burst.Editor.ref.dll_E2F92DAB6C167CC9.mvfrm
Library\Bee\artifacts\mvdfrm\Unity.Burst.ref.dll_F30DFA20C0DD1968.mvfrm
Library\Bee\artifacts\mvdfrm\Unity.InternalAPIEditorBridge.001.ref.dll_C275F416F58A86FE.mvfrm
Library\Bee\artifacts\mvdfrm\Unity.InternalAPIEngineBridge.001.ref.dll_B4F0ACC15A996E43.mvfrm
Library\Bee\artifacts\mvdfrm\Unity.Mathematics.Editor.ref.dll_9A20CFD48BC11F43.mvfrm
Library\Bee\artifacts\mvdfrm\Unity.Mathematics.ref.dll_E8EFDB1B8D5C174E.mvfrm
Library\Bee\artifacts\mvdfrm\Unity.PlasticSCM.Editor.ref.dll_257AEB342BE77856.mvfrm
Library\Bee\artifacts\mvdfrm\Unity.Rider.Editor.ref.dll_9B5591808ABA37AF.mvfrm
Library\Bee\artifacts\mvdfrm\Unity.TextMeshPro.Editor.ref.dll_159E061D77A10B86.mvfrm
Library\Bee\artifacts\mvdfrm\Unity.TextMeshPro.ref.dll_84A4293DBDD182DB.mvfrm
Library\Bee\artifacts\mvdfrm\Unity.Timeline.Editor.ref.dll_0D3D3C0B73557612.mvfrm
Library\Bee\artifacts\mvdfrm\Unity.Timeline.ref.dll_621CDDF9C514DF8F.mvfrm
Library\Bee\artifacts\mvdfrm\Unity.VSCode.Editor.ref.dll_3628369EB48E4C19.mvfrm
Library\Bee\artifacts\mvdfrm\Unity.VisualScripting.Core.Editor.ref.dll_EDC8690F57C5BDFD.mvfrm
Library\Bee\artifacts\mvdfrm\Unity.VisualScripting.Core.ref.dll_D75DF4EA1AFE54F4.mvfrm
Library\Bee\artifacts\mvdfrm\Unity.VisualScripting.Flow.Editor.ref.dll_6AF951BE66A4493E.mvfrm
Library\Bee\artifacts\mvdfrm\Unity.VisualScripting.Flow.ref.dll_1E6ED5409D07C9A3.mvfrm
Library\Bee\artifacts\mvdfrm\Unity.VisualScripting.SettingsProvider.Editor.ref.dll_A1A44354E0B583A8.mvfrm
Library\Bee\artifacts\mvdfrm\Unity.VisualScripting.Shared.Editor.ref.dll_9669F6EBFF6DFFB7.mvfrm
Library\Bee\artifacts\mvdfrm\Unity.VisualScripting.State.Editor.ref.dll_E03858E727F23F6F.mvfrm
Library\Bee\artifacts\mvdfrm\Unity.VisualScripting.State.ref.dll_D91762B7076BE462.mvfrm
Library\Bee\artifacts\mvdfrm\Unity.VisualStudio.Editor.ref.dll_3A975DBA53ABA4AD.mvfrm
Library\Bee\artifacts\mvdfrm\UnityEditor.UI.ref.dll_4C98D3F7040CD4F5.mvfrm
Library\Bee\artifacts\mvdfrm\UnityEngine.UI.ref.dll_08FEAA520A2EFD60.mvfrm
Library\Bee\artifacts\mvdfrm\Unity.Burst.Cecil.dll_79C1353DE8B999C1.mvfrm
Library\Bee\artifacts\mvdfrm\Unity.Burst.Cecil.Mdb.dll_FB21E83DC7B6C53E.mvfrm
Library\Bee\artifacts\mvdfrm\Unity.Burst.Cecil.Pdb.dll_127460AD466BC6C1.mvfrm
Library\Bee\artifacts\mvdfrm\Unity.Burst.Cecil.Rocks.dll_05E0E1AB6DFC1901.mvfrm
Library\Bee\artifacts\mvdfrm\Unity.Burst.Unsafe.dll_EBAA4057C758E582.mvfrm
Library\Bee\artifacts\mvdfrm\Unity.VisualScripting.Antlr3.Runtime.dll_2E6E9D873E090206.mvfrm
Library\Bee\artifacts\mvdfrm\UnityEditor.CoreModule.dll_8B59C53C7A28FA40.mvfrm
Library\Bee\artifacts\mvdfrm\UnityEditor.DeviceSimulatorModule.dll_1D0EA1F1C3D12781.mvfrm
Library\Bee\artifacts\mvdfrm\UnityEditor.DiagnosticsModule.dll_7B364069BAEE118F.mvfrm
Library\Bee\artifacts\mvdfrm\UnityEditor.dll_E435D65493229B55.mvfrm
Library\Bee\artifacts\mvdfrm\UnityEditor.GraphViewModule.dll_DAEE9B8802161986.mvfrm
Library\Bee\artifacts\mvdfrm\UnityEditor.PackageManagerUIModule.dll_78B5EBDFF1DFD79C.mvfrm
Library\Bee\artifacts\mvdfrm\UnityEditor.QuickSearchModule.dll_0645C17713C50DE8.mvfrm
Library\Bee\artifacts\mvdfrm\UnityEditor.SceneTemplateModule.dll_A432B6D1FB209969.mvfrm
Library\Bee\artifacts\mvdfrm\UnityEditor.TextCoreFontEngineModule.dll_B008665F2A04C3BE.mvfrm
Library\Bee\artifacts\mvdfrm\UnityEditor.TextCoreTextEngineModule.dll_F7F09CD0B9887CDC.mvfrm
Library\Bee\artifacts\mvdfrm\UnityEditor.UIBuilderModule.dll_2F7748A474CE92BA.mvfrm
Library\Bee\artifacts\mvdfrm\UnityEditor.UIElementsModule.dll_4715868C530DA17C.mvfrm
Library\Bee\artifacts\mvdfrm\UnityEditor.UIElementsSamplesModule.dll_E9AAE51134AEABB1.mvfrm
Library\Bee\artifacts\mvdfrm\UnityEditor.UIServiceModule.dll_68695A075E05E2D4.mvfrm
Library\Bee\artifacts\mvdfrm\UnityEditor.UnityConnectModule.dll_9172CAF107AAC8F6.mvfrm
Library\Bee\artifacts\mvdfrm\UnityEngine.AccessibilityModule.dll_D6D82268FB96C106.mvfrm
Library\Bee\artifacts\mvdfrm\UnityEngine.AIModule.dll_3F71A4A9C0C20094.mvfrm
Library\Bee\artifacts\mvdfrm\UnityEngine.AndroidJNIModule.dll_C55E6F5F9C2D1052.mvfrm
Library\Bee\artifacts\mvdfrm\UnityEngine.AnimationModule.dll_A97417B0DC72EE2C.mvfrm
Library\Bee\artifacts\mvdfrm\UnityEngine.ARModule.dll_F8E469AD1DDF5F5D.mvfrm
Library\Bee\artifacts\mvdfrm\UnityEngine.AssetBundleModule.dll_4A2EF468762BC2DA.mvfrm
Library\Bee\artifacts\mvdfrm\UnityEngine.AudioModule.dll_45931FA543F2E41E.mvfrm
Library\Bee\artifacts\mvdfrm\UnityEngine.ClothModule.dll_AC7B7CA01E0FC302.mvfrm
Library\Bee\artifacts\mvdfrm\UnityEngine.ClusterInputModule.dll_110F4006B9329BBC.mvfrm
Library\Bee\artifacts\mvdfrm\UnityEngine.ClusterRendererModule.dll_22BB6463338C3505.mvfrm
Library\Bee\artifacts\mvdfrm\UnityEngine.CoreModule.dll_AE7A988F222E656B.mvfrm
Library\Bee\artifacts\mvdfrm\UnityEngine.CrashReportingModule.dll_A38DC34DA5D309E3.mvfrm
Library\Bee\artifacts\mvdfrm\UnityEngine.DirectorModule.dll_51E2E3E0162B3648.mvfrm
Library\Bee\artifacts\mvdfrm\UnityEngine.dll_16DA1D2CF196283A.mvfrm
Library\Bee\artifacts\mvdfrm\UnityEngine.DSPGraphModule.dll_57344549888C0769.mvfrm
Library\Bee\artifacts\mvdfrm\UnityEngine.GameCenterModule.dll_EFABB97A626E0143.mvfrm
Library\Bee\artifacts\mvdfrm\UnityEngine.GIModule.dll_D7ADEDB75C70E8AE.mvfrm
Library\Bee\artifacts\mvdfrm\UnityEngine.GridModule.dll_8BEBB47D3A82FB62.mvfrm
Library\Bee\artifacts\mvdfrm\UnityEngine.HotReloadModule.dll_2ABCD5B6B7A609AE.mvfrm
Library\Bee\artifacts\mvdfrm\UnityEngine.ImageConversionModule.dll_8EAD6213B5B0ECF9.mvfrm
Library\Bee\artifacts\mvdfrm\UnityEngine.IMGUIModule.dll_7DF2BF0C0A2477FF.mvfrm
Library\Bee\artifacts\mvdfrm\UnityEngine.InputLegacyModule.dll_DB740F870E1D78CB.mvfrm
Library\Bee\artifacts\mvdfrm\UnityEngine.InputModule.dll_AC08E755BA2B08C2.mvfrm
Library\Bee\artifacts\mvdfrm\UnityEngine.JSONSerializeModule.dll_36EFABA4FAD22190.mvfrm
Library\Bee\artifacts\mvdfrm\UnityEngine.LocalizationModule.dll_4F5C0A5950AE8EB5.mvfrm
Library\Bee\artifacts\mvdfrm\UnityEngine.ParticleSystemModule.dll_F6A00C9A13E49571.mvfrm
Library\Bee\artifacts\mvdfrm\UnityEngine.PerformanceReportingModule.dll_DBB778B03FE0252A.mvfrm
Library\Bee\artifacts\mvdfrm\UnityEngine.Physics2DModule.dll_F61A07A17D6FE5C1.mvfrm
Library\Bee\artifacts\mvdfrm\UnityEngine.PhysicsModule.dll_4099E77CBD3B5EAF.mvfrm
Library\Bee\artifacts\mvdfrm\UnityEngine.ProfilerModule.dll_84291D16AF84BD55.mvfrm
Library\Bee\artifacts\mvdfrm\UnityEngine.RuntimeInitializeOnLoadManagerInitializerModule.dll_0C609AAEFC4E588A.mvfrm
Library\Bee\artifacts\mvdfrm\UnityEngine.ScreenCaptureModule.dll_50D7592A0F3E4DF2.mvfrm
Library\Bee\artifacts\mvdfrm\UnityEngine.SharedInternalsModule.dll_12BEA0E92CDEE849.mvfrm
Library\Bee\artifacts\mvdfrm\UnityEngine.SpriteMaskModule.dll_D8D82C0A83DD96BD.mvfrm
Library\Bee\artifacts\mvdfrm\UnityEngine.SpriteShapeModule.dll_639021C32BCDFAE4.mvfrm
Library\Bee\artifacts\mvdfrm\UnityEngine.StreamingModule.dll_5E0905012BFAA56A.mvfrm
Library\Bee\artifacts\mvdfrm\UnityEngine.SubstanceModule.dll_3AB4194A774DA378.mvfrm
Library\Bee\artifacts\mvdfrm\UnityEngine.SubsystemsModule.dll_4385926C52257ED0.mvfrm
Library\Bee\artifacts\mvdfrm\UnityEngine.TerrainModule.dll_5AE062EB92F9A79D.mvfrm
Library\Bee\artifacts\mvdfrm\UnityEngine.TerrainPhysicsModule.dll_F71AB56D2D278FFE.mvfrm
Library\Bee\artifacts\mvdfrm\UnityEngine.TextCoreFontEngineModule.dll_2E67E1B23D028289.mvfrm
Library\Bee\artifacts\mvdfrm\UnityEngine.TextCoreTextEngineModule.dll_76501823CC863BA7.mvfrm
Library\Bee\artifacts\mvdfrm\UnityEngine.TextRenderingModule.dll_7A16CB34C675CDE7.mvfrm
Library\Bee\artifacts\mvdfrm\UnityEngine.TilemapModule.dll_F9DCCA6CAAB688A6.mvfrm
Library\Bee\artifacts\mvdfrm\UnityEngine.TLSModule.dll_5F32FC2E9C73EBC3.mvfrm
Library\Bee\artifacts\mvdfrm\UnityEngine.UIElementsModule.dll_47C3F3D45551BAC7.mvfrm
Library\Bee\artifacts\mvdfrm\UnityEngine.UIElementsNativeModule.dll_C32FA075635847BE.mvfrm
Library\Bee\artifacts\mvdfrm\UnityEngine.UIModule.dll_3AE542D71D090640.mvfrm
Library\Bee\artifacts\mvdfrm\UnityEngine.UmbraModule.dll_C067CBBDD1198F91.mvfrm
Library\Bee\artifacts\mvdfrm\UnityEngine.UNETModule.dll_4120E0786F3D5AE4.mvfrm
Library\Bee\artifacts\mvdfrm\UnityEngine.UnityAnalyticsModule.dll_163F7D63C00BE76D.mvfrm
Library\Bee\artifacts\mvdfrm\UnityEngine.UnityConnectModule.dll_7ED24F000232C9A1.mvfrm
Library\Bee\artifacts\mvdfrm\UnityEngine.UnityCurlModule.dll_DC90B8E24C86E019.mvfrm
Library\Bee\artifacts\mvdfrm\UnityEngine.UnityTestProtocolModule.dll_A56D9B038EAA0107.mvfrm
Library\Bee\artifacts\mvdfrm\UnityEngine.UnityWebRequestAssetBundleModule.dll_57E0955FB44453FE.mvfrm
Library\Bee\artifacts\mvdfrm\UnityEngine.UnityWebRequestAudioModule.dll_53B3CC8EC64AEFC2.mvfrm
Library\Bee\artifacts\mvdfrm\UnityEngine.UnityWebRequestModule.dll_A04C69BDC0A58778.mvfrm
Library\Bee\artifacts\mvdfrm\UnityEngine.UnityWebRequestTextureModule.dll_FA0B8B409DBFF1D7.mvfrm
Library\Bee\artifacts\mvdfrm\UnityEngine.UnityWebRequestWWWModule.dll_41125D7FBC45F813.mvfrm
Library\Bee\artifacts\mvdfrm\UnityEngine.VehiclesModule.dll_C9A5DD5F905505E3.mvfrm
Library\Bee\artifacts\mvdfrm\UnityEngine.VFXModule.dll_E011949D72E15530.mvfrm
Library\Bee\artifacts\mvdfrm\UnityEngine.VideoModule.dll_6A9CA4100684FFC3.mvfrm
Library\Bee\artifacts\mvdfrm\UnityEngine.VirtualTexturingModule.dll_E7BC54E43C06C849.mvfrm
Library\Bee\artifacts\mvdfrm\UnityEngine.VRModule.dll_8DB7695CBEC38BB8.mvfrm
Library\Bee\artifacts\mvdfrm\UnityEngine.WindModule.dll_24C973B7B364E3D4.mvfrm
Library\Bee\artifacts\mvdfrm\UnityEngine.XRModule.dll_C0762C6147FDD916.mvfrm
Library\Bee\artifacts\mvdfrm\Unity.Android.Gradle.dll_26D008C910966428.mvfrm
Library\Bee\artifacts\mvdfrm\Unity.Android.Types.dll_74E9CCE466012694.mvfrm
Library\Bee\artifacts\mvdfrm\UnityEditor.iOS.Extensions.Common.dll_F7D2777C268FC3C5.mvfrm
Library\Bee\artifacts\mvdfrm\UnityEditor.iOS.Extensions.Xcode.dll_B296326040907557.mvfrm