Library\Bee\artifacts\mvdfrm\UnityEngine.UI.ref.dll_FAE6DBEA21006BE5.mvfrm
Library\Bee\artifacts\mvdfrm\Unity.Burst.Cecil.dll_79C1353DE8B999C1.mvfrm
Library\Bee\artifacts\mvdfrm\Unity.Burst.Cecil.Mdb.dll_FB21E83DC7B6C53E.mvfrm
Library\Bee\artifacts\mvdfrm\Unity.Burst.Cecil.Pdb.dll_127460AD466BC6C1.mvfrm
Library\Bee\artifacts\mvdfrm\Unity.Burst.Cecil.Rocks.dll_05E0E1AB6DFC1901.mvfrm
Library\Bee\artifacts\mvdfrm\Unity.Burst.Unsafe.dll_EBAA4057C758E582.mvfrm
Library\Bee\artifacts\mvdfrm\Unity.VisualScripting.Antlr3.Runtime.dll_2E6E9D873E090206.mvfrm
Library\Bee\artifacts\mvdfrm\UnityEngine.AccessibilityModule.dll_16E9329E5763CF98.mvfrm
Library\Bee\artifacts\mvdfrm\UnityEngine.AIModule.dll_E7A6FAF5AB3EED62.mvfrm
Library\Bee\artifacts\mvdfrm\UnityEngine.AndroidJNIModule.dll_30536D070B026420.mvfrm
Library\Bee\artifacts\mvdfrm\UnityEngine.AnimationModule.dll_79C0F78413C7083E.mvfrm
Library\Bee\artifacts\mvdfrm\UnityEngine.ARModule.dll_A119BFF9085C4C2B.mvfrm
Library\Bee\artifacts\mvdfrm\UnityEngine.AssetBundleModule.dll_A6BD7D267671B32C.mvfrm
Library\Bee\artifacts\mvdfrm\UnityEngine.AudioModule.dll_A3FAD3E17ADF29B0.mvfrm
Library\Bee\artifacts\mvdfrm\UnityEngine.ClothModule.dll_0AE330DC54FC0894.mvfrm
Library\Bee\artifacts\mvdfrm\UnityEngine.ClusterInputModule.dll_0D0A1F139980954A.mvfrm
Library\Bee\artifacts\mvdfrm\UnityEngine.ClusterRendererModule.dll_8874F336FC6EA9D7.mvfrm
Library\Bee\artifacts\mvdfrm\UnityEngine.CoreModule.dll_604A71ECE30117F9.mvfrm
Library\Bee\artifacts\mvdfrm\UnityEngine.CrashReportingModule.dll_C5F9318F0D6BE131.mvfrm
Library\Bee\artifacts\mvdfrm\UnityEngine.DirectorModule.dll_34169190C1431C56.mvfrm
Library\Bee\artifacts\mvdfrm\UnityEngine.dll_8BA563565CE1B04C.mvfrm
Library\Bee\artifacts\mvdfrm\UnityEngine.DSPGraphModule.dll_3967F2FA33A3ED77.mvfrm
Library\Bee\artifacts\mvdfrm\UnityEngine.GameCenterModule.dll_5AA0B721D1435511.mvfrm
Library\Bee\artifacts\mvdfrm\UnityEngine.GIModule.dll_7FE3440346EDD57C.mvfrm
Library\Bee\artifacts\mvdfrm\UnityEngine.GridModule.dll_3DBB8DDAFB55ADF0.mvfrm
Library\Bee\artifacts\mvdfrm\UnityEngine.HotReloadModule.dll_FB09B589EEFA23C0.mvfrm
Library\Bee\artifacts\mvdfrm\UnityEngine.ImageConversionModule.dll_F466F0E77E9361CB.mvfrm
Library\Bee\artifacts\mvdfrm\UnityEngine.IMGUIModule.dll_DC5A73484110BD91.mvfrm
Library\Bee\artifacts\mvdfrm\UnityEngine.InputLegacyModule.dll_380298450E63691D.mvfrm
Library\Bee\artifacts\mvdfrm\UnityEngine.InputModule.dll_0A709B91F1174E54.mvfrm
Library\Bee\artifacts\mvdfrm\UnityEngine.JSONSerializeModule.dll_7700BBDA569F3022.mvfrm
Library\Bee\artifacts\mvdfrm\UnityEngine.LocalizationModule.dll_4B56E96630FC8843.mvfrm
Library\Bee\artifacts\mvdfrm\UnityEngine.ParticleSystemModule.dll_190B7ADB7B7D6CBF.mvfrm
Library\Bee\artifacts\mvdfrm\UnityEngine.PerformanceReportingModule.dll_03641D050E4CE5B8.mvfrm
Library\Bee\artifacts\mvdfrm\UnityEngine.Physics2DModule.dll_C666E774B4C3FFD3.mvfrm
Library\Bee\artifacts\mvdfrm\UnityEngine.PhysicsModule.dll_CF71BF14E459EA81.mvfrm
Library\Bee\artifacts\mvdfrm\UnityEngine.ProfilerModule.dll_665CCAC75A9CA363.mvfrm
Library\Bee\artifacts\mvdfrm\UnityEngine.RuntimeInitializeOnLoadManagerInitializerModule.dll_C342BFBA58E9969C.mvfrm
Library\Bee\artifacts\mvdfrm\UnityEngine.ScreenCaptureModule.dll_90E8695F6B0B5C84.mvfrm
Library\Bee\artifacts\mvdfrm\UnityEngine.SharedInternalsModule.dll_78782FBCF5C15D1B.mvfrm
Library\Bee\artifacts\mvdfrm\UnityEngine.SpriteMaskModule.dll_43CD29B1F2B2EA8B.mvfrm
Library\Bee\artifacts\mvdfrm\UnityEngine.SpriteShapeModule.dll_C01EAA812C13EB36.mvfrm
Library\Bee\artifacts\mvdfrm\UnityEngine.StreamingModule.dll_2E55E4D4634EBF7C.mvfrm
Library\Bee\artifacts\mvdfrm\UnityEngine.SubstanceModule.dll_0B00F91DAEA1BD8A.mvfrm
Library\Bee\artifacts\mvdfrm\UnityEngine.SubsystemsModule.dll_AE7A9013C0FAD29E.mvfrm
Library\Bee\artifacts\mvdfrm\UnityEngine.TerrainModule.dll_E9B83A83BA18336F.mvfrm
Library\Bee\artifacts\mvdfrm\UnityEngine.TerrainPhysicsModule.dll_198623AE94C0674C.mvfrm
Library\Bee\artifacts\mvdfrm\UnityEngine.TextCoreFontEngineModule.dll_21171E884D63BD57.mvfrm
Library\Bee\artifacts\mvdfrm\UnityEngine.TextCoreTextEngineModule.dll_68FF54F9DCE77675.mvfrm
Library\Bee\artifacts\mvdfrm\UnityEngine.TextRenderingModule.dll_BA27DB6A2242DC79.mvfrm
Library\Bee\artifacts\mvdfrm\UnityEngine.TilemapModule.dll_88B4A204D1D51478.mvfrm
Library\Bee\artifacts\mvdfrm\UnityEngine.TLSModule.dll_601AD5BCC7983315.mvfrm
Library\Bee\artifacts\mvdfrm\UnityEngine.UIElementsModule.dll_B2B8F17BC4270E95.mvfrm
Library\Bee\artifacts\mvdfrm\UnityEngine.UIElementsNativeModule.dll_1C7ED4E1C90534CC.mvfrm
Library\Bee\artifacts\mvdfrm\UnityEngine.UIModule.dll_E31A99230785F30E.mvfrm
Library\Bee\artifacts\mvdfrm\UnityEngine.UmbraModule.dll_1ECF7FFA0805D523.mvfrm
Library\Bee\artifacts\mvdfrm\UnityEngine.UNETModule.dll_F2F0B9D630100D72.mvfrm
Library\Bee\artifacts\mvdfrm\UnityEngine.UnityAnalyticsModule.dll_38AAEBA527A4BEBB.mvfrm
Library\Bee\artifacts\mvdfrm\UnityEngine.UnityConnectModule.dll_7ACD2E0CE280C32F.mvfrm
Library\Bee\artifacts\mvdfrm\UnityEngine.UnityCurlModule.dll_ACDD98B583DAFA2B.mvfrm
Library\Bee\artifacts\mvdfrm\UnityEngine.UnityTestProtocolModule.dll_23D6CF7ADE492419.mvfrm
Library\Bee\artifacts\mvdfrm\UnityEngine.UnityWebRequestAssetBundleModule.dll_C3E3123E9D24F5CC.mvfrm
Library\Bee\artifacts\mvdfrm\UnityEngine.UnityWebRequestAudioModule.dll_7B6070E394B7B050.mvfrm
Library\Bee\artifacts\mvdfrm\UnityEngine.UnityWebRequestModule.dll_0605F8918987FC4A.mvfrm
Library\Bee\artifacts\mvdfrm\UnityEngine.UnityWebRequestTextureModule.dll_8C513B7EB1267025.mvfrm
Library\Bee\artifacts\mvdfrm\UnityEngine.UnityWebRequestWWWModule.dll_33C19A55CCA732E1.mvfrm
Library\Bee\artifacts\mvdfrm\UnityEngine.VehiclesModule.dll_ABD98B103B6CEBF1.mvfrm
Library\Bee\artifacts\mvdfrm\UnityEngine.VFXModule.dll_E0F96E2B9E059C82.mvfrm
Library\Bee\artifacts\mvdfrm\UnityEngine.VideoModule.dll_C904584C3D714555.mvfrm
Library\Bee\artifacts\mvdfrm\UnityEngine.VirtualTexturingModule.dll_410B8950A1B3B557.mvfrm
Library\Bee\artifacts\mvdfrm\UnityEngine.VRModule.dll_35ECBFA8A9407886.mvfrm
Library\Bee\artifacts\mvdfrm\UnityEngine.WindModule.dll_D6994D1574379662.mvfrm
Library\Bee\artifacts\mvdfrm\UnityEngine.XRModule.dll_68AB82AD327AC5E4.mvfrm