{"msg":"init","dagFile":"G:/Unity Project/JakieDoan/PracticalTest/LinesGame/Library/Il2cppBuildCache/iOS/buildstate/bee.dag","targets":["FinalProgram"]}
{"msg":"enqueueNode","enqueuedNodeAnnotation":"FinalProgram","enqueuedNodeIndex":2}
{"msg":"enqueueNode","enqueuedNodeAnnotation":"IL2CPP_CodeGen G:/Unity Project/JakieDoan/PracticalTest/LinesGame/Library/Il2cppBuildCache/iOS/buildstate/artifacts/il2cpp_conv_ycmv.traceevents","enqueuedNodeIndex":1,"enqueueingNodeAnnotation":"FinalProgram","enqueueingNodeIndex":2}
{"msg":"inputSignatureChanged","annotation":"IL2CPP_CodeGen G:/Unity Project/JakieDoan/PracticalTest/LinesGame/Library/Il2cppBuildCache/iOS/buildstate/artifacts/il2cpp_conv_ycmv.traceevents","index":1,"changes":[{"key":"InputFileDigest","path":"G:\\Unity Project\\JakieDoan\\PracticalTest\\LinesGame\\Temp\\StagingArea\\Data\\Managed\\Assembly-CSharp.dll","dependency":"explicit"},{"key":"InputFileDigest","path":"G:\\Unity Project\\JakieDoan\\PracticalTest\\LinesGame\\Temp\\StagingArea\\Data\\Managed\\Assembly-CSharp.pdb","dependency":"explicit"},{"key":"InputFileDigest","path":"G:\\Unity Project\\JakieDoan\\PracticalTest\\LinesGame\\Temp\\StagingArea\\Data\\Managed\\ICallSummary.txt","dependency":"explicit"},{"key":"InputFileDigest","path":"G:\\Unity Project\\JakieDoan\\PracticalTest\\LinesGame\\Temp\\StagingArea\\Data\\Managed\\MethodsToPreserve.xml","dependency":"explicit"},{"key":"InputFileDigest","path":"G:\\Unity Project\\JakieDoan\\PracticalTest\\LinesGame\\Temp\\StagingArea\\Data\\Managed\\UnityEngine.CoreModule.dll","dependency":"explicit"},{"key":"InputFileDigest","path":"G:\\Unity Project\\JakieDoan\\PracticalTest\\LinesGame\\Temp\\StagingArea\\Data\\Managed\\UnityEngine.CoreModule.pdb","dependency":"explicit"},{"key":"InputFileDigest","path":"G:\\Unity Project\\JakieDoan\\PracticalTest\\LinesGame\\Temp\\StagingArea\\Data\\Managed\\UnityICallRegistration.cpp","dependency":"explicit"},{"key":"InputFileDigest","path":"G:\\Unity Project\\JakieDoan\\PracticalTest\\LinesGame\\Library\\Il2cppBuildCache\\iOS\\additionalCppFiles\\UnityICallRegistration.cpp","dependency":"explicit"}]}
{"msg":"runNodeAction","annotation":"IL2CPP_CodeGen G:/Unity Project/JakieDoan/PracticalTest/LinesGame/Library/Il2cppBuildCache/iOS/buildstate/artifacts/il2cpp_conv_ycmv.traceevents","index":1}
{"msg":"noderesult","processed_node_count":0,"number_of_nodes_ever_queued":2,"annotation":"IL2CPP_CodeGen G:/Unity Project/JakieDoan/PracticalTest/LinesGame/Library/Il2cppBuildCache/iOS/buildstate/artifacts/il2cpp_conv_ycmv.traceevents","index":1,"exitcode":0,"profiler_output":"G:/Unity Project/JakieDoan/PracticalTest/LinesGame/Library/Il2cppBuildCache/iOS/buildstate/artifacts/il2cpp_conv_ycmv.traceevents","outputfile":"G:\\Unity Project\\JakieDoan\\PracticalTest\\LinesGame\\Library\\Il2cppBuildCache\\iOS\\buildstate\\artifacts\\il2cpp_conv_ycmv.traceevents","outputdirectory":"G:\\Unity Project\\JakieDoan\\PracticalTest\\LinesGame\\Library\\Il2cppBuildCache\\iOS\\il2cppOutput\\Data"}
