Library\Bee\artifacts\mvdfrm\UnityEngine.UI.ref.dll_185BE6B90A175B42.mvfrm
Library\Bee\artifacts\mvdfrm\Unity.Burst.Cecil.dll_79C1353DE8B999C1.mvfrm
Library\Bee\artifacts\mvdfrm\Unity.Burst.Cecil.Mdb.dll_FB21E83DC7B6C53E.mvfrm
Library\Bee\artifacts\mvdfrm\Unity.Burst.Cecil.Pdb.dll_127460AD466BC6C1.mvfrm
Library\Bee\artifacts\mvdfrm\Unity.Burst.Cecil.Rocks.dll_05E0E1AB6DFC1901.mvfrm
Library\Bee\artifacts\mvdfrm\Unity.Burst.Unsafe.dll_EBAA4057C758E582.mvfrm
Library\Bee\artifacts\mvdfrm\Unity.VisualScripting.Antlr3.Runtime.dll_2E6E9D873E090206.mvfrm
Library\Bee\artifacts\mvdfrm\UnityEngine.AccessibilityModule.dll_D278EBAD1CC783A4.mvfrm
Library\Bee\artifacts\mvdfrm\UnityEngine.AIModule.dll_2DB6A478AE3C7B96.mvfrm
Library\Bee\artifacts\mvdfrm\UnityEngine.AndroidJNIModule.dll_BA5628A5EDB30C54.mvfrm
Library\Bee\artifacts\mvdfrm\UnityEngine.AnimationModule.dll_19193630913CD94A.mvfrm
Library\Bee\artifacts\mvdfrm\UnityEngine.ARModule.dll_E729697C0B59DA5F.mvfrm
Library\Bee\artifacts\mvdfrm\UnityEngine.AssetBundleModule.dll_7ED60C00FBED5DB8.mvfrm
Library\Bee\artifacts\mvdfrm\UnityEngine.AudioModule.dll_4253031F2717D7BC.mvfrm
Library\Bee\artifacts\mvdfrm\UnityEngine.ClothModule.dll_A93B601A0134B6A0.mvfrm
Library\Bee\artifacts\mvdfrm\UnityEngine.CoreModule.dll_63B482AE9D0934AD.mvfrm
Library\Bee\artifacts\mvdfrm\UnityEngine.CrashReportingModule.dll_9E881E8DC4E2F665.mvfrm
Library\Bee\artifacts\mvdfrm\UnityEngine.DirectorModule.dll_08912687A30AC60A.mvfrm
Library\Bee\artifacts\mvdfrm\UnityEngine.dll_0A69A5A353A77558.mvfrm
Library\Bee\artifacts\mvdfrm\UnityEngine.DSPGraphModule.dll_0DE287F1156B972B.mvfrm
Library\Bee\artifacts\mvdfrm\UnityEngine.GameCenterModule.dll_E4A372C0B3F3FD45.mvfrm
Library\Bee\artifacts\mvdfrm\UnityEngine.GIModule.dll_C5F2ED8649EB63B0.mvfrm
Library\Bee\artifacts\mvdfrm\UnityEngine.GridModule.dll_41259E9CB55DCAA4.mvfrm
Library\Bee\artifacts\mvdfrm\UnityEngine.HotReloadModule.dll_9A61F4366C6FF4CC.mvfrm
Library\Bee\artifacts\mvdfrm\UnityEngine.ImageConversionModule.dll_5F595D9632E74F57.mvfrm
Library\Bee\artifacts\mvdfrm\UnityEngine.IMGUIModule.dll_7AB2A285ED496B9D.mvfrm
Library\Bee\artifacts\mvdfrm\UnityEngine.InputLegacyModule.dll_101B271F93DF13A9.mvfrm
Library\Bee\artifacts\mvdfrm\UnityEngine.InputModule.dll_A8C8CACF9D4FFC60.mvfrm
Library\Bee\artifacts\mvdfrm\UnityEngine.JSONSerializeModule.dll_329074E91C02E42E.mvfrm
Library\Bee\artifacts\mvdfrm\UnityEngine.LocalizationModule.dll_5B81CDA7E57EFEF7.mvfrm
Library\Bee\artifacts\mvdfrm\UnityEngine.ParticleSystemModule.dll_F19A67DA32F481F3.mvfrm
Library\Bee\artifacts\mvdfrm\UnityEngine.PerformanceReportingModule.dll_9B64B1B33076B66C.mvfrm
Library\Bee\artifacts\mvdfrm\UnityEngine.Physics2DModule.dll_65BF26213239D0DF.mvfrm
Library\Bee\artifacts\mvdfrm\UnityEngine.PhysicsModule.dll_4492F7E88346120D.mvfrm
Library\Bee\artifacts\mvdfrm\UnityEngine.ProfilerModule.dll_3AD75FBE3C644D17.mvfrm
Library\Bee\artifacts\mvdfrm\UnityEngine.RuntimeInitializeOnLoadManagerInitializerModule.dll_4EF8DEC100E37FA8.mvfrm
Library\Bee\artifacts\mvdfrm\UnityEngine.ScreenCaptureModule.dll_4C78226E306F1090.mvfrm
Library\Bee\artifacts\mvdfrm\UnityEngine.SharedInternalsModule.dll_E36A9C6BAA154AA7.mvfrm
Library\Bee\artifacts\mvdfrm\UnityEngine.SpriteMaskModule.dll_CDCFE550D56392BF.mvfrm
Library\Bee\artifacts\mvdfrm\UnityEngine.SpriteShapeModule.dll_9837395BB18F95C2.mvfrm
Library\Bee\artifacts\mvdfrm\UnityEngine.StreamingModule.dll_CDAE2380E0C49088.mvfrm
Library\Bee\artifacts\mvdfrm\UnityEngine.SubstanceModule.dll_AA5937CA2C178E96.mvfrm
Library\Bee\artifacts\mvdfrm\UnityEngine.SubsystemsModule.dll_387D4BB2A3AB7AD2.mvfrm
Library\Bee\artifacts\mvdfrm\UnityEngine.TerrainModule.dll_5ED9735759045AFB.mvfrm
Library\Bee\artifacts\mvdfrm\UnityEngine.TerrainPhysicsModule.dll_F21510AD4C377C80.mvfrm
Library\Bee\artifacts\mvdfrm\UnityEngine.TextCoreFontEngineModule.dll_82232C575F547F8B.mvfrm
Library\Bee\artifacts\mvdfrm\UnityEngine.TextCoreTextEngineModule.dll_CA0B62C8EED838A9.mvfrm
Library\Bee\artifacts\mvdfrm\UnityEngine.TextRenderingModule.dll_75B79478E7A69085.mvfrm
Library\Bee\artifacts\mvdfrm\UnityEngine.TilemapModule.dll_FDD5DAD870C13C04.mvfrm
Library\Bee\artifacts\mvdfrm\UnityEngine.TLSModule.dll_1B732BE1680D97A1.mvfrm
Library\Bee\artifacts\mvdfrm\UnityEngine.UIElementsModule.dll_3CBBAD1AA6D7B6C9.mvfrm
Library\Bee\artifacts\mvdfrm\UnityEngine.UIElementsNativeModule.dll_CC6AD988C00DB880.mvfrm
Library\Bee\artifacts\mvdfrm\UnityEngine.UIModule.dll_292A42A60A838142.mvfrm
Library\Bee\artifacts\mvdfrm\UnityEngine.UmbraModule.dll_BD27AF37B43E832F.mvfrm
Library\Bee\artifacts\mvdfrm\UnityEngine.UNETModule.dll_F65ACA97EA182A26.mvfrm
Library\Bee\artifacts\mvdfrm\UnityEngine.UnityAnalyticsModule.dll_1139D8A3DF1BD3EF.mvfrm
Library\Bee\artifacts\mvdfrm\UnityEngine.UnityConnectModule.dll_8AF8124E970339E3.mvfrm
Library\Bee\artifacts\mvdfrm\UnityEngine.UnityCurlModule.dll_4C35D7620150CB37.mvfrm
Library\Bee\artifacts\mvdfrm\UnityEngine.UnityTestProtocolModule.dll_B9D90B87A87B7B25.mvfrm
Library\Bee\artifacts\mvdfrm\UnityEngine.UnityWebRequestAssetBundleModule.dll_BB6648B4F462D200.mvfrm
Library\Bee\artifacts\mvdfrm\UnityEngine.UnityWebRequestAudioModule.dll_13610591B6E18104.mvfrm
Library\Bee\artifacts\mvdfrm\UnityEngine.UnityWebRequestModule.dll_70F865403DDBE9D6.mvfrm
Library\Bee\artifacts\mvdfrm\UnityEngine.UnityWebRequestTextureModule.dll_ED8B9EE856141F59.mvfrm
Library\Bee\artifacts\mvdfrm\UnityEngine.UnityWebRequestWWWModule.dll_94CDA824DE97F515.mvfrm
Library\Bee\artifacts\mvdfrm\UnityEngine.VehiclesModule.dll_805420071D3495A5.mvfrm
Library\Bee\artifacts\mvdfrm\UnityEngine.VFXModule.dll_9C51C4503E7B010E.mvfrm
Library\Bee\artifacts\mvdfrm\UnityEngine.VideoModule.dll_675C8789E9A9F361.mvfrm
Library\Bee\artifacts\mvdfrm\UnityEngine.VRModule.dll_7BFC692BAC3E06BA.mvfrm
Library\Bee\artifacts\mvdfrm\UnityEngine.WindModule.dll_DA035DD72E3FB316.mvfrm
Library\Bee\artifacts\mvdfrm\UnityEngine.XRModule.dll_AEBB2C3035785418.mvfrm