Library\Bee\artifacts\mvdfrm\Unity.2D.Tilemap.Editor.ref.dll_436C0E2610862891.mvfrm
Library\Bee\artifacts\mvdfrm\Unity.2D.Tilemap.Extras.ref.dll_371E356D6F5B6577.mvfrm
Library\Bee\artifacts\mvdfrm\UnityEditor.TestRunner.ref.dll_193EC4CE382CBFB3.mvfrm
Library\Bee\artifacts\mvdfrm\UnityEditor.UI.ref.dll_4C98D3F7040CD4F5.mvfrm
Library\Bee\artifacts\mvdfrm\UnityEngine.TestRunner.ref.dll_E55D0F7C63F01D9E.mvfrm
Library\Bee\artifacts\mvdfrm\UnityEngine.UI.ref.dll_08FEAA520A2EFD60.mvfrm
Library\Bee\artifacts\mvdfrm\UnityEditor.Graphs.dll_BB41BD8EF81282E2.mvfrm
Library\Bee\artifacts\mvdfrm\UnityEditor.CoreModule.dll_0D12FD95589CA8B0.mvfrm
Library\Bee\artifacts\mvdfrm\UnityEditor.DeviceSimulatorModule.dll_1E792F64B057D411.mvfrm
Library\Bee\artifacts\mvdfrm\UnityEditor.DiagnosticsModule.dll_11B9FFE25D5F1A1F.mvfrm
Library\Bee\artifacts\mvdfrm\UnityEditor.dll_1AB0734B8B85A1E5.mvfrm
Library\Bee\artifacts\mvdfrm\UnityEditor.GraphViewModule.dll_48C6AFC06703B016.mvfrm
Library\Bee\artifacts\mvdfrm\UnityEditor.PackageManagerUIModule.dll_396DBC58AD28DA0C.mvfrm
Library\Bee\artifacts\mvdfrm\UnityEditor.QuickSearchModule.dll_9CC980EFB6361678.mvfrm
Library\Bee\artifacts\mvdfrm\UnityEditor.SceneTemplateModule.dll_945ED86391D753F9.mvfrm
Library\Bee\artifacts\mvdfrm\UnityEditor.TextCoreFontEngineModule.dll_383DAB1BC487742E.mvfrm
Library\Bee\artifacts\mvdfrm\UnityEditor.TextCoreTextEngineModule.dll_8025E18D540B2D4C.mvfrm
Library\Bee\artifacts\mvdfrm\UnityEditor.UIBuilderModule.dll_9D4F5CDCD9BC294A.mvfrm
Library\Bee\artifacts\mvdfrm\UnityEditor.UIElementsModule.dll_85225DCC654419EC.mvfrm
Library\Bee\artifacts\mvdfrm\UnityEditor.UIElementsSamplesModule.dll_B6A3C6FE2C578A41.mvfrm
Library\Bee\artifacts\mvdfrm\UnityEditor.UIServiceModule.dll_D6416E3FC2F37964.mvfrm
Library\Bee\artifacts\mvdfrm\UnityEditor.UnityConnectModule.dll_55D2A3204705AF66.mvfrm
Library\Bee\artifacts\mvdfrm\UnityEngine.AccessibilityModule.dll_C70443FA924D7B96.mvfrm
Library\Bee\artifacts\mvdfrm\UnityEngine.AIModule.dll_A1701B43EAC84104.mvfrm
Library\Bee\artifacts\mvdfrm\UnityEngine.AndroidJNIModule.dll_036B469FAE6388C2.mvfrm
Library\Bee\artifacts\mvdfrm\UnityEngine.AnimationModule.dll_174C2BE9416084BC.mvfrm
Library\Bee\artifacts\mvdfrm\UnityEngine.ARModule.dll_5AE2E04747E59FCD.mvfrm
Library\Bee\artifacts\mvdfrm\UnityEngine.AssetBundleModule.dll_E0B2B3E1189CCB6A.mvfrm
Library\Bee\artifacts\mvdfrm\UnityEngine.AudioModule.dll_6D4AABCD340056AE.mvfrm
Library\Bee\artifacts\mvdfrm\UnityEngine.ClothModule.dll_D43308C80E1D3592.mvfrm
Library\Bee\artifacts\mvdfrm\UnityEngine.ClusterInputModule.dll_D56F1835F88D822C.mvfrm
Library\Bee\artifacts\mvdfrm\UnityEngine.ClusterRendererModule.dll_2425F1D62012E195.mvfrm
Library\Bee\artifacts\mvdfrm\UnityEngine.CoreModule.dll_3033D0E800A213DB.mvfrm
Library\Bee\artifacts\mvdfrm\UnityEngine.CrashReportingModule.dll_2ABB81F5914C1E53.mvfrm
Library\Bee\artifacts\mvdfrm\UnityEngine.DirectorModule.dll_31D91FF53C7F00B8.mvfrm
Library\Bee\artifacts\mvdfrm\UnityEngine.dll_4D54BA23E9F92ECA.mvfrm
Library\Bee\artifacts\mvdfrm\UnityEngine.DSPGraphModule.dll_372A815EAEDFD1D9.mvfrm
Library\Bee\artifacts\mvdfrm\UnityEngine.GameCenterModule.dll_2DB890BA74A479B3.mvfrm
Library\Bee\artifacts\mvdfrm\UnityEngine.GIModule.dll_39AC64518677291E.mvfrm
Library\Bee\artifacts\mvdfrm\UnityEngine.GridModule.dll_0DA4ECD618F6A9D2.mvfrm
Library\Bee\artifacts\mvdfrm\UnityEngine.HotReloadModule.dll_9894E9EF1C93A03E.mvfrm
Library\Bee\artifacts\mvdfrm\UnityEngine.ImageConversionModule.dll_9017EF86A2379989.mvfrm
Library\Bee\artifacts\mvdfrm\UnityEngine.IMGUIModule.dll_A5AA4B33FA31EA8F.mvfrm
Library\Bee\artifacts\mvdfrm\UnityEngine.InputLegacyModule.dll_71F7CEFFB08E815B.mvfrm
Library\Bee\artifacts\mvdfrm\UnityEngine.InputModule.dll_D3C0737DAA387B52.mvfrm
Library\Bee\artifacts\mvdfrm\UnityEngine.JSONSerializeModule.dll_271BCD369188DC20.mvfrm
Library\Bee\artifacts\mvdfrm\UnityEngine.LocalizationModule.dll_13BBE28890097525.mvfrm
Library\Bee\artifacts\mvdfrm\UnityEngine.NVIDIAModule.dll_4E98EC49492D21A7.mvfrm
Library\Bee\artifacts\mvdfrm\UnityEngine.ParticleSystemModule.dll_7DCDCB41FF5DA9E1.mvfrm
Library\Bee\artifacts\mvdfrm\UnityEngine.PerformanceReportingModule.dll_7FA50EE9DBBE439A.mvfrm
Library\Bee\artifacts\mvdfrm\UnityEngine.Physics2DModule.dll_63F21BD9E25D7C51.mvfrm
Library\Bee\artifacts\mvdfrm\UnityEngine.PhysicsModule.dll_3CF5FF43799FC33F.mvfrm
Library\Bee\artifacts\mvdfrm\UnityEngine.ProfilerModule.dll_641F592BD5D887C5.mvfrm
Library\Bee\artifacts\mvdfrm\UnityEngine.RuntimeInitializeOnLoadManagerInitializerModule.dll_24C44729F6010F1A.mvfrm
Library\Bee\artifacts\mvdfrm\UnityEngine.ScreenCaptureModule.dll_41037ABBA5F50882.mvfrm
Library\Bee\artifacts\mvdfrm\UnityEngine.SharedInternalsModule.dll_14292E5C196594D9.mvfrm
Library\Bee\artifacts\mvdfrm\UnityEngine.SpriteMaskModule.dll_16E5034A96140F2D.mvfrm
Library\Bee\artifacts\mvdfrm\UnityEngine.SpriteShapeModule.dll_FA13E13BCE3F0374.mvfrm
Library\Bee\artifacts\mvdfrm\UnityEngine.StreamingModule.dll_CBE1193990E83BFA.mvfrm
Library\Bee\artifacts\mvdfrm\UnityEngine.SubstanceModule.dll_A88C2D82DC3B3A08.mvfrm
Library\Bee\artifacts\mvdfrm\UnityEngine.SubsystemsModule.dll_819269AC645BF740.mvfrm
Library\Bee\artifacts\mvdfrm\UnityEngine.TerrainModule.dll_573C7AB24F5E0C2D.mvfrm
Library\Bee\artifacts\mvdfrm\UnityEngine.TerrainPhysicsModule.dll_7E48741518A0A46E.mvfrm
Library\Bee\artifacts\mvdfrm\UnityEngine.TextCoreFontEngineModule.dll_B69D266ED78532F9.mvfrm
Library\Bee\artifacts\mvdfrm\UnityEngine.TextCoreTextEngineModule.dll_FE855CE06708EC17.mvfrm
Library\Bee\artifacts\mvdfrm\UnityEngine.TextRenderingModule.dll_6A42ECC65D2C8877.mvfrm
Library\Bee\artifacts\mvdfrm\UnityEngine.TilemapModule.dll_F638E233671AED36.mvfrm
Library\Bee\artifacts\mvdfrm\UnityEngine.TLSModule.dll_315A9C6A2C94AC53.mvfrm
Library\Bee\artifacts\mvdfrm\UnityEngine.UIElementsModule.dll_85D0CB1467883337.mvfrm
Library\Bee\artifacts\mvdfrm\UnityEngine.UIElementsNativeModule.dll_83E770EE1EA14A2E.mvfrm
Library\Bee\artifacts\mvdfrm\UnityEngine.UIModule.dll_9CE3B971470F46B0.mvfrm
Library\Bee\artifacts\mvdfrm\UnityEngine.UmbraModule.dll_E81F57E5C1270221.mvfrm
Library\Bee\artifacts\mvdfrm\UnityEngine.UNETModule.dll_C2DA18D14DB10954.mvfrm
Library\Bee\artifacts\mvdfrm\UnityEngine.UnityAnalyticsModule.dll_9D6D3C0BAB84FBDD.mvfrm
Library\Bee\artifacts\mvdfrm\UnityEngine.UnityConnectModule.dll_4332272F418DB011.mvfrm
Library\Bee\artifacts\mvdfrm\UnityEngine.UnityCurlModule.dll_4A68CD1AB17476A9.mvfrm
Library\Bee\artifacts\mvdfrm\UnityEngine.UnityTestProtocolModule.dll_72667CF08652DF97.mvfrm
Library\Bee\artifacts\mvdfrm\UnityEngine.UnityWebRequestAssetBundleModule.dll_66446903852F3C6E.mvfrm
Library\Bee\artifacts\mvdfrm\UnityEngine.UnityWebRequestAudioModule.dll_F7A162C862290E32.mvfrm
Library\Bee\artifacts\mvdfrm\UnityEngine.UnityWebRequestModule.dll_A1B6F730AD2C3408.mvfrm
Library\Bee\artifacts\mvdfrm\UnityEngine.UnityWebRequestTextureModule.dll_BB49C39C76D33E47.mvfrm
Library\Bee\artifacts\mvdfrm\UnityEngine.UnityWebRequestWWWModule.dll_C947A23C56C8A883.mvfrm
Library\Bee\artifacts\mvdfrm\UnityEngine.VehiclesModule.dll_A99C1974B6A8D053.mvfrm
Library\Bee\artifacts\mvdfrm\UnityEngine.VFXModule.dll_B23934D9030215C0.mvfrm
Library\Bee\artifacts\mvdfrm\UnityEngine.VideoModule.dll_92543037F6927253.mvfrm
Library\Bee\artifacts\mvdfrm\UnityEngine.VirtualTexturingModule.dll_A874255CF74FCAB9.mvfrm
Library\Bee\artifacts\mvdfrm\UnityEngine.VRModule.dll_EFB5DFF6E8C9CC28.mvfrm
Library\Bee\artifacts\mvdfrm\UnityEngine.WindModule.dll_A682AC1091D89244.mvfrm
Library\Bee\artifacts\mvdfrm\UnityEngine.XRModule.dll_2274A2FB72041986.mvfrm
Library\Bee\artifacts\mvdfrm\Unity.Android.Gradle.dll_EB2FE0F84FF14A98.mvfrm
Library\Bee\artifacts\mvdfrm\Unity.Android.Types.dll_0B6D8C5D08722F24.mvfrm
Library\Bee\artifacts\mvdfrm\UnityEditor.Android.Extensions.dll_E5BDB62C727F85D8.mvfrm
Library\Bee\artifacts\mvdfrm\UnityEditor.AppleTV.Extensions.dll_E190363C8EFCD030.mvfrm
Library\Bee\artifacts\mvdfrm\UnityEditor.iOS.Extensions.Xcode.dll_82A79A5266652FA6.mvfrm
Library\Bee\artifacts\mvdfrm\UnityEditor.iOS.Extensions.Common.dll_B910AFD7FFA31035.mvfrm
Library\Bee\artifacts\mvdfrm\UnityEditor.iOS.Extensions.dll_1030CBA550713B20.mvfrm
Library\Bee\artifacts\mvdfrm\UnityEditor.iOS.Extensions.Xcode.dll_15CC688ECA9477E7.mvfrm
Library\Bee\artifacts\mvdfrm\UnityEditor.LinuxStandalone.Extensions.dll_B24BC1FE3CF15120.mvfrm
Library\Bee\artifacts\mvdfrm\UnityEditor.OSXStandalone.Extensions.dll_AFF2F5F6A26B619B.mvfrm
Library\Bee\artifacts\mvdfrm\UnityEditor.UWP.Extensions.dll_49DA2F5371DE619B.mvfrm
Library\Bee\artifacts\mvdfrm\UnityEditor.WebGL.Extensions.dll_2EA353FB9446D900.mvfrm
Library\Bee\artifacts\mvdfrm\UnityEditor.WindowsStandalone.Extensions.dll_3F48033F342483F0.mvfrm
Library\Bee\artifacts\mvdfrm\Unity.Burst.Cecil.dll_A1A1FCD0BC89B206.mvfrm
Library\Bee\artifacts\mvdfrm\Unity.Burst.Cecil.Mdb.dll_7B0780576CF646C3.mvfrm
Library\Bee\artifacts\mvdfrm\Unity.Burst.Cecil.Pdb.dll_9259F8C6EBAB4846.mvfrm
Library\Bee\artifacts\mvdfrm\Unity.Burst.Cecil.Rocks.dll_36BFABA49B822D26.mvfrm
Library\Bee\artifacts\mvdfrm\Unity.Burst.Unsafe.dll_F280C95C3911E4AD.mvfrm
Library\Bee\artifacts\mvdfrm\Unity.Plastic.Antlr3.Runtime.dll_267D3B54BD877FE9.mvfrm
Library\Bee\artifacts\mvdfrm\Unity.Plastic.Newtonsoft.Json.dll_D31664644C1BD63C.mvfrm
Library\Bee\artifacts\mvdfrm\Unity.VisualScripting.IonicZip.dll_9C76C05D029482A7.mvfrm
Library\Bee\artifacts\mvdfrm\Unity.VisualScripting.YamlDotNet.dll_3E1C86B4829B9B05.mvfrm
Library\Bee\artifacts\mvdfrm\Unity.VisualScripting.TextureAssets.dll_D53AB0084368F8FD.mvfrm
Library\Bee\artifacts\mvdfrm\Unity.VisualScripting.Antlr3.Runtime.dll_EF89AD95B364AB24.mvfrm