%YAML 1.1
%TAG !u! tag:unity3d.com,2011:
--- !u!78 &1
TagManager:
  serializedVersion: 2
  tags:
  - Obstacle
  - RightWall
  - LeftWall
  - Item
  layers:
  - Default
  - TransparentFX
  - Ignore Raycast
  - 
  - Water
  - UI
  - 
  - 
  - 
  - 
  - 
  - 
  - 
  - 
  - 
  - 
  - 
  - 
  - 
  - 
  - 
  - 
  - 
  - 
  - 
  - 
  - 
  - 
  - 
  - 
  - 
  - 
  m_SortingLayers:
  - name: Background
    uniqueID: 4259418793
    locked: 0
  - name: Tree
    uniqueID: 2215263785
    locked: 0
  - name: Default
    uniqueID: 0
    locked: 0
  - name: Terrain
    uniqueID: 347132567
    locked: 0
  - name: Player
    uniqueID: 4073502229
    locked: 0
