Library\Bee\artifacts\mvdfrm\Unity.Services.Core.Internal.ref.dll_1A693ED936C5C9EF.mvfrm
Library\Bee\artifacts\mvdfrm\Unity.Services.Core.ref.dll_8733AE466239FA82.mvfrm
Library\Bee\artifacts\mvdfrm\UnityEngine.UI.ref.dll_FAE6DBEA21006BE5.mvfrm
Library\Bee\artifacts\mvdfrm\UnityEngine.AccessibilityModule.dll_7803FA0FE7079808.mvfrm
Library\Bee\artifacts\mvdfrm\UnityEngine.AIModule.dll_E93A5F9267B6B9F2.mvfrm
Library\Bee\artifacts\mvdfrm\UnityEngine.AndroidJNIModule.dll_DAC6EDF2D95078B0.mvfrm
Library\Bee\artifacts\mvdfrm\UnityEngine.AnimationModule.dll_B69A00DD825B34AE.mvfrm
Library\Bee\artifacts\mvdfrm\UnityEngine.ARModule.dll_A2AD2495C4D418BB.mvfrm
Library\Bee\artifacts\mvdfrm\UnityEngine.AssetBundleModule.dll_0AA8075459A8CD9C.mvfrm
Library\Bee\artifacts\mvdfrm\UnityEngine.AudioModule.dll_F96793EC8FAABA20.mvfrm
Library\Bee\artifacts\mvdfrm\UnityEngine.ClothModule.dll_604FF0E769C79904.mvfrm
Library\Bee\artifacts\mvdfrm\UnityEngine.ClusterInputModule.dll_ADEA1844DB6DDBDA.mvfrm
Library\Bee\artifacts\mvdfrm\UnityEngine.ClusterRendererModule.dll_E61DD7444F00E047.mvfrm
Library\Bee\artifacts\mvdfrm\UnityEngine.CoreModule.dll_A48769C6B1FF1689.mvfrm
Library\Bee\artifacts\mvdfrm\UnityEngine.CrashReportingModule.dll_3ED826FC36B299C1.mvfrm
Library\Bee\artifacts\mvdfrm\UnityEngine.DirectorModule.dll_113151497EE43EE6.mvfrm
Library\Bee\artifacts\mvdfrm\UnityEngine.dll_55A686869E7D6CBC.mvfrm
Library\Bee\artifacts\mvdfrm\UnityEngine.DSPGraphModule.dll_1682B2B2F1451007.mvfrm
Library\Bee\artifacts\mvdfrm\UnityEngine.GameCenterModule.dll_0514380D9F9169A1.mvfrm
Library\Bee\artifacts\mvdfrm\UnityEngine.GIModule.dll_8176A8A00365A20C.mvfrm
Library\Bee\artifacts\mvdfrm\UnityEngine.GridModule.dll_81F885B4CA53AC80.mvfrm
Library\Bee\artifacts\mvdfrm\UnityEngine.HotReloadModule.dll_37E2BEE35D8E5030.mvfrm
Library\Bee\artifacts\mvdfrm\UnityEngine.ImageConversionModule.dll_520FD4F4D125983B.mvfrm
Library\Bee\artifacts\mvdfrm\UnityEngine.IMGUIModule.dll_31C7335355DC4E01.mvfrm
Library\Bee\artifacts\mvdfrm\UnityEngine.InputLegacyModule.dll_9BED2272F19A838D.mvfrm
Library\Bee\artifacts\mvdfrm\UnityEngine.InputModule.dll_5FDD5B9D05E2DEC4.mvfrm
Library\Bee\artifacts\mvdfrm\UnityEngine.JSONSerializeModule.dll_D81B834BE642F892.mvfrm
Library\Bee\artifacts\mvdfrm\UnityEngine.LocalizationModule.dll_EC36E29772E9CED3.mvfrm
Library\Bee\artifacts\mvdfrm\UnityEngine.ParticleSystemModule.dll_91EA7048A4C4254F.mvfrm
Library\Bee\artifacts\mvdfrm\UnityEngine.PerformanceReportingModule.dll_AC09D8D132CD7448.mvfrm
Library\Bee\artifacts\mvdfrm\UnityEngine.Physics2DModule.dll_033FF0CE23582C43.mvfrm
Library\Bee\artifacts\mvdfrm\UnityEngine.PhysicsModule.dll_F435E72CDE5CE8F1.mvfrm
Library\Bee\artifacts\mvdfrm\UnityEngine.ProfilerModule.dll_43778A80183DC5F3.mvfrm
Library\Bee\artifacts\mvdfrm\UnityEngine.RuntimeInitializeOnLoadManagerInitializerModule.dll_A1D323D62EBEA30C.mvfrm
Library\Bee\artifacts\mvdfrm\UnityEngine.ScreenCaptureModule.dll_F20330D0FAAF24F4.mvfrm
Library\Bee\artifacts\mvdfrm\UnityEngine.SharedInternalsModule.dll_D62113CA4853938B.mvfrm
Library\Bee\artifacts\mvdfrm\UnityEngine.SpriteMaskModule.dll_EE40AA9DC100FF1B.mvfrm
Library\Bee\artifacts\mvdfrm\UnityEngine.SpriteShapeModule.dll_240934AF0F4B05A6.mvfrm
Library\Bee\artifacts\mvdfrm\UnityEngine.StreamingModule.dll_6B2EEE2DD1E2EBEC.mvfrm
Library\Bee\artifacts\mvdfrm\UnityEngine.SubstanceModule.dll_47DA02771D35E9FA.mvfrm
Library\Bee\artifacts\mvdfrm\UnityEngine.SubsystemsModule.dll_58EE10FF8F48E72E.mvfrm
Library\Bee\artifacts\mvdfrm\UnityEngine.TerrainModule.dll_0E7C629BB41B31DF.mvfrm
Library\Bee\artifacts\mvdfrm\UnityEngine.TerrainPhysicsModule.dll_9265191BBE071FDC.mvfrm
Library\Bee\artifacts\mvdfrm\UnityEngine.TextCoreFontEngineModule.dll_9DEBA74710AC19E7.mvfrm
Library\Bee\artifacts\mvdfrm\UnityEngine.TextCoreTextEngineModule.dll_E5D3DDB8A02FD305.mvfrm
Library\Bee\artifacts\mvdfrm\UnityEngine.TextRenderingModule.dll_1B42A2DBB1E6A4E9.mvfrm
Library\Bee\artifacts\mvdfrm\UnityEngine.TilemapModule.dll_AD78CA1CCBD812E8.mvfrm
Library\Bee\artifacts\mvdfrm\UnityEngine.TLSModule.dll_957A549BFCCE1585.mvfrm
Library\Bee\artifacts\mvdfrm\UnityEngine.UIElementsModule.dll_5D2C726792752325.mvfrm
Library\Bee\artifacts\mvdfrm\UnityEngine.UIElementsNativeModule.dll_465B106EC7279F5C.mvfrm
Library\Bee\artifacts\mvdfrm\UnityEngine.UIModule.dll_E4ADFDBFC3FDBF9E.mvfrm
Library\Bee\artifacts\mvdfrm\UnityEngine.UmbraModule.dll_743C40051CD16593.mvfrm
Library\Bee\artifacts\mvdfrm\UnityEngine.UNETModule.dll_372DB1AFFF0E0C02.mvfrm
Library\Bee\artifacts\mvdfrm\UnityEngine.UnityAnalyticsModule.dll_B189E11250EB774B.mvfrm
Library\Bee\artifacts\mvdfrm\UnityEngine.UnityConnectModule.dll_1BAD273E246E09BF.mvfrm
Library\Bee\artifacts\mvdfrm\UnityEngine.UnityCurlModule.dll_E9B6A20EF26F269B.mvfrm
Library\Bee\artifacts\mvdfrm\UnityEngine.UnityTestProtocolModule.dll_93BDD09C70038889.mvfrm
Library\Bee\artifacts\mvdfrm\UnityEngine.UnityWebRequestAssetBundleModule.dll_EB4715C1CA8B9A5C.mvfrm
Library\Bee\artifacts\mvdfrm\UnityEngine.UnityWebRequestAudioModule.dll_24062CAFB9383EE0.mvfrm
Library\Bee\artifacts\mvdfrm\UnityEngine.UnityWebRequestModule.dll_63AEDC9EDC1A32BA.mvfrm
Library\Bee\artifacts\mvdfrm\UnityEngine.UnityWebRequestTextureModule.dll_92EF139847B970B5.mvfrm
Library\Bee\artifacts\mvdfrm\UnityEngine.UnityWebRequestWWWModule.dll_B09623148FEF8F71.mvfrm
Library\Bee\artifacts\mvdfrm\UnityEngine.VehiclesModule.dll_88F44AC8F90E0E81.mvfrm
Library\Bee\artifacts\mvdfrm\UnityEngine.VFXModule.dll_1658ED0AD33B7EF2.mvfrm
Library\Bee\artifacts\mvdfrm\UnityEngine.VideoModule.dll_1E711857523CD5C5.mvfrm
Library\Bee\artifacts\mvdfrm\UnityEngine.VirtualTexturingModule.dll_6AE7C4DD9FD61FE7.mvfrm
Library\Bee\artifacts\mvdfrm\UnityEngine.VRModule.dll_3780244565B84516.mvfrm
Library\Bee\artifacts\mvdfrm\UnityEngine.WindModule.dll_1AD644EF433594F2.mvfrm
Library\Bee\artifacts\mvdfrm\UnityEngine.XRModule.dll_6A3EE749EEF29274.mvfrm
Library\Bee\artifacts\mvdfrm\Unity.Burst.Cecil.dll_A1A1FCD0BC89B206.mvfrm
Library\Bee\artifacts\mvdfrm\Unity.Burst.Cecil.Mdb.dll_7B0780576CF646C3.mvfrm
Library\Bee\artifacts\mvdfrm\Unity.Burst.Cecil.Pdb.dll_9259F8C6EBAB4846.mvfrm
Library\Bee\artifacts\mvdfrm\Unity.Burst.Cecil.Rocks.dll_36BFABA49B822D26.mvfrm
Library\Bee\artifacts\mvdfrm\Unity.Burst.Unsafe.dll_F280C95C3911E4AD.mvfrm
Library\Bee\artifacts\mvdfrm\Unity.VisualScripting.Antlr3.Runtime.dll_EF89AD95B364AB24.mvfrm