('F:\\Pliki\\Studia\\nucleo_to_can\\SOFTWARE\\nucleo_to_can_win_app\\build\\main\\PYZ-00.pyz',
 [('PIL',
   'F:\\Pliki\\Studia\\nucleo_to_can\\SOFTWARE\\nucleo_to_can_win_app\\.venv\\Lib\\site-packages\\PIL\\__init__.py',
   'PYMODULE'),
  ('PIL.BlpImagePlugin',
   'F:\\Pliki\\Studia\\nucleo_to_can\\SOFTWARE\\nucleo_to_can_win_app\\.venv\\Lib\\site-packages\\PIL\\BlpImagePlugin.py',
   'PYMODULE'),
  ('PIL.BmpImagePlugin',
   'F:\\Pliki\\Studia\\nucleo_to_can\\SOFTWARE\\nucleo_to_can_win_app\\.venv\\Lib\\site-packages\\PIL\\BmpImagePlugin.py',
   'PYMODULE'),
  ('PIL.BufrStubImagePlugin',
   'F:\\Pliki\\Studia\\nucleo_to_can\\SOFTWARE\\nucleo_to_can_win_app\\.venv\\Lib\\site-packages\\PIL\\BufrStubImagePlugin.py',
   'PYMODULE'),
  ('PIL.CurImagePlugin',
   'F:\\Pliki\\Studia\\nucleo_to_can\\SOFTWARE\\nucleo_to_can_win_app\\.venv\\Lib\\site-packages\\PIL\\CurImagePlugin.py',
   'PYMODULE'),
  ('PIL.DcxImagePlugin',
   'F:\\Pliki\\Studia\\nucleo_to_can\\SOFTWARE\\nucleo_to_can_win_app\\.venv\\Lib\\site-packages\\PIL\\DcxImagePlugin.py',
   'PYMODULE'),
  ('PIL.DdsImagePlugin',
   'F:\\Pliki\\Studia\\nucleo_to_can\\SOFTWARE\\nucleo_to_can_win_app\\.venv\\Lib\\site-packages\\PIL\\DdsImagePlugin.py',
   'PYMODULE'),
  ('PIL.EpsImagePlugin',
   'F:\\Pliki\\Studia\\nucleo_to_can\\SOFTWARE\\nucleo_to_can_win_app\\.venv\\Lib\\site-packages\\PIL\\EpsImagePlugin.py',
   'PYMODULE'),
  ('PIL.ExifTags',
   'F:\\Pliki\\Studia\\nucleo_to_can\\SOFTWARE\\nucleo_to_can_win_app\\.venv\\Lib\\site-packages\\PIL\\ExifTags.py',
   'PYMODULE'),
  ('PIL.FitsImagePlugin',
   'F:\\Pliki\\Studia\\nucleo_to_can\\SOFTWARE\\nucleo_to_can_win_app\\.venv\\Lib\\site-packages\\PIL\\FitsImagePlugin.py',
   'PYMODULE'),
  ('PIL.FliImagePlugin',
   'F:\\Pliki\\Studia\\nucleo_to_can\\SOFTWARE\\nucleo_to_can_win_app\\.venv\\Lib\\site-packages\\PIL\\FliImagePlugin.py',
   'PYMODULE'),
  ('PIL.FpxImagePlugin',
   'F:\\Pliki\\Studia\\nucleo_to_can\\SOFTWARE\\nucleo_to_can_win_app\\.venv\\Lib\\site-packages\\PIL\\FpxImagePlugin.py',
   'PYMODULE'),
  ('PIL.FtexImagePlugin',
   'F:\\Pliki\\Studia\\nucleo_to_can\\SOFTWARE\\nucleo_to_can_win_app\\.venv\\Lib\\site-packages\\PIL\\FtexImagePlugin.py',
   'PYMODULE'),
  ('PIL.GbrImagePlugin',
   'F:\\Pliki\\Studia\\nucleo_to_can\\SOFTWARE\\nucleo_to_can_win_app\\.venv\\Lib\\site-packages\\PIL\\GbrImagePlugin.py',
   'PYMODULE'),
  ('PIL.GifImagePlugin',
   'F:\\Pliki\\Studia\\nucleo_to_can\\SOFTWARE\\nucleo_to_can_win_app\\.venv\\Lib\\site-packages\\PIL\\GifImagePlugin.py',
   'PYMODULE'),
  ('PIL.GimpGradientFile',
   'F:\\Pliki\\Studia\\nucleo_to_can\\SOFTWARE\\nucleo_to_can_win_app\\.venv\\Lib\\site-packages\\PIL\\GimpGradientFile.py',
   'PYMODULE'),
  ('PIL.GimpPaletteFile',
   'F:\\Pliki\\Studia\\nucleo_to_can\\SOFTWARE\\nucleo_to_can_win_app\\.venv\\Lib\\site-packages\\PIL\\GimpPaletteFile.py',
   'PYMODULE'),
  ('PIL.GribStubImagePlugin',
   'F:\\Pliki\\Studia\\nucleo_to_can\\SOFTWARE\\nucleo_to_can_win_app\\.venv\\Lib\\site-packages\\PIL\\GribStubImagePlugin.py',
   'PYMODULE'),
  ('PIL.Hdf5StubImagePlugin',
   'F:\\Pliki\\Studia\\nucleo_to_can\\SOFTWARE\\nucleo_to_can_win_app\\.venv\\Lib\\site-packages\\PIL\\Hdf5StubImagePlugin.py',
   'PYMODULE'),
  ('PIL.IcnsImagePlugin',
   'F:\\Pliki\\Studia\\nucleo_to_can\\SOFTWARE\\nucleo_to_can_win_app\\.venv\\Lib\\site-packages\\PIL\\IcnsImagePlugin.py',
   'PYMODULE'),
  ('PIL.IcoImagePlugin',
   'F:\\Pliki\\Studia\\nucleo_to_can\\SOFTWARE\\nucleo_to_can_win_app\\.venv\\Lib\\site-packages\\PIL\\IcoImagePlugin.py',
   'PYMODULE'),
  ('PIL.ImImagePlugin',
   'F:\\Pliki\\Studia\\nucleo_to_can\\SOFTWARE\\nucleo_to_can_win_app\\.venv\\Lib\\site-packages\\PIL\\ImImagePlugin.py',
   'PYMODULE'),
  ('PIL.Image',
   'F:\\Pliki\\Studia\\nucleo_to_can\\SOFTWARE\\nucleo_to_can_win_app\\.venv\\Lib\\site-packages\\PIL\\Image.py',
   'PYMODULE'),
  ('PIL.ImageChops',
   'F:\\Pliki\\Studia\\nucleo_to_can\\SOFTWARE\\nucleo_to_can_win_app\\.venv\\Lib\\site-packages\\PIL\\ImageChops.py',
   'PYMODULE'),
  ('PIL.ImageCms',
   'F:\\Pliki\\Studia\\nucleo_to_can\\SOFTWARE\\nucleo_to_can_win_app\\.venv\\Lib\\site-packages\\PIL\\ImageCms.py',
   'PYMODULE'),
  ('PIL.ImageColor',
   'F:\\Pliki\\Studia\\nucleo_to_can\\SOFTWARE\\nucleo_to_can_win_app\\.venv\\Lib\\site-packages\\PIL\\ImageColor.py',
   'PYMODULE'),
  ('PIL.ImageDraw',
   'F:\\Pliki\\Studia\\nucleo_to_can\\SOFTWARE\\nucleo_to_can_win_app\\.venv\\Lib\\site-packages\\PIL\\ImageDraw.py',
   'PYMODULE'),
  ('PIL.ImageDraw2',
   'F:\\Pliki\\Studia\\nucleo_to_can\\SOFTWARE\\nucleo_to_can_win_app\\.venv\\Lib\\site-packages\\PIL\\ImageDraw2.py',
   'PYMODULE'),
  ('PIL.ImageFile',
   'F:\\Pliki\\Studia\\nucleo_to_can\\SOFTWARE\\nucleo_to_can_win_app\\.venv\\Lib\\site-packages\\PIL\\ImageFile.py',
   'PYMODULE'),
  ('PIL.ImageFilter',
   'F:\\Pliki\\Studia\\nucleo_to_can\\SOFTWARE\\nucleo_to_can_win_app\\.venv\\Lib\\site-packages\\PIL\\ImageFilter.py',
   'PYMODULE'),
  ('PIL.ImageFont',
   'F:\\Pliki\\Studia\\nucleo_to_can\\SOFTWARE\\nucleo_to_can_win_app\\.venv\\Lib\\site-packages\\PIL\\ImageFont.py',
   'PYMODULE'),
  ('PIL.ImageGrab',
   'F:\\Pliki\\Studia\\nucleo_to_can\\SOFTWARE\\nucleo_to_can_win_app\\.venv\\Lib\\site-packages\\PIL\\ImageGrab.py',
   'PYMODULE'),
  ('PIL.ImageMath',
   'F:\\Pliki\\Studia\\nucleo_to_can\\SOFTWARE\\nucleo_to_can_win_app\\.venv\\Lib\\site-packages\\PIL\\ImageMath.py',
   'PYMODULE'),
  ('PIL.ImageMode',
   'F:\\Pliki\\Studia\\nucleo_to_can\\SOFTWARE\\nucleo_to_can_win_app\\.venv\\Lib\\site-packages\\PIL\\ImageMode.py',
   'PYMODULE'),
  ('PIL.ImageOps',
   'F:\\Pliki\\Studia\\nucleo_to_can\\SOFTWARE\\nucleo_to_can_win_app\\.venv\\Lib\\site-packages\\PIL\\ImageOps.py',
   'PYMODULE'),
  ('PIL.ImagePalette',
   'F:\\Pliki\\Studia\\nucleo_to_can\\SOFTWARE\\nucleo_to_can_win_app\\.venv\\Lib\\site-packages\\PIL\\ImagePalette.py',
   'PYMODULE'),
  ('PIL.ImagePath',
   'F:\\Pliki\\Studia\\nucleo_to_can\\SOFTWARE\\nucleo_to_can_win_app\\.venv\\Lib\\site-packages\\PIL\\ImagePath.py',
   'PYMODULE'),
  ('PIL.ImageQt',
   'F:\\Pliki\\Studia\\nucleo_to_can\\SOFTWARE\\nucleo_to_can_win_app\\.venv\\Lib\\site-packages\\PIL\\ImageQt.py',
   'PYMODULE'),
  ('PIL.ImageSequence',
   'F:\\Pliki\\Studia\\nucleo_to_can\\SOFTWARE\\nucleo_to_can_win_app\\.venv\\Lib\\site-packages\\PIL\\ImageSequence.py',
   'PYMODULE'),
  ('PIL.ImageShow',
   'F:\\Pliki\\Studia\\nucleo_to_can\\SOFTWARE\\nucleo_to_can_win_app\\.venv\\Lib\\site-packages\\PIL\\ImageShow.py',
   'PYMODULE'),
  ('PIL.ImageTk',
   'F:\\Pliki\\Studia\\nucleo_to_can\\SOFTWARE\\nucleo_to_can_win_app\\.venv\\Lib\\site-packages\\PIL\\ImageTk.py',
   'PYMODULE'),
  ('PIL.ImageWin',
   'F:\\Pliki\\Studia\\nucleo_to_can\\SOFTWARE\\nucleo_to_can_win_app\\.venv\\Lib\\site-packages\\PIL\\ImageWin.py',
   'PYMODULE'),
  ('PIL.ImtImagePlugin',
   'F:\\Pliki\\Studia\\nucleo_to_can\\SOFTWARE\\nucleo_to_can_win_app\\.venv\\Lib\\site-packages\\PIL\\ImtImagePlugin.py',
   'PYMODULE'),
  ('PIL.IptcImagePlugin',
   'F:\\Pliki\\Studia\\nucleo_to_can\\SOFTWARE\\nucleo_to_can_win_app\\.venv\\Lib\\site-packages\\PIL\\IptcImagePlugin.py',
   'PYMODULE'),
  ('PIL.Jpeg2KImagePlugin',
   'F:\\Pliki\\Studia\\nucleo_to_can\\SOFTWARE\\nucleo_to_can_win_app\\.venv\\Lib\\site-packages\\PIL\\Jpeg2KImagePlugin.py',
   'PYMODULE'),
  ('PIL.JpegImagePlugin',
   'F:\\Pliki\\Studia\\nucleo_to_can\\SOFTWARE\\nucleo_to_can_win_app\\.venv\\Lib\\site-packages\\PIL\\JpegImagePlugin.py',
   'PYMODULE'),
  ('PIL.JpegPresets',
   'F:\\Pliki\\Studia\\nucleo_to_can\\SOFTWARE\\nucleo_to_can_win_app\\.venv\\Lib\\site-packages\\PIL\\JpegPresets.py',
   'PYMODULE'),
  ('PIL.McIdasImagePlugin',
   'F:\\Pliki\\Studia\\nucleo_to_can\\SOFTWARE\\nucleo_to_can_win_app\\.venv\\Lib\\site-packages\\PIL\\McIdasImagePlugin.py',
   'PYMODULE'),
  ('PIL.MicImagePlugin',
   'F:\\Pliki\\Studia\\nucleo_to_can\\SOFTWARE\\nucleo_to_can_win_app\\.venv\\Lib\\site-packages\\PIL\\MicImagePlugin.py',
   'PYMODULE'),
  ('PIL.MpegImagePlugin',
   'F:\\Pliki\\Studia\\nucleo_to_can\\SOFTWARE\\nucleo_to_can_win_app\\.venv\\Lib\\site-packages\\PIL\\MpegImagePlugin.py',
   'PYMODULE'),
  ('PIL.MpoImagePlugin',
   'F:\\Pliki\\Studia\\nucleo_to_can\\SOFTWARE\\nucleo_to_can_win_app\\.venv\\Lib\\site-packages\\PIL\\MpoImagePlugin.py',
   'PYMODULE'),
  ('PIL.MspImagePlugin',
   'F:\\Pliki\\Studia\\nucleo_to_can\\SOFTWARE\\nucleo_to_can_win_app\\.venv\\Lib\\site-packages\\PIL\\MspImagePlugin.py',
   'PYMODULE'),
  ('PIL.PaletteFile',
   'F:\\Pliki\\Studia\\nucleo_to_can\\SOFTWARE\\nucleo_to_can_win_app\\.venv\\Lib\\site-packages\\PIL\\PaletteFile.py',
   'PYMODULE'),
  ('PIL.PalmImagePlugin',
   'F:\\Pliki\\Studia\\nucleo_to_can\\SOFTWARE\\nucleo_to_can_win_app\\.venv\\Lib\\site-packages\\PIL\\PalmImagePlugin.py',
   'PYMODULE'),
  ('PIL.PcdImagePlugin',
   'F:\\Pliki\\Studia\\nucleo_to_can\\SOFTWARE\\nucleo_to_can_win_app\\.venv\\Lib\\site-packages\\PIL\\PcdImagePlugin.py',
   'PYMODULE'),
  ('PIL.PcxImagePlugin',
   'F:\\Pliki\\Studia\\nucleo_to_can\\SOFTWARE\\nucleo_to_can_win_app\\.venv\\Lib\\site-packages\\PIL\\PcxImagePlugin.py',
   'PYMODULE'),
  ('PIL.PdfImagePlugin',
   'F:\\Pliki\\Studia\\nucleo_to_can\\SOFTWARE\\nucleo_to_can_win_app\\.venv\\Lib\\site-packages\\PIL\\PdfImagePlugin.py',
   'PYMODULE'),
  ('PIL.PdfParser',
   'F:\\Pliki\\Studia\\nucleo_to_can\\SOFTWARE\\nucleo_to_can_win_app\\.venv\\Lib\\site-packages\\PIL\\PdfParser.py',
   'PYMODULE'),
  ('PIL.PixarImagePlugin',
   'F:\\Pliki\\Studia\\nucleo_to_can\\SOFTWARE\\nucleo_to_can_win_app\\.venv\\Lib\\site-packages\\PIL\\PixarImagePlugin.py',
   'PYMODULE'),
  ('PIL.PngImagePlugin',
   'F:\\Pliki\\Studia\\nucleo_to_can\\SOFTWARE\\nucleo_to_can_win_app\\.venv\\Lib\\site-packages\\PIL\\PngImagePlugin.py',
   'PYMODULE'),
  ('PIL.PpmImagePlugin',
   'F:\\Pliki\\Studia\\nucleo_to_can\\SOFTWARE\\nucleo_to_can_win_app\\.venv\\Lib\\site-packages\\PIL\\PpmImagePlugin.py',
   'PYMODULE'),
  ('PIL.PsdImagePlugin',
   'F:\\Pliki\\Studia\\nucleo_to_can\\SOFTWARE\\nucleo_to_can_win_app\\.venv\\Lib\\site-packages\\PIL\\PsdImagePlugin.py',
   'PYMODULE'),
  ('PIL.PyAccess',
   'F:\\Pliki\\Studia\\nucleo_to_can\\SOFTWARE\\nucleo_to_can_win_app\\.venv\\Lib\\site-packages\\PIL\\PyAccess.py',
   'PYMODULE'),
  ('PIL.QoiImagePlugin',
   'F:\\Pliki\\Studia\\nucleo_to_can\\SOFTWARE\\nucleo_to_can_win_app\\.venv\\Lib\\site-packages\\PIL\\QoiImagePlugin.py',
   'PYMODULE'),
  ('PIL.SgiImagePlugin',
   'F:\\Pliki\\Studia\\nucleo_to_can\\SOFTWARE\\nucleo_to_can_win_app\\.venv\\Lib\\site-packages\\PIL\\SgiImagePlugin.py',
   'PYMODULE'),
  ('PIL.SpiderImagePlugin',
   'F:\\Pliki\\Studia\\nucleo_to_can\\SOFTWARE\\nucleo_to_can_win_app\\.venv\\Lib\\site-packages\\PIL\\SpiderImagePlugin.py',
   'PYMODULE'),
  ('PIL.SunImagePlugin',
   'F:\\Pliki\\Studia\\nucleo_to_can\\SOFTWARE\\nucleo_to_can_win_app\\.venv\\Lib\\site-packages\\PIL\\SunImagePlugin.py',
   'PYMODULE'),
  ('PIL.TgaImagePlugin',
   'F:\\Pliki\\Studia\\nucleo_to_can\\SOFTWARE\\nucleo_to_can_win_app\\.venv\\Lib\\site-packages\\PIL\\TgaImagePlugin.py',
   'PYMODULE'),
  ('PIL.TiffImagePlugin',
   'F:\\Pliki\\Studia\\nucleo_to_can\\SOFTWARE\\nucleo_to_can_win_app\\.venv\\Lib\\site-packages\\PIL\\TiffImagePlugin.py',
   'PYMODULE'),
  ('PIL.TiffTags',
   'F:\\Pliki\\Studia\\nucleo_to_can\\SOFTWARE\\nucleo_to_can_win_app\\.venv\\Lib\\site-packages\\PIL\\TiffTags.py',
   'PYMODULE'),
  ('PIL.WebPImagePlugin',
   'F:\\Pliki\\Studia\\nucleo_to_can\\SOFTWARE\\nucleo_to_can_win_app\\.venv\\Lib\\site-packages\\PIL\\WebPImagePlugin.py',
   'PYMODULE'),
  ('PIL.WmfImagePlugin',
   'F:\\Pliki\\Studia\\nucleo_to_can\\SOFTWARE\\nucleo_to_can_win_app\\.venv\\Lib\\site-packages\\PIL\\WmfImagePlugin.py',
   'PYMODULE'),
  ('PIL.XVThumbImagePlugin',
   'F:\\Pliki\\Studia\\nucleo_to_can\\SOFTWARE\\nucleo_to_can_win_app\\.venv\\Lib\\site-packages\\PIL\\XVThumbImagePlugin.py',
   'PYMODULE'),
  ('PIL.XbmImagePlugin',
   'F:\\Pliki\\Studia\\nucleo_to_can\\SOFTWARE\\nucleo_to_can_win_app\\.venv\\Lib\\site-packages\\PIL\\XbmImagePlugin.py',
   'PYMODULE'),
  ('PIL.XpmImagePlugin',
   'F:\\Pliki\\Studia\\nucleo_to_can\\SOFTWARE\\nucleo_to_can_win_app\\.venv\\Lib\\site-packages\\PIL\\XpmImagePlugin.py',
   'PYMODULE'),
  ('PIL._binary',
   'F:\\Pliki\\Studia\\nucleo_to_can\\SOFTWARE\\nucleo_to_can_win_app\\.venv\\Lib\\site-packages\\PIL\\_binary.py',
   'PYMODULE'),
  ('PIL._deprecate',
   'F:\\Pliki\\Studia\\nucleo_to_can\\SOFTWARE\\nucleo_to_can_win_app\\.venv\\Lib\\site-packages\\PIL\\_deprecate.py',
   'PYMODULE'),
  ('PIL._typing',
   'F:\\Pliki\\Studia\\nucleo_to_can\\SOFTWARE\\nucleo_to_can_win_app\\.venv\\Lib\\site-packages\\PIL\\_typing.py',
   'PYMODULE'),
  ('PIL._util',
   'F:\\Pliki\\Studia\\nucleo_to_can\\SOFTWARE\\nucleo_to_can_win_app\\.venv\\Lib\\site-packages\\PIL\\_util.py',
   'PYMODULE'),
  ('PIL._version',
   'F:\\Pliki\\Studia\\nucleo_to_can\\SOFTWARE\\nucleo_to_can_win_app\\.venv\\Lib\\site-packages\\PIL\\_version.py',
   'PYMODULE'),
  ('PIL.features',
   'F:\\Pliki\\Studia\\nucleo_to_can\\SOFTWARE\\nucleo_to_can_win_app\\.venv\\Lib\\site-packages\\PIL\\features.py',
   'PYMODULE'),
  ('__future__', 'D:\\python3\\Lib\\__future__.py', 'PYMODULE'),
  ('_aix_support', 'D:\\python3\\Lib\\_aix_support.py', 'PYMODULE'),
  ('_compat_pickle', 'D:\\python3\\Lib\\_compat_pickle.py', 'PYMODULE'),
  ('_compression', 'D:\\python3\\Lib\\_compression.py', 'PYMODULE'),
  ('_py_abc', 'D:\\python3\\Lib\\_py_abc.py', 'PYMODULE'),
  ('_pydatetime', 'D:\\python3\\Lib\\_pydatetime.py', 'PYMODULE'),
  ('_pydecimal', 'D:\\python3\\Lib\\_pydecimal.py', 'PYMODULE'),
  ('_pyi_rth_utils',
   'F:\\Pliki\\Studia\\nucleo_to_can\\SOFTWARE\\nucleo_to_can_win_app\\.venv\\Lib\\site-packages\\PyInstaller\\fake-modules\\_pyi_rth_utils\\__init__.py',
   'PYMODULE'),
  ('_strptime', 'D:\\python3\\Lib\\_strptime.py', 'PYMODULE'),
  ('_threading_local', 'D:\\python3\\Lib\\_threading_local.py', 'PYMODULE'),
  ('argparse', 'D:\\python3\\Lib\\argparse.py', 'PYMODULE'),
  ('ast', 'D:\\python3\\Lib\\ast.py', 'PYMODULE'),
  ('base64', 'D:\\python3\\Lib\\base64.py', 'PYMODULE'),
  ('bisect', 'D:\\python3\\Lib\\bisect.py', 'PYMODULE'),
  ('bz2', 'D:\\python3\\Lib\\bz2.py', 'PYMODULE'),
  ('calendar', 'D:\\python3\\Lib\\calendar.py', 'PYMODULE'),
  ('colorsys', 'D:\\python3\\Lib\\colorsys.py', 'PYMODULE'),
  ('configparser', 'D:\\python3\\Lib\\configparser.py', 'PYMODULE'),
  ('contextlib', 'D:\\python3\\Lib\\contextlib.py', 'PYMODULE'),
  ('contextvars', 'D:\\python3\\Lib\\contextvars.py', 'PYMODULE'),
  ('copy', 'D:\\python3\\Lib\\copy.py', 'PYMODULE'),
  ('csv', 'D:\\python3\\Lib\\csv.py', 'PYMODULE'),
  ('ctypes', 'D:\\python3\\Lib\\ctypes\\__init__.py', 'PYMODULE'),
  ('ctypes._endian', 'D:\\python3\\Lib\\ctypes\\_endian.py', 'PYMODULE'),
  ('ctypes.wintypes', 'D:\\python3\\Lib\\ctypes\\wintypes.py', 'PYMODULE'),
  ('dataclasses', 'D:\\python3\\Lib\\dataclasses.py', 'PYMODULE'),
  ('datetime', 'D:\\python3\\Lib\\datetime.py', 'PYMODULE'),
  ('decimal', 'D:\\python3\\Lib\\decimal.py', 'PYMODULE'),
  ('dis', 'D:\\python3\\Lib\\dis.py', 'PYMODULE'),
  ('email', 'D:\\python3\\Lib\\email\\__init__.py', 'PYMODULE'),
  ('email._encoded_words',
   'D:\\python3\\Lib\\email\\_encoded_words.py',
   'PYMODULE'),
  ('email._header_value_parser',
   'D:\\python3\\Lib\\email\\_header_value_parser.py',
   'PYMODULE'),
  ('email._parseaddr', 'D:\\python3\\Lib\\email\\_parseaddr.py', 'PYMODULE'),
  ('email._policybase', 'D:\\python3\\Lib\\email\\_policybase.py', 'PYMODULE'),
  ('email.base64mime', 'D:\\python3\\Lib\\email\\base64mime.py', 'PYMODULE'),
  ('email.charset', 'D:\\python3\\Lib\\email\\charset.py', 'PYMODULE'),
  ('email.contentmanager',
   'D:\\python3\\Lib\\email\\contentmanager.py',
   'PYMODULE'),
  ('email.encoders', 'D:\\python3\\Lib\\email\\encoders.py', 'PYMODULE'),
  ('email.errors', 'D:\\python3\\Lib\\email\\errors.py', 'PYMODULE'),
  ('email.feedparser', 'D:\\python3\\Lib\\email\\feedparser.py', 'PYMODULE'),
  ('email.generator', 'D:\\python3\\Lib\\email\\generator.py', 'PYMODULE'),
  ('email.header', 'D:\\python3\\Lib\\email\\header.py', 'PYMODULE'),
  ('email.headerregistry',
   'D:\\python3\\Lib\\email\\headerregistry.py',
   'PYMODULE'),
  ('email.iterators', 'D:\\python3\\Lib\\email\\iterators.py', 'PYMODULE'),
  ('email.message', 'D:\\python3\\Lib\\email\\message.py', 'PYMODULE'),
  ('email.parser', 'D:\\python3\\Lib\\email\\parser.py', 'PYMODULE'),
  ('email.policy', 'D:\\python3\\Lib\\email\\policy.py', 'PYMODULE'),
  ('email.quoprimime', 'D:\\python3\\Lib\\email\\quoprimime.py', 'PYMODULE'),
  ('email.utils', 'D:\\python3\\Lib\\email\\utils.py', 'PYMODULE'),
  ('fnmatch', 'D:\\python3\\Lib\\fnmatch.py', 'PYMODULE'),
  ('fractions', 'D:\\python3\\Lib\\fractions.py', 'PYMODULE'),
  ('ftplib', 'D:\\python3\\Lib\\ftplib.py', 'PYMODULE'),
  ('getopt', 'D:\\python3\\Lib\\getopt.py', 'PYMODULE'),
  ('getpass', 'D:\\python3\\Lib\\getpass.py', 'PYMODULE'),
  ('gettext', 'D:\\python3\\Lib\\gettext.py', 'PYMODULE'),
  ('glob', 'D:\\python3\\Lib\\glob.py', 'PYMODULE'),
  ('gzip', 'D:\\python3\\Lib\\gzip.py', 'PYMODULE'),
  ('hashlib', 'D:\\python3\\Lib\\hashlib.py', 'PYMODULE'),
  ('http', 'D:\\python3\\Lib\\http\\__init__.py', 'PYMODULE'),
  ('http.client', 'D:\\python3\\Lib\\http\\client.py', 'PYMODULE'),
  ('http.cookiejar', 'D:\\python3\\Lib\\http\\cookiejar.py', 'PYMODULE'),
  ('importlib', 'D:\\python3\\Lib\\importlib\\__init__.py', 'PYMODULE'),
  ('importlib._abc', 'D:\\python3\\Lib\\importlib\\_abc.py', 'PYMODULE'),
  ('importlib._bootstrap',
   'D:\\python3\\Lib\\importlib\\_bootstrap.py',
   'PYMODULE'),
  ('importlib._bootstrap_external',
   'D:\\python3\\Lib\\importlib\\_bootstrap_external.py',
   'PYMODULE'),
  ('importlib.abc', 'D:\\python3\\Lib\\importlib\\abc.py', 'PYMODULE'),
  ('importlib.machinery',
   'D:\\python3\\Lib\\importlib\\machinery.py',
   'PYMODULE'),
  ('importlib.metadata',
   'D:\\python3\\Lib\\importlib\\metadata\\__init__.py',
   'PYMODULE'),
  ('importlib.metadata._adapters',
   'D:\\python3\\Lib\\importlib\\metadata\\_adapters.py',
   'PYMODULE'),
  ('importlib.metadata._collections',
   'D:\\python3\\Lib\\importlib\\metadata\\_collections.py',
   'PYMODULE'),
  ('importlib.metadata._functools',
   'D:\\python3\\Lib\\importlib\\metadata\\_functools.py',
   'PYMODULE'),
  ('importlib.metadata._itertools',
   'D:\\python3\\Lib\\importlib\\metadata\\_itertools.py',
   'PYMODULE'),
  ('importlib.metadata._meta',
   'D:\\python3\\Lib\\importlib\\metadata\\_meta.py',
   'PYMODULE'),
  ('importlib.metadata._text',
   'D:\\python3\\Lib\\importlib\\metadata\\_text.py',
   'PYMODULE'),
  ('importlib.readers', 'D:\\python3\\Lib\\importlib\\readers.py', 'PYMODULE'),
  ('importlib.resources',
   'D:\\python3\\Lib\\importlib\\resources\\__init__.py',
   'PYMODULE'),
  ('importlib.resources._adapters',
   'D:\\python3\\Lib\\importlib\\resources\\_adapters.py',
   'PYMODULE'),
  ('importlib.resources._common',
   'D:\\python3\\Lib\\importlib\\resources\\_common.py',
   'PYMODULE'),
  ('importlib.resources._itertools',
   'D:\\python3\\Lib\\importlib\\resources\\_itertools.py',
   'PYMODULE'),
  ('importlib.resources._legacy',
   'D:\\python3\\Lib\\importlib\\resources\\_legacy.py',
   'PYMODULE'),
  ('importlib.resources.abc',
   'D:\\python3\\Lib\\importlib\\resources\\abc.py',
   'PYMODULE'),
  ('importlib.resources.readers',
   'D:\\python3\\Lib\\importlib\\resources\\readers.py',
   'PYMODULE'),
  ('importlib.util', 'D:\\python3\\Lib\\importlib\\util.py', 'PYMODULE'),
  ('inspect', 'D:\\python3\\Lib\\inspect.py', 'PYMODULE'),
  ('ipaddress', 'D:\\python3\\Lib\\ipaddress.py', 'PYMODULE'),
  ('json', 'D:\\python3\\Lib\\json\\__init__.py', 'PYMODULE'),
  ('json.decoder', 'D:\\python3\\Lib\\json\\decoder.py', 'PYMODULE'),
  ('json.encoder', 'D:\\python3\\Lib\\json\\encoder.py', 'PYMODULE'),
  ('json.scanner', 'D:\\python3\\Lib\\json\\scanner.py', 'PYMODULE'),
  ('logging', 'D:\\python3\\Lib\\logging\\__init__.py', 'PYMODULE'),
  ('lzma', 'D:\\python3\\Lib\\lzma.py', 'PYMODULE'),
  ('mimetypes', 'D:\\python3\\Lib\\mimetypes.py', 'PYMODULE'),
  ('netrc', 'D:\\python3\\Lib\\netrc.py', 'PYMODULE'),
  ('nturl2path', 'D:\\python3\\Lib\\nturl2path.py', 'PYMODULE'),
  ('numbers', 'D:\\python3\\Lib\\numbers.py', 'PYMODULE'),
  ('opcode', 'D:\\python3\\Lib\\opcode.py', 'PYMODULE'),
  ('packaging',
   'F:\\Pliki\\Studia\\nucleo_to_can\\SOFTWARE\\nucleo_to_can_win_app\\.venv\\Lib\\site-packages\\packaging\\__init__.py',
   'PYMODULE'),
  ('packaging._elffile',
   'F:\\Pliki\\Studia\\nucleo_to_can\\SOFTWARE\\nucleo_to_can_win_app\\.venv\\Lib\\site-packages\\packaging\\_elffile.py',
   'PYMODULE'),
  ('packaging._manylinux',
   'F:\\Pliki\\Studia\\nucleo_to_can\\SOFTWARE\\nucleo_to_can_win_app\\.venv\\Lib\\site-packages\\packaging\\_manylinux.py',
   'PYMODULE'),
  ('packaging._musllinux',
   'F:\\Pliki\\Studia\\nucleo_to_can\\SOFTWARE\\nucleo_to_can_win_app\\.venv\\Lib\\site-packages\\packaging\\_musllinux.py',
   'PYMODULE'),
  ('packaging._parser',
   'F:\\Pliki\\Studia\\nucleo_to_can\\SOFTWARE\\nucleo_to_can_win_app\\.venv\\Lib\\site-packages\\packaging\\_parser.py',
   'PYMODULE'),
  ('packaging._structures',
   'F:\\Pliki\\Studia\\nucleo_to_can\\SOFTWARE\\nucleo_to_can_win_app\\.venv\\Lib\\site-packages\\packaging\\_structures.py',
   'PYMODULE'),
  ('packaging._tokenizer',
   'F:\\Pliki\\Studia\\nucleo_to_can\\SOFTWARE\\nucleo_to_can_win_app\\.venv\\Lib\\site-packages\\packaging\\_tokenizer.py',
   'PYMODULE'),
  ('packaging.markers',
   'F:\\Pliki\\Studia\\nucleo_to_can\\SOFTWARE\\nucleo_to_can_win_app\\.venv\\Lib\\site-packages\\packaging\\markers.py',
   'PYMODULE'),
  ('packaging.metadata',
   'F:\\Pliki\\Studia\\nucleo_to_can\\SOFTWARE\\nucleo_to_can_win_app\\.venv\\Lib\\site-packages\\packaging\\metadata.py',
   'PYMODULE'),
  ('packaging.requirements',
   'F:\\Pliki\\Studia\\nucleo_to_can\\SOFTWARE\\nucleo_to_can_win_app\\.venv\\Lib\\site-packages\\packaging\\requirements.py',
   'PYMODULE'),
  ('packaging.specifiers',
   'F:\\Pliki\\Studia\\nucleo_to_can\\SOFTWARE\\nucleo_to_can_win_app\\.venv\\Lib\\site-packages\\packaging\\specifiers.py',
   'PYMODULE'),
  ('packaging.tags',
   'F:\\Pliki\\Studia\\nucleo_to_can\\SOFTWARE\\nucleo_to_can_win_app\\.venv\\Lib\\site-packages\\packaging\\tags.py',
   'PYMODULE'),
  ('packaging.utils',
   'F:\\Pliki\\Studia\\nucleo_to_can\\SOFTWARE\\nucleo_to_can_win_app\\.venv\\Lib\\site-packages\\packaging\\utils.py',
   'PYMODULE'),
  ('packaging.version',
   'F:\\Pliki\\Studia\\nucleo_to_can\\SOFTWARE\\nucleo_to_can_win_app\\.venv\\Lib\\site-packages\\packaging\\version.py',
   'PYMODULE'),
  ('pathlib', 'D:\\python3\\Lib\\pathlib.py', 'PYMODULE'),
  ('pickle', 'D:\\python3\\Lib\\pickle.py', 'PYMODULE'),
  ('pkg_resources',
   'F:\\Pliki\\Studia\\nucleo_to_can\\SOFTWARE\\nucleo_to_can_win_app\\.venv\\Lib\\site-packages\\pkg_resources\\__init__.py',
   'PYMODULE'),
  ('pkg_resources._vendor',
   'F:\\Pliki\\Studia\\nucleo_to_can\\SOFTWARE\\nucleo_to_can_win_app\\.venv\\Lib\\site-packages\\pkg_resources\\_vendor\\__init__.py',
   'PYMODULE'),
  ('pkg_resources._vendor.backports',
   'F:\\Pliki\\Studia\\nucleo_to_can\\SOFTWARE\\nucleo_to_can_win_app\\.venv\\Lib\\site-packages\\pkg_resources\\_vendor\\backports\\__init__.py',
   'PYMODULE'),
  ('pkg_resources._vendor.backports.tarfile',
   'F:\\Pliki\\Studia\\nucleo_to_can\\SOFTWARE\\nucleo_to_can_win_app\\.venv\\Lib\\site-packages\\pkg_resources\\_vendor\\backports\\tarfile.py',
   'PYMODULE'),
  ('pkg_resources._vendor.importlib_resources',
   'F:\\Pliki\\Studia\\nucleo_to_can\\SOFTWARE\\nucleo_to_can_win_app\\.venv\\Lib\\site-packages\\pkg_resources\\_vendor\\importlib_resources\\__init__.py',
   'PYMODULE'),
  ('pkg_resources._vendor.importlib_resources._adapters',
   'F:\\Pliki\\Studia\\nucleo_to_can\\SOFTWARE\\nucleo_to_can_win_app\\.venv\\Lib\\site-packages\\pkg_resources\\_vendor\\importlib_resources\\_adapters.py',
   'PYMODULE'),
  ('pkg_resources._vendor.importlib_resources._common',
   'F:\\Pliki\\Studia\\nucleo_to_can\\SOFTWARE\\nucleo_to_can_win_app\\.venv\\Lib\\site-packages\\pkg_resources\\_vendor\\importlib_resources\\_common.py',
   'PYMODULE'),
  ('pkg_resources._vendor.importlib_resources._compat',
   'F:\\Pliki\\Studia\\nucleo_to_can\\SOFTWARE\\nucleo_to_can_win_app\\.venv\\Lib\\site-packages\\pkg_resources\\_vendor\\importlib_resources\\_compat.py',
   'PYMODULE'),
  ('pkg_resources._vendor.importlib_resources._itertools',
   'F:\\Pliki\\Studia\\nucleo_to_can\\SOFTWARE\\nucleo_to_can_win_app\\.venv\\Lib\\site-packages\\pkg_resources\\_vendor\\importlib_resources\\_itertools.py',
   'PYMODULE'),
  ('pkg_resources._vendor.importlib_resources._legacy',
   'F:\\Pliki\\Studia\\nucleo_to_can\\SOFTWARE\\nucleo_to_can_win_app\\.venv\\Lib\\site-packages\\pkg_resources\\_vendor\\importlib_resources\\_legacy.py',
   'PYMODULE'),
  ('pkg_resources._vendor.importlib_resources.abc',
   'F:\\Pliki\\Studia\\nucleo_to_can\\SOFTWARE\\nucleo_to_can_win_app\\.venv\\Lib\\site-packages\\pkg_resources\\_vendor\\importlib_resources\\abc.py',
   'PYMODULE'),
  ('pkg_resources._vendor.importlib_resources.readers',
   'F:\\Pliki\\Studia\\nucleo_to_can\\SOFTWARE\\nucleo_to_can_win_app\\.venv\\Lib\\site-packages\\pkg_resources\\_vendor\\importlib_resources\\readers.py',
   'PYMODULE'),
  ('pkg_resources._vendor.importlib_resources.simple',
   'F:\\Pliki\\Studia\\nucleo_to_can\\SOFTWARE\\nucleo_to_can_win_app\\.venv\\Lib\\site-packages\\pkg_resources\\_vendor\\importlib_resources\\simple.py',
   'PYMODULE'),
  ('pkg_resources._vendor.jaraco',
   'F:\\Pliki\\Studia\\nucleo_to_can\\SOFTWARE\\nucleo_to_can_win_app\\.venv\\Lib\\site-packages\\pkg_resources\\_vendor\\jaraco\\__init__.py',
   'PYMODULE'),
  ('pkg_resources._vendor.jaraco.context',
   'F:\\Pliki\\Studia\\nucleo_to_can\\SOFTWARE\\nucleo_to_can_win_app\\.venv\\Lib\\site-packages\\pkg_resources\\_vendor\\jaraco\\context.py',
   'PYMODULE'),
  ('pkg_resources._vendor.jaraco.functools',
   'F:\\Pliki\\Studia\\nucleo_to_can\\SOFTWARE\\nucleo_to_can_win_app\\.venv\\Lib\\site-packages\\pkg_resources\\_vendor\\jaraco\\functools\\__init__.py',
   'PYMODULE'),
  ('pkg_resources._vendor.jaraco.text',
   'F:\\Pliki\\Studia\\nucleo_to_can\\SOFTWARE\\nucleo_to_can_win_app\\.venv\\Lib\\site-packages\\pkg_resources\\_vendor\\jaraco\\text\\__init__.py',
   'PYMODULE'),
  ('pkg_resources._vendor.more_itertools',
   'F:\\Pliki\\Studia\\nucleo_to_can\\SOFTWARE\\nucleo_to_can_win_app\\.venv\\Lib\\site-packages\\pkg_resources\\_vendor\\more_itertools\\__init__.py',
   'PYMODULE'),
  ('pkg_resources._vendor.more_itertools.more',
   'F:\\Pliki\\Studia\\nucleo_to_can\\SOFTWARE\\nucleo_to_can_win_app\\.venv\\Lib\\site-packages\\pkg_resources\\_vendor\\more_itertools\\more.py',
   'PYMODULE'),
  ('pkg_resources._vendor.more_itertools.recipes',
   'F:\\Pliki\\Studia\\nucleo_to_can\\SOFTWARE\\nucleo_to_can_win_app\\.venv\\Lib\\site-packages\\pkg_resources\\_vendor\\more_itertools\\recipes.py',
   'PYMODULE'),
  ('pkg_resources._vendor.packaging',
   'F:\\Pliki\\Studia\\nucleo_to_can\\SOFTWARE\\nucleo_to_can_win_app\\.venv\\Lib\\site-packages\\pkg_resources\\_vendor\\packaging\\__init__.py',
   'PYMODULE'),
  ('pkg_resources._vendor.packaging._elffile',
   'F:\\Pliki\\Studia\\nucleo_to_can\\SOFTWARE\\nucleo_to_can_win_app\\.venv\\Lib\\site-packages\\pkg_resources\\_vendor\\packaging\\_elffile.py',
   'PYMODULE'),
  ('pkg_resources._vendor.packaging._manylinux',
   'F:\\Pliki\\Studia\\nucleo_to_can\\SOFTWARE\\nucleo_to_can_win_app\\.venv\\Lib\\site-packages\\pkg_resources\\_vendor\\packaging\\_manylinux.py',
   'PYMODULE'),
  ('pkg_resources._vendor.packaging._musllinux',
   'F:\\Pliki\\Studia\\nucleo_to_can\\SOFTWARE\\nucleo_to_can_win_app\\.venv\\Lib\\site-packages\\pkg_resources\\_vendor\\packaging\\_musllinux.py',
   'PYMODULE'),
  ('pkg_resources._vendor.packaging._parser',
   'F:\\Pliki\\Studia\\nucleo_to_can\\SOFTWARE\\nucleo_to_can_win_app\\.venv\\Lib\\site-packages\\pkg_resources\\_vendor\\packaging\\_parser.py',
   'PYMODULE'),
  ('pkg_resources._vendor.packaging._structures',
   'F:\\Pliki\\Studia\\nucleo_to_can\\SOFTWARE\\nucleo_to_can_win_app\\.venv\\Lib\\site-packages\\pkg_resources\\_vendor\\packaging\\_structures.py',
   'PYMODULE'),
  ('pkg_resources._vendor.packaging._tokenizer',
   'F:\\Pliki\\Studia\\nucleo_to_can\\SOFTWARE\\nucleo_to_can_win_app\\.venv\\Lib\\site-packages\\pkg_resources\\_vendor\\packaging\\_tokenizer.py',
   'PYMODULE'),
  ('pkg_resources._vendor.packaging.markers',
   'F:\\Pliki\\Studia\\nucleo_to_can\\SOFTWARE\\nucleo_to_can_win_app\\.venv\\Lib\\site-packages\\pkg_resources\\_vendor\\packaging\\markers.py',
   'PYMODULE'),
  ('pkg_resources._vendor.packaging.metadata',
   'F:\\Pliki\\Studia\\nucleo_to_can\\SOFTWARE\\nucleo_to_can_win_app\\.venv\\Lib\\site-packages\\pkg_resources\\_vendor\\packaging\\metadata.py',
   'PYMODULE'),
  ('pkg_resources._vendor.packaging.requirements',
   'F:\\Pliki\\Studia\\nucleo_to_can\\SOFTWARE\\nucleo_to_can_win_app\\.venv\\Lib\\site-packages\\pkg_resources\\_vendor\\packaging\\requirements.py',
   'PYMODULE'),
  ('pkg_resources._vendor.packaging.specifiers',
   'F:\\Pliki\\Studia\\nucleo_to_can\\SOFTWARE\\nucleo_to_can_win_app\\.venv\\Lib\\site-packages\\pkg_resources\\_vendor\\packaging\\specifiers.py',
   'PYMODULE'),
  ('pkg_resources._vendor.packaging.tags',
   'F:\\Pliki\\Studia\\nucleo_to_can\\SOFTWARE\\nucleo_to_can_win_app\\.venv\\Lib\\site-packages\\pkg_resources\\_vendor\\packaging\\tags.py',
   'PYMODULE'),
  ('pkg_resources._vendor.packaging.utils',
   'F:\\Pliki\\Studia\\nucleo_to_can\\SOFTWARE\\nucleo_to_can_win_app\\.venv\\Lib\\site-packages\\pkg_resources\\_vendor\\packaging\\utils.py',
   'PYMODULE'),
  ('pkg_resources._vendor.packaging.version',
   'F:\\Pliki\\Studia\\nucleo_to_can\\SOFTWARE\\nucleo_to_can_win_app\\.venv\\Lib\\site-packages\\pkg_resources\\_vendor\\packaging\\version.py',
   'PYMODULE'),
  ('pkg_resources._vendor.platformdirs',
   'F:\\Pliki\\Studia\\nucleo_to_can\\SOFTWARE\\nucleo_to_can_win_app\\.venv\\Lib\\site-packages\\pkg_resources\\_vendor\\platformdirs\\__init__.py',
   'PYMODULE'),
  ('pkg_resources._vendor.platformdirs.__main__',
   'F:\\Pliki\\Studia\\nucleo_to_can\\SOFTWARE\\nucleo_to_can_win_app\\.venv\\Lib\\site-packages\\pkg_resources\\_vendor\\platformdirs\\__main__.py',
   'PYMODULE'),
  ('pkg_resources._vendor.platformdirs.android',
   'F:\\Pliki\\Studia\\nucleo_to_can\\SOFTWARE\\nucleo_to_can_win_app\\.venv\\Lib\\site-packages\\pkg_resources\\_vendor\\platformdirs\\android.py',
   'PYMODULE'),
  ('pkg_resources._vendor.platformdirs.api',
   'F:\\Pliki\\Studia\\nucleo_to_can\\SOFTWARE\\nucleo_to_can_win_app\\.venv\\Lib\\site-packages\\pkg_resources\\_vendor\\platformdirs\\api.py',
   'PYMODULE'),
  ('pkg_resources._vendor.platformdirs.macos',
   'F:\\Pliki\\Studia\\nucleo_to_can\\SOFTWARE\\nucleo_to_can_win_app\\.venv\\Lib\\site-packages\\pkg_resources\\_vendor\\platformdirs\\macos.py',
   'PYMODULE'),
  ('pkg_resources._vendor.platformdirs.unix',
   'F:\\Pliki\\Studia\\nucleo_to_can\\SOFTWARE\\nucleo_to_can_win_app\\.venv\\Lib\\site-packages\\pkg_resources\\_vendor\\platformdirs\\unix.py',
   'PYMODULE'),
  ('pkg_resources._vendor.platformdirs.version',
   'F:\\Pliki\\Studia\\nucleo_to_can\\SOFTWARE\\nucleo_to_can_win_app\\.venv\\Lib\\site-packages\\pkg_resources\\_vendor\\platformdirs\\version.py',
   'PYMODULE'),
  ('pkg_resources._vendor.platformdirs.windows',
   'F:\\Pliki\\Studia\\nucleo_to_can\\SOFTWARE\\nucleo_to_can_win_app\\.venv\\Lib\\site-packages\\pkg_resources\\_vendor\\platformdirs\\windows.py',
   'PYMODULE'),
  ('pkg_resources._vendor.zipp',
   'F:\\Pliki\\Studia\\nucleo_to_can\\SOFTWARE\\nucleo_to_can_win_app\\.venv\\Lib\\site-packages\\pkg_resources\\_vendor\\zipp.py',
   'PYMODULE'),
  ('pkg_resources.extern',
   'F:\\Pliki\\Studia\\nucleo_to_can\\SOFTWARE\\nucleo_to_can_win_app\\.venv\\Lib\\site-packages\\pkg_resources\\extern\\__init__.py',
   'PYMODULE'),
  ('pkgutil', 'D:\\python3\\Lib\\pkgutil.py', 'PYMODULE'),
  ('platform', 'D:\\python3\\Lib\\platform.py', 'PYMODULE'),
  ('plistlib', 'D:\\python3\\Lib\\plistlib.py', 'PYMODULE'),
  ('pprint', 'D:\\python3\\Lib\\pprint.py', 'PYMODULE'),
  ('py_compile', 'D:\\python3\\Lib\\py_compile.py', 'PYMODULE'),
  ('queue', 'D:\\python3\\Lib\\queue.py', 'PYMODULE'),
  ('quopri', 'D:\\python3\\Lib\\quopri.py', 'PYMODULE'),
  ('random', 'D:\\python3\\Lib\\random.py', 'PYMODULE'),
  ('selectors', 'D:\\python3\\Lib\\selectors.py', 'PYMODULE'),
  ('serial',
   'F:\\Pliki\\Studia\\nucleo_to_can\\SOFTWARE\\nucleo_to_can_win_app\\.venv\\Lib\\site-packages\\serial\\__init__.py',
   'PYMODULE'),
  ('serial.serialcli',
   'F:\\Pliki\\Studia\\nucleo_to_can\\SOFTWARE\\nucleo_to_can_win_app\\.venv\\Lib\\site-packages\\serial\\serialcli.py',
   'PYMODULE'),
  ('serial.serialjava',
   'F:\\Pliki\\Studia\\nucleo_to_can\\SOFTWARE\\nucleo_to_can_win_app\\.venv\\Lib\\site-packages\\serial\\serialjava.py',
   'PYMODULE'),
  ('serial.serialposix',
   'F:\\Pliki\\Studia\\nucleo_to_can\\SOFTWARE\\nucleo_to_can_win_app\\.venv\\Lib\\site-packages\\serial\\serialposix.py',
   'PYMODULE'),
  ('serial.serialutil',
   'F:\\Pliki\\Studia\\nucleo_to_can\\SOFTWARE\\nucleo_to_can_win_app\\.venv\\Lib\\site-packages\\serial\\serialutil.py',
   'PYMODULE'),
  ('serial.serialwin32',
   'F:\\Pliki\\Studia\\nucleo_to_can\\SOFTWARE\\nucleo_to_can_win_app\\.venv\\Lib\\site-packages\\serial\\serialwin32.py',
   'PYMODULE'),
  ('serial.tools',
   'F:\\Pliki\\Studia\\nucleo_to_can\\SOFTWARE\\nucleo_to_can_win_app\\.venv\\Lib\\site-packages\\serial\\tools\\__init__.py',
   'PYMODULE'),
  ('serial.tools.list_ports',
   'F:\\Pliki\\Studia\\nucleo_to_can\\SOFTWARE\\nucleo_to_can_win_app\\.venv\\Lib\\site-packages\\serial\\tools\\list_ports.py',
   'PYMODULE'),
  ('serial.tools.list_ports_common',
   'F:\\Pliki\\Studia\\nucleo_to_can\\SOFTWARE\\nucleo_to_can_win_app\\.venv\\Lib\\site-packages\\serial\\tools\\list_ports_common.py',
   'PYMODULE'),
  ('serial.tools.list_ports_linux',
   'F:\\Pliki\\Studia\\nucleo_to_can\\SOFTWARE\\nucleo_to_can_win_app\\.venv\\Lib\\site-packages\\serial\\tools\\list_ports_linux.py',
   'PYMODULE'),
  ('serial.tools.list_ports_osx',
   'F:\\Pliki\\Studia\\nucleo_to_can\\SOFTWARE\\nucleo_to_can_win_app\\.venv\\Lib\\site-packages\\serial\\tools\\list_ports_osx.py',
   'PYMODULE'),
  ('serial.tools.list_ports_posix',
   'F:\\Pliki\\Studia\\nucleo_to_can\\SOFTWARE\\nucleo_to_can_win_app\\.venv\\Lib\\site-packages\\serial\\tools\\list_ports_posix.py',
   'PYMODULE'),
  ('serial.tools.list_ports_windows',
   'F:\\Pliki\\Studia\\nucleo_to_can\\SOFTWARE\\nucleo_to_can_win_app\\.venv\\Lib\\site-packages\\serial\\tools\\list_ports_windows.py',
   'PYMODULE'),
  ('serial.win32',
   'F:\\Pliki\\Studia\\nucleo_to_can\\SOFTWARE\\nucleo_to_can_win_app\\.venv\\Lib\\site-packages\\serial\\win32.py',
   'PYMODULE'),
  ('shlex', 'D:\\python3\\Lib\\shlex.py', 'PYMODULE'),
  ('shutil', 'D:\\python3\\Lib\\shutil.py', 'PYMODULE'),
  ('signal', 'D:\\python3\\Lib\\signal.py', 'PYMODULE'),
  ('socket', 'D:\\python3\\Lib\\socket.py', 'PYMODULE'),
  ('ssl', 'D:\\python3\\Lib\\ssl.py', 'PYMODULE'),
  ('statistics', 'D:\\python3\\Lib\\statistics.py', 'PYMODULE'),
  ('string', 'D:\\python3\\Lib\\string.py', 'PYMODULE'),
  ('stringprep', 'D:\\python3\\Lib\\stringprep.py', 'PYMODULE'),
  ('subprocess', 'D:\\python3\\Lib\\subprocess.py', 'PYMODULE'),
  ('sysconfig', 'D:\\python3\\Lib\\sysconfig.py', 'PYMODULE'),
  ('tarfile', 'D:\\python3\\Lib\\tarfile.py', 'PYMODULE'),
  ('tempfile', 'D:\\python3\\Lib\\tempfile.py', 'PYMODULE'),
  ('textwrap', 'D:\\python3\\Lib\\textwrap.py', 'PYMODULE'),
  ('threading', 'D:\\python3\\Lib\\threading.py', 'PYMODULE'),
  ('tkinter', 'D:\\python3\\Lib\\tkinter\\__init__.py', 'PYMODULE'),
  ('tkinter.constants', 'D:\\python3\\Lib\\tkinter\\constants.py', 'PYMODULE'),
  ('tkinter.font', 'D:\\python3\\Lib\\tkinter\\font.py', 'PYMODULE'),
  ('tkinter.scrolledtext',
   'D:\\python3\\Lib\\tkinter\\scrolledtext.py',
   'PYMODULE'),
  ('tkinter.ttk', 'D:\\python3\\Lib\\tkinter\\ttk.py', 'PYMODULE'),
  ('token', 'D:\\python3\\Lib\\token.py', 'PYMODULE'),
  ('tokenize', 'D:\\python3\\Lib\\tokenize.py', 'PYMODULE'),
  ('tracemalloc', 'D:\\python3\\Lib\\tracemalloc.py', 'PYMODULE'),
  ('ttkbootstrap',
   'F:\\Pliki\\Studia\\nucleo_to_can\\SOFTWARE\\nucleo_to_can_win_app\\.venv\\Lib\\site-packages\\ttkbootstrap\\__init__.py',
   'PYMODULE'),
  ('ttkbootstrap.colorutils',
   'F:\\Pliki\\Studia\\nucleo_to_can\\SOFTWARE\\nucleo_to_can_win_app\\.venv\\Lib\\site-packages\\ttkbootstrap\\colorutils.py',
   'PYMODULE'),
  ('ttkbootstrap.constants',
   'F:\\Pliki\\Studia\\nucleo_to_can\\SOFTWARE\\nucleo_to_can_win_app\\.venv\\Lib\\site-packages\\ttkbootstrap\\constants.py',
   'PYMODULE'),
  ('ttkbootstrap.dialogs',
   'F:\\Pliki\\Studia\\nucleo_to_can\\SOFTWARE\\nucleo_to_can_win_app\\.venv\\Lib\\site-packages\\ttkbootstrap\\dialogs\\__init__.py',
   'PYMODULE'),
  ('ttkbootstrap.dialogs.colorchooser',
   'F:\\Pliki\\Studia\\nucleo_to_can\\SOFTWARE\\nucleo_to_can_win_app\\.venv\\Lib\\site-packages\\ttkbootstrap\\dialogs\\colorchooser.py',
   'PYMODULE'),
  ('ttkbootstrap.dialogs.colordropper',
   'F:\\Pliki\\Studia\\nucleo_to_can\\SOFTWARE\\nucleo_to_can_win_app\\.venv\\Lib\\site-packages\\ttkbootstrap\\dialogs\\colordropper.py',
   'PYMODULE'),
  ('ttkbootstrap.dialogs.dialogs',
   'F:\\Pliki\\Studia\\nucleo_to_can\\SOFTWARE\\nucleo_to_can_win_app\\.venv\\Lib\\site-packages\\ttkbootstrap\\dialogs\\dialogs.py',
   'PYMODULE'),
  ('ttkbootstrap.icons',
   'F:\\Pliki\\Studia\\nucleo_to_can\\SOFTWARE\\nucleo_to_can_win_app\\.venv\\Lib\\site-packages\\ttkbootstrap\\icons.py',
   'PYMODULE'),
  ('ttkbootstrap.localization',
   'F:\\Pliki\\Studia\\nucleo_to_can\\SOFTWARE\\nucleo_to_can_win_app\\.venv\\Lib\\site-packages\\ttkbootstrap\\localization\\__init__.py',
   'PYMODULE'),
  ('ttkbootstrap.localization.msgcat',
   'F:\\Pliki\\Studia\\nucleo_to_can\\SOFTWARE\\nucleo_to_can_win_app\\.venv\\Lib\\site-packages\\ttkbootstrap\\localization\\msgcat.py',
   'PYMODULE'),
  ('ttkbootstrap.localization.msgs',
   'F:\\Pliki\\Studia\\nucleo_to_can\\SOFTWARE\\nucleo_to_can_win_app\\.venv\\Lib\\site-packages\\ttkbootstrap\\localization\\msgs.py',
   'PYMODULE'),
  ('ttkbootstrap.publisher',
   'F:\\Pliki\\Studia\\nucleo_to_can\\SOFTWARE\\nucleo_to_can_win_app\\.venv\\Lib\\site-packages\\ttkbootstrap\\publisher.py',
   'PYMODULE'),
  ('ttkbootstrap.scrolled',
   'F:\\Pliki\\Studia\\nucleo_to_can\\SOFTWARE\\nucleo_to_can_win_app\\.venv\\Lib\\site-packages\\ttkbootstrap\\scrolled.py',
   'PYMODULE'),
  ('ttkbootstrap.style',
   'F:\\Pliki\\Studia\\nucleo_to_can\\SOFTWARE\\nucleo_to_can_win_app\\.venv\\Lib\\site-packages\\ttkbootstrap\\style.py',
   'PYMODULE'),
  ('ttkbootstrap.themes',
   'F:\\Pliki\\Studia\\nucleo_to_can\\SOFTWARE\\nucleo_to_can_win_app\\.venv\\Lib\\site-packages\\ttkbootstrap\\themes\\__init__.py',
   'PYMODULE'),
  ('ttkbootstrap.themes.standard',
   'F:\\Pliki\\Studia\\nucleo_to_can\\SOFTWARE\\nucleo_to_can_win_app\\.venv\\Lib\\site-packages\\ttkbootstrap\\themes\\standard.py',
   'PYMODULE'),
  ('ttkbootstrap.themes.user',
   'F:\\Pliki\\Studia\\nucleo_to_can\\SOFTWARE\\nucleo_to_can_win_app\\.venv\\Lib\\site-packages\\ttkbootstrap\\themes\\user.py',
   'PYMODULE'),
  ('ttkbootstrap.tooltip',
   'F:\\Pliki\\Studia\\nucleo_to_can\\SOFTWARE\\nucleo_to_can_win_app\\.venv\\Lib\\site-packages\\ttkbootstrap\\tooltip.py',
   'PYMODULE'),
  ('ttkbootstrap.utility',
   'F:\\Pliki\\Studia\\nucleo_to_can\\SOFTWARE\\nucleo_to_can_win_app\\.venv\\Lib\\site-packages\\ttkbootstrap\\utility.py',
   'PYMODULE'),
  ('ttkbootstrap.validation',
   'F:\\Pliki\\Studia\\nucleo_to_can\\SOFTWARE\\nucleo_to_can_win_app\\.venv\\Lib\\site-packages\\ttkbootstrap\\validation.py',
   'PYMODULE'),
  ('ttkbootstrap.widgets',
   'F:\\Pliki\\Studia\\nucleo_to_can\\SOFTWARE\\nucleo_to_can_win_app\\.venv\\Lib\\site-packages\\ttkbootstrap\\widgets.py',
   'PYMODULE'),
  ('ttkbootstrap.window',
   'F:\\Pliki\\Studia\\nucleo_to_can\\SOFTWARE\\nucleo_to_can_win_app\\.venv\\Lib\\site-packages\\ttkbootstrap\\window.py',
   'PYMODULE'),
  ('typing', 'D:\\python3\\Lib\\typing.py', 'PYMODULE'),
  ('urllib', 'D:\\python3\\Lib\\urllib\\__init__.py', 'PYMODULE'),
  ('urllib.error', 'D:\\python3\\Lib\\urllib\\error.py', 'PYMODULE'),
  ('urllib.parse', 'D:\\python3\\Lib\\urllib\\parse.py', 'PYMODULE'),
  ('urllib.request', 'D:\\python3\\Lib\\urllib\\request.py', 'PYMODULE'),
  ('urllib.response', 'D:\\python3\\Lib\\urllib\\response.py', 'PYMODULE'),
  ('xml', 'D:\\python3\\Lib\\xml\\__init__.py', 'PYMODULE'),
  ('xml.parsers', 'D:\\python3\\Lib\\xml\\parsers\\__init__.py', 'PYMODULE'),
  ('xml.parsers.expat', 'D:\\python3\\Lib\\xml\\parsers\\expat.py', 'PYMODULE'),
  ('xml.sax', 'D:\\python3\\Lib\\xml\\sax\\__init__.py', 'PYMODULE'),
  ('xml.sax._exceptions',
   'D:\\python3\\Lib\\xml\\sax\\_exceptions.py',
   'PYMODULE'),
  ('xml.sax.expatreader',
   'D:\\python3\\Lib\\xml\\sax\\expatreader.py',
   'PYMODULE'),
  ('xml.sax.handler', 'D:\\python3\\Lib\\xml\\sax\\handler.py', 'PYMODULE'),
  ('xml.sax.saxutils', 'D:\\python3\\Lib\\xml\\sax\\saxutils.py', 'PYMODULE'),
  ('xml.sax.xmlreader', 'D:\\python3\\Lib\\xml\\sax\\xmlreader.py', 'PYMODULE'),
  ('zipfile', 'D:\\python3\\Lib\\zipfile\\__init__.py', 'PYMODULE'),
  ('zipfile._path',
   'D:\\python3\\Lib\\zipfile\\_path\\__init__.py',
   'PYMODULE'),
  ('zipfile._path.glob',
   'D:\\python3\\Lib\\zipfile\\_path\\glob.py',
   'PYMODULE'),
  ('zipimport', 'D:\\python3\\Lib\\zipimport.py', 'PYMODULE')])
