DirectoryEntryExport,frequency
0,15495
1,697
2,542
3,272
4,604
5,363
6,121
7,122
8,86
9,74
10,62
11,36
12,62
13,33
14,46
15,26
16,46
17,22
18,24
19,19
20,14
21,22
22,15
23,16
24,13
25,11
26,14
27,16
28,14
29,17
30,16
31,12
32,10
33,11
34,10
35,4
36,8
37,10
38,6
39,8
40,6
41,4
42,7
43,3
44,7
45,6
46,13
47,5
48,4
49,1
50,4
51,5
52,5
53,3
54,6
55,9
56,9
57,5
58,4
59,4
60,4
61,4
62,3
63,6
65,6
66,9
67,5
68,4
69,2
70,2
71,4
72,5
73,2
74,1
75,3
76,6
77,2
78,1
79,3
80,6
81,3
84,4
87,1
88,2
89,2
90,2
93,4
94,1
95,4
96,1
97,3
98,1
99,1
100,2
101,3
102,2
103,4
104,2
105,4
108,1
110,1
113,1
115,2
116,4
118,1
119,3
120,1
121,2
122,2
123,1
124,1
125,2
126,1
127,2
128,1
129,1
130,1
131,3
132,2
134,1
137,1
138,2
141,3
142,3
144,2
145,4
146,2
149,3
151,3
152,2
153,2
154,1
155,1
157,1
159,3
160,2
161,1
162,1
164,1
165,1
166,3
167,1
168,1
170,1
171,1
172,2
173,1
174,1
175,3
176,2
178,3
179,2
180,3
181,1
182,1
183,2
185,1
186,2
188,4
190,1
191,4
192,1
193,3
196,1
197,1
199,1
200,1
202,1
203,1
205,1
206,3
207,1
208,1
209,1
216,1
217,1
218,1
219,1
220,1
223,1
225,1
229,1
230,2
231,1
234,2
236,1
238,1
240,1
241,1
244,1
245,1
249,1
252,1
253,33
258,1
259,2
262,1
267,1
269,1
270,2
271,1
276,2
278,1
282,1
283,1
289,1
290,1
291,1
295,1
303,1
306,2
309,1
311,1
312,1
313,2
314,1
315,1
318,1
319,1
321,1
323,1
329,2
332,2
334,1
351,1
363,1
366,1
368,1
374,1
379,1
383,1
392,1
394,1
399,2
404,2
408,1
409,1
414,2
437,1
442,1
446,3
450,1
451,1
456,1
460,1
463,1
468,1
478,1
481,1
482,1
486,1
488,1
497,1
503,1
526,1
536,1
538,1
555,1
558,1
562,1
565,1
566,1
567,1
570,1
572,1
582,1
601,1
603,1
605,1
609,1
611,1
612,1
614,1
618,1
621,1
623,2
631,1
633,1
635,1
637,1
658,1
665,1
679,1
681,1
686,1
698,2
700,1
708,1
739,1
757,1
767,1
778,1
802,1
803,1
816,1
826,1
829,1
844,1
849,1
856,1
862,1
863,1
876,1
905,1
908,1
924,1
925,1
954,1
962,1
980,1
988,1
993,1
1035,1
1037,1
1060,1
1091,1
1123,1
1126,1
1131,1
1141,1
1165,1
1221,1
1222,1
1235,1
1244,1
1262,1
1282,1
1319,1
1347,1
1359,1
1410,1
1417,1
1429,1
1450,1
1466,1
1471,1
1512,1
1515,1
1550,1
1551,1
1569,1
1577,1
1621,2
1670,1
1676,1
1688,1
1729,1
1935,1
1947,1
1966,1
2037,1
2068,1
2221,1
2225,1
2298,1
2443,1
2482,1
2536,1
2548,1
2559,1
3138,1
3185,1
3189,1
3340,1
3683,1
3686,1
4129,1
4411,1
4838,1
5517,1
5523,1
6823,1
7319,1
