Name,intro_video,resume_url,LinkedIn,availability,first_name,skills
Swastik Malakar,https://www.loom.com/share/4b9c3fe457d44638b5088574852df9e4?sharedAppSource=personal_library,https://upraised-assets.s3.ap-south-1.amazonaws.com/embark/2021/recruircrm-candidate_resumes/017ac87b-1c0d-0382-6cab-1fc635043e28_resume.pdf,https://www.linkedin.com/in/malakar-swastik/,4 months starting immediately,Swastik,Hiring Well|HR Ops And Tools|HR Sense|
Shradha Bhatti,https://drive.google.com/file/d/1kDyLv6FRlnG4sDm93AVuak0wrZkiCgSx/view?usp=sharing,https://upraised-assets.s3.ap-south-1.amazonaws.com/embark/2021/recruircrm-candidate_resumes/017b9a8a-f538-9497-9388-7091deb4adf4_resume.pdf,https://linkedin.com/in/shradha-bhatti-1a17a51aa,3 months starting June,Shradha,Company Building And Employee Experience|Hiring Well|HR Sense|
Anisha Mohanty,https://drive.google.com/file/d/1y8rlALHsvSAHTih4EL427EYS6tlsMBjH/view?usp=sharing,https://upraised-assets.s3.ap-south-1.amazonaws.com/embark/2021/recruircrm-candidate_resumes/017a7d04-17b1-2565-aed1-397dbd3c8519_resume.pdf,https://www.linkedin.com/in/anisha-mohantyy/,3 months starting May,Anisha,Hiring Well|HR Ops And Tools|HR Sense|
Ishan Verma,https://www.loom.com/share/5481b80de3704913a961da78a5dbce3c,https://upraised-assets.s3.ap-south-1.amazonaws.com/embark/2021/recruircrm-candidate_resumes/017be7aa-2bf9-8a35-e48b-7490493fc49b_resume.pdf,https://www.linkedin.com/in/ishan-vrma/,3 months starting April,Ishan,Company Building And Employee Experience|Hiring Well|HR Ops And Tools|
Jatin Rajpal,https://drive.google.com/file/d/1pL5Y4J_kQhAibAjPasMciU-D_oFLCCEV/view?usp=drivesdk,https://upraised-assets.s3.ap-south-1.amazonaws.com/embark/2021/recruircrm-candidate_resumes/017c0d87-7344-ea39-c685-ee653d97ea4f_resume.pdf,https://www.linkedin.com/in/jatin-rajpal-694165143,6 months starting immediately,Jatin,Company Building And Employee Experience|HR Ops And Tools|HR Sense|
Joji Regi,https://www.loom.com/share/2a230515847a493d8c93a06546bf440a,https://upraised-assets.s3.ap-south-1.amazonaws.com/embark/2021/recruircrm-candidate_resumes/017b472b-a6af-2565-0b44-62210fcd6a0a_resume.pdf,https://www.linkedin.com/in/joji-regi/,3 months starting May,Joji,Company Building And Employee Experience|Hiring Well|HR Ops And Tools|
Nagasai Kanmatha,https://loom.com/share/d60bc78495924d25b18f2d31ee08ac13,https://upraised-assets.s3.ap-south-1.amazonaws.com/embark/2021/recruircrm-candidate_resumes/017bb032-c9df-7340-6ab0-5a89ea985c22_resume.pdf,https://www.linkedin.com/in/nagasai1/,6 months starting Jan,Nagasai,Hiring Well|HR Ops And Tools|HR Sense|
Krishna sharma,https://www.loom.com/share/b6eb50af67944543ba735ad453564474,https://upraised-assets.s3.ap-south-1.amazonaws.com/embark/2021/recruircrm-candidate_resumes/017c188c-98be-2061-0522-9055f1fe22c9_resume.pdf,https://www.linkedin.com/mwlite/in/krishna-sharma-ba52241bb,2 months starting June,Krishna,Company Building And Employee Experience|Hiring Well|HR Ops And Tools|
Mahak Jain,https://www.loom.com/share/2665829f11d94dac8489df663ecf5f1d,https://upraised-assets.s3.ap-south-1.amazonaws.com/embark/2021/recruircrm-candidate_resumes/017c2325-3249-8889-c09d-9f5403e4a6e1_resume.pdf,https://www.linkedin.com/in/mahak-jain-4b7169205,6 months starting immediately,Mahak,Company Building And Employee Experience|Hiring Well|HR Sense|
Nachiket Shembekar,https://drive.google.com/file/d/1I-PwfS8bsvhfCkAIroZ8aEky28eqG1XT/view?usp=sharing,https://upraised-assets.s3.ap-south-1.amazonaws.com/embark/2021/recruircrm-candidate_resumes/017ae161-8e20-a7f9-e3f1-227200e30c1c_resume.pdf,https://www.linkedin.com/in/nachiket-shembekar,3 months starting May,Nachiket,Company Building And Employee Experience|Hiring Well|HR Sense|
Piyush Gupta,https://www.loom.com/share/e6cc2dfb33f243c0b23b9c7fabcfdc8e,https://upraised-assets.s3.ap-south-1.amazonaws.com/embark/2021/recruircrm-candidate_resumes/017bf876-48f5-b45d-de9f-71e13742b596_resume.pdf,https://www.linkedin.com/in/piyush-gupta-b18892191,6 months starting Jan,Piyush,Company Building And Employee Experience|Hiring Well|HR Sense|
Vinayak Sharma,https://www.loom.com/share/1deef033515342b1aaea5e1504b035e9,https://upraised-assets.s3.ap-south-1.amazonaws.com/embark/2021/recruircrm-candidate_resumes/017c1ec5-e0bd-6df7-ddf5-56914048e927_resume.pdf,https://www.linkedin.com/in/vinayak-sharma-a9273b1a0,6 months starting immediately,Vinayak,Company Building And Employee Experience|Hiring Well|HR Sense|
Shrabana Talukdar,https://drive.google.com/file/d/1mJyK4Jb5VgZ-iEYWDN63nbOo-2unti5G/view?usp=sharing,https://upraised-assets.s3.ap-south-1.amazonaws.com/embark/2021/recruircrm-candidate_resumes/017bd5ca-8ad0-c2cb-0782-0d73599cb0d7_resume.pdf,https://www.linkedin.com/in/shrabana-talukdar-9a8ab4184/,3 months starting June,Shrabana,Hiring Well|HR Ops And Tools|HR Sense|
Mohd Ali Jauhar,https://www.loom.com/share/5311274ddee24075b20731305da25df1,https://upraised-assets.s3.ap-south-1.amazonaws.com/embark/2021/recruircrm-candidate_resumes/017c2c88-8055-4c91-eeb0-2b1911347e27_resume.pdf,https://www.linkedin.com/in/majauhar,2 months starting May,Mohd,Company Building And Employee Experience|Hiring Well|HR Ops And Tools|
Sayantan Mahato,https://www.loom.com/share/f27e68538555445a8b29358e41e61b3e,https://upraised-assets.s3.ap-south-1.amazonaws.com/embark/2021/recruircrm-candidate_resumes/017c7ffe-1b70-fb95-d542-741920e529d1_resume.pdf,https://www.linkedin.com/in/sayantan-mahato/,6 months starting Jan,Sayantan,Company Building And Employee Experience|HR Ops And Tools|HR Sense|
Syed Tauseef Ahmed,https://www.loom.com/share/40f2872d7a8b4eaa8609851dc4d332c4,https://upraised-assets.s3.ap-south-1.amazonaws.com/embark/2021/recruircrm-candidate_resumes/017b1fa9-07c7-ab36-ecf0-5a573cccfdfc_resume.pdf,https://www.linkedin.com/in/tauseef27/,6 months starting immediately,Syed,Company Building And Employee Experience|HR Ops And Tools|HR Sense|
Tusshar Chandwani,https://www.loom.com/share/1a30efb28e964814ac849dc362db33ec,https://upraised-assets.s3.ap-south-1.amazonaws.com/embark/2021/recruircrm-candidate_resumes/017b061b-0911-5bea-cddf-7ab3bdde6216_resume.pdf,https://www.linkedin.com/in/tusshar-chandwani-2748a6187/,6 months starting Jan,Tusshar,Company Building And Employee Experience|Hiring Well|HR Ops And Tools|
Yashraj Singh,https://www.loom.com/share/c32f77bc100844fc828ee2e1358673fc,https://upraised-assets.s3.ap-south-1.amazonaws.com/embark/2021/recruircrm-candidate_resumes/017c763f-e4ed-cb44-09eb-943feec073ed_resume.pdf,https://www.linkedin.com/in/yashraj-singh-8664b2145/,2 months starting May,Yashraj,Company Building And Employee Experience|Hiring Well|HR Ops And Tools|