Name,intro_video,resume_url,LinkedIn,availability,first_name,skills
Akshat Goyal,https://youtu.be/xUEAAtrBLPY,https://upraised-assets.s3.ap-south-1.amazonaws.com/embark/2021/recruircrm-candidate_resumes/017bfa47-7933-3f47-0058-6b8fd73b1550_resume.pdf,https://www.linkedin.com/in/akshat-g-5160bbb9/,3 months starting May,Akshat,Data Driven|Decision Making|Business Understanding|
Ayan Bindra,https://www.loom.com/share/28a5f38ce552411b9ca0000dcfa7eaa6,https://upraised-assets.s3.ap-south-1.amazonaws.com/embark/2021/recruircrm-candidate_resumes/017ac764-ab02-c80c-a1ab-6059fd33d22b_resume.pdf,https://www.linkedin.com/in/ayanbindra/,3months starting May,Ayan,Data Driven|Decision Making|Business Understanding|
Ayush Patil,https://www.loom.com/share/0f17e1f0abec4e368e2419ccc5da46fb,https://upraised-assets.s3.ap-south-1.amazonaws.com/embark/2021/recruircrm-candidate_resumes/017b33cd-b8fa-daa5-55e8-dc0471a80869_resume.pdf,https://www.linkedin.com/in/ayush-r-patil/,2months starting May,Ayush,Data Driven|Decision Making|Business Understanding|
Manya Gupta,https://www.loom.com/share/41d5887d7bdf41929949f0b890e7f53e,https://upraised-assets.s3.ap-south-1.amazonaws.com/embark/2021/recruircrm-candidate_resumes/017b8bd1-45e0-21b7-5740-d851a3bad912_resume.pdf,https://www.linkedin.com/in/manya-gupta-234749200,6 months starting immediately,Manya,Data Driven|Business Understanding|Problem Solving|
Anirudh Jakhar,https://www.loom.com/share/4daef6991e854843a923ecdcb52251f3?sharedAppSource=personal_library,https://upraised-assets.s3.ap-south-1.amazonaws.com/embark/2021/recruircrm-candidate_resumes/017bb099-6ead-573d-4551-f135c4f59be0_resume.pdf,https://linkedin.com/in/anirudh-jakhar-957549179,3months starting April,Anirudh,Decision Making|Business Understanding|Planning And Execution|
Karan Soni,https://www.loom.com/share/c963346d70534d30acbb32e17b807aca,https://upraised-assets.s3.ap-south-1.amazonaws.com/embark/2021/recruircrm-candidate_resumes/017aaa4a-09f6-1a5c-04e5-68a704d0ec94_resume.pdf,https://www.linkedin.com/in/karan-soni-592482171,3 months starting May,Karan,Decision Making|Business Understanding|Planning And Execution|
Sunisth Kumar,https://youtu.be/flyEFDg0T1Y,https://upraised-assets.s3.ap-south-1.amazonaws.com/embark/2021/recruircrm-candidate_resumes/017aed99-e167-c61b-0c3f-cdcc1a1bac12_resume.pdf,https://www.linkedin.com/in/sunisthkumar/,6 months starting May,Sunisth,Data Driven|Planning And Execution|Problem Solving|
Manali Thonte,https://www.loom.com/share/22fa3ce1b5554bb5996b3c8c278377e8,https://upraised-assets.s3.ap-south-1.amazonaws.com/embark/2021/recruircrm-candidate_resumes/017c7341-7b9d-6794-4a11-3e01aef9a172_resume.pdf,https://www.linkedin.com/in/manalithonte/,3 months starting May,Manali,Decision Making|Business Understanding|Planning And Execution|
Kashyap Mehta,https://www.loom.com/share/b49dfd21ae6243f7b9f2557a8ff2ce8b,https://upraised-assets.s3.ap-south-1.amazonaws.com/embark/2021/recruircrm-candidate_resumes/017ba4e2-fc9c-0608-dd99-a5ae79430e95_resume.pdf,https://www.linkedin.com/in/kashyap-mehta/,2months starting May,Kashyap,Decision Making|Business Understanding|Planning And Execution|
Subham Pattanaik,https://drive.google.com/file/d/1y4Rme7SlGHyFP8J7CBEu8oQhLETpKI9A/view?usp=sharing,https://upraised-assets.s3.ap-south-1.amazonaws.com/embark/2021/recruircrm-candidate_resumes/017c7e67-e92b-5c5c-ba96-06fcf2073877_resume.pdf,https://www.linkedin.com/in/subhampattanaik,6 months starting immediately,Subham,Data Driven|Decision Making|Problem Solving|
Pragun Singhal,https://drive.google.com/file/d/1MFqQywB8uJuTyG751YfYz6UO15WWJe2d/view?usp=drivesdk,https://upraised-assets.s3.ap-south-1.amazonaws.com/embark/2021/recruircrm-candidate_resumes/017b8b02-3303-49d5-dabc-724623e2d541_resume.pdf,https://www.linkedin.com/in/pragun-singhal-64322618b/,6months starting Jan,Pragun,Data Driven|Decision Making|Business Understanding|
Prachi Singh,https://drive.google.com/file/d/177cyQlRUDpDAF-To_NzFeQSA98DRuZJq/view?usp=drivesdk,https://upraised-assets.s3.ap-south-1.amazonaws.com/embark/2021/recruircrm-candidate_resumes/017aee9d-061c-565b-110e-9a4447ace3f9_resume.pdf,https://www.linkedin.com/in/prachi-singh-39790a1a9,3 months starting June,Prachi,Decision Making|Business Understanding|Problem Solving|
Rishav Giri,https://loom.com/share/2c8461f163f244ec8df85d6f50ca02ac,https://upraised-assets.s3.ap-south-1.amazonaws.com/embark/2021/recruircrm-candidate_resumes/017bac0f-1c04-7e72-0eef-ef6535c1c03a_resume.pdf,https://www.linkedin.com/in/rishavgiri/,3months from April,Rishav,Data Driven|Decision Making|Business Understanding|
Ronak Vishnoi,https://www.loom.com/share/4f7939d81f31439abd1d89def3bf82e3,https://upraised-assets.s3.ap-south-1.amazonaws.com/embark/2021/recruircrm-candidate_resumes/017b25f3-42e0-5189-be66-faa44c075c01_resume.pdf,https://www.linkedin.com/in/ronak-vishnoi/,3months starting May,Ronak,Data Driven|Decision Making|Business Understanding|
Sahej Dhingra,https://drive.google.com/file/d/1QK3o2LLvEJrLWNXAdHYOndF6H12n58tL/view?usp=sharing,https://production-recruitcrm.s3.ap-southeast-1.amazonaws.com/7569/candidate/16373082472460010460HMo/resumefilename?response-content-disposition=inline%3Bfilename%2A%3Dutf-8%27%27Sahej%2520Dhingra_Resume.docx.pdf&X-Amz-Content-Sha256=UNSIGNED-PAYLOAD&X-Amz-Algorithm=AWS4-HMAC-SHA256&X-Amz-Credential=AKIA32W5QQGOQCJATAQI%2F20211123%2Fap-southeast-1%2Fs3%2Faws4_request&X-Amz-Date=20211123T123325Z&X-Amz-SignedHeaders=host&X-Amz-Expires=300&X-Amz-Signature=1d192087de440ad5f6b369e5732c86c76447d2b159f335a5f31d1cec8b919903,https://www.linkedin.com/in/sahej-dhingra-517208191/,3months starting May,Sahej,Data Driven|Decision Making|Business Understanding|
Saksham Gambhir,https://www.loom.com/share/c86f3e13e53d4b939bc2acdcd42f44c8,https://upraised-assets.s3.ap-south-1.amazonaws.com/embark/2021/recruircrm-candidate_resumes/017c7ac9-b15d-aea1-10cc-f590cdf8515a_resume.pdf,https://www.linkedin.com/in/saksham-gambhir-03a293150/,3months starting from May,Saksham,Data Driven|Business Understanding|Problem Solving|
Sanket Mahale,https://www.loom.com/share/bef025993b794c149ba95633a57376f8,https://upraised-assets.s3.ap-south-1.amazonaws.com/embark/2021/recruircrm-candidate_resumes/017c1e02-fa79-325f-0994-a22fa0f790cb_resume.pdf,https://www.linkedin.com/in/sanketmahale/,6 months starting immediately,Sanket,Decision Making|Business Understanding|Planning And Execution|
Saurabh Bharuka,https://vimeo.com/643577634/f3c1a56ff6,https://upraised-assets.s3.ap-south-1.amazonaws.com/embark/2021/recruircrm-candidate_resumes/017acfa5-b079-8595-a7bd-cbdbac9e4dce_resume.pdf,https://www.linkedin.com/in/saurabh-bharuka/,2 months starting April,Saurabh,Decision Making|Business Understanding|Planning And Execution|
Mahika Singh,https://www.loom.com/share/313e217deb754362a7f820acce705019,https://upraised-assets.s3.ap-south-1.amazonaws.com/embark/2021/recruircrm-candidate_resumes/017b8e2e-8f9d-6e23-2117-a0938137a23e_resume.pdf,https://www.linkedin.com/in/mahika-singh-322096206/,3 months starting May,Mahika,Decision Making|Business Understanding|Planning And Execution|