city;latitude;longitude;population;radius
George Town;19.2866;-81.37436;29370;3000
West Bay;19.36667;-81.41667;11269;2500
Bodden Town;19.27647;-81.2542;10341;2500
East End;19.3;-81.11667;1639;1500
North Side;19.35;-81.2;1184;1500
