\relax 
\providecommand\hyper@newdestlabel[2]{}
\providecommand{\transparent@use}[1]{}
\providecommand\HyperFirstAtBeginDocument{\AtBeginDocument}
\HyperFirstAtBeginDocument{\ifx\hyper@anchor\@undefined
\global\let\oldcontentsline\contentsline
\gdef\contentsline#1#2#3#4{\oldcontentsline{#1}{#2}{#3}}
\global\let\oldnewlabel\newlabel
\gdef\newlabel#1#2{\newlabelxx{#1}#2}
\gdef\newlabelxx#1#2#3#4#5#6{\oldnewlabel{#1}{{#2}{#3}}}
\AtEndDocument{\ifx\hyper@anchor\@undefined
\let\contentsline\oldcontentsline
\let\newlabel\oldnewlabel
\fi}
\fi}
\global\let\hyper@last\relax 
\gdef\HyperFirstAtBeginDocument#1{#1}
\providecommand\HyField@AuxAddToFields[1]{}
\providecommand\HyField@AuxAddToCoFields[2]{}
\@writefile{nav}{\headcommand {\slideentry {0}{0}{1}{1/1}{}{0}}}
\@writefile{nav}{\headcommand {\beamer@framepages {1}{1}}}
\@writefile{nav}{\headcommand {\slideentry {0}{0}{2}{2/2}{}{0}}}
\@writefile{nav}{\headcommand {\beamer@framepages {2}{2}}}
\@writefile{toc}{\beamer@sectionintoc {1}{Introduction}{3}{0}{1}}
\@writefile{nav}{\headcommand {\beamer@sectionpages {1}{2}}}
\@writefile{nav}{\headcommand {\beamer@subsectionpages {1}{2}}}
\@writefile{nav}{\headcommand {\sectionentry {1}{Introduction}{3}{Introduction}{0}}}
\@writefile{nav}{\headcommand {\slideentry {1}{0}{1}{3/3}{}{0}}}
\@writefile{nav}{\headcommand {\beamer@framepages {3}{3}}}
\@writefile{nav}{\headcommand {\slideentry {1}{0}{2}{4/4}{}{0}}}
\@writefile{nav}{\headcommand {\beamer@framepages {4}{4}}}
\providecommand*\caption@xref[2]{\@setref\relax\@undefined{#1}}
\newlabel{fig: info energy}{{1}{5}{Nitrosamine Molecule\relax }{Doc-Start}{}}
\@writefile{snm}{\beamer@slide {fig: info energy}{5}}
\@writefile{nav}{\headcommand {\slideentry {1}{0}{3}{5/5}{}{0}}}
\@writefile{nav}{\headcommand {\beamer@framepages {5}{5}}}
\@writefile{nav}{\headcommand {\slideentry {1}{0}{4}{6/6}{}{0}}}
\@writefile{nav}{\headcommand {\beamer@framepages {6}{6}}}
\newlabel{fig: info energy}{{2}{7}{U.S. energy consumption by energy sources 2017\relax }{Doc-Start}{}}
\@writefile{snm}{\beamer@slide {fig: info energy}{7}}
\@writefile{nav}{\headcommand {\slideentry {1}{0}{5}{7/7}{}{0}}}
\@writefile{nav}{\headcommand {\beamer@framepages {7}{7}}}
\@writefile{nav}{\headcommand {\slideentry {1}{0}{6}{8/8}{}{0}}}
\@writefile{nav}{\headcommand {\beamer@framepages {8}{8}}}
\@writefile{nav}{\headcommand {\slideentry {1}{0}{7}{9/9}{}{0}}}
\@writefile{nav}{\headcommand {\beamer@framepages {9}{9}}}
\@writefile{nav}{\headcommand {\slideentry {1}{0}{8}{10/10}{}{0}}}
\@writefile{nav}{\headcommand {\beamer@framepages {10}{10}}}
\@writefile{nav}{\headcommand {\slideentry {1}{0}{9}{11/11}{}{0}}}
\@writefile{nav}{\headcommand {\beamer@framepages {11}{11}}}
\newlabel{fig: info energy}{{3}{12}{U.S. energy consumption by energy sources 2017\relax }{Doc-Start}{}}
\@writefile{snm}{\beamer@slide {fig: info energy}{12}}
\@writefile{nav}{\headcommand {\slideentry {1}{0}{10}{12/12}{}{0}}}
\@writefile{nav}{\headcommand {\beamer@framepages {12}{12}}}
\@writefile{nav}{\headcommand {\slideentry {1}{0}{11}{13/13}{}{0}}}
\@writefile{nav}{\headcommand {\beamer@framepages {13}{13}}}
\@writefile{toc}{\beamer@sectionintoc {2}{Discrete Fracture Network Background}{14}{0}{2}}
\@writefile{nav}{\headcommand {\beamer@sectionpages {3}{13}}}
\@writefile{nav}{\headcommand {\beamer@subsectionpages {3}{13}}}
\@writefile{nav}{\headcommand {\sectionentry {2}{Discrete Fracture Network Background}{14}{Discrete Fracture Network Background}{0}}}
\@writefile{nav}{\headcommand {\slideentry {2}{0}{1}{14/14}{}{0}}}
\@writefile{nav}{\headcommand {\beamer@framepages {14}{14}}}
\@writefile{nav}{\headcommand {\slideentry {2}{0}{2}{15/15}{}{0}}}
\@writefile{nav}{\headcommand {\beamer@framepages {15}{15}}}
\@writefile{nav}{\headcommand {\slideentry {2}{0}{3}{16/16}{}{0}}}
\@writefile{nav}{\headcommand {\beamer@framepages {16}{16}}}
\@writefile{nav}{\headcommand {\slideentry {2}{0}{4}{17/17}{}{0}}}
\@writefile{nav}{\headcommand {\beamer@framepages {17}{17}}}
\@writefile{nav}{\headcommand {\slideentry {2}{0}{5}{18/18}{}{0}}}
\@writefile{nav}{\headcommand {\beamer@framepages {18}{18}}}
\@writefile{toc}{\beamer@sectionintoc {3}{Discrete Fracture Network Models}{19}{0}{3}}
\@writefile{nav}{\headcommand {\beamer@sectionpages {14}{18}}}
\@writefile{nav}{\headcommand {\beamer@subsectionpages {14}{18}}}
\@writefile{nav}{\headcommand {\sectionentry {3}{Discrete Fracture Network Models}{19}{Discrete Fracture Network Models}{0}}}
\newlabel{fig: DFN}{{4}{19}{Simulated DFN used for high-fidelity computations\relax }{Doc-Start}{}}
\@writefile{snm}{\beamer@slide {fig: DFN}{19}}
\@writefile{nav}{\headcommand {\slideentry {3}{0}{1}{19/19}{}{0}}}
\@writefile{nav}{\headcommand {\beamer@framepages {19}{19}}}
\newlabel{fig: DFN}{{5}{20}{Simulated DFN used for high-fidelity computations\relax }{Doc-Start}{}}
\@writefile{snm}{\beamer@slide {fig: DFN}{20}}
\@writefile{nav}{\headcommand {\slideentry {3}{0}{2}{20/20}{}{0}}}
\@writefile{nav}{\headcommand {\beamer@framepages {20}{20}}}
\newlabel{fig: DFN}{{6}{21}{Simulated DFN used for high-fidelity computations\relax }{Doc-Start}{}}
\@writefile{snm}{\beamer@slide {fig: DFN}{21}}
\@writefile{nav}{\headcommand {\slideentry {3}{0}{3}{21/21}{}{0}}}
\@writefile{nav}{\headcommand {\beamer@framepages {21}{21}}}
\newlabel{fig:DFN and graph equivalent}{{7}{22}{\tiny A simple DFN composed of 6 fractures, 2 outlet boundaries, and 1 inlet boundary and its graph equivalent. Graphs are the central vehicle for the computation reduction and manipulation of large-scale fracture networks.\relax }{Doc-Start}{}}
\@writefile{snm}{\beamer@slide {fig:DFN and graph equivalent}{22}}
\@writefile{nav}{\headcommand {\slideentry {3}{0}{4}{22/22}{}{0}}}
\@writefile{nav}{\headcommand {\beamer@framepages {22}{22}}}
\@writefile{toc}{\beamer@sectionintoc {4}{The Forward and Inverse Problems}{23}{0}{4}}
\@writefile{nav}{\headcommand {\beamer@sectionpages {19}{22}}}
\@writefile{nav}{\headcommand {\beamer@subsectionpages {19}{22}}}
\@writefile{nav}{\headcommand {\sectionentry {4}{The Forward and Inverse Problems}{23}{The Forward and Inverse Problems}{0}}}
\@writefile{snm}{\beamer@slide {eq: steady state forward problem}{23}}
\newlabel{eq: steady state forward problem}{{1}{23}{The Forward and Inverse Problems}{Doc-Start}{}}
\@writefile{snm}{\beamer@slide {eq: conservation of mass graph}{23}}
\newlabel{eq: conservation of mass graph}{{2}{23}{The Forward and Inverse Problems}{Doc-Start}{}}
\@writefile{nav}{\headcommand {\slideentry {4}{0}{1}{23/23}{}{0}}}
\@writefile{nav}{\headcommand {\beamer@framepages {23}{23}}}
\@writefile{snm}{\beamer@slide {eq: conservation of mass graph 2}{24}}
\newlabel{eq: conservation of mass graph 2}{{6}{24}{The Forward and Inverse Problems}{Doc-Start}{}}
\@writefile{nav}{\headcommand {\slideentry {4}{0}{2}{24/24}{}{0}}}
\@writefile{nav}{\headcommand {\beamer@framepages {24}{24}}}
\@writefile{nav}{\headcommand {\slideentry {4}{0}{3}{25/25}{}{0}}}
\@writefile{nav}{\headcommand {\beamer@framepages {25}{25}}}
\@writefile{nav}{\headcommand {\slideentry {4}{0}{4}{26/26}{}{0}}}
\@writefile{nav}{\headcommand {\beamer@framepages {26}{26}}}
\@writefile{nav}{\headcommand {\slideentry {4}{0}{5}{27/27}{}{0}}}
\@writefile{nav}{\headcommand {\beamer@framepages {27}{27}}}
\@writefile{toc}{\beamer@sectionintoc {5}{Responses and Outcomes}{28}{0}{5}}
\@writefile{nav}{\headcommand {\beamer@sectionpages {23}{27}}}
\@writefile{nav}{\headcommand {\beamer@subsectionpages {23}{27}}}
\@writefile{nav}{\headcommand {\sectionentry {5}{Responses and Outcomes}{28}{Responses and Outcomes}{0}}}
\@writefile{nav}{\headcommand {\slideentry {5}{0}{1}{28/28}{}{0}}}
\@writefile{nav}{\headcommand {\beamer@framepages {28}{28}}}
\@writefile{toc}{\beamer@sectionintoc {6}{Numerical Examples}{29}{0}{6}}
\@writefile{nav}{\headcommand {\beamer@sectionpages {28}{28}}}
\@writefile{nav}{\headcommand {\beamer@subsectionpages {28}{28}}}
\@writefile{nav}{\headcommand {\sectionentry {6}{Numerical Examples}{29}{Numerical Examples}{0}}}
\@writefile{nav}{\headcommand {\slideentry {6}{0}{1}{29/29}{}{0}}}
\@writefile{nav}{\headcommand {\beamer@framepages {29}{29}}}
\@writefile{nav}{\headcommand {\slideentry {6}{0}{2}{30/30}{}{0}}}
\@writefile{nav}{\headcommand {\beamer@framepages {30}{30}}}
\@writefile{nav}{\headcommand {\slideentry {6}{0}{3}{31/31}{}{0}}}
\@writefile{nav}{\headcommand {\beamer@framepages {31}{31}}}
\@writefile{nav}{\headcommand {\slideentry {6}{0}{4}{32/32}{}{0}}}
\@writefile{nav}{\headcommand {\beamer@framepages {32}{32}}}
\@writefile{nav}{\headcommand {\slideentry {6}{0}{5}{33/33}{}{0}}}
\@writefile{nav}{\headcommand {\beamer@framepages {33}{33}}}
\@writefile{nav}{\headcommand {\slideentry {6}{0}{6}{34/34}{}{0}}}
\@writefile{nav}{\headcommand {\beamer@framepages {34}{34}}}
\@writefile{toc}{\beamer@sectionintoc {7}{Conclusions}{35}{0}{7}}
\@writefile{nav}{\headcommand {\beamer@sectionpages {29}{34}}}
\@writefile{nav}{\headcommand {\beamer@subsectionpages {29}{34}}}
\@writefile{nav}{\headcommand {\sectionentry {7}{Conclusions}{35}{Conclusions}{0}}}
\@writefile{nav}{\headcommand {\slideentry {7}{0}{1}{35/35}{}{0}}}
\@writefile{nav}{\headcommand {\beamer@framepages {35}{35}}}
\@writefile{toc}{\beamer@sectionintoc {8}{Future Work}{36}{0}{8}}
\@writefile{nav}{\headcommand {\beamer@sectionpages {35}{35}}}
\@writefile{nav}{\headcommand {\beamer@subsectionpages {35}{35}}}
\@writefile{nav}{\headcommand {\sectionentry {8}{Future Work}{36}{Future Work}{0}}}
\@writefile{nav}{\headcommand {\slideentry {8}{0}{1}{36/36}{}{0}}}
\@writefile{nav}{\headcommand {\beamer@framepages {36}{36}}}
\@writefile{toc}{\beamer@sectionintoc {9}{Thanks!}{37}{0}{9}}
\@writefile{nav}{\headcommand {\beamer@sectionpages {36}{36}}}
\@writefile{nav}{\headcommand {\beamer@subsectionpages {36}{36}}}
\@writefile{nav}{\headcommand {\sectionentry {9}{Thanks!}{37}{Thanks!}{0}}}
\@writefile{nav}{\headcommand {\slideentry {9}{0}{1}{37/37}{}{0}}}
\@writefile{nav}{\headcommand {\beamer@framepages {37}{37}}}
\@writefile{nav}{\headcommand {\beamer@partpages {1}{37}}}
\@writefile{nav}{\headcommand {\beamer@subsectionpages {37}{37}}}
\@writefile{nav}{\headcommand {\beamer@sectionpages {37}{37}}}
\@writefile{nav}{\headcommand {\beamer@documentpages {37}}}
\@writefile{nav}{\headcommand {\gdef \inserttotalframenumber {37}}}
\xwm@secstopagerange{{10000}{1}}
\newlabel{xwmlastpage}{{9}{37}{Thanks!\relax }{Doc-Start}{}}
