\beamer@sectionintoc {1}{Fracture networks: Background and Relevant Problems}{2}{0}{1}
\beamer@sectionintoc {2}{Fracture networks: High Fidelity Models }{5}{0}{2}
\beamer@sectionintoc {3}{The Forward and Inverse Problems}{9}{0}{3}
\beamer@sectionintoc {4}{Numerical Examples}{14}{0}{4}
