\relax 
\providecommand\hyper@newdestlabel[2]{}
\providecommand{\transparent@use}[1]{}
\providecommand\HyperFirstAtBeginDocument{\AtBeginDocument}
\HyperFirstAtBeginDocument{\ifx\hyper@anchor\@undefined
\global\let\oldcontentsline\contentsline
\gdef\contentsline#1#2#3#4{\oldcontentsline{#1}{#2}{#3}}
\global\let\oldnewlabel\newlabel
\gdef\newlabel#1#2{\newlabelxx{#1}#2}
\gdef\newlabelxx#1#2#3#4#5#6{\oldnewlabel{#1}{{#2}{#3}}}
\AtEndDocument{\ifx\hyper@anchor\@undefined
\let\contentsline\oldcontentsline
\let\newlabel\oldnewlabel
\fi}
\fi}
\global\let\hyper@last\relax 
\gdef\HyperFirstAtBeginDocument#1{#1}
\providecommand\HyField@AuxAddToFields[1]{}
\providecommand\HyField@AuxAddToCoFields[2]{}
\providecommand\pbs@newkey[2]{}
\providecommand\pbs@seq@push@cx[2]{}
\providecommand\pbs@at@end@dvi@check{}
\pbs@at@end@dvi@check
\providecommand\mix@newkey[2]{}
\pbs@newkey{pbs@last@page}{1}
\@writefile{nav}{\headcommand {\slideentry {0}{0}{1}{1/1}{}{0}}}
\@writefile{nav}{\headcommand {\beamer@framepages {1}{1}}}
\pbs@newkey{pbs@last@page}{2}
\@writefile{toc}{\beamer@sectionintoc {1}{Dissertation Defense Overview}{2}{0}{1}}
\@writefile{nav}{\headcommand {\beamer@sectionpages {1}{1}}}
\@writefile{nav}{\headcommand {\beamer@subsectionpages {1}{1}}}
\@writefile{nav}{\headcommand {\sectionentry {1}{Dissertation Defense Overview}{2}{Dissertation Defense Overview}{0}}}
\@writefile{nav}{\headcommand {\slideentry {1}{0}{1}{2/2}{}{0}}}
\@writefile{nav}{\headcommand {\beamer@framepages {2}{2}}}
\citation{stormer_granite_2015}
\citation{stormer_granite_2015}
\citation{national_research_council_rock_1996}
\citation{phillips_geological_2009}
\citation{national_research_council_rock_1996}
\citation{phillips_geological_2009}
\pbs@newkey{pbs@last@page}{3}
\@writefile{toc}{\beamer@sectionintoc {2}{Rock Fractures as Geophysical Phenomenon}{3}{0}{2}}
\@writefile{nav}{\headcommand {\beamer@sectionpages {2}{2}}}
\@writefile{nav}{\headcommand {\beamer@subsectionpages {2}{2}}}
\@writefile{nav}{\headcommand {\sectionentry {2}{Rock Fractures as Geophysical Phenomenon}{3}{Rock Fractures as Geophysical Phenomenon}{0}}}
\@writefile{nav}{\headcommand {\slideentry {2}{0}{1}{3/3}{}{0}}}
\@writefile{nav}{\headcommand {\beamer@framepages {3}{3}}}
\citation{noauthor_hydraulic_2018}
\citation{noauthor_hydraulic_2018}
\citation{noauthor_heated_2011}
\citation{noauthor_heated_2011}
\citation{john_evaluation_2010}
\citation{john_evaluation_2010}
\citation{bardach_oceans_1993}
\citation{diao_short-term_2015}
\citation{diao_short}
\pbs@newkey{pbs@last@page}{4}
\providecommand*\caption@xref[2]{\@setref\relax\@undefined{#1}}
\newlabel{figure_noauthor_hydraulic_2018}{{2a}{4}{Hydrofracturing diagram (not to scale) of oil drilling operation creating fracture zone. \textit {Learning Geology} \cite {noauthor_hydraulic_2018}.\relax }{Doc-Start}{}}
\@writefile{snm}{\beamer@slide {figure_noauthor_hydraulic_2018}{4}}
\newlabel{figure_spendRodTransport0}{{2b}{4}{\footnotesize Railroad cars with 123 tons of nuclear waste caught in infrared images in Valognes, France. Image credit: \textit {National Geographic} \cite {noauthor_heated_2011}.\relax }{Doc-Start}{}}
\@writefile{snm}{\beamer@slide {figure_spendRodTransport0}{4}}
\newlabel{figure_c02_sequestration_john_evaluation_2010}{{2c}{4}{\footnotesize $C0_2$ sequestration with potential leak into groundwater aquifer. \textit {Apps} \cite {john_evaluation_2010}. \relax }{Doc-Start}{}}
\@writefile{snm}{\beamer@slide {figure_c02_sequestration_john_evaluation_2010}{4}}
\@writefile{nav}{\headcommand {\slideentry {2}{0}{2}{4/4}{}{0}}}
\@writefile{nav}{\headcommand {\beamer@framepages {4}{4}}}
\pbs@newkey{pbs@last@page}{5}
\@writefile{toc}{\beamer@sectionintoc {3}{Discrete Fracture Network Modeling}{5}{0}{3}}
\@writefile{nav}{\headcommand {\beamer@sectionpages {3}{4}}}
\@writefile{nav}{\headcommand {\beamer@subsectionpages {3}{4}}}
\@writefile{nav}{\headcommand {\sectionentry {3}{Discrete Fracture Network Modeling}{5}{Discrete Fracture Network Modeling}{0}}}
\@writefile{nav}{\headcommand {\slideentry {3}{0}{1}{5/5}{}{0}}}
\@writefile{nav}{\headcommand {\beamer@framepages {5}{5}}}
\citation{long_model_1985}
\citation{long_model_1985}
\citation{maryska_numerical_2005}
\citation{maryska_numerical_2005}
\citation{maryska_numerical_2005}
\citation{maryska_numerical_2005}
\pbs@newkey{pbs@last@page}{6}
\newlabel{fig_circular-disk-fractures_long_model_1985}{{3}{6}{Discrete fractures as orthgonal, disk-shaped wedges in surrounding impermeable matrix. Flow calculations were done using Darcy's law. \textit {Long} \cite {long_model_1985}.\relax }{Doc-Start}{}}
\@writefile{snm}{\beamer@slide {fig_circular-disk-fractures_long_model_1985}{6}}
\@writefile{nav}{\headcommand {\slideentry {3}{0}{2}{6/6}{}{0}}}
\@writefile{nav}{\headcommand {\beamer@framepages {6}{6}}}
\citation{hyman_dfnworks_2015}
\citation{hyman_dfnworks_2015}
\citation{omalley_efficient_2018}
\citation{hyman_dfnworks_2015}
\citation{hyman_dfnworks_2015}
\citation{omalley_efficient_2018}
\pbs@newkey{pbs@last@page}{7}
\@writefile{nav}{\headcommand {\slideentry {3}{0}{3}{7/7}{}{0}}}
\@writefile{nav}{\headcommand {\beamer@framepages {7}{7}}}
\citation{hyman_dfnworks_2015}
\citation{hyman_dfnworks_2015}
\pbs@newkey{pbs@last@page}{8}
\@writefile{nav}{\headcommand {\slideentry {3}{0}{4}{8/8}{}{0}}}
\@writefile{nav}{\headcommand {\beamer@framepages {8}{8}}}
\citation{viswanathan_advancing_2018}
\citation{karra_modeling_2018}
\citation{hyman_dfnworks_2015}
\citation{hyman_dfnworks_2015}
\pbs@newkey{pbs@last@page}{9}
\@writefile{nav}{\headcommand {\slideentry {3}{0}{5}{9/9}{}{0}}}
\@writefile{nav}{\headcommand {\beamer@framepages {9}{9}}}
\pbs@newkey{pbs@last@page}{10}
\@writefile{toc}{\beamer@sectionintoc {4}{Objectives Of Optimizing Graphs}{10}{0}{4}}
\@writefile{nav}{\headcommand {\beamer@sectionpages {5}{9}}}
\@writefile{nav}{\headcommand {\beamer@subsectionpages {5}{9}}}
\@writefile{nav}{\headcommand {\sectionentry {4}{Objectives Of Optimizing Graphs}{10}{Objectives Of Optimizing Graphs}{0}}}
\@writefile{nav}{\headcommand {\slideentry {4}{0}{1}{10/10}{}{0}}}
\@writefile{nav}{\headcommand {\beamer@framepages {10}{10}}}
\pbs@newkey{pbs@last@page}{11}
\@writefile{toc}{\beamer@sectionintoc {5}{Discrete Fracture Networks as Graphs}{11}{0}{5}}
\@writefile{nav}{\headcommand {\beamer@sectionpages {10}{10}}}
\@writefile{nav}{\headcommand {\beamer@subsectionpages {10}{10}}}
\@writefile{nav}{\headcommand {\sectionentry {5}{Discrete Fracture Networks as Graphs}{11}{Discrete Fracture Networks as Graphs}{0}}}
\@writefile{nav}{\headcommand {\slideentry {5}{0}{1}{11/11}{}{0}}}
\@writefile{nav}{\headcommand {\beamer@framepages {11}{11}}}
\pbs@newkey{pbs@last@page}{12}
\newlabel{fig:DFN and graph equivalent}{{9}{12}{A simple DFN composed of 6 fractures, 2 outlet boundaries, and 1 inlet boundary and its graph equivalent. Graphs are the central vehicle for the computation reduction and manipulation of large-scale fracture networks.\relax }{Doc-Start}{}}
\@writefile{snm}{\beamer@slide {fig:DFN and graph equivalent}{12}}
\@writefile{nav}{\headcommand {\slideentry {5}{0}{2}{12/12}{}{0}}}
\@writefile{nav}{\headcommand {\beamer@framepages {12}{12}}}
\pbs@newkey{pbs@last@page}{13}
\@writefile{snm}{\beamer@slide {eq: conservation of mass graph}{13}}
\@writefile{nav}{\headcommand {\slideentry {5}{0}{3}{13/13}{}{0}}}
\@writefile{nav}{\headcommand {\beamer@framepages {13}{13}}}
\pbs@newkey{pbs@last@page}{14}
\@writefile{toc}{\beamer@sectionintoc {6}{Fordward and Inverse Models on the Graph}{14}{0}{6}}
\@writefile{nav}{\headcommand {\beamer@sectionpages {11}{13}}}
\@writefile{nav}{\headcommand {\beamer@subsectionpages {11}{13}}}
\@writefile{nav}{\headcommand {\sectionentry {6}{Fordward and Inverse Models on the Graph}{14}{Fordward and Inverse Models on the Graph}{0}}}
\@writefile{nav}{\headcommand {\slideentry {6}{0}{1}{14/14}{}{0}}}
\@writefile{nav}{\headcommand {\beamer@framepages {14}{14}}}
\pbs@newkey{pbs@last@page}{15}
\@writefile{nav}{\headcommand {\slideentry {6}{0}{2}{15/15}{}{0}}}
\@writefile{nav}{\headcommand {\beamer@framepages {15}{15}}}
\pbs@newkey{pbs@last@page}{16}
\@writefile{nav}{\headcommand {\slideentry {6}{0}{3}{16/16}{}{0}}}
\@writefile{nav}{\headcommand {\beamer@framepages {16}{16}}}
\pbs@newkey{pbs@last@page}{17}
\@writefile{nav}{\headcommand {\slideentry {6}{0}{4}{17/17}{}{0}}}
\@writefile{nav}{\headcommand {\beamer@framepages {17}{17}}}
\pbs@newkey{pbs@last@page}{18}
\@writefile{nav}{\headcommand {\slideentry {6}{0}{5}{18/18}{}{0}}}
\@writefile{nav}{\headcommand {\beamer@framepages {18}{18}}}
\pbs@newkey{pbs@last@page}{19}
\@writefile{nav}{\headcommand {\slideentry {6}{0}{6}{19/19}{}{0}}}
\@writefile{nav}{\headcommand {\beamer@framepages {19}{19}}}
\pbs@newkey{pbs@last@page}{20}
\@writefile{nav}{\headcommand {\slideentry {6}{0}{7}{20/20}{}{0}}}
\@writefile{nav}{\headcommand {\beamer@framepages {20}{20}}}
\pbs@newkey{pbs@last@page}{21}
\@writefile{nav}{\headcommand {\slideentry {6}{0}{8}{21/21}{}{0}}}
\@writefile{nav}{\headcommand {\beamer@framepages {21}{21}}}
\pbs@newkey{pbs@last@page}{22}
\@writefile{nav}{\headcommand {\slideentry {6}{0}{9}{22/22}{}{0}}}
\@writefile{nav}{\headcommand {\beamer@framepages {22}{22}}}
\pbs@newkey{pbs@last@page}{23}
\@writefile{toc}{\beamer@sectionintoc {7}{Results of Calibrating Pressures}{23}{0}{7}}
\@writefile{nav}{\headcommand {\beamer@sectionpages {14}{22}}}
\@writefile{nav}{\headcommand {\beamer@subsectionpages {14}{22}}}
\@writefile{nav}{\headcommand {\sectionentry {7}{Results of Calibrating Pressures}{23}{Results of Calibrating Pressures}{0}}}
\@writefile{nav}{\headcommand {\slideentry {7}{0}{1}{23/23}{}{0}}}
\@writefile{nav}{\headcommand {\beamer@framepages {23}{23}}}
\pbs@newkey{pbs@last@page}{24}
\newlabel{}{{12}{24}{Histograms of observed pressures and physics-based pressures (Darcy and Brinkman). Nearly 80 pressures near lower boundary of 1MPa and nearly 100 near upper boundary 2MPa. Physics-based model pressures are deficient at capturing pressures at the upper boundary. High pressures are difficult to target correctly, leading to overcompensations in other nodes. \relax }{Doc-Start}{}}
\@writefile{snm}{\beamer@slide {}{24}}
\@writefile{nav}{\headcommand {\slideentry {7}{0}{2}{24/24}{}{0}}}
\@writefile{nav}{\headcommand {\beamer@framepages {24}{24}}}
\pbs@newkey{pbs@last@page}{25}
\@writefile{nav}{\headcommand {\slideentry {7}{0}{3}{25/25}{}{0}}}
\@writefile{nav}{\headcommand {\beamer@framepages {25}{25}}}
\pbs@newkey{pbs@last@page}{26}
\newlabel{fig_histogram_apertures_dfn_data}{{16}{26}{Histograms of pressures with $\lambda = 1e-8$. \relax }{Doc-Start}{}}
\@writefile{snm}{\beamer@slide {fig_histogram_apertures_dfn_data}{26}}
\@writefile{nav}{\headcommand {\slideentry {7}{0}{4}{26/26}{}{0}}}
\@writefile{nav}{\headcommand {\beamer@framepages {26}{26}}}
\pbs@newkey{pbs@last@page}{27}
\@writefile{nav}{\headcommand {\slideentry {7}{0}{5}{27/27}{}{0}}}
\@writefile{nav}{\headcommand {\beamer@framepages {27}{27}}}
\pbs@newkey{pbs@last@page}{28}
\@writefile{nav}{\headcommand {\slideentry {7}{0}{6}{28/28}{}{0}}}
\@writefile{nav}{\headcommand {\beamer@framepages {28}{28}}}
\pbs@newkey{pbs@last@page}{29}
\@writefile{toc}{\beamer@sectionintoc {8}{Results of Calibrating Weights}{29}{0}{8}}
\@writefile{nav}{\headcommand {\beamer@sectionpages {23}{28}}}
\@writefile{nav}{\headcommand {\beamer@subsectionpages {23}{28}}}
\@writefile{nav}{\headcommand {\sectionentry {8}{Results of Calibrating Weights}{29}{Results of Calibrating Weights}{0}}}
\@writefile{nav}{\headcommand {\slideentry {8}{0}{1}{29/29}{}{0}}}
\@writefile{nav}{\headcommand {\beamer@framepages {29}{29}}}
\pbs@newkey{pbs@last@page}{30}
\@writefile{nav}{\headcommand {\slideentry {8}{0}{2}{30/30}{}{0}}}
\@writefile{nav}{\headcommand {\beamer@framepages {30}{30}}}
\pbs@newkey{pbs@last@page}{31}
\@writefile{nav}{\headcommand {\slideentry {8}{0}{3}{31/31}{}{0}}}
\@writefile{nav}{\headcommand {\beamer@framepages {31}{31}}}
\pbs@newkey{pbs@last@page}{32}
\@writefile{nav}{\headcommand {\slideentry {8}{0}{4}{32/32}{}{0}}}
\@writefile{nav}{\headcommand {\beamer@framepages {32}{32}}}
\pbs@newkey{pbs@last@page}{33}
\@writefile{nav}{\headcommand {\slideentry {8}{0}{5}{33/33}{}{0}}}
\@writefile{nav}{\headcommand {\beamer@framepages {33}{33}}}
\pbs@newkey{pbs@last@page}{34}
\@writefile{nav}{\headcommand {\slideentry {8}{0}{6}{34/34}{}{0}}}
\@writefile{nav}{\headcommand {\beamer@framepages {34}{34}}}
\pbs@newkey{pbs@last@page}{35}
\@writefile{nav}{\headcommand {\slideentry {8}{0}{7}{35/35}{}{0}}}
\@writefile{nav}{\headcommand {\beamer@framepages {35}{35}}}
\pbs@newkey{pbs@last@page}{36}
\@writefile{toc}{\beamer@sectionintoc {9}{Breakthrough Curves}{36}{0}{9}}
\@writefile{nav}{\headcommand {\beamer@sectionpages {29}{35}}}
\@writefile{nav}{\headcommand {\beamer@subsectionpages {29}{35}}}
\@writefile{nav}{\headcommand {\sectionentry {9}{Breakthrough Curves}{36}{Breakthrough Curves}{0}}}
\@writefile{nav}{\headcommand {\slideentry {9}{0}{1}{36/36}{}{0}}}
\@writefile{nav}{\headcommand {\beamer@framepages {36}{36}}}
\pbs@newkey{pbs@last@page}{37}
\@writefile{nav}{\headcommand {\slideentry {9}{0}{2}{37/37}{}{0}}}
\@writefile{nav}{\headcommand {\beamer@framepages {37}{37}}}
\pbs@newkey{pbs@last@page}{38}
\@writefile{nav}{\headcommand {\slideentry {9}{0}{3}{38/38}{}{0}}}
\@writefile{nav}{\headcommand {\beamer@framepages {38}{38}}}
\pbs@newkey{pbs@last@page}{39}
\@writefile{nav}{\headcommand {\slideentry {9}{0}{4}{39/39}{}{0}}}
\@writefile{nav}{\headcommand {\beamer@framepages {39}{39}}}
\pbs@newkey{pbs@last@page}{40}
\@writefile{nav}{\headcommand {\slideentry {9}{0}{5}{40/40}{}{0}}}
\@writefile{nav}{\headcommand {\beamer@framepages {40}{40}}}
\pbs@newkey{pbs@last@page}{41}
\@writefile{nav}{\headcommand {\slideentry {9}{0}{6}{41/41}{}{0}}}
\@writefile{nav}{\headcommand {\beamer@framepages {41}{41}}}
\pbs@newkey{pbs@last@page}{42}
\@writefile{toc}{\beamer@sectionintoc {10}{First Passage Times}{42}{0}{10}}
\@writefile{nav}{\headcommand {\beamer@sectionpages {36}{41}}}
\@writefile{nav}{\headcommand {\beamer@subsectionpages {36}{41}}}
\@writefile{nav}{\headcommand {\sectionentry {10}{First Passage Times}{42}{First Passage Times}{0}}}
\@writefile{nav}{\headcommand {\slideentry {10}{0}{1}{42/42}{}{0}}}
\@writefile{nav}{\headcommand {\beamer@framepages {42}{42}}}
\pbs@newkey{pbs@last@page}{43}
\@writefile{nav}{\headcommand {\slideentry {10}{0}{2}{43/43}{}{0}}}
\@writefile{nav}{\headcommand {\beamer@framepages {43}{43}}}
\pbs@newkey{pbs@last@page}{44}
\@writefile{toc}{\beamer@sectionintoc {11}{Summary of Advancements and Conclusion}{44}{0}{11}}
\@writefile{nav}{\headcommand {\beamer@sectionpages {42}{43}}}
\@writefile{nav}{\headcommand {\beamer@subsectionpages {42}{43}}}
\@writefile{nav}{\headcommand {\sectionentry {11}{Summary of Advancements and Conclusion}{44}{Summary of Advancements and Conclusion}{0}}}
\@writefile{nav}{\headcommand {\slideentry {11}{0}{1}{44/44}{}{0}}}
\@writefile{nav}{\headcommand {\beamer@framepages {44}{44}}}
\pbs@newkey{pbs@last@page}{45}
\@writefile{nav}{\headcommand {\slideentry {11}{0}{2}{45/45}{}{0}}}
\@writefile{nav}{\headcommand {\beamer@framepages {45}{45}}}
\bibstyle{plainnat}
\bibdata{bibliography}
\bibcite{noauthor_heated_2011}{\hyperlink {beamerbibnoauthor_heated_2011}{noa(2011)}}
\bibcite{noauthor_hydraulic_2018}{\hyperlink {beamerbibnoauthor_hydraulic_2018}{noa(2018)}}
\bibcite{bardach_oceans_1993}{\hyperlink {beamerbibbardach_oceans_1993}{Bardach and Lewis(1993)}}
\bibcite{national_research_council_rock_1996}{\hyperlink {beamerbibnational_research_council_rock_1996}{Council(1996)}}
\bibcite{diao_short-term_2015}{\hyperlink {beamerbibdiao_short-term_2015}{Diao et\nobreakspace  {}al.(2015)Diao, Zhang, Wang, Li, and Cao}}
\bibcite{hyman_dfnworks_2015}{\hyperlink {beamerbibhyman_dfnworks_2015}{Hyman et\nobreakspace  {}al.(2015)Hyman, Karra, Makedonska, Gable, Painter, and Viswanathan}}
\bibcite{john_evaluation_2010}{\hyperlink {beamerbibjohn_evaluation_2010}{John et\nobreakspace  {}al.(2010)John, Zheng, Xu, and Birkholzer}}
\bibcite{karra_modeling_2018}{\hyperlink {beamerbibkarra_modeling_2018}{Karra et\nobreakspace  {}al.(2018)Karra, O'Malley, Hyman, Viswanathan, and Srinivasan}}
\bibcite{long_model_1985}{\hyperlink {beamerbiblong_model_1985}{Long et\nobreakspace  {}al.(1985)Long, Gilmour, and Witherspoon}}
\bibcite{maryska_numerical_2005}{\hyperlink {beamerbibmaryska_numerical_2005}{Maryska et\nobreakspace  {}al.(2005)Maryska, Severyn, and Vohralik}}
\bibcite{omalley_efficient_2018}{\hyperlink {beamerbibomalley_efficient_2018}{O'Malley et\nobreakspace  {}al.(2018)O'Malley, Karra, Hyman, Viswanathan, and Srinivasan}}
\bibcite{phillips_geological_2009}{\hyperlink {beamerbibphillips_geological_2009}{Phillips(2009)}}
\bibcite{stormer_granite_2015}{\hyperlink {beamerbibstormer_granite_2015}{Stormer(2015)}}
\bibcite{viswanathan_advancing_2018}{\hyperlink {beamerbibviswanathan_advancing_2018}{Viswanathan et\nobreakspace  {}al.(2018)Viswanathan, Hyman, Karra, O'Malley, Srinivasan, Hagberg, and Srinivasan}}
\pbs@newkey{pbs@last@page}{46}
\@writefile{nav}{\headcommand {\slideentry {11}{0}{3}{46/46}{}{0}}}
\@writefile{nav}{\headcommand {\beamer@framepages {46}{46}}}
\pbs@newkey{pbs@last@page}{47}
\@writefile{nav}{\headcommand {\slideentry {11}{0}{3}{46/47}{}{0}}}
\@writefile{nav}{\headcommand {\beamer@framepages {46}{47}}}
\pbs@newkey{pbs@last@page}{48}
\@writefile{nav}{\headcommand {\slideentry {11}{0}{3}{46/48}{}{0}}}
\@writefile{nav}{\headcommand {\beamer@framepages {46}{48}}}
\pbs@newkey{pbs@last@page}{49}
\@writefile{nav}{\headcommand {\slideentry {11}{0}{3}{46/49}{}{0}}}
\@writefile{nav}{\headcommand {\beamer@framepages {46}{49}}}
\pbs@newkey{pbs@last@page}{50}
\@writefile{nav}{\headcommand {\slideentry {11}{0}{3}{46/50}{}{0}}}
\@writefile{nav}{\headcommand {\beamer@framepages {46}{50}}}
\pbs@newkey{pbs@last@page}{51}
\@writefile{nav}{\headcommand {\slideentry {11}{0}{3}{46/51}{}{0}}}
\@writefile{nav}{\headcommand {\beamer@framepages {46}{51}}}
\@writefile{nav}{\headcommand {\beamer@partpages {1}{51}}}
\@writefile{nav}{\headcommand {\beamer@subsectionpages {44}{51}}}
\@writefile{nav}{\headcommand {\beamer@sectionpages {44}{51}}}
\@writefile{nav}{\headcommand {\beamer@documentpages {51}}}
\@writefile{nav}{\headcommand {\gdef \inserttotalframenumber {51}}}
\xwm@secstopagerange{{10000}{51}}
\newlabel{xwmlastpage}{{51}{51}{Summary of Advancements and Conclusion\relax }{Doc-Start}{}}
