\beamer@sectionintoc {1}{Fracture networks: Background and Relevant Problems}{2}{0}{1}
\beamer@sectionintoc {2}{Fracture networks: High Fidelity Models }{4}{0}{2}
\beamer@sectionintoc {3}{The Forward and Inverse Problems}{10}{0}{3}
\beamer@sectionintoc {4}{Preliminary Results}{19}{0}{4}
