\relax 
\providecommand\hyper@newdestlabel[2]{}
\providecommand{\transparent@use}[1]{}
\providecommand\HyperFirstAtBeginDocument{\AtBeginDocument}
\HyperFirstAtBeginDocument{\ifx\hyper@anchor\@undefined
\global\let\oldcontentsline\contentsline
\gdef\contentsline#1#2#3#4{\oldcontentsline{#1}{#2}{#3}}
\global\let\oldnewlabel\newlabel
\gdef\newlabel#1#2{\newlabelxx{#1}#2}
\gdef\newlabelxx#1#2#3#4#5#6{\oldnewlabel{#1}{{#2}{#3}}}
\AtEndDocument{\ifx\hyper@anchor\@undefined
\let\contentsline\oldcontentsline
\let\newlabel\oldnewlabel
\fi}
\fi}
\global\let\hyper@last\relax 
\gdef\HyperFirstAtBeginDocument#1{#1}
\providecommand\HyField@AuxAddToFields[1]{}
\providecommand\HyField@AuxAddToCoFields[2]{}
\providecommand\pbs@newkey[2]{}
\providecommand\pbs@seq@push@cx[2]{}
\providecommand\pbs@at@end@dvi@check{}
\pbs@at@end@dvi@check
\providecommand\mix@newkey[2]{}
\pbs@newkey{pbs@last@page}{1}
\@writefile{nav}{\headcommand {\slideentry {0}{0}{1}{1/1}{}{0}}}
\@writefile{nav}{\headcommand {\beamer@framepages {1}{1}}}
\citation{NRC96}
\pbs@newkey{pbs@last@page}{2}
\@writefile{toc}{\beamer@sectionintoc {1}{Fracture networks: Background and Relevant Problems}{2}{0}{1}}
\@writefile{nav}{\headcommand {\beamer@sectionpages {1}{1}}}
\@writefile{nav}{\headcommand {\beamer@subsectionpages {1}{1}}}
\@writefile{nav}{\headcommand {\sectionentry {1}{Fracture networks: Background and Relevant Problems}{2}{Fracture networks: Background and Relevant Problems}{0}}}
\providecommand*\caption@xref[2]{\@setref\relax\@undefined{#1}}
\newlabel{fig: DFN}{{1}{2}{\scriptsize Rock fractures showing through a surface \relax }{Doc-Start}{}}
\@writefile{snm}{\beamer@slide {fig: DFN}{2}}
\@writefile{nav}{\headcommand {\slideentry {1}{0}{1}{2/2}{}{0}}}
\@writefile{nav}{\headcommand {\beamer@framepages {2}{2}}}
\pbs@newkey{pbs@last@page}{3}
\newlabel{fig: agricultural runoff}{{2}{3}{\tiny Agricultural runoff. \relax }{Doc-Start}{}}
\@writefile{snm}{\beamer@slide {fig: agricultural runoff}{3}}
\newlabel{fig: hydrofracking}{{3}{3}{\tiny Hydrofracking allows flow of natural gas and oil from repositories.\relax }{Doc-Start}{}}
\@writefile{snm}{\beamer@slide {fig: hydrofracking}{3}}
\newlabel{fig:}{{4}{3}{\tiny Spent fuel rod and transportation canister.\relax }{Doc-Start}{}}
\@writefile{snm}{\beamer@slide {fig:}{3}}
\@writefile{nav}{\headcommand {\slideentry {1}{0}{2}{3/3}{}{0}}}
\@writefile{nav}{\headcommand {\beamer@framepages {3}{3}}}
\pbs@newkey{pbs@last@page}{4}
\@writefile{toc}{\beamer@sectionintoc {2}{Fracture networks: High Fidelity Models }{4}{0}{2}}
\@writefile{nav}{\headcommand {\beamer@sectionpages {2}{3}}}
\@writefile{nav}{\headcommand {\beamer@subsectionpages {2}{3}}}
\@writefile{nav}{\headcommand {\sectionentry {2}{Fracture networks: High Fidelity Models }{4}{Fracture networks: High Fidelity Models }{0}}}
\newlabel{fig: DFN}{{5}{4}{\tiny A DFN used for high-fidelity computations. Stochastically generated fractures idealized as 2D planes. Each plane is meshed for flow and transport calculations. Particle tracking is performed for breakthrough curve timings. \relax }{Doc-Start}{}}
\@writefile{snm}{\beamer@slide {fig: DFN}{4}}
\@writefile{nav}{\headcommand {\slideentry {2}{0}{1}{4/4}{}{0}}}
\@writefile{nav}{\headcommand {\beamer@framepages {4}{4}}}
\pbs@newkey{pbs@last@page}{5}
\@writefile{nav}{\headcommand {\slideentry {2}{0}{2}{5/5}{}{0}}}
\@writefile{nav}{\headcommand {\beamer@framepages {5}{5}}}
\pbs@newkey{pbs@last@page}{6}
\newlabel{fig: DFN}{{6}{6}{\tiny Simulated DFN used for high-fidelity computations\relax }{Doc-Start}{}}
\@writefile{snm}{\beamer@slide {fig: DFN}{6}}
\pbs@newkey{pbs@last@page}{7}
\@writefile{nav}{\headcommand {\slideentry {2}{0}{3}{6/7}{}{0}}}
\@writefile{nav}{\headcommand {\beamer@framepages {6}{7}}}
\pbs@newkey{pbs@last@page}{8}
\newlabel{fig:DFN and graph equivalent}{{7}{8}{\scriptsize A simple DFN composed of 6 fractures, 2 outlet boundaries, and 1 inlet boundary and its graph equivalent. Graphs are the central vehicle for the computation reduction and manipulation of large-scale fracture networks.\relax }{Doc-Start}{}}
\@writefile{snm}{\beamer@slide {fig:DFN and graph equivalent}{8}}
\@writefile{nav}{\headcommand {\slideentry {2}{0}{4}{8/8}{}{0}}}
\@writefile{nav}{\headcommand {\beamer@framepages {8}{8}}}
\pbs@newkey{pbs@last@page}{9}
\@writefile{nav}{\headcommand {\slideentry {2}{0}{5}{9/9}{}{0}}}
\@writefile{nav}{\headcommand {\beamer@framepages {9}{9}}}
\pbs@newkey{pbs@last@page}{10}
\@writefile{toc}{\beamer@sectionintoc {3}{The Forward and Inverse Problems}{10}{0}{3}}
\@writefile{nav}{\headcommand {\beamer@sectionpages {4}{9}}}
\@writefile{nav}{\headcommand {\beamer@subsectionpages {4}{9}}}
\@writefile{nav}{\headcommand {\sectionentry {3}{The Forward and Inverse Problems}{10}{The Forward and Inverse Problems}{0}}}
\@writefile{snm}{\beamer@slide {eq: conservation of mass graph}{10}}
\@writefile{nav}{\headcommand {\slideentry {3}{0}{1}{10/10}{}{0}}}
\@writefile{nav}{\headcommand {\beamer@framepages {10}{10}}}
\pbs@newkey{pbs@last@page}{11}
\@writefile{nav}{\headcommand {\slideentry {3}{0}{2}{11/11}{}{0}}}
\@writefile{nav}{\headcommand {\beamer@framepages {11}{11}}}
\pbs@newkey{pbs@last@page}{12}
\@writefile{nav}{\headcommand {\slideentry {3}{0}{3}{12/12}{}{0}}}
\@writefile{nav}{\headcommand {\beamer@framepages {12}{12}}}
\pbs@newkey{pbs@last@page}{13}
\@writefile{nav}{\headcommand {\slideentry {3}{0}{4}{13/13}{}{0}}}
\@writefile{nav}{\headcommand {\beamer@framepages {13}{13}}}
\pbs@newkey{pbs@last@page}{14}
\@writefile{nav}{\headcommand {\slideentry {3}{0}{5}{14/14}{}{0}}}
\@writefile{nav}{\headcommand {\beamer@framepages {14}{14}}}
\pbs@newkey{pbs@last@page}{15}
\@writefile{nav}{\headcommand {\slideentry {3}{0}{6}{15/15}{}{0}}}
\@writefile{nav}{\headcommand {\beamer@framepages {15}{15}}}
\pbs@newkey{pbs@last@page}{16}
\@writefile{nav}{\headcommand {\slideentry {3}{0}{7}{16/16}{}{0}}}
\@writefile{nav}{\headcommand {\beamer@framepages {16}{16}}}
\pbs@newkey{pbs@last@page}{17}
\@writefile{nav}{\headcommand {\slideentry {3}{0}{8}{17/17}{}{0}}}
\@writefile{nav}{\headcommand {\beamer@framepages {17}{17}}}
\pbs@newkey{pbs@last@page}{18}
\@writefile{nav}{\headcommand {\slideentry {3}{0}{9}{18/18}{}{0}}}
\@writefile{nav}{\headcommand {\beamer@framepages {18}{18}}}
\pbs@newkey{pbs@last@page}{19}
\@writefile{toc}{\beamer@sectionintoc {4}{Preliminary Results}{19}{0}{4}}
\@writefile{nav}{\headcommand {\beamer@sectionpages {10}{18}}}
\@writefile{nav}{\headcommand {\beamer@subsectionpages {10}{18}}}
\@writefile{nav}{\headcommand {\sectionentry {4}{Preliminary Results}{19}{Preliminary Results}{0}}}
\@writefile{nav}{\headcommand {\slideentry {4}{0}{1}{19/19}{}{0}}}
\@writefile{nav}{\headcommand {\beamer@framepages {19}{19}}}
\pbs@newkey{pbs@last@page}{20}
\@writefile{nav}{\headcommand {\slideentry {4}{0}{2}{20/20}{}{0}}}
\@writefile{nav}{\headcommand {\beamer@framepages {20}{20}}}
\pbs@newkey{pbs@last@page}{21}
\@writefile{nav}{\headcommand {\slideentry {4}{0}{3}{21/21}{}{0}}}
\@writefile{nav}{\headcommand {\beamer@framepages {21}{21}}}
\bibstyle{plain}
\bibdata{_999_references}
\bibcite{ASPO2005}{\hyperlink {beamerbibASPO2005}{1}}
\bibcite{NRC96}{\hyperlink {beamerbibNRC96}{2}}
\bibcite{OMALLEY2018}{\hyperlink {beamerbibOMALLEY2018}{3}}
\bibcite{lombard2008}{\hyperlink {beamerbiblombard2008}{4}}
\bibcite{srinivasan2018}{\hyperlink {beamerbibsrinivasan2018}{5}}
\pbs@newkey{pbs@last@page}{22}
\@writefile{nav}{\headcommand {\slideentry {4}{0}{4}{22/22}{}{0}}}
\@writefile{nav}{\headcommand {\beamer@framepages {22}{22}}}
\@writefile{nav}{\headcommand {\beamer@partpages {1}{22}}}
\@writefile{nav}{\headcommand {\beamer@subsectionpages {19}{22}}}
\@writefile{nav}{\headcommand {\beamer@sectionpages {19}{22}}}
\@writefile{nav}{\headcommand {\beamer@documentpages {22}}}
\@writefile{nav}{\headcommand {\gdef \inserttotalframenumber {21}}}
\xwm@secstopagerange{{10000}{22}}
\newlabel{xwmlastpage}{{4}{22}{Preliminary Results\relax }{Doc-Start}{}}
