\beamer@sectionintoc {1}{Rock Fractures as Geophysical Phenomenon}{2}{0}{1}
\beamer@sectionintoc {2}{Discrete Fracture Network Modeling}{4}{0}{2}
\beamer@sectionintoc {3}{Discrete Fracture Networks as Graphs}{9}{0}{3}
