\relax 
\providecommand\hyper@newdestlabel[2]{}
\providecommand{\transparent@use}[1]{}
\providecommand\HyperFirstAtBeginDocument{\AtBeginDocument}
\HyperFirstAtBeginDocument{\ifx\hyper@anchor\@undefined
\global\let\oldcontentsline\contentsline
\gdef\contentsline#1#2#3#4{\oldcontentsline{#1}{#2}{#3}}
\global\let\oldnewlabel\newlabel
\gdef\newlabel#1#2{\newlabelxx{#1}#2}
\gdef\newlabelxx#1#2#3#4#5#6{\oldnewlabel{#1}{{#2}{#3}}}
\AtEndDocument{\ifx\hyper@anchor\@undefined
\let\contentsline\oldcontentsline
\let\newlabel\oldnewlabel
\fi}
\fi}
\global\let\hyper@last\relax 
\gdef\HyperFirstAtBeginDocument#1{#1}
\providecommand\HyField@AuxAddToFields[1]{}
\providecommand\HyField@AuxAddToCoFields[2]{}
\providecommand\pbs@newkey[2]{}
\providecommand\pbs@seq@push@cx[2]{}
\providecommand\pbs@at@end@dvi@check{}
\pbs@at@end@dvi@check
\providecommand\mix@newkey[2]{}
\pbs@newkey{pbs@last@page}{1}
\@writefile{nav}{\headcommand {\slideentry {0}{0}{1}{1/1}{}{0}}}
\@writefile{nav}{\headcommand {\beamer@framepages {1}{1}}}
\citation{stormer_granite_2015}
\citation{phillips_geological_2009}
\citation{stormer_granite_2015}
\citation{phillips_geological_2009}
\citation{national_research_council_rock_1996}
\pbs@newkey{pbs@last@page}{2}
\@writefile{toc}{\beamer@sectionintoc {1}{Rock Fractures as Geophysical Phenomenon}{2}{0}{1}}
\@writefile{nav}{\headcommand {\beamer@sectionpages {1}{1}}}
\@writefile{nav}{\headcommand {\beamer@subsectionpages {1}{1}}}
\@writefile{nav}{\headcommand {\sectionentry {1}{Rock Fractures as Geophysical Phenomenon}{2}{Rock Fractures as Geophysical Phenomenon}{0}}}
\providecommand*\caption@xref[2]{\@setref\relax\@undefined{#1}}
\newlabel{figure_stormer_granite_2015_rock_frack_sample_cr_jane_stormer}{{0a}{2}{\relax }{Doc-Start}{}}
\@writefile{snm}{\beamer@slide {figure_stormer_granite_2015_rock_frack_sample_cr_jane_stormer}{2}}
\newlabel{figure_fractures_in_sandstone_phillips_geological_2009}{{0b}{2}{\relax }{Doc-Start}{}}
\@writefile{snm}{\beamer@slide {figure_fractures_in_sandstone_phillips_geological_2009}{2}}
\newlabel{figure_introduction_rock_mechanics}{{1}{2}{\textbf {Left:} Granite fractures in Otter Creek, Maine. Mechanical breaks (rock fractures) existing within the rock formation can be seen opening to the surface where they exist as outcrops. Image credit: \textit {Stormer} \cite {stormer_granite_2015}. \textbf {Right:} A network of plane fractures in sandstone. Image credit: \textit {Phillips} \cite {phillips_geological_2009}. Fractures are surrounded by low-permeability, impervious rock (rock matrix), making them the primary pathways for fluid transportation through the rock mass. \relax }{Doc-Start}{}}
\@writefile{snm}{\beamer@slide {figure_introduction_rock_mechanics}{2}}
\@writefile{nav}{\headcommand {\slideentry {1}{0}{1}{2/2}{}{0}}}
\@writefile{nav}{\headcommand {\beamer@framepages {2}{2}}}
\citation{noauthor_hydraulic_2018}
\citation{noauthor_hydraulic_2018}
\citation{noauthor_heated_2011}
\citation{noauthor_heated_2011}
\citation{john_evaluation_2010}
\citation{john_evaluation_2010}
\citation{bardach_oceans_1993}
\citation{diao_short-term_2015}
\citation{diao_short}
\pbs@newkey{pbs@last@page}{3}
\newlabel{figure_noauthor_hydraulic_2018}{{1a}{3}{Hydrofracturing diagram (not to scale) of oil drilling operation creating fracture zone. Image credit: \textit {Learning Geology} \cite {noauthor_hydraulic_2018}.\relax }{Doc-Start}{}}
\@writefile{snm}{\beamer@slide {figure_noauthor_hydraulic_2018}{3}}
\newlabel{figure_spendRodTransport0}{{1b}{3}{\footnotesize Railroad cars with 123 tons of nuclear waste caught in infrared images in Valognes, France. Image credit: \textit {National Geographic} \cite {noauthor_heated_2011}.\relax }{Doc-Start}{}}
\@writefile{snm}{\beamer@slide {figure_spendRodTransport0}{3}}
\newlabel{figure_c02_sequestration_john_evaluation_2010}{{1c}{3}{\footnotesize $C0_2$ sequestration with potential leak into groundwater aquifer. Image credit: \textit {Apps} \cite {john_evaluation_2010}. \relax }{Doc-Start}{}}
\@writefile{snm}{\beamer@slide {figure_c02_sequestration_john_evaluation_2010}{3}}
\@writefile{nav}{\headcommand {\slideentry {1}{0}{2}{3/3}{}{0}}}
\@writefile{nav}{\headcommand {\beamer@framepages {3}{3}}}
\pbs@newkey{pbs@last@page}{4}
\@writefile{toc}{\beamer@sectionintoc {2}{Discrete Fracture Network Modeling}{4}{0}{2}}
\@writefile{nav}{\headcommand {\beamer@sectionpages {2}{3}}}
\@writefile{nav}{\headcommand {\beamer@subsectionpages {2}{3}}}
\@writefile{nav}{\headcommand {\sectionentry {2}{Discrete Fracture Network Modeling}{4}{Discrete Fracture Network Modeling}{0}}}
\@writefile{nav}{\headcommand {\slideentry {2}{0}{1}{4/4}{}{0}}}
\@writefile{nav}{\headcommand {\beamer@framepages {4}{4}}}
\citation{long_model_1985}
\citation{long_model_1985}
\citation{maryska_numerical_2005}
\citation{maryska_numerical_2005}
\citation{maryska_numerical_2005}
\citation{maryska_numerical_2005}
\pbs@newkey{pbs@last@page}{5}
\newlabel{fig_circular-disk-fractures_long_model_1985}{{2}{5}{Discrete fractures as disk-shaped wedges in surrounding impermeable matrix. Flow calculations were done using Darcy's law. Intersections between disks occur orthogonally. The disks were randomly populated and have lognormally distributed radii. A mixed analytical-numerical method is used to calculate steady state flow through the discrete fracture network. \textit {Long} \cite {long_model_1985}.\relax }{Doc-Start}{}}
\@writefile{snm}{\beamer@slide {fig_circular-disk-fractures_long_model_1985}{5}}
\@writefile{nav}{\headcommand {\slideentry {2}{0}{2}{5/5}{}{0}}}
\@writefile{nav}{\headcommand {\beamer@framepages {5}{5}}}
\citation{hyman_conforming_2014}
\citation{hyman_conforming_2014-1}
\citation{hyman_conforming_2014}
\citation{hyman_conforming_2014-1}
\citation{hyman_dfnworks_2015}
\citation{hyman_dfnworks_2015}
\citation{omalley_efficient_2018}
\citation{hyman_dfnworks_2015}
\citation{hyman_dfnworks_2015}
\citation{omalley_efficient_2018}
\pbs@newkey{pbs@last@page}{6}
\@writefile{nav}{\headcommand {\slideentry {2}{0}{3}{6/6}{}{0}}}
\@writefile{nav}{\headcommand {\beamer@framepages {6}{6}}}
\citation{hyman_dfnworks_2015}
\citation{hyman_dfnworks_2015}
\pbs@newkey{pbs@last@page}{7}
\@writefile{nav}{\headcommand {\slideentry {2}{0}{4}{7/7}{}{0}}}
\@writefile{nav}{\headcommand {\beamer@framepages {7}{7}}}
\citation{viswanathan_advancing_2018}
\citation{karra_modeling_2018}
\citation{hyman_dfnworks_2015}
\citation{hyman_dfnworks_2015}
\pbs@newkey{pbs@last@page}{8}
\@writefile{nav}{\headcommand {\slideentry {2}{0}{5}{8/8}{}{0}}}
\@writefile{nav}{\headcommand {\beamer@framepages {8}{8}}}
\pbs@newkey{pbs@last@page}{9}
\@writefile{toc}{\beamer@sectionintoc {3}{Discrete Fracture Networks as Graphs}{9}{0}{3}}
\@writefile{nav}{\headcommand {\beamer@sectionpages {4}{8}}}
\@writefile{nav}{\headcommand {\beamer@subsectionpages {4}{8}}}
\@writefile{nav}{\headcommand {\sectionentry {3}{Discrete Fracture Networks as Graphs}{9}{Discrete Fracture Networks as Graphs}{0}}}
\@writefile{nav}{\headcommand {\slideentry {3}{0}{1}{9/9}{}{0}}}
\@writefile{nav}{\headcommand {\beamer@framepages {9}{9}}}
\@writefile{nav}{\headcommand {\beamer@partpages {1}{9}}}
\@writefile{nav}{\headcommand {\beamer@subsectionpages {9}{9}}}
\@writefile{nav}{\headcommand {\beamer@sectionpages {9}{9}}}
\@writefile{nav}{\headcommand {\beamer@documentpages {9}}}
\@writefile{nav}{\headcommand {\gdef \inserttotalframenumber {9}}}
\xwm@secstopagerange{{10000}{8}}
\newlabel{xwmlastpage}{{3}{9}{Discrete Fracture Networks as Graphs\relax }{Doc-Start}{}}
