// Jest Snapshot v1, https://goo.gl/fbAQLP

exports[`Pruebas en <AddCategory/> debe mostrare correctamente 1`] = `
<form
  onSubmit={[Function]}
>
  <p />
  <h2 />
  <input
    onChange={[Function]}
    type="text"
    value=""
  />
</form>
`;
