// Jest Snapshot v1, https://goo.gl/fbAQLP

exports[`Pruebas en el archivo <PrimeraApp/> Should show <PrimeraApp/> correctly 1`] = `
<Fragment>
  <h1>
    hola
  </h1>
  <p>
    soy un subtitulo
  </p>
</Fragment>
`;

exports[`Pruebas en el archivo <PrimeraApp/> Should show the subtitle sended by props 1`] = `
<Fragment>
  <h1>
    hola
  </h1>
  <p>
    subtitle
  </p>
</Fragment>
`;
