{
    "hr": "<hr style=\"border:1px outset;background-color:#99CCCC;color:#99CCCC;height:8px;width:100%\" />",
    "style": "<style>h2{font-family: \"Times New Roman\", Times, serif;font-size: 25px;letter-spacing: 1px;word-spacing: -0.4px;color: #000000;font-weight: normal;text-decoration: none solid rgb(68, 68, 68);font-style: normal;font-variant: normal;text-transform: uppercase;}</style>"
}