0113770043959190328TO
0113780001603190328TO
0113790102526190328CD
0113800161391190328CA
0113800161359190328CA
0113810132331190328CA
0113820091823190325EM
0113830961253190328CA
0113840961253190328TO
0113850961253190328CD
0113860156163190329TO
0113870182977190402CD
0113880161327190403PR
