Place,Name,Sex,BirthDate,Age,Equipment,Division,BodyweightKg,WeightClassKg,Squat1Kg,Squat2Kg,Squat3Kg,Best3SquatKg,Bench1Kg,Bench2Kg,Bench3Kg,Best3BenchKg,Deadlift1Kg,Deadlift2Kg,Deadlift3Kg,Best3DeadliftKg,TotalKg,Event,Team,Tested
1,Sami Carberry,F,2002-08-29,21,Raw,Open,51.6,52,90,100,102.5,102.5,57.5,62.5,67.5,67.5,110,125,132.5,132.5,302.5,SBD,,Yes
1,Janine Blake,F,1956-10-12,67,Raw,Open,54.6,56,90,95,100,100,50,52.5,-56,52.5,125,135,138,138,290.5,SBD,BNB,Yes
1,Rosie Hunt,F,1977-11-18,46,Raw,Open,59.95,60,110,115,120,120,60,65,67.5,67.5,130,142.5,150,150,337.5,SBD,Steen S&F,Yes
1,Christine McKee,F,1984-04-08,39,Raw,Open,66,67.5,115,122.5,127.5,127.5,55,60,-62.5,60,150,160,-171,160,347.5,SBD,Steen S&F,Yes
2,Jodie Davison,F,1995-08-12,28,Raw,Open,64.9,67.5,90,95,100,100,47.5,50,-52.5,50,100,110,120,120,270,SBD,Steen S&F,Yes
3,Grace-Sierra Kari,F,2002-10-19,21,Raw,Open,66.75,67.5,95,100,105,105,45,47.5,50,50,90,100,,100,255,SBD,BNB,Yes
1,Leila Warnes,F,1997-04-24,26,Raw,Open,72.9,75,105,115,125,125,70,75,-77.5,75,130,140,150,150,350,SBD,BNB,Yes
2,Hayley Calleja,F,2003-08-10,20,Raw,Open,73.25,75,90,100,-105,100,57.5,60,-62.5,60,95,105,112.5,112.5,272.5,SBD,RiverCity,Yes
1,Rebekah Simmons,F,1985-03-19,38,Raw,Open,82.05,82.5,130,140,145,145,62.5,67.5,70,70,150,160,167.5,167.5,382.5,SBD,Matt Martino,Yes
1,Desiree Meauta,F,1994-04-09,29,Raw,Open,106.65,110,152.5,170,-180,170,85,-92.5,-92.5,85,185,200,211,211,466,SBD,BlackDam,Yes
1,Erica Patane,F,2000-10-23,23,Wraps,Open,73.4,75,95,110,-120,110,72.5,77.5,-82.5,77.5,115,125,145,145,332.5,SBD,,Yes
1,Kenisha Laffey,F,1993-12-09,30,Wraps,Open,109.9,110,170,180,-187.5,180,80,85,90,90,190,-200,-200,190,460,SBD,,Yes
1,Luke Macarone,M,1994-09-19,29,Raw,Open,82.15,82.5,170,180,190,190,125,135,145,145,200,210,-220,210,545,SBD,BNB,Yes
2,Brock Schafer,M,2002-02-17,21,Raw,Open,81.65,82.5,180,195,-205,195,110,120,125,125,205,220,-235,220,540,SBD,BNB,Yes
3,Ash Thorpe,M,1988-12-16,35,Raw,Open,80.8,82.5,170,185,-190,185,110,-120,-120,110,210,-220,220,220,515,SBD,BNB,Yes
1,Derek Huynh,M,1998-12-26,24,Raw,Open,88.8,90,215,232.5,240,240,130,140,-147.5,140,215,230,245,245,625,SBD,,Yes
2,Joey Hizon,M,1977-08-30,46,Raw,Open,86.85,90,195,205,,205,117.5,125,127.5,127.5,210,220,-225,220,552.5,SBD,Matt Martino,Yes
1,James Forrest,M,2004-09-27,19,Raw,Open,99.35,100,217.5,230,237.5,237.5,135,142.5,-150,142.5,240,260,-270,260,640,SBD,Matt Martino,Yes
2,Tyson Keating,M,1999-10-07,24,Raw,Open,93.15,100,210,220,-230,220,130,140,145,145,225,245,-275,245,610,SBD,BNB,Yes
3,John Wykman,M,1972-11-11,51,Raw,Open,94.1,100,155,165,175,175,95,105,115,115,185,200,210,210,500,SBD,BNB,Yes
4,Matthew Reeves,M,1967-11-14,56,Raw,Open,97.75,100,150,160,162.5,162.5,100,-110,-110,100,190,200,215,215,477.5,SBD,,Yes
1,Rik Callander,M,1980-01-07,43,Raw,Open,109.3,110,230,240,245,245,132.5,140,-145,140,220,235,247.5,247.5,632.5,SBD,Steen S&F,Yes
2,Damian Flett,M,1989-10-09,34,Raw,Open,107.9,110,205,215,-225,215,150,160,-170,160,220,240,-265,240,615,SBD,BNB,Yes
3,Benjamin Dunphy,M,2007-12-16,16,Raw,Open,104.6,110,190,200,-210,200,100,110,115,115,190,210,222.5,222.5,537.5,SBD,Steen S&F,Yes
1,Calvin Bennett,M,1987-09-29,36,Raw,Open,114.35,125,190,205,215,215,132.5,140,145,145,215,232.5,-240,232.5,592.5,SBD,Steen S&F,Yes
DQ,Khalib Bennett,M,1994-03-25,29,Raw,Open,120.45,125,260,-275,,260,140,150,-160,150,,,,,,SBD,BNB,Yes
1,Andrew Mann,M,1988-07-22,35,Raw,Open,165.4,140+,175,185,195,195,100,105,110,110,180,190,200,200,505,SBD,BNB,Yes
1,Dan Schuberg,M,1986-10-23,37,Raw,Open,117.15,125,200,215,225,225,130,140,,140,240,260,280,280,645,SBD,BNB,No
1,Brandon Grace,M,1996-04-12,27,Wraps,Open,76.95,82.5,-190,190,-200,190,135,137.5,-142.5,137.5,235,245,-257.5,245,572.5,SBD,RiverCity,Yes
1,Igor Tsurkin,M,1982-04-14,41,Wraps,Open,92.55,100,155,165,-175,165,100,110,-120,110,180,195,205,205,480,SBD,BNB,Yes
1,January Meauta,M,1992-01-16,31,Wraps,Open,162.8,140+,320,335,,335,200,212.5,-217.5,212.5,245,260,-270,260,807.5,SBD,BlackDam,Yes
